{"text_format":"1","workbook":"xlsx","n_sheets":5,"sheets":["Data","Lists","Engine","ورقة1","ورقة2"],"not_rendered":{"charts":0,"images":0,"macros":1,"external_links":0,"defined_names":9,"comments":0,"pivot_tables":0},"unopened":[],"bounds":{"document_bytes":16777216,"sheet_cells":100000,"rows_first":2000,"rows_last":500,"rows_between":2000,"halvings":0,"cell_chars":16384,"cell_head_chars":4096},"cells_cut":0,"cells_raw":0,"read":"whole","date_system":"1900"}

{"sheet":"Data","index":0,"n_rows":103,"n_cols":24,"rows_kept":103,"cut":false,"hidden":false,"merged":[]}
[]
[null,null,"قاعد الحشد  ","مكاني 3",null,null,null,null,null,{"$f":"COUNTA(C8:C57000)","v":0}]
[null,null,null,null,null,null,null,null,null,null,"البرنامج","العدد","النسبة","المشروع","العدد","النسبة"]
[null,null,null,null,null,null,null,null,null,null,"مهارات",{"$f":"COUNTIF(L8:L102,Lists!G4)","v":0},null,"مكاني1"]
[null,null,null,null,null,null,null,null,"عدد الذكور",{"$f":"COUNTIF(G:G,Lists!C4)","v":0},"حماية",{"$f":"COUNTIF(L8:L120,Lists!G5)","v":0},null,"مكاني2"]
[null,null,null,null,null,null,null,null,"عدد الاناث",{"$f":"COUNTIF(G:G,Lists!C5)","v":0},"دعم التعليم",{"$f":"COUNTIF(L8:L90,Lists!G6)","v":0},null,"مكاني3"]
[null,"الرقم","الاسم","اسم الام","Full Name","تاريخ الميلاد","الجنس","رقم الاثبات","الجنسية","العنوان","الهاتف","البرنامج","المشروع","تاريخ التسجيل"]
[]
[]
[]
[]
[]
[null,null,null,null,null,null,null,null,null,null,null,null,null,null,null,null,null,null,null,null,null,null,null,"فلسطينية"]
[null,null,null,null,null,null,null,null,null,null,null,null,null,null,null,null,null,null,null,null,null,null,null,"اردنية"]
[null,null,null,null,null,null,null,null,null,null,"","","",""]
[]
[]
[]
[]
[]
[]
[]
[]
[]
[]
[]
[]
[]
[]
[]
[]
[]
[]
[]
[]
[]
[]
[]
[]
[]
[]
[]
[]
[]
[]
[]
[]
[]
[]
[]
[]
[]
[]
[]
[]
[]
[]
[]
[]
[]
[]
[]
[]
[]
[]
[]
[]
[]
[]
[]
[]
[null,null,null,null,null,null,null,null,null,null,"","","",""]
[]
[]
[]
[]
[]
[]
[null,null,null,null,null,null,null,null,null,null,"","","",""]
[]
[]
[]
[]
[]
[]
[]
[null,null,null,null,null,null,null,null,null,null,"","","",""]
[]
[]
[]
[]
[]
[]
[]
[null,null,null,null,null,null,null,null,null,null,"","","",""]
[]
[]
[]
[]
[]
[]
[]
[null,null,null,null,null,null,null,null,null,null,"","","",""]

{"sheet":"Lists","index":1,"n_rows":34,"n_cols":16,"rows_kept":34,"cut":false,"hidden":false,"merged":[]}
[]
[]
[null,"Yes / No List","Gender List","Region","Job Status","Marital Status","البرنامج"]
[null,"مستفيد","ذكر",1,1,"مستفيد","مهارات الحياة","مسجل","مكاني 1",null,{"$f":"COUNTIF(Data!M:M,Lists!F4)","v":0},null,{"$f":"COUNTIF(Data!P:P,Lists!H4)","v":0},1,2015,1]
[null,"غير مستفيد","أنثى",2,2,"غير مستفيد","حماية الطفل","غير مسجل","مكاني 2",null,{"$f":"COUNTIF(Data!N:N,Lists!F4)","v":0},null,{"$f":"COUNTIF(Data!Q:Q,Lists!H4)","v":0},2,2016,2]
[null,null,null,3,3,null,"خدمات دعم التعليم",null,"مكاني 3",null,{"$f":"COUNTIF(Data!O:O,Lists!F4)","v":0},null,{"$f":"COUNTIF(Data!R:R,Lists!H4)","v":0},3,2017,3]
[null,null,null,null,null,null,null,null,null,null,{"$f":"SUM(K4:K6)","v":0},null,{"$f":"SUM(M4:M6)","v":0},4,2018,4]
[null,null,null,null,null,null,null,null,null,null,null,null,null,5,2019,5]
[null,null,null,null,null,null,null,null,null,null,null,null,null,6,null,6]
[null,null,null,null,null,null,null,null,null,null,null,null,null,7,null,7]
[null,null,null,null,null,null,null,null,null,null,null,null,null,8,null,8]
[null,null,null,null,null,null,null,null,null,null,null,null,null,9,null,9]
[null,null,null,null,null,null,null,null,null,null,null,null,null,10,null,10]
[null,null,null,null,null,null,null,null,null,null,null,null,null,11,null,11]
[null,null,null,null,null,null,null,null,null,null,null,null,null,12,null,12]
[null,null,null,null,null,null,null,null,null,null,null,null,null,null,null,13]
[null,null,null,null,null,null,null,null,null,null,null,null,null,null,null,14]
[null,null,null,null,null,null,null,null,null,null,null,null,null,null,null,15]
[null,null,null,null,null,null,null,null,null,null,null,null,null,null,null,16]
[null,null,null,null,null,null,null,null,null,null,null,null,null,null,null,17]
[null,null,null,null,null,null,null,null,null,null,null,null,null,null,null,18]
[null,null,null,null,null,null,null,null,null,null,null,null,null,null,null,19]
[null,null,null,null,null,null,null,null,null,null,null,null,null,null,null,20]
[null,null,null,null,null,null,null,null,null,null,null,null,null,null,null,21]
[null,null,null,null,null,null,null,null,null,null,null,null,null,null,null,22]
[null,null,null,null,null,null,null,null,null,null,null,null,null,null,null,23]
[null,null,null,null,null,null,null,null,null,null,null,null,null,null,null,24]
[null,null,null,null,null,null,null,null,null,null,null,null,null,null,null,25]
[null,null,null,null,null,null,null,null,null,null,null,null,null,null,null,26]
[null,null,null,null,null,null,null,null,null,null,null,null,null,null,null,27]
[null,null,null,null,null,null,null,null,null,null,null,null,null,null,null,28]
[null,null,null,null,null,null,null,null,null,null,null,null,null,null,null,29]
[null,null,null,null,null,null,null,null,null,null,null,null,null,null,null,30]
[null,null,null,null,null,null,null,null,null,null,null,null,null,null,null,31]

{"sheet":"Engine","index":2,"n_rows":24,"n_cols":3,"rows_kept":24,"cut":false,"hidden":false,"merged":[]}
[]
[]
[null,{"$f":"COUNTA(Data!E1:E10000)-1","v":0},"Total entries in database - maximum 10000"]
[null,"NEW","Mode"]
[null,65,"Row Store"]
[]
[]
[]
[]
[]
[]
[]
[]
[]
[]
[]
[]
[]
[]
[]
[]
[]
[]
[null,null,"Engine"]

{"sheet":"ورقة1","index":3,"n_rows":162,"n_cols":15,"rows_kept":162,"cut":false,"hidden":true,"merged":[[0,0,1,14]]}
["قاعدة الحشد / برنامج مهارات الحياة "]
[]
["الرقم","إسم الطالب","اسم الأم","المركز","تاريخ الميلاد","الجنس","رقم اثبات الشخصية للمنتفع","الجنسية","رقم المفوضية/البطاقة الأمنية","العنوان","رقم هاتف ولي الأمر","المستوى التعليمي","مكاني/تاريخ التسجيل","الجنسية","العنوان"]
[null,{"$f":"IF(Data!$L$8:$L$10000=Lists!$G$4,ROW(Data!$L$8:$L$10000)-ROW(Data!$L$7))","v":{"$error":"#VALUE!"}}]
[]
[]
[]
[]
[]
[]
[]
[]
[]
[]
[]
[]
[]
[]
[]
[]
[]
[]
[]
[]
[]
[]
[]
[{"$f":"IF(Data!M:M=\"مستفيد\",Data!C30,\"\")","v":""}]
[{"$f":"IF(Data!M:M=\"مستفيد\",Data!C31,\"\")","v":""}]
[{"$f":"IF(Data!M:M=\"مستفيد\",Data!C32,\"\")","v":""}]
[{"$f":"IF(Data!M:M=\"مستفيد\",Data!C33,\"\")","v":""}]
[{"$f":"IF(Data!M:M=\"مستفيد\",Data!C34,\"\")","v":""}]
[{"$f":"IF(Data!M:M=\"مستفيد\",Data!C35,\"\")","v":""}]
[{"$f":"IF(Data!M:M=\"مستفيد\",Data!C36,\"\")","v":""}]
[{"$f":"IF(Data!M:M=\"مستفيد\",Data!C37,\"\")","v":""}]
[{"$f":"IF(Data!M:M=\"مستفيد\",Data!C38,\"\")","v":""}]
[{"$f":"IF(Data!M:M=\"مستفيد\",Data!C39,\"\")","v":""}]
[{"$f":"IF(Data!M:M=\"مستفيد\",Data!C40,\"\")","v":""}]
[{"$f":"IF(Data!M:M=\"مستفيد\",Data!C41,\"\")","v":""}]
[{"$f":"IF(Data!M:M=\"مستفيد\",Data!C42,\"\")","v":""}]
[{"$f":"IF(Data!M:M=\"مستفيد\",Data!C43,\"\")","v":""}]
[{"$f":"IF(Data!M:M=\"مستفيد\",Data!C44,\"\")","v":""}]
[{"$f":"IF(Data!M:M=\"مستفيد\",Data!C45,\"\")","v":""}]
[{"$f":"IF(Data!M:M=\"مستفيد\",Data!C46,\"\")","v":""}]
[{"$f":"IF(Data!M:M=\"مستفيد\",Data!C47,\"\")","v":""}]
[{"$f":"IF(Data!M:M=\"مستفيد\",Data!C48,\"\")","v":""}]
[{"$f":"IF(Data!M:M=\"مستفيد\",Data!C49,\"\")","v":""}]
[{"$f":"IF(Data!M:M=\"مستفيد\",Data!C50,\"\")","v":""}]
[{"$f":"IF(Data!M:M=\"مستفيد\",Data!C51,\"\")","v":""}]
[{"$f":"IF(Data!M:M=\"مستفيد\",Data!C52,\"\")","v":""}]
[{"$f":"IF(Data!M:M=\"مستفيد\",Data!C53,\"\")","v":""}]
[{"$f":"IF(Data!M:M=\"مستفيد\",Data!C54,\"\")","v":""}]
[{"$f":"IF(Data!M:M=\"مستفيد\",Data!C55,\"\")","v":""}]
[{"$f":"IF(Data!M:M=\"مستفيد\",Data!C56,\"\")","v":""}]
[{"$f":"IF(Data!M:M=\"مستفيد\",Data!C57,\"\")","v":""}]
[{"$f":"IF(Data!M:M=\"مستفيد\",Data!C58,\"\")","v":""}]
[{"$f":"IF(Data!M:M=\"مستفيد\",Data!C59,\"\")","v":""}]
[{"$f":"IF(Data!M:M=\"مستفيد\",Data!C60,\"\")","v":""}]
[{"$f":"IF(Data!M:M=\"مستفيد\",Data!C61,\"\")","v":""}]
[{"$f":"IF(Data!M:M=\"مستفيد\",Data!C62,\"\")","v":""}]
[{"$f":"IF(Data!M:M=\"مستفيد\",Data!C63,\"\")","v":""}]
[{"$f":"IF(Data!M:M=\"مستفيد\",Data!C64,\"\")","v":""}]
[{"$f":"IF(Data!M:M=\"مستفيد\",Data!C65,\"\")","v":""}]
[{"$f":"IF(Data!M:M=\"مستفيد\",Data!C66,\"\")","v":""}]
[{"$f":"IF(Data!M:M=\"مستفيد\",Data!C67,\"\")","v":""}]
[{"$f":"IF(Data!M:M=\"مستفيد\",Data!C68,\"\")","v":""}]
[{"$f":"IF(Data!M:M=\"مستفيد\",Data!C69,\"\")","v":""}]
[{"$f":"IF(Data!M:M=\"مستفيد\",Data!C70,\"\")","v":""}]
[{"$f":"IF(Data!M:M=\"مستفيد\",Data!C71,\"\")","v":""}]
[{"$f":"IF(Data!M:M=\"مستفيد\",Data!C72,\"\")","v":""}]
[{"$f":"IF(Data!M:M=\"مستفيد\",Data!C73,\"\")","v":""}]
[{"$f":"IF(Data!M:M=\"مستفيد\",Data!C74,\"\")","v":""}]
[{"$f":"IF(Data!M:M=\"مستفيد\",Data!C75,\"\")","v":""}]
[{"$f":"IF(Data!M:M=\"مستفيد\",Data!C76,\"\")","v":""}]
[{"$f":"IF(Data!M:M=\"مستفيد\",Data!C77,\"\")","v":""}]
[{"$f":"IF(Data!M:M=\"مستفيد\",Data!C78,\"\")","v":""}]
[{"$f":"IF(Data!M:M=\"مستفيد\",Data!C79,\"\")","v":""}]
[{"$f":"IF(Data!M:M=\"مستفيد\",Data!C80,\"\")","v":""}]
[{"$f":"IF(Data!M:M=\"مستفيد\",Data!C81,\"\")","v":""}]
[{"$f":"IF(Data!M:M=\"مستفيد\",Data!C82,\"\")","v":""}]
[{"$f":"IF(Data!M:M=\"مستفيد\",Data!C83,\"\")","v":""}]
[{"$f":"IF(Data!M:M=\"مستفيد\",Data!C84,\"\")","v":""}]
[{"$f":"IF(Data!M:M=\"مستفيد\",Data!C85,\"\")","v":""}]
[{"$f":"IF(Data!M:M=\"مستفيد\",Data!C86,\"\")","v":""}]
[{"$f":"IF(Data!M:M=\"مستفيد\",Data!C87,\"\")","v":""}]
[{"$f":"IF(Data!M:M=\"مستفيد\",Data!C88,\"\")","v":""}]
[{"$f":"IF(Data!M:M=\"مستفيد\",Data!C89,\"\")","v":""}]
[{"$f":"IF(Data!M:M=\"مستفيد\",Data!C90,\"\")","v":""}]
[{"$f":"IF(Data!M:M=\"مستفيد\",Data!C91,\"\")","v":""}]
[{"$f":"IF(Data!M:M=\"مستفيد\",Data!C92,\"\")","v":""}]
[{"$f":"IF(Data!M:M=\"مستفيد\",Data!C93,\"\")","v":""}]
[{"$f":"IF(Data!M:M=\"مستفيد\",Data!C94,\"\")","v":""}]
[{"$f":"IF(Data!M:M=\"مستفيد\",Data!C95,\"\")","v":""}]
[{"$f":"IF(Data!M:M=\"مستفيد\",Data!C96,\"\")","v":""}]
[{"$f":"IF(Data!M:M=\"مستفيد\",Data!C97,\"\")","v":""}]
[{"$f":"IF(Data!M:M=\"مستفيد\",Data!C98,\"\")","v":""}]
[{"$f":"IF(Data!M:M=\"مستفيد\",Data!C99,\"\")","v":""}]
[{"$f":"IF(Data!M:M=\"مستفيد\",Data!C100,\"\")","v":""}]
[{"$f":"IF(Data!M:M=\"مستفيد\",Data!C101,\"\")","v":""}]
[{"$f":"IF(Data!M:M=\"مستفيد\",Data!C102,\"\")","v":""}]
[{"$f":"IF(Data!M:M=\"مستفيد\",Data!C103,\"\")","v":""}]
[{"$f":"IF(Data!M:M=\"مستفيد\",Data!C104,\"\")","v":""}]
[{"$f":"IF(Data!M:M=\"مستفيد\",Data!C105,\"\")","v":""}]
[{"$f":"IF(Data!M:M=\"مستفيد\",Data!C106,\"\")","v":""}]
[{"$f":"IF(Data!M:M=\"مستفيد\",Data!C107,\"\")","v":""}]
[{"$f":"IF(Data!M:M=\"مستفيد\",Data!C108,\"\")","v":""}]
[{"$f":"IF(Data!M:M=\"مستفيد\",Data!C109,\"\")","v":""}]
[{"$f":"IF(Data!M:M=\"مستفيد\",Data!C110,\"\")","v":""}]
[{"$f":"IF(Data!M:M=\"مستفيد\",Data!C111,\"\")","v":""}]
[{"$f":"IF(Data!M:M=\"مستفيد\",Data!C112,\"\")","v":""}]
[{"$f":"IF(Data!M:M=\"مستفيد\",Data!C113,\"\")","v":""}]
[{"$f":"IF(Data!M:M=\"مستفيد\",Data!C114,\"\")","v":""}]
[{"$f":"IF(Data!M:M=\"مستفيد\",Data!C115,\"\")","v":""}]
[{"$f":"IF(Data!M:M=\"مستفيد\",Data!C116,\"\")","v":""}]
[{"$f":"IF(Data!M:M=\"مستفيد\",Data!C117,\"\")","v":""}]
[{"$f":"IF(Data!M:M=\"مستفيد\",Data!C118,\"\")","v":""}]
[{"$f":"IF(Data!M:M=\"مستفيد\",Data!C119,\"\")","v":""}]
[{"$f":"IF(Data!M:M=\"مستفيد\",Data!C120,\"\")","v":""}]
[{"$f":"IF(Data!M:M=\"مستفيد\",Data!C121,\"\")","v":""}]
[{"$f":"IF(Data!M:M=\"مستفيد\",Data!C122,\"\")","v":""}]
[{"$f":"IF(Data!M:M=\"مستفيد\",Data!C123,\"\")","v":""}]
[{"$f":"IF(Data!M:M=\"مستفيد\",Data!C124,\"\")","v":""}]
[{"$f":"IF(Data!M:M=\"مستفيد\",Data!C125,\"\")","v":""}]
[{"$f":"IF(Data!M:M=\"مستفيد\",Data!C126,\"\")","v":""}]
[{"$f":"IF(Data!M:M=\"مستفيد\",Data!C127,\"\")","v":""}]
[{"$f":"IF(Data!M:M=\"مستفيد\",Data!C128,\"\")","v":""}]
[{"$f":"IF(Data!M:M=\"مستفيد\",Data!C129,\"\")","v":""}]
[{"$f":"IF(Data!M:M=\"مستفيد\",Data!C130,\"\")","v":""}]
[{"$f":"IF(Data!M:M=\"مستفيد\",Data!C131,\"\")","v":""}]
[{"$f":"IF(Data!M:M=\"مستفيد\",Data!C132,\"\")","v":""}]
[{"$f":"IF(Data!M:M=\"مستفيد\",Data!C133,\"\")","v":""}]
[{"$f":"IF(Data!M:M=\"مستفيد\",Data!C134,\"\")","v":""}]
[{"$f":"IF(Data!M:M=\"مستفيد\",Data!C135,\"\")","v":""}]
[{"$f":"IF(Data!M:M=\"مستفيد\",Data!C136,\"\")","v":""}]
[{"$f":"IF(Data!M:M=\"مستفيد\",Data!C137,\"\")","v":""}]
[{"$f":"IF(Data!M:M=\"مستفيد\",Data!C138,\"\")","v":""}]
[{"$f":"IF(Data!M:M=\"مستفيد\",Data!C139,\"\")","v":""}]
[{"$f":"IF(Data!M:M=\"مستفيد\",Data!C140,\"\")","v":""}]
[{"$f":"IF(Data!M:M=\"مستفيد\",Data!C141,\"\")","v":""}]
[{"$f":"IF(Data!M:M=\"مستفيد\",Data!C142,\"\")","v":""}]
[{"$f":"IF(Data!M:M=\"مستفيد\",Data!C143,\"\")","v":""}]
[{"$f":"IF(Data!M:M=\"مستفيد\",Data!C144,\"\")","v":""}]
[{"$f":"IF(Data!M:M=\"مستفيد\",Data!C145,\"\")","v":""}]
[{"$f":"IF(Data!M:M=\"مستفيد\",Data!C146,\"\")","v":""}]
[{"$f":"IF(Data!M:M=\"مستفيد\",Data!C147,\"\")","v":""}]
[{"$f":"IF(Data!M:M=\"مستفيد\",Data!C148,\"\")","v":""}]
[{"$f":"IF(Data!M:M=\"مستفيد\",Data!C149,\"\")","v":""}]
[{"$f":"IF(Data!M:M=\"مستفيد\",Data!C150,\"\")","v":""}]
[{"$f":"IF(Data!M:M=\"مستفيد\",Data!C151,\"\")","v":""}]
[{"$f":"IF(Data!M:M=\"مستفيد\",Data!C152,\"\")","v":""}]
[{"$f":"IF(Data!M:M=\"مستفيد\",Data!C153,\"\")","v":""}]
[{"$f":"IF(Data!M:M=\"مستفيد\",Data!C154,\"\")","v":""}]
[{"$f":"IF(Data!M:M=\"مستفيد\",Data!C155,\"\")","v":""}]
[{"$f":"IF(Data!M:M=\"مستفيد\",Data!C156,\"\")","v":""}]
[{"$f":"IF(Data!M:M=\"مستفيد\",Data!C157,\"\")","v":""}]
[{"$f":"IF(Data!M:M=\"مستفيد\",Data!C158,\"\")","v":""}]
[{"$f":"IF(Data!M:M=\"مستفيد\",Data!C159,\"\")","v":""}]
[{"$f":"IF(Data!M:M=\"مستفيد\",Data!C160,\"\")","v":""}]
[{"$f":"IF(Data!M:M=\"مستفيد\",Data!C161,\"\")","v":""}]
[{"$f":"IF(Data!M:M=\"مستفيد\",Data!C162,\"\")","v":""}]
[{"$f":"IF(ورقة1!I:I=\"مستفيد\",Data!C163,\"\")","v":""}]
[{"$f":"IF(ورقة1!I:I=\"مستفيد\",Data!C164,\"\")","v":""}]

{"sheet":"ورقة2","index":4,"n_rows":0,"n_cols":0,"rows_kept":0,"cut":false,"hidden":true,"merged":[]}