{"text_format":"1","workbook":"xlsx","n_sheets":7,"sheets":["Sheets","السيارات ","January","February","March","April","May"],"not_rendered":{"charts":0,"images":0,"macros":1,"external_links":0,"defined_names":9,"comments":0,"pivot_tables":0},"unopened":[],"bounds":{"document_bytes":16777216,"sheet_cells":100000,"rows_first":2000,"rows_last":500,"rows_between":2000,"halvings":0,"cell_chars":16384,"cell_head_chars":4096},"cells_cut":0,"cells_raw":0,"read":"whole","date_system":"1900"}

{"sheet":"Sheets","index":0,"n_rows":10,"n_cols":14,"rows_kept":10,"cut":false,"hidden":false,"merged":[[1,8,2,8],[1,0,2,0],[1,1,2,1],[1,3,2,3],[1,4,2,4],[1,6,2,6],[1,7,2,7],[1,5,2,5],[1,2,2,2]]}
["اختار الشهر الميلادي","January",null,null,null,null,{"$f":"COUNTA(H6:H7)","v":0},null,null,"تاريخ اليوم",{"$f":"TODAY()","v":"2018-12-06"},"رقم السيارة ",{"$f":"C4","v":8779},"رقم الكرت "]
["التاريخ ","نوع الوقود","رقم السيارة ","سعر اللتر ","المبلغ المدفوع","رقم الكرت ","قراءة العداد السابق","قراءة العداد الجديد","المسافـــــــة\nالمقطوعــــة","كمية البنزين\nالممونه للسياره\n( المره الثانيه )","معدل إستهلاك\nالوقود","قراءة العداد السابق",{"$f":"G4","v":142},{"$f":"VLOOKUP(C4,INDIRECT(\"'\"&INDEX(Sheetlist,MATCH(1,--(COUNTIF(INDIRECT(\"'\"&Sheetlist&\"'!$B$2:$F$1000\"),C4)>0),0))&\"'!$B$2:$F$1000\"),5,FALSE)","v":105}]
[null,null,null,null,null,null,null,null,null,"لتــــــر","كم / لتر\n","المسافـــــــة\nالمقطوعــــة",{"$f":"VLOOKUP(C4,INDIRECT(\"'\"&INDEX(Sheetlist,MATCH(1,--(COUNTIF(INDIRECT(\"'\"&Sheetlist&\"'!$B$2:$I$1000\"),C4)>0),0))&\"'!$B$2:$I$1000\"),8,FALSE)","v":8}]
[null,"ديزل ",8779,{"$f":"IF(B4=\"بنزين\",'السيارات '!D20,'السيارات '!D21)","v":0.38},25,null,{"$f":"VLOOKUP(C4,INDIRECT(\"'\"&INDEX(Sheetlist,MATCH(1,--(COUNTIF(INDIRECT(\"'\"&Sheetlist&\"'!$B$2:$G$1000\"),C4)>0),0))&\"'!$B$2:$G$1000\"),6,FALSE)","v":142},{"$f":"VLOOKUP(C4,INDIRECT(\"'\"&INDEX(Sheetlist,MATCH(1,--(COUNTIF(INDIRECT(\"'\"&Sheetlist&\"'!$B$2:$H$1000\"),C4)>0),0))&\"'!$B$2:$H$1000\"),7,FALSE)","v":345},{"$f":"IFERROR(H4-G4,\"\")","v":203},{"$f":"IFERROR(E4/D4,\"\")","v":65.78947368421052},{"$f":"IFERROR(I4/J4,\"\")","v":3.0856000000000003}]
[]
[]
[]
[]
[]
[null,null,null,null,null,null,null,null,null,null,null,{"$f":"VLOOKUP(C4,January!B2:H16,6,0)","v":142}]

{"sheet":"السيارات ","index":1,"n_rows":27,"n_cols":16,"rows_kept":27,"cut":false,"hidden":false,"merged":[[3,1,4,1],[9,2,9,4],[10,2,10,4],[11,2,11,4],[12,2,12,4],[14,2,14,4],[15,2,15,4],[13,2,13,4],[3,2,4,4],[3,5,4,5],[5,2,5,4],[6,2,6,4],[7,2,7,4],[8,2,8,4]]}
[]
[]
[]
[null,"رقم ","نوع السيارة ",null,null,"رقم السيارة",null,"م","الشهر "]
[null,null,null,null,null,null,null,1,"January"]
[null,1,"هينو ",null,null,2218,null,2,"February"]
[null,2,"هينو ",null,null,2219,null,3,"March"]
[null,3,"هينو ",null,null,2217,null,4,"April"]
[null,4,"هينو ",null,null,2231,null,5,"May",null,"نوع الوقود","ديزل "]
[null,5,"اسيزو ",null,null,8280,null,6,"June",null,"السيارة",2217]
[null,6,"اسيزو ",null,null,8828,null,7,"July",null,"السعر"]
[null,7,"اسيزو ",null,null,8779,null,8,"August"]
[null,8,"اسيزو ",null,null,1491,null,9,"September"]
[null,9,"مستوبيشي",null,null,5764,null,10,"October"]
[null,10,"رافعة ",null,null,"رافعة كبيرة",null,11,"November"]
[null,11,"رافعة ",null,null,"رافعة صغيرة",null,12,"December"]
[]
[null,null,null,null,null,null,null,null,null,null,null,"ديزل","بنزين","السعر ",null,"رقم السيارة "]
[null,"الرقم ","نوع الوقود ","السعر / لتر",null,null,null,null,null,null,null,5764,"رافعة كبيرة",2.04]
[null,2,"بنزين",2.04,null,null,null,null,null,null,null,2218,"رافعة صغيرة",0.38]
[null,3,"ديزل ",0.38,null,null,null,null,null,null,null,2219]
[null,null,null,null,null,null,null,null,null,null,null,2217]
[null,null,null,null,null,null,null,null,null,null,null,2231]
[null,null,null,null,null,null,null,null,null,null,null,8280]
[null,null,null,null,null,null,null,null,null,null,null,8828]
[null,null,null,null,null,null,null,null,null,null,null,8779]
[null,null,null,null,null,null,null,null,null,null,null,1491]

{"sheet":"January","index":2,"n_rows":16,"n_cols":11,"rows_kept":16,"cut":false,"hidden":false,"merged":[]}
["التاريخ ","رقم السيارة ","نوع الوقود","سعر اللتر ","المبلغ المدفوع","رقم الكرت ","قراءة العداد السابق","قراءة العداد الجديد","المسافـــــــة\nالمقطوعــــة","كمية البنزين\nالممونه للسياره\n( المره الثانيه )","معدل إستهلاك\nالوقود"]
["1955-04-23",8280,"ديزل ",0.38,25,102,1210,2152,942,65.78947368421052,14.3184]
["1905-07-12",8280,"ديزل ",0.38,25,102,102,10255,10153,65.78947368421052,154.32560000000001]
["1905-07-12",8779,"ديزل ",0.38,25,105,142,345,8,65.78947368421052,0.12160000000000001]
["1905-03-14",2218,"ديزل ",0.38,25,102,1210,2152,942,65.78947368421052,14.3184]
["1905-07-12",8280,"ديزل ",0.38,25,102,102,10255,10153,65.78947368421052,154.32560000000001]
["1905-07-12",8779,"ديزل ",0.38,25,105,142,12345,8,65.78947368421052,0.12160000000000001]
["1955-04-23",2218,"ديزل ",0.38,25,102,1210,2152,942,65.78947368421052,14.3184]
["1905-07-12",8280,"ديزل ",0.38,25,102,102,10255,10153,65.78947368421052,154.32560000000001]
["1905-07-12",8779,"ديزل ",0.38,25,105,142,123,8,65.78947368421052,0.12160000000000001]
["1955-04-23",8280,"ديزل ",0.38,25,102,1210,2152,942,65.78947368421052,14.3184]
["1905-07-12",8280,"ديزل ",0.38,25,102,102,10255,10153,65.78947368421052,154.32560000000001]
["1905-07-12",8779,"ديزل ",0.38,25,105,142,90,8,65.78947368421052,0.12160000000000001]
["1914-07-29",2218,"ديزل ",0.38,25,1246,1530,1689,159,65.78947368421052,2.4168000000000003]
["1905-07-10",2218,"ديزل ",0.38,25,99,1689,4567,2878,65.78947368421052,43.745600000000003]
["2018-12-05",2218,"ديزل ",0.38,25,12,1689,1700,11,65.78947368421052,0.16720000000000002]

{"sheet":"February","index":3,"n_rows":6,"n_cols":11,"rows_kept":6,"cut":false,"hidden":false,"merged":[]}
["التاريخ ","رقم السيارة ","نوع الوقود","سعر اللتر ","المبلغ المدفوع","رقم الكرت ","قراءة العداد عند\nتموين السيارة\nالمره الأولى","قراءة العداد عند\nتموين السيارة\nالمره الثانيه","المسافـــــــة\nالمقطوعــــة","كمية البنزين\nالممونه للسياره\n( المره الثانيه )","معدل إستهلاك\nالوقود"]
["1955-04-23",8280,"ديزل ",0.38,25,102,1210,2152,942,65.78947368421052,14.3184]
["1905-07-12",8280,"ديزل ",0.38,25,102,102,10255,10153,65.78947368421052,154.32560000000001]
["1905-07-12",8779,"ديزل ",0.38,25,105,142,150,8,65.78947368421052,0.12160000000000001]
["1900-07-20",2218,"ديزل ",0.38,25,15,1521,1530,9,65.78947368421052,0.1368]
["1955-04-23",8280,"ديزل ",0.38,25,102,1210,2152,942,65.78947368421052,14.3184]

{"sheet":"March","index":4,"n_rows":6,"n_cols":11,"rows_kept":6,"cut":false,"hidden":false,"merged":[]}
["التاريخ ","رقم السيارة ","نوع الوقود","سعر اللتر ","المبلغ المدفوع","رقم الكرت ","قراءة العداد عند\nتموين السيارة\nالمره الأولى","قراءة العداد عند\nتموين السيارة\nالمره الثانيه","المسافـــــــة\nالمقطوعــــة","كمية البنزين\nالممونه للسياره\n( المره الثانيه )","معدل إستهلاك\nالوقود"]
["1955-04-23",8280,"ديزل ",0.38,25,102,1210,2152,942,65.78947368421052,14.3184]
["1905-07-12",8280,"ديزل ",0.38,25,102,102,10255,10153,65.78947368421052,154.32560000000001]
["1905-07-12",8779,"ديزل ",0.38,25,105,142,150,8,65.78947368421052,0.12160000000000001]
["1900-07-20",2218,"ديزل ",0.38,25,15,1521,1530,9,65.78947368421052,0.1368]
["1955-04-23",8280,"ديزل ",0.38,25,102,1210,2152,942,65.78947368421052,14.3184]

{"sheet":"April","index":5,"n_rows":6,"n_cols":11,"rows_kept":6,"cut":false,"hidden":false,"merged":[]}
["التاريخ ","رقم السيارة ","نوع الوقود","سعر اللتر ","المبلغ المدفوع","رقم الكرت ","قراءة العداد عند\nتموين السيارة\nالمره الأولى","قراءة العداد عند\nتموين السيارة\nالمره الثانيه","المسافـــــــة\nالمقطوعــــة","كمية البنزين\nالممونه للسياره\n( المره الثانيه )","معدل إستهلاك\nالوقود"]
["1955-04-23",8280,"ديزل ",0.38,25,102,1210,2152,942,65.78947368421052,14.3184]
["1905-07-12",8280,"ديزل ",0.38,25,102,102,10255,10153,65.78947368421052,154.32560000000001]
["1905-07-12",8779,"ديزل ",0.38,25,105,142,150,8,65.78947368421052,0.12160000000000001]
["1900-07-20",2218,"ديزل ",0.38,25,15,1521,1530,9,65.78947368421052,0.1368]
["1955-04-23",8280,"ديزل ",0.38,25,102,1210,2152,942,65.78947368421052,14.3184]

{"sheet":"May","index":6,"n_rows":6,"n_cols":11,"rows_kept":6,"cut":false,"hidden":false,"merged":[]}
["التاريخ ","رقم السيارة ","نوع الوقود","سعر اللتر ","المبلغ المدفوع","رقم الكرت ","قراءة العداد عند\nتموين السيارة\nالمره الأولى","قراءة العداد عند\nتموين السيارة\nالمره الثانيه","المسافـــــــة\nالمقطوعــــة","كمية البنزين\nالممونه للسياره\n( المره الثانيه )","معدل إستهلاك\nالوقود"]
["1955-04-23",8280,"ديزل ",0.38,25,102,1210,2152,942,65.78947368421052,14.3184]
["1905-07-12",8280,"ديزل ",0.38,25,102,102,10255,10153,65.78947368421052,154.32560000000001]
["1905-07-12",8779,"ديزل ",0.38,25,105,142,150,8,65.78947368421052,0.12160000000000001]
["1900-07-20",2218,"ديزل ",0.38,25,15,1521,1530,9,65.78947368421052,0.1368]
["1955-04-23",8280,"ديزل ",0.38,25,102,1210,2152,942,65.78947368421052,14.3184]