{"text_format":"1","workbook":"xlsx","n_sheets":7,"sheets":["Sheets","السيارات ","January","February","March","April","May"],"not_rendered":{"charts":0,"images":0,"macros":1,"external_links":0,"defined_names":8,"comments":1,"pivot_tables":0},"unopened":[],"bounds":{"document_bytes":16777216,"sheet_cells":100000,"rows_first":2000,"rows_last":500,"rows_between":2000,"halvings":0,"cell_chars":16384,"cell_head_chars":4096},"cells_cut":0,"cells_raw":0,"read":"whole","date_system":"1900"}

{"sheet":"Sheets","index":0,"n_rows":10,"n_cols":15,"rows_kept":10,"cut":false,"hidden":false,"merged":[[1,8,2,8],[1,0,2,0],[1,1,2,1],[1,3,2,3],[1,4,2,4],[1,6,2,6],[1,7,2,7],[1,5,2,5],[1,2,2,2]]}
["اختار الشهر الميلادي","January",null,null,null,null,null,null,null,"تاريخ اليوم",{"$f":"TODAY()","v":"2018-12-06"},"رقم السيارة ",{"$f":"C4","v":2218},"رقم الكرت ","عدد مرات التعبئة"]
["التاريخ ","نوع الوقود","رقم السيارة ","سعر اللتر ","المبلغ المدفوع","رقم الكرت ","قراءة العداد السابق","قراءة العداد الجديد","المسافـــــــة\nالمقطوعــــة","كمية البنزين\nالممونه للسياره\n( المره الثانيه )","معدل إستهلاك\nالوقود","قراءة العداد السابق",{"$f":"IFERROR(VLOOKUP(M1,January!$C$2:$H$989,MATCH(L2,January!$C$1:$H$1,0),0),\"0\")","v":2152},{"$f":"IFERROR(VLOOKUP(M1,January!$C$2:H163,MATCH(N1,January!$C$1:$H$1,0),0),\"0\")","v":102},{"$f":"IFERROR(COUNTIF(January!$C$2:C6,$M$1),\"\")","v":5}]
[null,null,null,null,null,null,null,null,null,"لتــــــر","كم / لتر\n"]
[null,"ديزل ",2218,{"$f":"IF(B4=\"بنزين\",'السيارات '!D20,'السيارات '!D21)","v":0.38},25,null,{"$f":"IFERROR(VLOOKUP(C4,January!C2:H227,MATCH(L2,January!$C$1:$H$1,0),0),\"\")","v":2152},null,{"$f":"IFERROR(H4-G4,\"\")","v":-2152},{"$f":"IFERROR(E4/D4,\"\")","v":65.78947368421052},{"$f":"IFERROR(I4/J4,\"\")","v":-32.7104}]
[]
[]
[]
[]
[null,null,null,null,null,null,null,null,null,null,null,null,{"$f":"MATCH(L2,January!$C$1:$H$1,0)","v":6}]
[null,null,null,null,null,null,null,null,null,null,null,{"$f":"VLOOKUP(C4,January!C2:H6,6,0)","v":2152}]

{"sheet":"السيارات ","index":1,"n_rows":27,"n_cols":16,"rows_kept":27,"cut":false,"hidden":true,"merged":[[3,1,4,1],[9,2,9,4],[10,2,10,4],[11,2,11,4],[12,2,12,4],[14,2,14,4],[15,2,15,4],[13,2,13,4],[3,2,4,4],[3,5,4,5],[5,2,5,4],[6,2,6,4],[7,2,7,4],[8,2,8,4]]}
[]
[]
[]
[null,"رقم ","نوع السيارة ",null,null,"رقم السيارة",null,"م","الشهر "]
[null,null,null,null,null,null,null,1,"January"]
[null,1,"هينو ",null,null,2218,null,2,"February"]
[null,2,"هينو ",null,null,2219,null,3,"March"]
[null,3,"هينو ",null,null,2217,null,4,"April"]
[null,4,"هينو ",null,null,2231,null,5,"May",null,"نوع الوقود","ديزل "]
[null,5,"اسيزو ",null,null,8280,null,6,"June",null,"السيارة",2217]
[null,6,"اسيزو ",null,null,8828,null,7,"July",null,"السعر"]
[null,7,"اسيزو ",null,null,8779,null,8,"August"]
[null,8,"اسيزو ",null,null,1491,null,9,"September"]
[null,9,"مستوبيشي",null,null,5764,null,10,"October"]
[null,10,"رافعة ",null,null,"رافعة كبيرة",null,11,"November"]
[null,11,"رافعة ",null,null,"رافعة صغيرة",null,12,"December"]
[]
[null,null,null,null,null,null,null,null,null,null,null,"ديزل","بنزين","السعر ",null,"رقم السيارة "]
[null,"الرقم ","نوع الوقود ","السعر / لتر",null,null,null,null,null,null,null,5764,"رافعة كبيرة",2.04]
[null,2,"بنزين",2.04,null,null,null,null,null,null,null,2218,"رافعة صغيرة",0.38]
[null,3,"ديزل ",0.38,null,null,null,null,null,null,null,2219]
[null,null,null,null,null,null,null,null,null,null,null,2217]
[null,null,null,null,null,null,null,null,null,null,null,2231]
[null,null,null,null,null,null,null,null,null,null,null,8280]
[null,null,null,null,null,null,null,null,null,null,null,8828]
[null,null,null,null,null,null,null,null,null,null,null,8779]
[null,null,null,null,null,null,null,null,null,null,null,1491]

{"sheet":"January","index":2,"n_rows":6,"n_cols":11,"rows_kept":6,"cut":false,"hidden":false,"merged":[]}
["التاريخ ","نوع الوقود","رقم السيارة ","سعر اللتر ","المبلغ المدفوع","رقم الكرت ","قراءة العداد الجديد","قراءة العداد السابق","المسافـــــــة\nالمقطوعــــة","كمية البنزين\nالممونه للسياره\n( المره الثانيه )","معدل إستهلاك\nالوقود"]
["1905-03-14","ديزل ",2218,0.38,25,102,1210,2152,942,65.78947368421052,14.3184]
["1955-04-23","ديزل ",2218,0.38,25,102,1210,2152,942,65.78947368421052,14.3184]
["1914-07-29","ديزل ",2218,0.38,25,1246,1530,1689,159,65.78947368421052,2.4168000000000003]
["1905-07-10","ديزل ",2218,0.38,25,99,1689,4567,2878,65.78947368421052,43.745600000000003]
["2018-12-05","ديزل ",2218,0.38,25,12,1689,1700,11,65.78947368421052,0.16720000000000002]

{"sheet":"February","index":3,"n_rows":6,"n_cols":11,"rows_kept":6,"cut":false,"hidden":false,"merged":[]}
["التاريخ ","نوع الوقود","رقم السيارة ","سعر اللتر ","المبلغ المدفوع","رقم الكرت ","قراءة العداد عند\nتموين السيارة\nالمره الأولى","قراءة العداد عند\nتموين السيارة\nالمره الثانيه","المسافـــــــة\nالمقطوعــــة","كمية البنزين\nالممونه للسياره\n( المره الثانيه )","معدل إستهلاك\nالوقود"]
["1955-04-23","ديزل ",8280,0.38,25,102,1210,2152,942,65.78947368421052,14.3184]
["1905-07-12","ديزل ",8280,0.38,25,102,102,10255,10153,65.78947368421052,154.32560000000001]
["1905-07-12","ديزل ",8779,0.38,25,105,142,150,8,65.78947368421052,0.12160000000000001]
["1900-07-20","ديزل ",2218,0.38,25,15,1521,1530,9,65.78947368421052,0.1368]
["1955-04-23","ديزل ",8280,0.38,25,102,1210,2152,942,65.78947368421052,14.3184]

{"sheet":"March","index":4,"n_rows":6,"n_cols":11,"rows_kept":6,"cut":false,"hidden":false,"merged":[]}
["التاريخ ","نوع الوقود","رقم السيارة ","سعر اللتر ","المبلغ المدفوع","رقم الكرت ","قراءة العداد عند\nتموين السيارة\nالمره الأولى","قراءة العداد عند\nتموين السيارة\nالمره الثانيه","المسافـــــــة\nالمقطوعــــة","كمية البنزين\nالممونه للسياره\n( المره الثانيه )","معدل إستهلاك\nالوقود"]
["1955-04-23","ديزل ",8280,0.38,25,102,1210,2152,942,65.78947368421052,14.3184]
["1905-07-12","ديزل ",8280,0.38,25,102,102,10255,10153,65.78947368421052,154.32560000000001]
["1905-07-12","ديزل ",8779,0.38,25,105,142,150,8,65.78947368421052,0.12160000000000001]
["1900-07-20","ديزل ",2218,0.38,25,15,1521,1530,9,65.78947368421052,0.1368]
["1955-04-23","ديزل ",8280,0.38,25,102,1210,2152,942,65.78947368421052,14.3184]

{"sheet":"April","index":5,"n_rows":6,"n_cols":11,"rows_kept":6,"cut":false,"hidden":false,"merged":[]}
["التاريخ ","نوع الوقود","رقم السيارة ","سعر اللتر ","المبلغ المدفوع","رقم الكرت ","قراءة العداد عند\nتموين السيارة\nالمره الأولى","قراءة العداد عند\nتموين السيارة\nالمره الثانيه","المسافـــــــة\nالمقطوعــــة","كمية البنزين\nالممونه للسياره\n( المره الثانيه )","معدل إستهلاك\nالوقود"]
["1955-04-23","ديزل ",8280,0.38,25,102,1210,2152,942,65.78947368421052,14.3184]
["1905-07-12","ديزل ",8280,0.38,25,102,102,10255,10153,65.78947368421052,154.32560000000001]
["1905-07-12","ديزل ",8779,0.38,25,105,142,150,8,65.78947368421052,0.12160000000000001]
["1900-07-20","ديزل ",2218,0.38,25,15,1521,1530,9,65.78947368421052,0.1368]
["1955-04-23","ديزل ",8280,0.38,25,102,1210,2152,942,65.78947368421052,14.3184]

{"sheet":"May","index":6,"n_rows":6,"n_cols":11,"rows_kept":6,"cut":false,"hidden":false,"merged":[]}
["التاريخ ","نوع الوقود","رقم السيارة ","سعر اللتر ","المبلغ المدفوع","رقم الكرت ","قراءة العداد عند\nتموين السيارة\nالمره الأولى","قراءة العداد عند\nتموين السيارة\nالمره الثانيه","المسافـــــــة\nالمقطوعــــة","كمية البنزين\nالممونه للسياره\n( المره الثانيه )","معدل إستهلاك\nالوقود"]
["1955-04-23","ديزل ",8280,0.38,25,102,1210,2152,942,65.78947368421052,14.3184]
["1905-07-12","ديزل ",8280,0.38,25,102,102,10255,10153,65.78947368421052,154.32560000000001]
["1905-07-12","ديزل ",8779,0.38,25,105,142,150,8,65.78947368421052,0.12160000000000001]
["1900-07-20","ديزل ",2218,0.38,25,15,1521,1530,9,65.78947368421052,0.1368]
["1955-04-23","ديزل ",8280,0.38,25,102,1210,2152,942,65.78947368421052,14.3184]