{"text_format":"1","workbook":"xlsx","n_sheets":3,"sheets":["Sheet1","Sheet2","Sheet3"],"not_rendered":{"charts":0,"images":0,"macros":1,"external_links":0,"defined_names":0,"comments":0,"pivot_tables":0},"unopened":[],"bounds":{"document_bytes":16777216,"sheet_cells":100000,"rows_first":2000,"rows_last":500,"rows_between":2000,"halvings":0,"cell_chars":16384,"cell_head_chars":4096},"cells_cut":0,"cells_raw":0,"read":"whole","date_system":"1900"}

{"sheet":"Sheet1","index":0,"n_rows":11,"n_cols":36,"rows_kept":11,"cut":false,"hidden":false,"merged":[]}
[null,"col_num","max"]
[null,8,42]
[]
[{"$f":"IF(A6<>\"\",\"Column : \"&COLUMNS($A$1:A1),\"\")","v":"Column : 1"},{"$f":"IF(B6<>\"\",\"Column : \"&COLUMNS($A$1:B1),\"\")","v":"Column : 2"},{"$f":"IF(C6<>\"\",\"Column : \"&COLUMNS($A$1:C1),\"\")","v":"Column : 3"},{"$f":"IF(D6<>\"\",\"Column : \"&COLUMNS($A$1:D1),\"\")","v":"Column : 4"},{"$f":"IF(E6<>\"\",\"Column : \"&COLUMNS($A$1:E1),\"\")","v":"Column : 5"},{"$f":"IF(F6<>\"\",\"Column : \"&COLUMNS($A$1:F1),\"\")","v":"Column : 6"},{"$f":"IF(G6<>\"\",\"Column : \"&COLUMNS($A$1:G1),\"\")","v":"Column : 7"},{"$f":"IF(H6<>\"\",\"Column : \"&COLUMNS($A$1:H1),\"\")","v":"Column : 8"},{"$f":"IF(I6<>\"\",\"Column : \"&COLUMNS($A$1:I1),\"\")","v":""},{"$f":"IF(J6<>\"\",\"Column : \"&COLUMNS($A$1:J1),\"\")","v":""},{"$f":"IF(K6<>\"\",\"Column : \"&COLUMNS($A$1:K1),\"\")","v":""},{"$f":"IF(L6<>\"\",\"Column : \"&COLUMNS($A$1:L1),\"\")","v":""},{"$f":"IF(M6<>\"\",\"Column : \"&COLUMNS($A$1:M1),\"\")","v":""},{"$f":"IF(N6<>\"\",\"Column : \"&COLUMNS($A$1:N1),\"\")","v":""},{"$f":"IF(O6<>\"\",\"Column : \"&COLUMNS($A$1:O1),\"\")","v":""},{"$f":"IF(P6<>\"\",\"Column : \"&COLUMNS($A$1:P1),\"\")","v":""},{"$f":"IF(Q6<>\"\",\"Column : \"&COLUMNS($A$1:Q1),\"\")","v":""},{"$f":"IF(R6<>\"\",\"Column : \"&COLUMNS($A$1:R1),\"\")","v":""},{"$f":"IF(S6<>\"\",\"Column : \"&COLUMNS($A$1:S1),\"\")","v":""},{"$f":"IF(T6<>\"\",\"Column : \"&COLUMNS($A$1:T1),\"\")","v":""},{"$f":"IF(U6<>\"\",\"Column : \"&COLUMNS($A$1:U1),\"\")","v":""},{"$f":"IF(V6<>\"\",\"Column : \"&COLUMNS($A$1:V1),\"\")","v":""},{"$f":"IF(W6<>\"\",\"Column : \"&COLUMNS($A$1:W1),\"\")","v":""},{"$f":"IF(X6<>\"\",\"Column : \"&COLUMNS($A$1:X1),\"\")","v":""},{"$f":"IF(Y6<>\"\",\"Column : \"&COLUMNS($A$1:Y1),\"\")","v":""},{"$f":"IF(Z6<>\"\",\"Column : \"&COLUMNS($A$1:Z1),\"\")","v":""},{"$f":"IF(AA6<>\"\",\"Column : \"&COLUMNS($A$1:AA1),\"\")","v":""},{"$f":"IF(AB6<>\"\",\"Column : \"&COLUMNS($A$1:AB1),\"\")","v":""},{"$f":"IF(AC6<>\"\",\"Column : \"&COLUMNS($A$1:AC1),\"\")","v":""},{"$f":"IF(AD6<>\"\",\"Column : \"&COLUMNS($A$1:AD1),\"\")","v":""},{"$f":"IF(AE6<>\"\",\"Column : \"&COLUMNS($A$1:AE1),\"\")","v":""},{"$f":"IF(AF6<>\"\",\"Column : \"&COLUMNS($A$1:AF1),\"\")","v":""},{"$f":"IF(AG6<>\"\",\"Column : \"&COLUMNS($A$1:AG1),\"\")","v":""},{"$f":"IF(AH6<>\"\",\"Column : \"&COLUMNS($A$1:AH1),\"\")","v":""},{"$f":"IF(AI6<>\"\",\"Column : \"&COLUMNS($A$1:AI1),\"\")","v":""},{"$f":"IF(AJ6<>\"\",\"Column : \"&COLUMNS($A$1:AJ1),\"\")","v":""}]
[]
[1,2,3,4,5,6,7,8]
[9,10,11,12,13,14,15,16]
[17,18,19,20,21,22,23,24]
[25,26,27,28,29,30,31,32]
[33,34,35,36,37,38,39,40]
[41,42]

{"sheet":"Sheet2","index":1,"n_rows":0,"n_cols":0,"rows_kept":0,"cut":false,"hidden":false,"merged":[]}

{"sheet":"Sheet3","index":2,"n_rows":0,"n_cols":0,"rows_kept":0,"cut":false,"hidden":false,"merged":[]}