{"text_format":"1","workbook":"xlsx","n_sheets":2,"sheets":["Sheet3","Sheet2"],"not_rendered":{"charts":0,"images":0,"macros":1,"external_links":0,"defined_names":1,"comments":0,"pivot_tables":0},"unopened":[],"bounds":{"document_bytes":16777216,"sheet_cells":100000,"rows_first":2000,"rows_last":500,"rows_between":2000,"halvings":0,"cell_chars":16384,"cell_head_chars":4096},"cells_cut":0,"cells_raw":0,"read":"whole","date_system":"1900"}

{"sheet":"Sheet3","index":0,"n_rows":43,"n_cols":3,"rows_kept":43,"cut":false,"hidden":false,"merged":[[20,4,20,6],[10,0,11,2]]}
[]
[]
[]
[]
["التاريخ",{"$f":"TODAY()","v":"2018-12-17"}]
[]
[]
[]
["السادة /","مدرسة الرياض الثانوية","المحترمين"]
[null,"السلام عليكم ورحمة الله وبركاته"]
["نهديكم اطيب تحية وبعد... نأمل من سعادتكم السماح للطالب أدناه بالخروج من المدرسة بعد الحصة الثالثة يوم الثلاثاء الموافق 09/10/2018م حيث تم اختياره ضمن فريق كرة القدم لفئة البراعم بالنادي للمشاركة في مباراة ضد فريق نادي الرياضي ضمن منافسات دوري المنطقة لكرة القدم."]
[]
[]
["م","  اسم اللاعب ","الصفة    "]
[{"$f":"IFERROR(VLOOKUP(ROW()-14,Sheet2!$A$6:$G$54,2,0),\"\")","v":8},{"$f":"IFERROR(VLOOKUP(ROW()-14,Sheet2!$A$6:$G$54,4,0),\"\")","v":"اللاعب 8"},"لاعب"]
[{"$f":"IFERROR(VLOOKUP(ROW()-14,Sheet2!$A$6:$G$54,2,0),\"\")","v":31},{"$f":"IFERROR(VLOOKUP(ROW()-14,Sheet2!$A$6:$G$54,4,0),\"\")","v":"اللاعب 31"}]
[{"$f":"IFERROR(VLOOKUP(ROW()-14,Sheet2!$A$6:$G$54,2,0),\"\")","v":32},{"$f":"IFERROR(VLOOKUP(ROW()-14,Sheet2!$A$6:$G$54,4,0),\"\")","v":"اللاعب 32"}]
[{"$f":"IFERROR(VLOOKUP(ROW()-14,Sheet2!$A$6:$G$54,2,0),\"\")","v":42},{"$f":"IFERROR(VLOOKUP(ROW()-14,Sheet2!$A$6:$G$54,4,0),\"\")","v":"اللاعب 42"}]
[{"$f":"IFERROR(VLOOKUP(ROW()-14,Sheet2!$A$6:$G$54,2,0),\"\")","v":43},{"$f":"IFERROR(VLOOKUP(ROW()-14,Sheet2!$A$6:$G$54,4,0),\"\")","v":"اللاعب 43"}]
[{"$f":"IFERROR(VLOOKUP(ROW()-14,Sheet2!$A$6:$G$54,2,0),\"\")","v":45},{"$f":"IFERROR(VLOOKUP(ROW()-14,Sheet2!$A$6:$G$54,4,0),\"\")","v":"اللاعب 45"}]
[{"$f":"IFERROR(VLOOKUP(ROW()-14,Sheet2!$A$6:$G$54,2,0),\"\")","v":""},{"$f":"IFERROR(VLOOKUP(ROW()-14,Sheet2!$A$6:$G$54,4,0),\"\")","v":""}]
[{"$f":"IFERROR(VLOOKUP(ROW()-14,Sheet2!$A$6:$G$54,2,0),\"\")","v":""},{"$f":"IFERROR(VLOOKUP(ROW()-14,Sheet2!$A$6:$G$54,4,0),\"\")","v":""}]
[{"$f":"IFERROR(VLOOKUP(ROW()-14,Sheet2!$A$6:$G$54,2,0),\"\")","v":""},{"$f":"IFERROR(VLOOKUP(ROW()-14,Sheet2!$A$6:$G$54,4,0),\"\")","v":""}]
[{"$f":"IFERROR(VLOOKUP(ROW()-14,Sheet2!$A$6:$G$54,2,0),\"\")","v":""},{"$f":"IFERROR(VLOOKUP(ROW()-14,Sheet2!$A$6:$G$54,4,0),\"\")","v":""}]
[{"$f":"IFERROR(VLOOKUP(ROW()-14,Sheet2!$A$6:$G$54,2,0),\"\")","v":""},{"$f":"IFERROR(VLOOKUP(ROW()-14,Sheet2!$A$6:$G$54,4,0),\"\")","v":""}]
[]
[]
[]
[]
[]
[]
[]
[]
[]
[]
[]
[]
[]
[]
[null,"ولكم خالص تحياتنا،،،"]
[null,"                                                                 أمين عام نادي "]
[]
[null,"                                                                خالد احمد الفهد"]

{"sheet":"Sheet2","index":1,"n_rows":142,"n_cols":22,"rows_kept":142,"cut":false,"hidden":false,"merged":[[59,1,59,2],[2,1,2,2],[1,1,1,2],[0,1,0,3],[57,1,57,3],[58,1,58,2]]}
[]
[null,"اسم اللعبة: كرة القدم"]
[null,"الدرجــة:  البراعم"]
[]
["عمود مساعد","م"," رقم اللاعب  ","  اسم اللاعب ","ميلاد اللاعب بالهجري","ميلاد اللاعب بالميلادي","المدرسة","الطول","الوزن"]
[{"$f":"IF(Sheet3!$B$9=Sheet2!$G$6:$G$54,COUNTIF(Sheet2!$G$6:G6,Sheet2!G6),\"\")","v":""},1,100,"اللاعب 1",{"$f":"F6","v":"2004-05-06"},"2004-05-06","مدرسة سعد بن الحارث المتوسطة ",null,null,null,null,null,null,null,null,null,null,null,null,null,null,{"$f":"IFERROR(INDEX($G$6:$G$54,MATCH(0,COUNTIF($V$5:V5,$G$6:$G$54),0)),\"\")","v":"مدرسة سعد بن الحارث المتوسطة "}]
[{"$f":"IF(Sheet3!$B$9=Sheet2!$G$6:$G$54,COUNTIF(Sheet2!$G$6:G7,Sheet2!G7),\"\")","v":""},2,101,"اللاعب 2",{"$f":"F7","v":"2004-04-15"},"2004-04-15","مدرسة سعد بن الحارث المتوسطة ",null,null,null,null,null,null,null,null,null,null,null,null,null,null,{"$f":"IFERROR(INDEX($G$6:$G$54,MATCH(0,COUNTIF($V$5:V6,$G$6:$G$54),0)),\"\")","v":"فخر الدين الرازي المتوسطة"}]
[{"$f":"IF(Sheet3!$B$9=Sheet2!$G$6:$G$54,COUNTIF(Sheet2!$G$6:G8,Sheet2!G8),\"\")","v":""},3,102,"اللاعب 3",{"$f":"F8","v":"2004-03-18"},"2004-03-18","فخر الدين الرازي المتوسطة",null,null,null,null,null,null,null,null,null,null,null,null,null,null,{"$f":"IFERROR(INDEX($G$6:$G$54,MATCH(0,COUNTIF($V$5:V7,$G$6:$G$54),0)),\"\")","v":"مدرسة العلوم "}]
[{"$f":"IF(Sheet3!$B$9=Sheet2!$G$6:$G$54,COUNTIF(Sheet2!$G$6:G9,Sheet2!G9),\"\")","v":""},4,103,"اللاعب 4",{"$f":"F9","v":"2003-03-01"},"2003-03-01","مدرسة العلوم ",null,null,null,null,null,null,null,null,null,null,null,null,null,null,{"$f":"IFERROR(INDEX($G$6:$G$54,MATCH(0,COUNTIF($V$5:V8,$G$6:$G$54),0)),\"\")","v":"مدرسة عثمان بن العاص المتوسطة"}]
[{"$f":"IF(Sheet3!$B$9=Sheet2!$G$6:$G$54,COUNTIF(Sheet2!$G$6:G10,Sheet2!G10),\"\")","v":""},5,104,"اللاعب 5","2004-03-22","2004-03-22","مدرسة سعد بن الحارث المتوسطة ",null,null,null,null,null,null,null,null,null,null,null,null,null,null,{"$f":"IFERROR(INDEX($G$6:$G$54,MATCH(0,COUNTIF($V$5:V9,$G$6:$G$54),0)),\"\")","v":"مدرسة الرياض الثانوية"}]
[{"$f":"IF(Sheet3!$B$9=Sheet2!$G$6:$G$54,COUNTIF(Sheet2!$G$6:G11,Sheet2!G11),\"\")","v":""},6,105,"اللاعب 6","2004-04-12","2004-04-12","مدرسة عثمان بن العاص المتوسطة",null,null,null,null,null,null,null,null,null,null,null,null,null,null,{"$f":"IFERROR(INDEX($G$6:$G$54,MATCH(0,COUNTIF($V$5:V10,$G$6:$G$54),0)),\"\")","v":"مدرسة يزيد بن عبد الملك الثانوية "}]
[{"$f":"IF(Sheet3!$B$9=Sheet2!$G$6:$G$54,COUNTIF(Sheet2!$G$6:G12,Sheet2!G12),\"\")","v":""},7,106,"اللاعب 7","2004-10-03","2004-10-03","مدرسة سعد بن الحارث المتوسطة ",null,null,null,null,null,null,null,null,null,null,null,null,null,null,{"$f":"IFERROR(INDEX($G$6:$G$54,MATCH(0,COUNTIF($V$5:V11,$G$6:$G$54),0)),\"\")","v":"مدرسة ابن القيم المتوسطة"}]
[{"$f":"IF(Sheet3!$B$9=Sheet2!$G$6:$G$54,COUNTIF(Sheet2!$G$6:G13,Sheet2!G13),\"\")","v":1},8,107,"اللاعب 8","2003-05-12","2003-05-12","مدرسة الرياض الثانوية",null,null,null,null,null,null,null,null,null,null,null,null,null,null,{"$f":"IFERROR(INDEX($G$6:$G$54,MATCH(0,COUNTIF($V$5:V12,$G$6:$G$54),0)),\"\")","v":"مدرسة ليث بن سعد لمتوسطة"}]
[{"$f":"IF(Sheet3!$B$9=Sheet2!$G$6:$G$54,COUNTIF(Sheet2!$G$6:G14,Sheet2!G14),\"\")","v":""},9,108,"اللاعب 9","2004-08-09","2004-08-09","مدرسة سعد بن الحارث المتوسطة ",null,null,null,null,null,null,null,null,null,null,null,null,null,null,{"$f":"IFERROR(INDEX($G$6:$G$54,MATCH(0,COUNTIF($V$5:V13,$G$6:$G$54),0)),\"\")","v":"مدرسة دار الحكمة الثانوية"}]
[{"$f":"IF(Sheet3!$B$9=Sheet2!$G$6:$G$54,COUNTIF(Sheet2!$G$6:G15,Sheet2!G15),\"\")","v":""},10,109,"اللاعب 10","2004-08-14","2004-08-14","مدرسة العلوم ",null,null,null,null,null,null,null,null,null,null,null,null,null,null,{"$f":"IFERROR(INDEX($G$6:$G$54,MATCH(0,COUNTIF($V$5:V14,$G$6:$G$54),0)),\"\")","v":"مدرسة عكاظ الثانوية"}]
[{"$f":"IF(Sheet3!$B$9=Sheet2!$G$6:$G$54,COUNTIF(Sheet2!$G$6:G16,Sheet2!G16),\"\")","v":""},11,110,"اللاعب 11","2003-07-12","2003-07-12","مدرسة العلوم ",null,null,null,null,null,null,null,null,null,null,null,null,null,null,{"$f":"IFERROR(INDEX($G$6:$G$54,MATCH(0,COUNTIF($V$5:V15,$G$6:$G$54),0)),\"\")","v":"مدرسة التهذيب الاهليه الثانوية"}]
[{"$f":"IF(Sheet3!$B$9=Sheet2!$G$6:$G$54,COUNTIF(Sheet2!$G$6:G17,Sheet2!G17),\"\")","v":""},12,111,"اللاعب 12","2003-08-24","2003-08-24","مدرسة يزيد بن عبد الملك الثانوية ",null,null,null,null,null,null,null,null,null,null,null,null,null,null,{"$f":"IFERROR(INDEX($G$6:$G$54,MATCH(0,COUNTIF($V$5:V16,$G$6:$G$54),0)),\"\")","v":"مدرسة تاروت الثانوية "}]
[{"$f":"IF(Sheet3!$B$9=Sheet2!$G$6:$G$54,COUNTIF(Sheet2!$G$6:G18,Sheet2!G18),\"\")","v":""},13,112,"اللاعب 13","2004-04-08","2004-04-08","مدرسة ابن القيم المتوسطة",null,null,null,null,null,null,null,null,null,null,null,null,null,null,{"$f":"IFERROR(INDEX($G$6:$G$54,MATCH(0,COUNTIF($V$5:V17,$G$6:$G$54),0)),\"\")","v":"مدرسة سعد بن عبادة الثانوية"}]
[{"$f":"IF(Sheet3!$B$9=Sheet2!$G$6:$G$54,COUNTIF(Sheet2!$G$6:G19,Sheet2!G19),\"\")","v":""},14,113,"اللاعب 14","2003-04-25","2003-04-25","مدرسة العلوم ",null,null,null,null,null,null,null,null,null,null,null,null,null,null,{"$f":"IFERROR(INDEX($G$6:$G$54,MATCH(0,COUNTIF($V$5:V18,$G$6:$G$54),0)),\"\")","v":"مدرسةابن القيم المتوسطة"}]
[{"$f":"IF(Sheet3!$B$9=Sheet2!$G$6:$G$54,COUNTIF(Sheet2!$G$6:G20,Sheet2!G20),\"\")","v":""},15,114,"اللاعب 15","2004-07-01","2004-07-01","مدرسة ليث بن سعد لمتوسطة",null,null,null,null,null,null,null,null,null,null,null,null,null,null,{"$f":"IFERROR(INDEX($G$6:$G$54,MATCH(0,COUNTIF($V$5:V19,$G$6:$G$54),0)),\"\")","v":"مدرسة موسى بن نصيرالمتوسطة"}]
[{"$f":"IF(Sheet3!$B$9=Sheet2!$G$6:$G$54,COUNTIF(Sheet2!$G$6:G21,Sheet2!G21),\"\")","v":""},16,115,"اللاعب 16","2003-12-17","2003-12-17","مدرسة دار الحكمة الثانوية",null,null,null,null,null,null,null,null,null,null,null,null,null,null,{"$f":"IFERROR(INDEX($G$6:$G$54,MATCH(0,COUNTIF($V$5:V20,$G$6:$G$54),0)),\"\")","v":"مدرسة سعد بن حارث المتوسطة"}]
[{"$f":"IF(Sheet3!$B$9=Sheet2!$G$6:$G$54,COUNTIF(Sheet2!$G$6:G22,Sheet2!G22),\"\")","v":""},17,116,"اللاعب 17","2003-06-30","2003-06-30","مدرسة عكاظ الثانوية",null,null,null,null,null,null,null,null,null,null,null,null,null,null,{"$f":"IFERROR(INDEX($G$6:$G$54,MATCH(0,COUNTIF($V$5:V21,$G$6:$G$54),0)),\"\")","v":"مدرسة ابن القيم الثانوية"}]
[{"$f":"IF(Sheet3!$B$9=Sheet2!$G$6:$G$54,COUNTIF(Sheet2!$G$6:G23,Sheet2!G23),\"\")","v":""},18,117,"اللاعب 18","2003-06-30","2003-06-30","مدرسة عكاظ الثانوية",null,null,null,null,null,null,null,null,null,null,null,null,null,null,{"$f":"IFERROR(INDEX($G$6:$G$54,MATCH(0,COUNTIF($V$5:V22,$G$6:$G$54),0)),\"\")","v":"مدرسة دار العلوم الثانوية "}]
[{"$f":"IF(Sheet3!$B$9=Sheet2!$G$6:$G$54,COUNTIF(Sheet2!$G$6:G24,Sheet2!G24),\"\")","v":""},19,118,"اللاعب 19","2003-03-07","2003-03-07","مدرسة التهذيب الاهليه الثانوية",null,null,null,null,null,null,null,null,null,null,null,null,null,null,{"$f":"IFERROR(INDEX($G$6:$G$54,MATCH(0,COUNTIF($V$5:V23,$G$6:$G$54),0)),\"\")","v":"مدرسة ابن القيم الثانوية "}]
[{"$f":"IF(Sheet3!$B$9=Sheet2!$G$6:$G$54,COUNTIF(Sheet2!$G$6:G25,Sheet2!G25),\"\")","v":""},20,119,"اللاعب 20","2003-07-17","2003-07-17","مدرسة العلوم ",null,null,null,null,null,null,null,null,null,null,null,null,null,null,{"$f":"IFERROR(INDEX($G$6:$G$54,MATCH(0,COUNTIF($V$5:V24,$G$6:$G$54),0)),\"\")","v":"مدرسة الرياض المتوسطة"}]
[{"$f":"IF(Sheet3!$B$9=Sheet2!$G$6:$G$54,COUNTIF(Sheet2!$G$6:G26,Sheet2!G26),\"\")","v":""},21,120,"اللاعب 21","2003-08-01","2003-08-01","مدرسة تاروت الثانوية ",null,null,null,null,null,null,null,null,null,null,null,null,null,null,{"$f":"IFERROR(INDEX($G$6:$G$54,MATCH(0,COUNTIF($V$5:V25,$G$6:$G$54),0)),\"\")","v":"مدرسة الدمام الثانوية"}]
[{"$f":"IF(Sheet3!$B$9=Sheet2!$G$6:$G$54,COUNTIF(Sheet2!$G$6:G27,Sheet2!G27),\"\")","v":""},22,121,"اللاعب 22","2003-03-19","2003-03-19","مدرسة العلوم ",null,null,null,null,null,null,null,null,null,null,null,null,null,null,{"$f":"IFERROR(INDEX($G$6:$G$54,MATCH(0,COUNTIF($V$5:V26,$G$6:$G$54),0)),\"\")","v":""}]
[{"$f":"IF(Sheet3!$B$9=Sheet2!$G$6:$G$54,COUNTIF(Sheet2!$G$6:G28,Sheet2!G28),\"\")","v":""},23,122,"اللاعب 23","2005-09-24","2005-09-24","مدرسة العلوم ",null,null,null,null,null,null,null,null,null,null,null,null,null,null,{"$f":"IFERROR(INDEX($G$6:$G$54,MATCH(0,COUNTIF($V$5:V27,$G$6:$G$54),0)),\"\")","v":""}]
[{"$f":"IF(Sheet3!$B$9=Sheet2!$G$6:$G$54,COUNTIF(Sheet2!$G$6:G29,Sheet2!G29),\"\")","v":""},24,123,"اللاعب 24","2004-01-31","2004-01-31","مدرسة العلوم ",null,null,null,null,null,null,null,null,null,null,null,null,null,null,{"$f":"IFERROR(INDEX($G$6:$G$54,MATCH(0,COUNTIF($V$5:V28,$G$6:$G$54),0)),\"\")","v":""}]
[{"$f":"IF(Sheet3!$B$9=Sheet2!$G$6:$G$54,COUNTIF(Sheet2!$G$6:G30,Sheet2!G30),\"\")","v":""},25,124,"اللاعب 25","2003-01-10","2003-01-10","مدرسة سعد بن عبادة الثانوية",null,null,null,null,null,null,null,null,null,null,null,null,null,null,{"$f":"IFERROR(INDEX($G$6:$G$54,MATCH(0,COUNTIF($V$5:V29,$G$6:$G$54),0)),\"\")","v":""}]
[{"$f":"IF(Sheet3!$B$9=Sheet2!$G$6:$G$54,COUNTIF(Sheet2!$G$6:G31,Sheet2!G31),\"\")","v":""},26,125,"اللاعب 26","2003-09-03","2003-09-03","مدرسة يزيد بن عبد الملك الثانوية ",null,null,null,null,null,null,null,null,null,null,null,null,null,null,{"$f":"IFERROR(INDEX($G$6:$G$54,MATCH(0,COUNTIF($V$5:V30,$G$6:$G$54),0)),\"\")","v":""}]
[{"$f":"IF(Sheet3!$B$9=Sheet2!$G$6:$G$54,COUNTIF(Sheet2!$G$6:G32,Sheet2!G32),\"\")","v":""},27,126,"اللاعب 27","2003-05-24","2003-05-24","مدرسة العلوم ",null,null,null,null,null,null,null,null,null,null,null,null,null,null,{"$f":"IFERROR(INDEX($G$6:$G$54,MATCH(0,COUNTIF($V$5:V31,$G$6:$G$54),0)),\"\")","v":""}]
[{"$f":"IF(Sheet3!$B$9=Sheet2!$G$6:$G$54,COUNTIF(Sheet2!$G$6:G33,Sheet2!G33),\"\")","v":""},28,127,"اللاعب 28","2004-06-14","2004-06-14","مدرسةابن القيم المتوسطة",null,null,null,null,null,null,null,null,null,null,null,null,null,null,{"$f":"IFERROR(INDEX($G$6:$G$54,MATCH(0,COUNTIF($V$5:V32,$G$6:$G$54),0)),\"\")","v":""}]
[{"$f":"IF(Sheet3!$B$9=Sheet2!$G$6:$G$54,COUNTIF(Sheet2!$G$6:G34,Sheet2!G34),\"\")","v":""},29,128,"اللاعب 29","2004-06-23","2004-06-23","مدرسة موسى بن نصيرالمتوسطة",null,null,null,null,null,null,null,null,null,null,null,null,null,null,{"$f":"IFERROR(INDEX($G$6:$G$54,MATCH(0,COUNTIF($V$5:V33,$G$6:$G$54),0)),\"\")","v":""}]
[{"$f":"IF(Sheet3!$B$9=Sheet2!$G$6:$G$54,COUNTIF(Sheet2!$G$6:G35,Sheet2!G35),\"\")","v":""},30,129,"اللاعب 30","2004-07-21","2004-07-21","مدرسة العلوم ",null,null,null,null,null,null,null,null,null,null,null,null,null,null,{"$f":"IFERROR(INDEX($G$6:$G$54,MATCH(0,COUNTIF($V$5:V34,$G$6:$G$54),0)),\"\")","v":""}]
[{"$f":"IF(Sheet3!$B$9=Sheet2!$G$6:$G$54,COUNTIF(Sheet2!$G$6:G36,Sheet2!G36),\"\")","v":2},31,130,"اللاعب 31","2003-11-09","2003-11-09","مدرسة الرياض الثانوية",null,null,null,null,null,null,null,null,null,null,null,null,null,null,{"$f":"IFERROR(INDEX($G$6:$G$54,MATCH(0,COUNTIF($V$5:V35,$G$6:$G$54),0)),\"\")","v":""}]
[{"$f":"IF(Sheet3!$B$9=Sheet2!$G$6:$G$54,COUNTIF(Sheet2!$G$6:G37,Sheet2!G37),\"\")","v":3},32,131,"اللاعب 32","2003-12-04","2003-12-04","مدرسة الرياض الثانوية",null,null,null,null,null,null,null,null,null,null,null,null,null,null,{"$f":"IFERROR(INDEX($G$6:$G$54,MATCH(0,COUNTIF($V$5:V36,$G$6:$G$54),0)),\"\")","v":""}]
[{"$f":"IF(Sheet3!$B$9=Sheet2!$G$6:$G$54,COUNTIF(Sheet2!$G$6:G38,Sheet2!G38),\"\")","v":""},33,132,"اللاعب 33","2004-02-14","2004-02-14","مدرسة العلوم ",null,null,null,null,null,null,null,null,null,null,null,null,null,null,{"$f":"IFERROR(INDEX($G$6:$G$54,MATCH(0,COUNTIF($V$5:V37,$G$6:$G$54),0)),\"\")","v":""}]
[{"$f":"IF(Sheet3!$B$9=Sheet2!$G$6:$G$54,COUNTIF(Sheet2!$G$6:G39,Sheet2!G39),\"\")","v":""},34,133,"اللاعب 34","2004-08-13","2004-08-13","مدرسة سعد بن حارث المتوسطة",null,null,null,null,null,null,null,null,null,null,null,null,null,null,{"$f":"IFERROR(INDEX($G$6:$G$54,MATCH(0,COUNTIF($V$5:V38,$G$6:$G$54),0)),\"\")","v":""}]
[{"$f":"IF(Sheet3!$B$9=Sheet2!$G$6:$G$54,COUNTIF(Sheet2!$G$6:G40,Sheet2!G40),\"\")","v":""},35,134,"اللاعب 35","2003-05-27","2003-05-27","مدرسة العلوم ",null,null,null,null,null,null,null,null,null,null,null,null,null,null,{"$f":"IFERROR(INDEX($G$6:$G$54,MATCH(0,COUNTIF($V$5:V39,$G$6:$G$54),0)),\"\")","v":""}]
[{"$f":"IF(Sheet3!$B$9=Sheet2!$G$6:$G$54,COUNTIF(Sheet2!$G$6:G41,Sheet2!G41),\"\")","v":""},36,135,"اللاعب 36","2004-04-18","2004-04-18","مدرسة العلوم ",null,null,null,null,null,null,null,null,null,null,null,null,null,null,{"$f":"IFERROR(INDEX($G$6:$G$54,MATCH(0,COUNTIF($V$5:V40,$G$6:$G$54),0)),\"\")","v":""}]
[{"$f":"IF(Sheet3!$B$9=Sheet2!$G$6:$G$54,COUNTIF(Sheet2!$G$6:G42,Sheet2!G42),\"\")","v":""},37,136,"اللاعب 37","2003-06-11","2003-06-11","مدرسة العلوم ",null,null,null,null,null,null,null,null,null,null,null,null,null,null,{"$f":"IFERROR(INDEX($G$6:$G$54,MATCH(0,COUNTIF($V$5:V41,$G$6:$G$54),0)),\"\")","v":""}]
[{"$f":"IF(Sheet3!$B$9=Sheet2!$G$6:$G$54,COUNTIF(Sheet2!$G$6:G43,Sheet2!G43),\"\")","v":""},38,137,"اللاعب 38","2004-09-21","2004-09-21","مدرسة ابن القيم المتوسطة",null,null,null,null,null,null,null,null,null,null,null,null,null,null,{"$f":"IFERROR(INDEX($G$6:$G$54,MATCH(0,COUNTIF($V$5:V42,$G$6:$G$54),0)),\"\")","v":""}]
[{"$f":"IF(Sheet3!$B$9=Sheet2!$G$6:$G$54,COUNTIF(Sheet2!$G$6:G44,Sheet2!G44),\"\")","v":""},39,138,"اللاعب 39","2003-02-11","2003-02-11","مدرسة ابن القيم الثانوية",null,null,null,null,null,null,null,null,null,null,null,null,null,null,{"$f":"IFERROR(INDEX($G$6:$G$54,MATCH(0,COUNTIF($V$5:V43,$G$6:$G$54),0)),\"\")","v":""}]
[{"$f":"IF(Sheet3!$B$9=Sheet2!$G$6:$G$54,COUNTIF(Sheet2!$G$6:G45,Sheet2!G45),\"\")","v":""},40,139,"اللاعب 40","2003-04-20","2003-04-20","مدرسة دار العلوم الثانوية ",null,null,null,null,null,null,null,null,null,null,null,null,null,null,{"$f":"IFERROR(INDEX($G$6:$G$54,MATCH(0,COUNTIF($V$5:V44,$G$6:$G$54),0)),\"\")","v":""}]
[{"$f":"IF(Sheet3!$B$9=Sheet2!$G$6:$G$54,COUNTIF(Sheet2!$G$6:G46,Sheet2!G46),\"\")","v":""},41,140,"اللاعب 41","2003-05-26","2003-05-26","مدرسة ابن القيم الثانوية ",null,null,null,null,null,null,null,null,null,null,null,null,null,null,{"$f":"IFERROR(INDEX($G$6:$G$54,MATCH(0,COUNTIF($V$5:V45,$G$6:$G$54),0)),\"\")","v":""}]
[{"$f":"IF(Sheet3!$B$9=Sheet2!$G$6:$G$54,COUNTIF(Sheet2!$G$6:G47,Sheet2!G47),\"\")","v":4},42,141,"اللاعب 42","2003-08-09","2003-08-09","مدرسة الرياض الثانوية",null,null,null,null,null,null,null,null,null,null,null,null,null,null,{"$f":"IFERROR(INDEX($G$6:$G$54,MATCH(0,COUNTIF($V$5:V46,$G$6:$G$54),0)),\"\")","v":""}]
[{"$f":"IF(Sheet3!$B$9=Sheet2!$G$6:$G$54,COUNTIF(Sheet2!$G$6:G48,Sheet2!G48),\"\")","v":5},43,142,"اللاعب 43","2003-10-13","2003-10-13","مدرسة الرياض الثانوية",null,null,null,null,null,null,null,null,null,null,null,null,null,null,{"$f":"IFERROR(INDEX($G$6:$G$54,MATCH(0,COUNTIF($V$5:V47,$G$6:$G$54),0)),\"\")","v":""}]
[{"$f":"IF(Sheet3!$B$9=Sheet2!$G$6:$G$54,COUNTIF(Sheet2!$G$6:G49,Sheet2!G49),\"\")","v":""},44,143,"اللاعب 44","2004-12-03","2004-12-03","مدرسة الرياض المتوسطة",null,null,null,null,null,null,null,null,null,null,null,null,null,null,{"$f":"IFERROR(INDEX($G$6:$G$54,MATCH(0,COUNTIF($V$5:V48,$G$6:$G$54),0)),\"\")","v":""}]
[{"$f":"IF(Sheet3!$B$9=Sheet2!$G$6:$G$54,COUNTIF(Sheet2!$G$6:G50,Sheet2!G50),\"\")","v":6},45,144,"اللاعب 45","2003-10-29","2003-10-29","مدرسة الرياض الثانوية",null,null,null,null,null,null,null,null,null,null,null,null,null,null,{"$f":"IFERROR(INDEX($G$6:$G$54,MATCH(0,COUNTIF($V$5:V49,$G$6:$G$54),0)),\"\")","v":""}]
[{"$f":"IF(Sheet3!$B$9=Sheet2!$G$6:$G$54,COUNTIF(Sheet2!$G$6:G51,Sheet2!G51),\"\")","v":""},46,145,"اللاعب 46","2004-06-10","2004-06-10","مدرسة سعد بن الحارث المتوسطة ",null,null,null,null,null,null,null,null,null,null,null,null,null,null,{"$f":"IFERROR(INDEX($G$6:$G$54,MATCH(0,COUNTIF($V$5:V50,$G$6:$G$54),0)),\"\")","v":""}]
[{"$f":"IF(Sheet3!$B$9=Sheet2!$G$6:$G$54,COUNTIF(Sheet2!$G$6:G52,Sheet2!G52),\"\")","v":""},47,146,"اللاعب 47","2004-08-20","2004-08-20","مدرسة العلوم ",null,null,null,null,null,null,null,null,null,null,null,null,null,null,{"$f":"IFERROR(INDEX($G$6:$G$54,MATCH(0,COUNTIF($V$5:V51,$G$6:$G$54),0)),\"\")","v":""}]
[{"$f":"IF(Sheet3!$B$9=Sheet2!$G$6:$G$54,COUNTIF(Sheet2!$G$6:G53,Sheet2!G53),\"\")","v":""},48,147,"اللاعب 48","2003-04-29","2003-04-29","مدرسة الدمام الثانوية",null,null,null,null,null,null,null,null,null,null,null,null,null,null,{"$f":"IFERROR(INDEX($G$6:$G$54,MATCH(0,COUNTIF($V$5:V52,$G$6:$G$54),0)),\"\")","v":""}]
[{"$f":"IF(Sheet3!$B$9=Sheet2!$G$6:$G$54,COUNTIF(Sheet2!$G$6:G54,Sheet2!G54),\"\")","v":""},49,148,"اللاعب 49","2004-05-02","2004-05-02","مدرسة العلوم ",null,null,null,null,null,null,null,null,null,null,null,null,null,null,{"$f":"IFERROR(INDEX($G$6:$G$54,MATCH(0,COUNTIF($V$5:V53,$G$6:$G$54),0)),\"\")","v":""}]
[null,null,null,null,null,null,null,null,null,null,null,null,null,null,null,null,null,null,null,null,null,{"$f":"IFERROR(INDEX($G$6:$G$54,MATCH(0,COUNTIF($V$5:V54,$G$6:$G$54),0)),\"\")","v":""}]
[null,null,null,null,null,null,null,null,null,null,null,null,null,null,null,null,null,null,null,null,null,{"$f":"IFERROR(INDEX($G$6:$G$54,MATCH(0,COUNTIF($V$5:V55,$G$6:$G$54),0)),\"\")","v":""}]
[null,null,null,null,null,null,null,null,null,null,null,null,null,null,null,null,null,null,null,null,null,{"$f":"IFERROR(INDEX($G$6:$G$54,MATCH(0,COUNTIF($V$5:V56,$G$6:$G$54),0)),\"\")","v":""}]
[null,null,null,null,null,null,null,null,null,null,null,null,null,null,null,null,null,null,null,null,null,{"$f":"IFERROR(INDEX($G$6:$G$54,MATCH(0,COUNTIF($V$5:V57,$G$6:$G$54),0)),\"\")","v":""}]
[null,"اسم اللعبة: كرة القدم",null,null,null,null,null,null,null,null,null,null,null,null,null,null,null,null,null,null,null,{"$f":"IFERROR(INDEX($G$6:$G$54,MATCH(0,COUNTIF($V$5:V58,$G$6:$G$54),0)),\"\")","v":""}]
[null,"الدرجــة:  براعم أ",null,null,null,null,null,null,null,null,null,null,null,null,null,null,null,null,null,null,null,{"$f":"IFERROR(INDEX($G$6:$G$54,MATCH(0,COUNTIF($V$5:V59,$G$6:$G$54),0)),\"\")","v":""}]
[null,"م"," رقم اللاعب  ","  اسم اللاعب ","ميلاد اللاعب بالهجري","ميلاد اللاعب بالميلادي","المدرسة","الطول","الوزن",null,null,null,null,null,null,null,null,null,null,null,null,{"$f":"IFERROR(INDEX($G$6:$G$54,MATCH(0,COUNTIF($V$5:V60,$G$6:$G$54),0)),\"\")","v":""}]
[null,1,149,"اللاعب 50","2005-12-17","2005-12-17","مدرسة الصالحين ",null,null,null,null,null,null,null,null,null,null,null,null,null,null,{"$f":"IFERROR(INDEX($G$6:$G$54,MATCH(0,COUNTIF($V$5:V61,$G$6:$G$54),0)),\"\")","v":""}]
[null,2,150,"اللاعب 51","2005-10-25","2005-10-25","مدرسة الرياض المتوسطة",null,null,null,null,null,null,null,null,null,null,null,null,null,null,{"$f":"IFERROR(INDEX($G$6:$G$54,MATCH(0,COUNTIF($V$5:V62,$G$6:$G$54),0)),\"\")","v":""}]
[null,3,151,"اللاعب 52","2006-03-14","2006-03-14","مدرسة ابن القيم المتوسطة ",null,null,null,null,null,null,null,null,null,null,null,null,null,null,{"$f":"IFERROR(INDEX($G$6:$G$54,MATCH(0,COUNTIF($V$5:V63,$G$6:$G$54),0)),\"\")","v":""}]
[null,4,152,"اللاعب 53","2005-02-28","2005-02-28","مدرسة الرياض المتوسطة",null,null,null,null,null,null,null,null,null,null,null,null,null,null,{"$f":"IFERROR(INDEX($G$6:$G$54,MATCH(0,COUNTIF($V$5:V64,$G$6:$G$54),0)),\"\")","v":""}]
[null,5,153,"اللاعب 54","2006-10-11","2006-10-11","مدرسة الصالحين ",null,null,null,null,null,null,null,null,null,null,null,null,null,null,{"$f":"IFERROR(INDEX($G$6:$G$54,MATCH(0,COUNTIF($V$5:V65,$G$6:$G$54),0)),\"\")","v":""}]
[null,6,154,"اللاعب 55","2005-10-15","2005-10-15","مدرسة ابن القيم المتوسطة",null,null,null,null,null,null,null,null,null,null,null,null,null,null,{"$f":"IFERROR(INDEX($G$6:$G$54,MATCH(0,COUNTIF($V$5:V66,$G$6:$G$54),0)),\"\")","v":""}]
[null,7,155,"اللاعب 56","2005-02-24","2005-02-24","مدرسة سعد بن حارث المتوسطة  ",null,null,null,null,null,null,null,null,null,null,null,null,null,null,{"$f":"IFERROR(INDEX($G$6:$G$54,MATCH(0,COUNTIF($V$5:V67,$G$6:$G$54),0)),\"\")","v":""}]
[null,8,156,"اللاعب 57","2006-03-18","2006-03-18","مدرسة سعد بن حارث المتوسطة  ",null,null,null,null,null,null,null,null,null,null,null,null,null,null,{"$f":"IFERROR(INDEX($G$6:$G$54,MATCH(0,COUNTIF($V$5:V68,$G$6:$G$54),0)),\"\")","v":""}]
[null,9,157,"اللاعب 58","2005-10-20","2005-10-20","مدرسة الرياض المتوسطة",null,null,null,null,null,null,null,null,null,null,null,null,null,null,{"$f":"IFERROR(INDEX($G$6:$G$54,MATCH(0,COUNTIF($V$5:V69,$G$6:$G$54),0)),\"\")","v":""}]
[null,10,158,"اللاعب 59","2005-10-13","2005-10-13","مدرسة سعد بن عبادة المتوسطة",null,null,null,null,null,null,null,null,null,null,null,null,null,null,{"$f":"IFERROR(INDEX($G$6:$G$54,MATCH(0,COUNTIF($V$5:V70,$G$6:$G$54),0)),\"\")","v":""}]
[null,11,159,"اللاعب 60","2008-01-02","2008-01-02","مدرسة الصالحين ",null,null,null,null,null,null,null,null,null,null,null,null,null,null,{"$f":"IFERROR(INDEX($G$6:$G$54,MATCH(0,COUNTIF($V$5:V71,$G$6:$G$54),0)),\"\")","v":""}]
[null,12,160,"اللاعب 61",{"$f":"F73","v":"2007-06-21"},"2007-06-21","مدرسة السلام الابتدائية ",null,null,null,null,null,null,null,null,null,null,null,null,null,null,{"$f":"IFERROR(INDEX($G$6:$G$54,MATCH(0,COUNTIF($V$5:V72,$G$6:$G$54),0)),\"\")","v":""}]
[null,13,161,"اللاعب 62","2006-02-02","2006-02-02","مدرسة عقبة بن عامر المتوسطة",null,null,null,null,null,null,null,null,null,null,null,null,null,null,{"$f":"IFERROR(INDEX($G$6:$G$54,MATCH(0,COUNTIF($V$5:V73,$G$6:$G$54),0)),\"\")","v":""}]
[null,14,162,"اللاعب 63","2005-01-23","2005-01-23","مدرسة سعد بن عبادة المتوسطة",null,null,null,null,null,null,null,null,null,null,null,null,null,null,{"$f":"IFERROR(INDEX($G$6:$G$54,MATCH(0,COUNTIF($V$5:V74,$G$6:$G$54),0)),\"\")","v":""}]
[null,15,163,"اللاعب 64","2006-09-23","2006-09-23","مدرسة التهذيب الأهلية المتوسطة",null,null,null,null,null,null,null,null,null,null,null,null,null,null,{"$f":"IFERROR(INDEX($G$6:$G$54,MATCH(0,COUNTIF($V$5:V75,$G$6:$G$54),0)),\"\")","v":""}]
[null,16,164,"اللاعب 65","2009-08-22","2009-08-22","مدرسة الصالحين ",null,null,null,null,null,null,null,null,null,null,null,null,null,null,{"$f":"IFERROR(INDEX($G$6:$G$54,MATCH(0,COUNTIF($V$5:V76,$G$6:$G$54),0)),\"\")","v":""}]
[null,17,165,"اللاعب 66","2006-10-20","2006-10-20","مدرسة الصالحين ",null,null,null,null,null,null,null,null,null,null,null,null,null,null,{"$f":"IFERROR(INDEX($G$6:$G$54,MATCH(0,COUNTIF($V$5:V77,$G$6:$G$54),0)),\"\")","v":""}]
[null,18,166,"اللاعب 67","2005-11-27","2005-11-27","مدرسة سعد بن الحارث المتوسطة ",null,null,null,null,null,null,null,null,null,null,null,null,null,null,{"$f":"IFERROR(INDEX($G$6:$G$54,MATCH(0,COUNTIF($V$5:V78,$G$6:$G$54),0)),\"\")","v":""}]
[null,19,167,"اللاعب 68","2006-09-12","2006-09-12","مدرسة ابن القيم المتوسطة ",null,null,null,null,null,null,null,null,null,null,null,null,null,null,{"$f":"IFERROR(INDEX($G$6:$G$54,MATCH(0,COUNTIF($V$5:V79,$G$6:$G$54),0)),\"\")","v":""}]
{"$rows_left_out":62}