{"text_format":"1","workbook":"xlsx","n_sheets":6,"sheets":["مياه","مقاولين","العميل","Daily Log","نتائج الاختبارات","3-إستلام أعمال بنيه تحتية"],"not_rendered":{"charts":0,"images":8,"macros":1,"external_links":0,"defined_names":10,"comments":1,"pivot_tables":0},"unopened":[],"bounds":{"document_bytes":16777216,"sheet_cells":100000,"rows_first":2000,"rows_last":500,"rows_between":2000,"halvings":0,"cell_chars":16384,"cell_head_chars":4096},"cells_cut":0,"cells_raw":0,"read":"whole","date_system":"1900"}

{"sheet":"مياه","index":0,"n_rows":269,"n_cols":49,"rows_kept":269,"cut":false,"hidden":false,"merged":[[266,45,268,48],[218,19,263,19],[10,0,10,15],[11,0,11,15],[177,45,179,48],[162,22,167,22],[13,28,15,28],[13,25,15,25],[13,27,15,27],[13,26,15,26],[13,46,15,46],[13,19,13,21],[13,17,15,17],[13,33,15,33],[13,37,15,37],[13,39,15,39],[8,0,8,48],[9,0,9,48],[10,30,10,48],[11,31,11,48],[71,45,73,48],[13,48,15,48],[14,22,15,22],[13,16,15,16],[13,18,15,18],[13,47,15,47],[13,44,15,44],[13,34,15,34],[13,36,15,36],[13,38,15,38],[13,40,15,40],[13,42,15,42],[13,43,15,43],[13,45,15,45],[13,24,15,24],[13,30,15,30],[13,32,15,32],[13,31,15,31],[13,35,15,35],[13,7,15,7],[13,8,15,8],[13,9,15,9],[14,19,15,19],[13,41,15,41],[210,19,211,19],[117,20,118,20],[267,0,267,10],[268,0,268,10],[13,12,15,12],[13,14,15,14],[177,0,177,10],[178,0,178,10],[179,0,179,10],[71,0,71,10],[72,0,72,10],[73,0,73,10],[266,0,266,10],[13,4,15,4],[13,2,14,3],[13,1,15,1],[161,18,167,18],[157,24,159,24],[161,16,167,16],[199,21,209,21],[199,19,209,19],[157,22,161,22],[160,24,166,24],[157,18,160,18],[157,16,160,16],[0,0,6,4],[12,0,12,48],[13,29,15,29],[13,10,15,10],[13,23,15,23],[13,5,15,5],[13,6,15,6],[0,19,0,25],[1,6,6,23],[1,27,5,39],[13,0,15,0],[13,15,15,15],[13,11,15,11],[13,13,15,13],[14,20,15,20],[14,21,15,21]]}
["وزارة الإسكان والمرافق\nهيئة المرافق والمجتمعات العمرانية \nجهاز العاصمة الإداريه الجديدة",null,null,null,null,null,null,null,null,null,null,null,null,null,null,null,null,null,null,"حصر كميات أعمال البنية الاساسية"]
[null,null,null,null,null,null,"الاستشاري:- المهندسون الاستشاريون ( AAW )  ",null,null,null,null,null,null,null,null,null,null,null,null,null,null,null,null,null,null,null,null,"المقاول:- شركة كونكورد للهندسة والمقاولات "]
[]
[]
[]
[]
[]
[]
[]
["اســـم الـــمـشـروع :اسناد تنفيذ أعمال البنية الأساسية ( مياه - صرف - رى ) لإمتداد طرق بن زايد الشمالي والجنوبي والأعمال الكهروميكانيكية لخزان الإنشاءات 100 الف م3/يوم وكذلك الخط الرئيسى الخارج من الخزان بالعاصمةالإدارية الجديدة إلى المنطقة الإستثمارية\n"]
["تــاريــخ بــدء الــعــمــل حــســب الــعــقــد :          02/09/2018 م ",null,null,null,null,null,null,null,null,null,null,null,null,null,null,null,null,null,null,null,null,null,null,null,null,null,null,null,null,null,"مـــدة الـــمـــشـــروع حـــســـب الـــعـــقـــد :  365   يــــــوم   ( 12  شهرا  )"]
["تــاريــخ بــدء الــعــمــل الــــفــعـــلــي :             ",null,null,null,null,null,null,null,null,null,null,null,null,null,null,null,null,null,null,null,null,null,null,null,null,null,null,null,null,null,null,"تاريخ النهو المقرر للـــمـــشـــروع :01/09/2019 م "]
["Accumelative Status Report"]
["م","اسم الخط","station",null,"طول الفرعة","نوع التربة","عدد طبقات الاحلال","المقاول","القطر","اعمال التركيب","المنفذ","الميزانية الشبكية (رقم طلب الاستلام)","المنفذ","توقيع المسار (رقم طلب الاستلام)","المنفذ","منسوب قاع حفر (رقم طلب الاستلام)","المنفذ","استلام قطاع الحفر","المنفذ","الاحلال",null,null,null,"استلام مناسيب ظهر الماسورة والاستقامة","المنفذ","استلام التعميم الخارجى  لوصلات المواسير والحلقمة","المنفذ","تغليف بولي ايثيلين","المنفذ",{"$f":"'Daily Log'!AA18","v":"ردم  حول الماسورة( طبقة أولـى  وطبقة ثانية) بسمك 50 سم"},"المنفذ",{"$f":"'Daily Log'!AA19","v":"ردم حول الماسورة( طبقة ثالثة وطبقة رابعة ) بسمك 50 سم"},"المنفذ","تغليف المواسير","المنفذ","تجربة الاختبار بالهواء المضغوط","المنفذ","ردم فوق التغليف (طبقة أولى)","المنفذ","ردم فوق التغليف (طبقة ثانية)","المنفذ","ردم فوق التغليف (طبقة ثالثة)","المنفذ","ردم فوق التغليف (طبقة رابعة)","المنفذ","صلاحية تربة زلطية","صلاحية رمال نظيفة","أخذ عينات صخر","أخذ عينات من ناتج الحفر"]
[null,null,null,null,null,null,null,null,null,null,null,null,null,null,null,null,null,null,null,"طبقة الأولى 25 سم","المنفذ","الفرشة","المنفذ"]
{"$rows_left_out":255}
{"sheet":"مقاولين","index":1,"n_rows":18,"n_cols":14,"rows_kept":18,"cut":false,"hidden":false,"merged":[[3,10,3,13],[3,6,3,9],[1,1,1,3],[15,0,15,1],[17,0,17,1],[16,0,16,1],[3,1,5,1],[3,0,5,0],[3,2,3,5]]}
[]
[null,"شركة كونكورد للهندسة والمقاولات \nالعاصمة الادارية الجديدة\nالمكتب الفني"]
[]
["م","المقاول","حفر",null,null,null,"تركيب",null,null,null,"اختبار"]
[null,null,"قطر","قطر","قطر","قطر","قطر","قطر","قطر","قطر","قطر","قطر","قطر","قطر"]
[null,null,900,1000,1200,1400,900,1000,1200,1400,900,1000,1200,1400]
[1,"عبود (متكامل)",{"$f":"SUMIFS(مياه!$S$17:$S$269,مياه!$H$17:$H$269,B7,مياه!$I$17:$I$269,$C$6)","v":1650},{"$f":"SUMIFS(مياه!$S$17:$S$269,مياه!$H$17:$H$269,B7,مياه!$I$17:$I$269,$D$6)","v":1617.58},{"$f":"SUMIFS(مياه!$S$17:$S$269,مياه!$H$17:$H$269,B7,مياه!$I$17:$I$269,E$6)","v":0},{"$f":"SUMIFS(مياه!$S$17:$S$269,مياه!$H$17:$H$269,B7,مياه!$I$17:$I$269,F$6)","v":0},{"$f":"SUMIFS(مياه!$Y$17:$Y$269,مياه!$H$17:$H$269,B7,مياه!$I$17:$I$269,$G$6)","v":1573.42},{"$f":"SUMIFS(مياه!$Y$17:$Y$269,مياه!$H$17:$H$269,B7,مياه!$I$17:$I$269,$H$6)","v":1407.8899999999999},{"$f":"SUMIFS(مياه!$Y$17:$Y$269,مياه!$H$17:$H$269,B7,مياه!$I$17:$I$269,I$6)","v":0},{"$f":"SUMIFS(مياه!$Y$17:$Y$269,مياه!$H$17:$H$269,B7,مياه!$I$17:$I$269,J$6)","v":0},{"$f":"SUMIFS(مياه!$AJ$17:$AJ$269,مياه!$H$17:$H$269,B7,مياه!$I$17:$I$269,$K$6)","v":0},{"$f":"SUMIFS(مياه!$AJ$17:$AJ$269,مياه!$H$17:$H$269,B7,مياه!$I$17:$I$269,$L$6)","v":0},{"$f":"SUMIFS(مياه!$AJ$17:$AJ$269,مياه!$H$17:$H$269,F7,مياه!$I$17:$I$269,M$6)","v":0},{"$f":"SUMIFS(مياه!$AJ$17:$AJ$269,مياه!$H$17:$H$269,F7,مياه!$I$17:$I$269,N$6)","v":0}]
[2,"محمد مصطفى",{"$f":"SUMIFS(مياه!$S$17:$S$269,مياه!$H$17:$H$269,B8,مياه!$I$17:$I$269,$C$6)","v":0},{"$f":"SUMIFS(مياه!$S$17:$S$269,مياه!$H$17:$H$269,B8,مياه!$I$17:$I$269,$D$6)","v":0},{"$f":"SUMIFS(مياه!$S$17:$S$269,مياه!$H$17:$H$269,B8,مياه!$I$17:$I$269,E$6)","v":1005},{"$f":"SUMIFS(مياه!$S$17:$S$269,مياه!$H$17:$H$269,B8,مياه!$I$17:$I$269,F$6)","v":0},{"$f":"SUMIFS(مياه!$Y$17:$Y$269,مياه!$H$17:$H$269,B8,مياه!$I$17:$I$269,$G$6)","v":0},{"$f":"SUMIFS(مياه!$Y$17:$Y$269,مياه!$H$17:$H$269,B8,مياه!$I$17:$I$269,$H$6)","v":0},{"$f":"SUMIFS(مياه!$Y$17:$Y$269,مياه!$H$17:$H$269,B8,مياه!$I$17:$I$269,I$6)","v":996},{"$f":"SUMIFS(مياه!$Y$17:$Y$269,مياه!$H$17:$H$269,B8,مياه!$I$17:$I$269,J$6)","v":0},{"$f":"SUMIFS(مياه!$AJ$17:$AJ$269,مياه!$H$17:$H$269,B8,مياه!$I$17:$I$269,$K$6)","v":0},{"$f":"SUMIFS(مياه!$AJ$17:$AJ$269,مياه!$H$17:$H$269,B8,مياه!$I$17:$I$269,$L$6)","v":0},{"$f":"SUMIFS(مياه!$AJ$17:$AJ$269,مياه!$H$17:$H$269,F8,مياه!$I$17:$I$269,M$6)","v":0},{"$f":"SUMIFS(مياه!$AJ$17:$AJ$269,مياه!$H$17:$H$269,F8,مياه!$I$17:$I$269,N$6)","v":0}]
[3,null,{"$f":"SUMIFS(مياه!$S$17:$S$269,مياه!$H$17:$H$269,B9,مياه!$I$17:$I$269,$C$6)","v":0},{"$f":"SUMIFS(مياه!$S$17:$S$269,مياه!$H$17:$H$269,B9,مياه!$I$17:$I$269,$D$6)","v":0},{"$f":"SUMIFS(مياه!$S$17:$S$269,مياه!$H$17:$H$269,B9,مياه!$I$17:$I$269,E$6)","v":0},{"$f":"SUMIFS(مياه!$S$17:$S$269,مياه!$H$17:$H$269,B9,مياه!$I$17:$I$269,F$6)","v":0},{"$f":"SUMIFS(مياه!$Y$17:$Y$269,مياه!$H$17:$H$269,B9,مياه!$I$17:$I$269,$G$6)","v":0},{"$f":"SUMIFS(مياه!$Y$17:$Y$269,مياه!$H$17:$H$269,B9,مياه!$I$17:$I$269,$H$6)","v":0},{"$f":"SUMIFS(مياه!$Y$17:$Y$269,مياه!$H$17:$H$269,B9,مياه!$I$17:$I$269,I$6)","v":0},{"$f":"SUMIFS(مياه!$Y$17:$Y$269,مياه!$H$17:$H$269,B9,مياه!$I$17:$I$269,J$6)","v":0},{"$f":"SUMIFS(مياه!$AJ$17:$AJ$269,مياه!$H$17:$H$269,B9,مياه!$I$17:$I$269,$K$6)","v":0},{"$f":"SUMIFS(مياه!$AJ$17:$AJ$269,مياه!$H$17:$H$269,B9,مياه!$I$17:$I$269,$L$6)","v":0},{"$f":"SUMIFS(مياه!$AJ$17:$AJ$269,مياه!$H$17:$H$269,F9,مياه!$I$17:$I$269,M$6)","v":0},{"$f":"SUMIFS(مياه!$AJ$17:$AJ$269,مياه!$H$17:$H$269,F9,مياه!$I$17:$I$269,N$6)","v":0}]
[4,null,{"$f":"SUMIFS(مياه!$S$17:$S$269,مياه!$H$17:$H$269,B10,مياه!$I$17:$I$269,$C$6)","v":0},{"$f":"SUMIFS(مياه!$S$17:$S$269,مياه!$H$17:$H$269,B10,مياه!$I$17:$I$269,$D$6)","v":0},{"$f":"SUMIFS(مياه!$S$17:$S$269,مياه!$H$17:$H$269,B10,مياه!$I$17:$I$269,E$6)","v":0},{"$f":"SUMIFS(مياه!$S$17:$S$269,مياه!$H$17:$H$269,B10,مياه!$I$17:$I$269,F$6)","v":0},{"$f":"SUMIFS(مياه!$Y$17:$Y$269,مياه!$H$17:$H$269,B10,مياه!$I$17:$I$269,$G$6)","v":0},{"$f":"SUMIFS(مياه!$Y$17:$Y$269,مياه!$H$17:$H$269,B10,مياه!$I$17:$I$269,$H$6)","v":0},{"$f":"SUMIFS(مياه!$Y$17:$Y$269,مياه!$H$17:$H$269,B10,مياه!$I$17:$I$269,I$6)","v":0},{"$f":"SUMIFS(مياه!$Y$17:$Y$269,مياه!$H$17:$H$269,B10,مياه!$I$17:$I$269,J$6)","v":0},{"$f":"SUMIFS(مياه!$AJ$17:$AJ$269,مياه!$H$17:$H$269,B10,مياه!$I$17:$I$269,$K$6)","v":0},{"$f":"SUMIFS(مياه!$AJ$17:$AJ$269,مياه!$H$17:$H$269,B10,مياه!$I$17:$I$269,$L$6)","v":0},{"$f":"SUMIFS(مياه!$AJ$17:$AJ$269,مياه!$H$17:$H$269,F10,مياه!$I$17:$I$269,M$6)","v":0},{"$f":"SUMIFS(مياه!$AJ$17:$AJ$269,مياه!$H$17:$H$269,F10,مياه!$I$17:$I$269,N$6)","v":0}]
[5,null,{"$f":"SUMIFS(مياه!$S$17:$S$269,مياه!$H$17:$H$269,B11,مياه!$I$17:$I$269,$C$6)","v":0},{"$f":"SUMIFS(مياه!$S$17:$S$269,مياه!$H$17:$H$269,B11,مياه!$I$17:$I$269,$D$6)","v":0},{"$f":"SUMIFS(مياه!$S$17:$S$269,مياه!$H$17:$H$269,B11,مياه!$I$17:$I$269,E$6)","v":0},{"$f":"SUMIFS(مياه!$S$17:$S$269,مياه!$H$17:$H$269,B11,مياه!$I$17:$I$269,F$6)","v":0},{"$f":"SUMIFS(مياه!$Y$17:$Y$269,مياه!$H$17:$H$269,B11,مياه!$I$17:$I$269,$G$6)","v":0},{"$f":"SUMIFS(مياه!$Y$17:$Y$269,مياه!$H$17:$H$269,B11,مياه!$I$17:$I$269,$H$6)","v":0},{"$f":"SUMIFS(مياه!$Y$17:$Y$269,مياه!$H$17:$H$269,B11,مياه!$I$17:$I$269,I$6)","v":0},{"$f":"SUMIFS(مياه!$Y$17:$Y$269,مياه!$H$17:$H$269,B11,مياه!$I$17:$I$269,J$6)","v":0},{"$f":"SUMIFS(مياه!$AJ$17:$AJ$269,مياه!$H$17:$H$269,B11,مياه!$I$17:$I$269,$K$6)","v":0},{"$f":"SUMIFS(مياه!$AJ$17:$AJ$269,مياه!$H$17:$H$269,B11,مياه!$I$17:$I$269,$L$6)","v":0},{"$f":"SUMIFS(مياه!$AJ$17:$AJ$269,مياه!$H$17:$H$269,F11,مياه!$I$17:$I$269,M$6)","v":0},{"$f":"SUMIFS(مياه!$AJ$17:$AJ$269,مياه!$H$17:$H$269,F11,مياه!$I$17:$I$269,N$6)","v":0}]
[6,null,{"$f":"SUMIFS(مياه!$S$17:$S$269,مياه!$H$17:$H$269,B12,مياه!$I$17:$I$269,$C$6)","v":0},{"$f":"SUMIFS(مياه!$S$17:$S$269,مياه!$H$17:$H$269,B12,مياه!$I$17:$I$269,$D$6)","v":0},{"$f":"SUMIFS(مياه!$S$17:$S$269,مياه!$H$17:$H$269,B12,مياه!$I$17:$I$269,E$6)","v":0},{"$f":"SUMIFS(مياه!$S$17:$S$269,مياه!$H$17:$H$269,B12,مياه!$I$17:$I$269,F$6)","v":0},{"$f":"SUMIFS(مياه!$Y$17:$Y$269,مياه!$H$17:$H$269,B12,مياه!$I$17:$I$269,$G$6)","v":0},{"$f":"SUMIFS(مياه!$Y$17:$Y$269,مياه!$H$17:$H$269,B12,مياه!$I$17:$I$269,$H$6)","v":0},{"$f":"SUMIFS(مياه!$Y$17:$Y$269,مياه!$H$17:$H$269,B12,مياه!$I$17:$I$269,I$6)","v":0},{"$f":"SUMIFS(مياه!$Y$17:$Y$269,مياه!$H$17:$H$269,B12,مياه!$I$17:$I$269,J$6)","v":0},{"$f":"SUMIFS(مياه!$AJ$17:$AJ$269,مياه!$H$17:$H$269,B12,مياه!$I$17:$I$269,$K$6)","v":0},{"$f":"SUMIFS(مياه!$AJ$17:$AJ$269,مياه!$H$17:$H$269,B12,مياه!$I$17:$I$269,$L$6)","v":0},{"$f":"SUMIFS(مياه!$AJ$17:$AJ$269,مياه!$H$17:$H$269,F12,مياه!$I$17:$I$269,M$6)","v":0},{"$f":"SUMIFS(مياه!$AJ$17:$AJ$269,مياه!$H$17:$H$269,F12,مياه!$I$17:$I$269,N$6)","v":0}]
[7,null,{"$f":"SUMIFS(مياه!$S$17:$S$269,مياه!$H$17:$H$269,B13,مياه!$I$17:$I$269,$C$6)","v":0},{"$f":"SUMIFS(مياه!$S$17:$S$269,مياه!$H$17:$H$269,B13,مياه!$I$17:$I$269,$D$6)","v":0},{"$f":"SUMIFS(مياه!$S$17:$S$269,مياه!$H$17:$H$269,B13,مياه!$I$17:$I$269,E$6)","v":0},{"$f":"SUMIFS(مياه!$S$17:$S$269,مياه!$H$17:$H$269,B13,مياه!$I$17:$I$269,F$6)","v":0},{"$f":"SUMIFS(مياه!$Y$17:$Y$269,مياه!$H$17:$H$269,B13,مياه!$I$17:$I$269,$G$6)","v":0},{"$f":"SUMIFS(مياه!$Y$17:$Y$269,مياه!$H$17:$H$269,B13,مياه!$I$17:$I$269,$H$6)","v":0},{"$f":"SUMIFS(مياه!$Y$17:$Y$269,مياه!$H$17:$H$269,B13,مياه!$I$17:$I$269,I$6)","v":0},{"$f":"SUMIFS(مياه!$Y$17:$Y$269,مياه!$H$17:$H$269,B13,مياه!$I$17:$I$269,J$6)","v":0},{"$f":"SUMIFS(مياه!$AJ$17:$AJ$269,مياه!$H$17:$H$269,B13,مياه!$I$17:$I$269,$K$6)","v":0},{"$f":"SUMIFS(مياه!$AJ$17:$AJ$269,مياه!$H$17:$H$269,B13,مياه!$I$17:$I$269,$L$6)","v":0},{"$f":"SUMIFS(مياه!$AJ$17:$AJ$269,مياه!$H$17:$H$269,F13,مياه!$I$17:$I$269,M$6)","v":0},{"$f":"SUMIFS(مياه!$AJ$17:$AJ$269,مياه!$H$17:$H$269,F13,مياه!$I$17:$I$269,N$6)","v":0}]
[8,null,{"$f":"SUMIFS(مياه!$S$17:$S$269,مياه!$H$17:$H$269,B14,مياه!$I$17:$I$269,$C$6)","v":0},{"$f":"SUMIFS(مياه!$S$17:$S$269,مياه!$H$17:$H$269,B14,مياه!$I$17:$I$269,$D$6)","v":0},{"$f":"SUMIFS(مياه!$S$17:$S$269,مياه!$H$17:$H$269,B14,مياه!$I$17:$I$269,E$6)","v":0},{"$f":"SUMIFS(مياه!$S$17:$S$269,مياه!$H$17:$H$269,B14,مياه!$I$17:$I$269,F$6)","v":0},{"$f":"SUMIFS(مياه!$Y$17:$Y$269,مياه!$H$17:$H$269,B14,مياه!$I$17:$I$269,$G$6)","v":0},{"$f":"SUMIFS(مياه!$Y$17:$Y$269,مياه!$H$17:$H$269,B14,مياه!$I$17:$I$269,$H$6)","v":0},{"$f":"SUMIFS(مياه!$Y$17:$Y$269,مياه!$H$17:$H$269,B14,مياه!$I$17:$I$269,I$6)","v":0},{"$f":"SUMIFS(مياه!$Y$17:$Y$269,مياه!$H$17:$H$269,B14,مياه!$I$17:$I$269,J$6)","v":0},{"$f":"SUMIFS(مياه!$AJ$17:$AJ$269,مياه!$H$17:$H$269,B14,مياه!$I$17:$I$269,$K$6)","v":0},{"$f":"SUMIFS(مياه!$AJ$17:$AJ$269,مياه!$H$17:$H$269,B14,مياه!$I$17:$I$269,$L$6)","v":0},{"$f":"SUMIFS(مياه!$AJ$17:$AJ$269,مياه!$H$17:$H$269,F14,مياه!$I$17:$I$269,M$6)","v":0},{"$f":"SUMIFS(مياه!$AJ$17:$AJ$269,مياه!$H$17:$H$269,F14,مياه!$I$17:$I$269,N$6)","v":0}]
[9,null,{"$f":"SUMIFS(مياه!$S$17:$S$269,مياه!$H$17:$H$269,B15,مياه!$I$17:$I$269,$C$6)","v":0},{"$f":"SUMIFS(مياه!$S$17:$S$269,مياه!$H$17:$H$269,B15,مياه!$I$17:$I$269,$D$6)","v":0},{"$f":"SUMIFS(مياه!$S$17:$S$269,مياه!$H$17:$H$269,B15,مياه!$I$17:$I$269,E$6)","v":0},{"$f":"SUMIFS(مياه!$S$17:$S$269,مياه!$H$17:$H$269,B15,مياه!$I$17:$I$269,F$6)","v":0},{"$f":"SUMIFS(مياه!$Y$17:$Y$269,مياه!$H$17:$H$269,B15,مياه!$I$17:$I$269,$G$6)","v":0},{"$f":"SUMIFS(مياه!$Y$17:$Y$269,مياه!$H$17:$H$269,B15,مياه!$I$17:$I$269,$H$6)","v":0},{"$f":"SUMIFS(مياه!$Y$17:$Y$269,مياه!$H$17:$H$269,B15,مياه!$I$17:$I$269,I$6)","v":0},{"$f":"SUMIFS(مياه!$Y$17:$Y$269,مياه!$H$17:$H$269,B15,مياه!$I$17:$I$269,J$6)","v":0},{"$f":"SUMIFS(مياه!$AJ$17:$AJ$269,مياه!$H$17:$H$269,B15,مياه!$I$17:$I$269,$K$6)","v":0},{"$f":"SUMIFS(مياه!$AJ$17:$AJ$269,مياه!$H$17:$H$269,B15,مياه!$I$17:$I$269,$L$6)","v":0},{"$f":"SUMIFS(مياه!$AJ$17:$AJ$269,مياه!$H$17:$H$269,F15,مياه!$I$17:$I$269,M$6)","v":0},{"$f":"SUMIFS(مياه!$AJ$17:$AJ$269,مياه!$H$17:$H$269,F15,مياه!$I$17:$I$269,N$6)","v":0}]
{"$rows_left_out":4}
{"sheet":"العميل","index":2,"n_rows":0,"n_cols":0,"rows_kept":0,"cut":false,"hidden":false,"merged":[]}

{"sheet":"Daily Log","index":3,"n_rows":1006,"n_cols":33,"rows_kept":1006,"cut":false,"hidden":false,"merged":[[4,31,5,31],[4,32,5,32],[4,30,5,30],[0,13,1,13],[0,28,1,28],[0,26,1,26],[0,25,1,25],[0,24,1,24],[0,23,1,23],[0,27,1,27],[0,16,1,16],[0,17,1,17],[0,14,1,14],[0,15,1,15],[0,29,1,29],[0,12,1,12],[0,8,1,8],[0,9,1,9],[0,10,1,10],[0,11,1,11],[0,0,1,0],[0,4,1,4],[0,6,1,6],[0,7,1,7],[0,1,1,1],[0,3,1,3],[0,2,1,2],[0,5,1,5]]}
["م","رقم الطلب","تاريخ تقديم الطلب","اسم المشروع","اسم الطريق","نوع الأعمال","اسم الخط / منهول","وصف الطلب","من","الى","طول (م)","قطر مم","الاعتماد","المكتب الاستشارى","rev no","مهندس المقاول","ملاحظات","hyperlink",null,null,null,null,null,"المكتب الاستشارى","مهندس المقاول","المشاريع","وصف الطلب","طبيعة الاعمال","الاعتماد","نوع الاعمال"]
[]
[0,null,null,null,null,null,null,null,null,null,{"$f":"IF(E3<>\"\",J3-I3,\"\")","v":""},{"$f":"IF(E3<>\"\",IF(E3=$S$4,$U$4,IF(E3=$S$5,$U$5,IF(E3=$S$6,$U$6,IF(E3=$S$8,$U$8,IF(E3=$S$9,$U$9,IF(E3=$S$10,$U$10,IF(E3=$S$11,$U$11,IF(E3=$S$12,$U$12,IF(E3=$S$13,$U$13,IF(E3=$S$14,$AA$8,IF(E3=$S$15,$AA$9,IF(E3=$S$16,$AA$10,IF(E3=$S$17,$AA$11,IF(E3=$S$18,#REF!,IF(E3=$S$19,$AA$12,IF(E3=$S$20,$AA$13,IF(E3=$S$21,$AA$15,IF(E3=$S$22,$AA$16,IF(E3=$S$23,$AA$17,IF(E3=$S$24,$AA$18,IF(E3=$S$25,$AA$19,IF(E3=$S$26,$AA$20,IF(E3=$S$27,$AA$21,IF(E3=$S$28,$AA$22,IF(E3=$S$29,$AA$23,IF(E3=$S$30,$AA$24,IF(E3=$S$31,$AA$25,IF(E3=$S$32,$AA$26,IF(E3=$S$33,$AA$27,IF(E3=$S$34,$AA$28,IF(E3=$S$35,$U$35,IF(E3=$S$38,$U$38,IF(E3=$S$41,$U$41,IF(E3=$S$44,$U$44,IF(E3=$S$46,$U$46,\"\"))))))))))))))))))))))))))))))))))),\"\")","v":""}]
[1,1,"2018-03-11",null,null,"استلام نقاط ثوابت مساحية استناد الى الجدول المرفق من وحدة الاستشارات المساحيه - جامعة عين شمس ","من 3525الى 5357",null,null,null,{"$f":"J4-I4","v":0},900,null,"A","A"]
[2,2,"2018-03-11",null,null,"استلام الرفع المساحى لمسار خط ال 900 ","من 5300الى 5075","توقيع المسار",5075,5300,{"$f":"J5-I5","v":225},900,null,"D","D",null,null,null,null,null,null,null,null,null,null,null,null,null,null,null,"م","وصف الطلب","ملاحظات"]
[3,3,"2018-03-13",null,null,"معاينة قاع حفر + مسار خط ال 900 مم ","من 4475الى 4325","استلام قطاع الحفر",4325,4475,150,900,null,"A","A"]
[4,4,"2018-03-02",null,null,"معاينة صخر ","من 4475الى4325",null,4325,4475,150,900,null,"C","C"]
[5,5,"2018-03-21",null,null,"معاينة قاع حفر ","من 5075الى 4575","استلام قطاع الحفر",4075,5075,1000,900,null,"A","A",null,null,null,null,null,null,null,null,"بيت الخبرة","عشري عبدالرحمن","طرق بن زايد الشمالى والجنوبى","الميزانية الشبكية","صرف","A","مساحة",1,"الميزانية الشبكية","مساح"]
[6,6,"2018-03-21",null,null,"استلام فرشة (طبقة تأسيس)","من 5250الى 5025","استلام طبقة الفرشة 25 سم",5025,5250,225,900,null,"A","A",null,null,null,null,null,null,null,null,"عبدالوارث","مصطفى غازى","طريق 9","توقيع المسار","مياه","B","معمل",2,"توقيع المسار","مساح"]
[7,7,"2018-03-24",null,null,"استلام الرفع المساحى لمسار خط ال 900 ","من 225+3الى 357+5","توقيع المسار",3225,5357,2132,900,null,"A","A",null,null,null,null,null,null,null,null,null,"أحمد علاء","الخط العاجل","استلام قطاع الحفر","ري","C",null,3,"استلام قطاع الحفر","مهندس+توجيه معمل"]
[8,8,"2018-03-25",null,null,"استلام طبقة تأسيس (الفرشة) + المسار ","من 5025الى 4800","استلام طبقة الفرشة 25 سم",4800,5025,225,900,null,"C","C",null,null,null,null,null,null,null,null,null,"عيد عادل",null,"منسوب قاع حفر","كهرباء","D",null,4,"منسوب قاع حفر","مساحة"]
[9,9,"2018-03-26",null,null,"استلام ظهر مواسير (تركيب مواسير)","من 5200الى 5025","استلام مناسيب ظهر الماسورة والاستقامة",5025,5200,175,900,null,"D","D",null,null,null,null,null,null,null,null,null,"حازم",null,"طبقة الأولى 25 سم",null,null,null,5,"طبقة الأولى 25 سم","مهندس + توجيه المعمل"]
[10,10,"2018-03-27",null,null,"نتائج الاختبارات المعملية التي تم اجراؤها على الرمل المورد المستخدم في الردم والاحلال والتاسيس على خط ال 900 مياة رئيسيى ","نتائج ",null,null,null,0,900,null,null,null,null,null,null,null,null,null,null,null,null,null,null,"استلام طبقة الفرشة 25 سم",null,null,null,6,"الفرشة","مهندس + توجيه المعمل"]
[11,11,"2018-03-27",null,null,"استلام فرشة (طبقة تأسيس)","من 5250الى 5025","استلام طبقة الفرشة 25 سم",5025,5250,225,900,null,"A","A",null,null,null,null,null,null,null,null,null,null,null,"استلام منسوب طبقة الفرشة 25 سم",null,null,null,7,"استلام مناسيب ظهر الماسورة والاستقامة","مساح"]
[12,12,"2018-03-27",null,null,"استلام طبقة أساس (فرشة )","من 4800الى 4575","استلام طبقة الفرشة 25 سم",4575,4800,225,900,null,"A","A",null,null,null,null,null,null,null,null,null,null,null,"استلام مناسيب ظهر الماسورة والاستقامة",null,null,null,8,"استلام تعميم وصلات المواسير","فى حالة المواسير الخرسانية"]
{"$rows_left_out":992}
{"sheet":"نتائج الاختبارات","index":4,"n_rows":101,"n_cols":14,"rows_kept":101,"cut":false,"hidden":false,"merged":[]}
["الرقم ","التاريخ ","الموضوع ","نوع الاختبار","من ","الى","AC","تاريخ اخذ العينة ","Hyperlink"]
[1,"2018-03-12","تقرير الدرسات الهندسية لابحاث التربة والاساسات لشبكة المياه وشبكة الرى ",null,null,null,null,null,null,null,null,null,"صلاحية","A"]
[2,"2018-03-21","تقرير معاينة قاع الحفر ومنسوب التأسيس خط المياة الرئيسى قطر 900 مم ",null,null,null,null,null,null,null,null,null,"دمك","B"]
[3,"2018-03-28","شهادة اختبار مصنع عثمان جروب ",null,null,null,null,null,null,null,null,null,null,"C"]
[4,"2018-03-27","نتائج الاختبارات المعملية التي تم اجراؤها على الرمل المورد المستخدم في الردم والاحلال والتاسيس على خط 900 مم مياه رئيسى لمنطقة المستثمرين رقم 1 ","صلاحية",null,null,"A","2018-03-27",null,null,null,null,null,"D"]
[5,"2018-03-27","فرشة تأسيس ","دمك",5020,5250,"A","2018-03-27"]
[6,"2018-03-27","فرشة تأسيس ","دمك",4800,5025,"A","2018-03-27"]
[7,"2018-04-03","فرشة أساس ","دمك",4800,4575,"A","2018-04-03"]
[8,"2018-04-10","فرشة تأسيس ","دمك",4575,4375,"A","2018-04-10"]
[9,"2018-04-18","فرشة تأسيس ","دمك",4375,4100,"A","2018-04-18"]
[10,"2018-06-09","فرشة أساس ","دمك",1925,1875,"A","2018-06-09"]
[11,"2018-06-09","فرشة أساس ","دمك",1875,1839,"A","2018-06-09"]
[12,"2018-06-09","فرشة أساس ","دمك",2800,2900,"A","2018-06-09"]
[13,"2018-06-10","فرشة تأسيس ","دمك",2900,3075,"A","2018-06-10"]
[14,"2018-06-11","نتائج الاختبارات المعملية التي تم اجراؤها على الرمل المورد المستخدم في الردم والاحلال والتاسيس على خط 1000 مم  رقم 1 ","صلاحية",3100,1838.54,"A","2018-06-11"]
{"$rows_left_out":87}
{"sheet":"3-إستلام أعمال بنيه تحتية","index":5,"n_rows":35,"n_cols":15,"rows_kept":35,"cut":false,"hidden":false,"merged":[[20,2,20,5],[20,10,21,13],[21,2,21,9],[22,2,22,4],[22,5,22,13],[32,2,32,8],[32,9,32,13],[33,2,33,8],[33,9,33,13],[28,2,28,7],[28,10,28,13],[34,2,34,13],[4,6,4,7],[4,3,4,4],[5,9,5,10],[6,9,6,10],[29,2,29,8],[29,10,29,13],[30,2,30,8],[30,9,30,13],[31,2,31,8],[31,9,31,13],[23,2,23,13],[24,2,24,13],[25,2,25,13],[26,2,26,13],[27,2,27,13],[12,2,12,13],[13,2,13,13],[14,2,14,5],[14,10,14,13],[15,2,15,7],[15,8,15,9],[16,2,16,13],[18,5,18,6],[18,7,18,9],[19,2,19,3],[19,4,19,5],[19,6,19,7],[19,8,19,9],[19,12,19,13],[17,2,17,5],[17,9,17,12],[18,2,18,4],[19,10,19,11],[11,12,11,13],[10,2,10,3],[10,4,10,5],[10,6,10,7],[10,8,10,9],[10,10,10,11],[10,12,10,13],[11,2,11,3],[11,4,11,5],[11,6,11,7],[11,8,11,9],[11,10,11,11],[8,2,8,13],[9,2,9,3],[9,4,9,5],[9,6,9,7],[9,8,9,9],[9,10,9,11],[9,12,9,13],[6,2,6,4],[6,5,6,7],[7,5,7,7],[7,9,7,13],[4,8,4,10],[4,11,5,13],[5,5,5,7],[5,3,5,4],[7,3,7,4],[6,11,6,12],[1,2,1,13],[2,2,2,6],[2,7,2,10],[2,11,2,13],[3,2,3,11],[3,12,3,13]]}
[]
[null,null,"مشروع العاصمة الإدارية الجديدة"]
[null,null,"المالــك\n",null,null,null,null,"الشركة المنفذة",null,null,null,"الاستشاري العام للإشراف"]
[null,null,"طلب معاينة وإستلام أعمال بنيه تحتية ( Infra Structure Inspection Request )",null,null,null,null,null,null,null,null,null,"نموذج رقم (03)",null,157]
[null,null,"رقم الطلب:",{"$f":"O4","v":157},null,"تاريخ تقديم الطلب:",{"$f":"VLOOKUP($O$4,'Daily Log'!B4:O505,2,FALSE)","v":"2018-11-15"},null,"طريق رقم",null,null,"رقم اللوحة المعتمدة"]
[null,null,{"$f":"VLOOKUP($O$4,'Daily Log'!B4:O505,14,FALSE)","v":0},"REV no.",null,"تاريخ المعاينة:",null,null,"خط/ منهول رقم:"]
[null,null,"الخط الرئيسى",null,null,"وقت المعاينة",null,null,"من محطة كم/ منهول:",-200,null,"الي محطة كم/ منهول:",null,-237]
[null,null,"مواسير قطر:",{"$f":"VLOOKUP($O$4,'Daily Log'!B4:O505,11,FALSE)","v":"1200/1000"},null,null,null,null,"المادة:",{"$f":"VLOOKUP($O$4,'Daily Log'!B4:O505,7,FALSE)","v":0}]
[]
[null,null,"  مساحة",null,"صرف مياه الأمطار",null,"مياه الشرب",null,"انارة",null,"    اشارات مرورية",null,"كهرباء جهد متوسط"]
[null,null,"صرف صحي",null,"مضخات",null,"خزانات",null,"اتصالات",null,"ري",null,"كهرباء جهد منخفض"]
[null,null,"     تنقية مياه",null,"     تنسيق موقع",null,"طرق",null,"بردورات",null,"أرصفة",null,"أخري"]
[null,null,"يتعهد المقاول بأن الأعمال المذكورة أعلاه قد تم معاينتها من قبله بناءً على مواصفات المشروع و مخططات الورشة المعتمدة و وثائق العقد ."]
[null,null,"بيـــــــان الأعمـــــال"]
[null,null,"السيد مدير المشروع (الاستشاري)"]
{"$rows_left_out":20}