{"text_format":"1","workbook":"xlsx","n_sheets":6,"sheets":["مياه","مقاولين","العميل","Daily Log","نتائج الاختبارات","3-إستلام أعمال بنيه تحتية"],"not_rendered":{"charts":0,"images":8,"macros":1,"external_links":0,"defined_names":10,"comments":1,"pivot_tables":0},"unopened":[],"bounds":{"document_bytes":16777216,"sheet_cells":100000,"rows_first":2000,"rows_last":500,"rows_between":2000,"halvings":0,"cell_chars":16384,"cell_head_chars":4096},"cells_cut":0,"cells_raw":0,"read":"whole","date_system":"1900"}

{"sheet":"مياه","index":0,"n_rows":269,"n_cols":49,"rows_kept":269,"cut":false,"hidden":false,"merged":[[266,45,268,48],[218,19,263,19],[10,0,10,15],[11,0,11,15],[177,45,179,48],[162,22,167,22],[13,28,15,28],[13,25,15,25],[13,27,15,27],[13,26,15,26],[13,46,15,46],[13,19,13,21],[13,17,15,17],[13,33,15,33],[13,37,15,37],[13,39,15,39],[8,0,8,48],[9,0,9,48],[10,30,10,48],[11,31,11,48],[71,45,73,48],[13,48,15,48],[14,22,15,22],[13,16,15,16],[13,18,15,18],[13,47,15,47],[13,44,15,44],[13,34,15,34],[13,36,15,36],[13,38,15,38],[13,40,15,40],[13,42,15,42],[13,43,15,43],[13,45,15,45],[13,24,15,24],[13,30,15,30],[13,32,15,32],[13,31,15,31],[13,35,15,35],[13,7,15,7],[13,8,15,8],[13,9,15,9],[14,19,15,19],[13,41,15,41],[210,19,211,19],[117,20,118,20],[267,0,267,10],[268,0,268,10],[13,12,15,12],[13,14,15,14],[177,0,177,10],[178,0,178,10],[179,0,179,10],[71,0,71,10],[72,0,72,10],[73,0,73,10],[266,0,266,10],[13,4,15,4],[13,2,14,3],[13,1,15,1],[161,18,167,18],[157,24,159,24],[161,16,167,16],[199,21,209,21],[199,19,209,19],[157,22,161,22],[160,24,166,24],[157,18,160,18],[157,16,160,16],[0,0,6,4],[12,0,12,48],[13,29,15,29],[13,10,15,10],[13,23,15,23],[13,5,15,5],[13,6,15,6],[0,19,0,25],[1,6,6,23],[1,27,5,39],[13,0,15,0],[13,15,15,15],[13,11,15,11],[13,13,15,13],[14,20,15,20],[14,21,15,21]]}
["وزارة الإسكان والمرافق\nهيئة المرافق والمجتمعات العمرانية \nجهاز العاصمة الإداريه الجديدة",null,null,null,null,null,null,null,null,null,null,null,null,null,null,null,null,null,null,"حصر كميات أعمال البنية الاساسية"]
[null,null,null,null,null,null,"الاستشاري:- المهندسون الاستشاريون ( AAW )  ",null,null,null,null,null,null,null,null,null,null,null,null,null,null,null,null,null,null,null,null,"المقاول:- شركة كونكورد للهندسة والمقاولات "]
[]
[]
[]
[]
[]
[]
[]
["اســـم الـــمـشـروع :اسناد تنفيذ أعمال البنية الأساسية ( مياه - صرف - رى ) لإمتداد طرق بن زايد الشمالي والجنوبي والأعمال الكهروميكانيكية لخزان الإنشاءات 100 الف م3/يوم وكذلك الخط الرئيسى الخارج من الخزان بالعاصمةالإدارية الجديدة إلى المنطقة الإستثمارية\n"]
["تــاريــخ بــدء الــعــمــل حــســب الــعــقــد :          02/09/2018 م ",null,null,null,null,null,null,null,null,null,null,null,null,null,null,null,null,null,null,null,null,null,null,null,null,null,null,null,null,null,"مـــدة الـــمـــشـــروع حـــســـب الـــعـــقـــد :  365   يــــــوم   ( 12  شهرا  )"]
["تــاريــخ بــدء الــعــمــل الــــفــعـــلــي :             ",null,null,null,null,null,null,null,null,null,null,null,null,null,null,null,null,null,null,null,null,null,null,null,null,null,null,null,null,null,null,"تاريخ النهو المقرر للـــمـــشـــروع :01/09/2019 م "]
["Accumelative Status Report"]
["م","اسم الخط","station",null,"طول الفرعة","نوع التربة","عدد طبقات الاحلال","المقاول","القطر","اعمال التركيب","المنفذ","الميزانية الشبكية (رقم طلب الاستلام)","المنفذ","توقيع المسار (رقم طلب الاستلام)","المنفذ","منسوب قاع حفر (رقم طلب الاستلام)","المنفذ","استلام قطاع الحفر","المنفذ","الاحلال",null,null,null,"استلام مناسيب ظهر الماسورة والاستقامة","المنفذ","استلام التعميم الخارجى  لوصلات المواسير والحلقمة","المنفذ","تغليف بولي ايثيلين","المنفذ",{"$f":"'Daily Log'!AA18","v":"ردم  حول الماسورة( طبقة أولـى  وطبقة ثانية) بسمك 50 سم"},"المنفذ",{"$f":"'Daily Log'!AA19","v":"ردم حول الماسورة( طبقة ثالثة وطبقة رابعة ) بسمك 50 سم"},"المنفذ","تغليف المواسير","المنفذ","تجربة الاختبار بالهواء المضغوط","المنفذ","ردم فوق التغليف (طبقة أولى)","المنفذ","ردم فوق التغليف (طبقة ثانية)","المنفذ","ردم فوق التغليف (طبقة ثالثة)","المنفذ","ردم فوق التغليف (طبقة رابعة)","المنفذ","صلاحية تربة زلطية","صلاحية رمال نظيفة","أخذ عينات صخر","أخذ عينات من ناتج الحفر"]
[null,null,null,null,null,null,null,null,null,null,null,null,null,null,null,null,null,null,null,"طبقة الأولى 25 سم","المنفذ","الفرشة","المنفذ"]
[null,null,"من:----","إلى:----"]
[1,"الخط الرئيسي",-425,-400,{"$f":"D17-C17","v":25},null,null,"محمد مصطفى",1200,{"$f":"IF(X17<>\"\",\"Y\",\"N\")","v":"N"},{"$f":"IF(J17=\"Y\",E17,0)","v":0},null,{"$f":"IF(L17<>\"\",$E$17,\"\")","v":""},null,{"$f":"IF(N17<>\"\",E17,\"\")","v":""},null,{"$f":"IF(P17<>\"\",E17,\"\")","v":""},null,{"$f":"IF(R17<>\"\",E17,\"\")","v":""},null,{"$f":"IF(T17<>\"\",E17,\"\")","v":""},null,{"$f":"IF(V17<>\"\",E17,\"\")","v":""},null,{"$f":"IF(X17<>\"\",E17,\"\")","v":""},null,{"$f":"IF(Z17<>\"\",E17,\"\")","v":""},null,{"$f":"IF(AB17<>\"\",E17,\"\")","v":""},null,{"$f":"IF(AD17<>\"\",E17,\"\")","v":""},null,{"$f":"IF(AF17<>\"\",E17,\"\")","v":""},null,{"$f":"IF(AH17<>\"\",E17,\"\")","v":""},null,{"$f":"IF(AJ17<>\"\",E17,\"\")","v":""},null,{"$f":"IF(AL17<>\"\",E17,\"\")","v":""},null,{"$f":"IF(AN17<>\"\",E17,\"\")","v":""},null,{"$f":"IF(AP17<>\"\",E17,\"\")","v":""},null,{"$f":"IF(AR17<>\"\",E17,\"\")","v":""}]
[2,"الخط الرئيسي",{"$f":"C17+25","v":-400},{"$f":"D17+25","v":-375},25,null,null,"محمد مصطفى",1200,{"$f":"IF(X18<>\"\",\"Y\",\"N\")","v":"N"},0,null,{"$f":"IF(L18<>\"\",E18,\"\")","v":""},null,{"$f":"IF(N18<>\"\",E18,\"\")","v":""},null,{"$f":"IF(P18<>\"\",E18,\"\")","v":""},null,{"$f":"IF(R18<>\"\",E18,\"\")","v":""},null,"",null,{"$f":"IF(V18<>\"\",E18,\"\")","v":""},null,{"$f":"IF(X18<>\"\",E18,\"\")","v":""},null,{"$f":"IF(Z18<>\"\",E18,\"\")","v":""},null,{"$f":"IF(AB18<>\"\",E18,\"\")","v":""},null,{"$f":"IF(AD18<>\"\",E18,\"\")","v":""},null,{"$f":"IF(AF18<>\"\",E18,\"\")","v":""},null,{"$f":"IF(AH18<>\"\",E18,\"\")","v":""},null,{"$f":"IF(AJ18<>\"\",E18,\"\")","v":""},null,{"$f":"IF(AL18<>\"\",E18,\"\")","v":""},null,{"$f":"IF(AN18<>\"\",E18,\"\")","v":""},null,{"$f":"IF(AP18<>\"\",E18,\"\")","v":""},null,{"$f":"IF(AR18<>\"\",E18,\"\")","v":""}]
[3,"الخط الرئيسي",{"$f":"C18+25","v":-375},{"$f":"D18+25","v":-350},25,null,null,"محمد مصطفى",1200,"N",0,null,{"$f":"IF(L19<>\"\",E19,\"\")","v":""},null,"",null,"",null,"",null,"",null,"",null,"",null,"",null,"",null,"",null,"",null,"",null,"",null,"",null,"",null,"",null,""]
[4,"الخط الرئيسي",-350,-325,25,null,null,"محمد مصطفى",1200,"N",0,null,{"$f":"IF(L20<>\"\",E20,\"\")","v":""},null,"",null,"",null,"",null,{"$f":"IF(T20<>\"\",E20,\"\")","v":""},null,"",null,"",null,"",null,"",null,"",null,"",null,"",null,"",null,"",null,"",null,"",null,""]
[5,"الخط الرئيسي",-325,-300,25,null,null,"محمد مصطفى",1200,"N",0,null,"",null,"",null,"",null,"",null,{"$f":"IF(T21<>\"\",E21,\"\")","v":""},null,"",null,"",null,"",null,"",null,"",null,"",null,"",null,"",null,"",null,"",null,"",null,""]
[6,"الخط الرئيسي",-300,-275,25,null,null,"محمد مصطفى",1200,"N",0,null,"",null,"",null,"",null,"",null,"",null,"",null,"",null,"",null,"",null,"",null,"",null,"",null,"",null,"",null,"",null,"",null,""]
[7,"الخط الرئيسي",{"$f":"C22+25","v":-275},-250,25,null,null,"محمد مصطفى",1200,"N",0,null,"",null,"",null,"",null,"",null,"",null,"",null,"",null,"",null,"",null,"",null,"",null,"",null,"",null,"",null,"",null,"",null,""]
[8,"الخط الرئيسي",-250,-244,{"$f":"D24-C24","v":6},null,null,"محمد مصطفى",1200,"N",0,null,"",null,"",null,"",null,"",null,"",null,"",null,"",null,"",null,"",null,"",null,"",null,"",null,"",null,"",null,"",null,"",null,""]
[9,"الخط الرئيسي",-244,-225,{"$f":"D25-C25","v":19},null,null,"محمد مصطفى",1200,"N",{"$f":"IF(J25=\"Y\",E25,0)","v":0},197,19,null,"",184,19,null,"",null,"",null,"",null,"",null,"",null,"",null,"",null,"",null,"",null,"",null,"",null,"",null,"",null,""]
[10,"الخط الرئيسي",{"$f":"C24+25","v":-225},-200,25,null,null,"محمد مصطفى",1200,"N",0,197,25,null,"",184,25,null,"",null,"",null,"",null,"",null,"",null,"",null,"",null,"",null,"",null,"",null,"",null,"",null,"",null,""]
[11,"الخط الرئيسي",-200,-175,25,null,null,"محمد مصطفى",1200,"Y",25,null,"",null,"",177,25,171,25,null,"",181,25,187,25,null,"",null,null,null,"",null,""]
[12,"الخط الرئيسي",-175,-150,25,null,null,"محمد مصطفى",1200,"Y",25,null,"",null,"",177,25,171,25,null,"",181,25,187,25,null,"",null,null,null,"",null,""]
[13,"الخط الرئيسي",-150,-125,25,null,null,"محمد مصطفى",1200,"Y",25,null,"",null,"",177,25,171,25,null,"",181,25,187,25,null,"",null,null,null,"",null,""]
[14,"الخط الرئيسي",-125,-100,25,null,1,"محمد مصطفى",1200,"Y",25,null,"",null,"",158,25,159,25,null,"",170,25,174,25,175,25,null,null,null,"",null,"",null,"",null,"",null,"",null,"",null,"",null,""]
[15,"الخط الرئيسي",-100,-75,25,null,1,"محمد مصطفى",1200,"Y",25,null,"",null,"",158,25,159,25,null,"",170,25,174,25,175,25,null,null,null,"",null,"",null,"",null,"",null,"",null,"",null,"",null,""]
[16,"الخط الرئيسي",-75,-40,35,null,1,"محمد مصطفى",1200,"Y",35,null,"",null,"",158,35,159,35,null,"",170,35,174,35,175,35,null,null,null,"",null,"",null,"",null,"",null,"",null,"",null,"",null,""]
[17,"الخط الرئيسي",{"$f":"-40","v":-40},{"$f":"-25","v":-25},15,null,1,"محمد مصطفى",1200,"Y",15,null,"",null,"",158,15,159,15,null,"",161,15,167,15,175,15,null,null,null,"",null,"",null,"",null,"",null,"",null,"",null,"",null,""]
[18,"الخط الرئيسي",-25,0,{"$f":"D34-C34","v":25},null,1,"محمد مصطفى",1200,"Y",25,null,"",null,"",158,25,159,25,null,"",161,25,167,25,168,25,null,null,null,"",null,"",null,"",null,"",null,"",null,"",null,"",null,""]
[19,"الخط الرئيسي",0,{"$f":"D34+25","v":25},25,null,2,"محمد مصطفى",1200,"Y",25,null,"",null,"",146,25,146,25,148,25,152,25,167,25,156,25,null,null,162,25,null,"",null,"",null,"",null,"",null,"",null,"",null,""]
[20,"الخط الرئيسي",25,50,25,null,2,"محمد مصطفى",1200,"Y",25,null,"",null,"",146,25,146,25,148,25,152,25,167,25,156,25,null,null,162,25,null,"",null,"",null,"",null,"",null,"",null,"",null,""]
[21,"الخط الرئيسي",50,75,25,null,2,"محمد مصطفى",1200,"Y",25,null,"",null,"",146,25,146,25,148,25,152,25,167,25,156,25,null,null,162,25,null,"",null,"",null,"",null,"",null,"",null,"",null,""]
[22,"الخط الرئيسي",75,100,25,null,2,"محمد مصطفى",1200,"Y",25,null,"",null,"",146,25,146,25,148,25,152,25,155,25,156,25,null,null,162,25,null,"",null,"",null,"",null,"",null,"",null,"",null,""]
[23,"الخط الرئيسي",100,125,25,null,2,"محمد مصطفى",1200,"Y",25,null,"",null,"",146,25,146,25,148,25,152,25,155,25,156,25,null,null,162,25,null,"",null,"",null,"",null,"",null,"",null,"",null,""]
[24,"الخط الرئيسي",125,150,25,null,2,"محمد مصطفى",1200,"Y",25,null,"",null,"",146,25,146,25,148,25,152,25,155,25,156,25,null,null,162,25,null,"",null,"",null,"",null,"",null,"",null,"",null,""]
[25,"الخط الرئيسي",150,175,25,null,2,"محمد مصطفى",1200,"Y",25,null,"",null,"",146,25,146,25,148,25,152,25,155,25,156,25,null,null,162,25,null,"",null,"",null,"",null,"",null,"",null,"",null,""]
[26,"الخط الرئيسي",175,200,25,null,2,"محمد مصطفى",1200,"Y",25,null,"",null,"",146,25,146,25,148,25,152,25,155,25,156,25,null,null,162,25,null,"",null,"",null,"",null,"",null,"",null,"",null,""]
[27,"الخط الرئيسي",200,215,15,null,2,"محمد مصطفى",1200,"Y",15,null,"",null,"",146,15,146,15,148,15,152,15,155,15,156,15,null,null,162,15,null,"",null,"",2,null,null,"",null,"",null,"",null,""]
[28,"الخط الرئيسي",215,225,10,null,2,"محمد مصطفى",1200,"Y",10,null,"",null,"",117,10,117,10,148,10,152,10,154,10,156,10,null,null,162,10,null,"",null,"",null,null,null,"",null,"",null,"",null,""]
[29,"الخط الرئيسي",{"$f":"C43+25","v":225},{"$f":"D44+25","v":250},25,null,2,"محمد مصطفى",1200,"Y",25,null,"",null,"",117,25,117,25,137,25,138,25,154,25,156,25,null,null,null,"",163,25,null,"",null,null,null,"",null,"",null,"",null,""]
[30,"الخط الرئيسي",250,275,25,null,2,"محمد مصطفى",1200,"Y",25,null,"",null,"",117,25,117,25,137,25,138,25,145,25,null,"",null,null,null,"",163,25,null,"",null,null,null,"",null,"",null,"",null,""]
[31,"الخط الرئيسي",275,300,25,null,2,"محمد مصطفى",1200,"Y",25,null,"",null,"",117,25,117,25,137,25,138,25,145,25,null,"",null,null,151,25,163,25,null,"",null,null,null,"",null,"",null,"",null,""]
[32,"الخط الرئيسي",300,325,25,null,2,"محمد مصطفى",1200,"Y",25,null,"",null,"",117,25,117,25,128,25,131,25,145,25,null,"",null,null,151,25,163,25,null,"",null,null,null,"",null,"",null,"",null,""]
[33,"الخط الرئيسي",325,350,25,null,2,"محمد مصطفى",1200,"Y",25,null,"",null,"",117,25,117,25,128,25,131,25,145,25,null,"",null,null,151,25,163,25,null,"",null,null,null,"",null,"",null,"",null,""]
[34,"الخط الرئيسي",350,375,25,null,2,"محمد مصطفى",1200,"Y",25,null,"",null,"",117,25,117,25,128,25,131,25,145,25,null,"",null,null,151,25,163,25,null,"",null,null,null,"",null,"",null,"",null,""]
[35,"الخط الرئيسي",375,400,25,null,2,"محمد مصطفى",1200,"Y",25,null,"",null,"",117,25,117,25,128,25,131,25,145,25,null,"",null,null,151,25,163,25,null,"",null,null,null,"",null,"",null,"",null,""]
[36,"الخط الرئيسي",400,425,25,null,2,"محمد مصطفى",1200,"Y",25,null,"",null,"",117,25,117,25,128,25,131,25,145,25,null,"",null,null,151,25,163,25,null,"",null,null,null,"",null,"",null,"",null,""]
[37,"الخط الرئيسي",425,450,25,null,2,"محمد مصطفى",1200,"Y",25,null,"",null,"",117,25,117,25,128,25,131,25,145,25,null,"",null,null,151,25,163,25,null,"",null,null,null,"",null,"",null,"",null,""]
[38,"الخط الرئيسي",450,475,25,null,2,"محمد مصطفى",1200,"Y",25,null,"",null,"",117,25,117,25,128,25,131,25,145,25,null,"",null,null,151,25,163,25,null,"",null,null,null,"",null,"",null,"",null,""]
[39,"الخط الرئيسي",475,500,25,null,2,"محمد مصطفى",1200,{"$f":"IF(X55<>\"\",\"Y\",\"N\")","v":"Y"},25,null,"",null,"",115,25,115,25,116,25,118,25,145,25,null,"",null,null,135,25,147,25,null,"",null,null,null,"",null,"",null,"",null,""]
[40,"الخط الرئيسي",500,525,25,null,2,"محمد مصطفى",1200,"Y",25,null,"",null,"",115,25,115,25,116,25,118,25,145,25,null,"",null,null,135,25,147,25,null,"",null,null,null,"",null,"",null,"",null,""]
[41,"الخط الرئيسي",525,550,25,null,2,"محمد مصطفى",1200,"Y",25,null,"",null,"",115,25,115,25,116,25,118,25,130,25,null,"",null,null,135,25,147,25,null,"",null,null,null,"",null,"",null,"",null,""]
[42,"الخط الرئيسي",550,575,25,null,2,"محمد مصطفى",1200,"Y",25,null,"",null,"",115,25,115,25,116,25,118,25,130,25,null,"",null,null,141,25,147,25,null,"",null,null,null,"",null,"",null,"",null,""]
[43,"الخط الرئيسي",575,600,25,null,2,"محمد مصطفى",1200,"Y",25,null,"",null,"",115,25,115,25,116,25,118,25,130,25,null,"",null,null,141,25,147,25,null,"",null,null,null,"",null,"",null,"",null,""]
[44,"الخط الرئيسي",600,616,16,null,2,"محمد مصطفى",1200,"Y",16,null,"",null,"",115,16,115,16,116,16,118,16,130,16,null,"",null,null,141,16,147,16,null,"",null,null,null,"",null,"",null,"",null,""]
[45,"الخط الرئيسي",616,{"$f":"D59+25","v":625},9,null,2,"محمد مصطفى",1200,"N",0,null,"",null,"",115,9,115,9,116,9,118,9,null,"",null,"",null,null,141,9,147,9,null,"",null,null,null,"",null,"",null,"",null,""]
[46,"الخط الرئيسي",625,650,25,null,2,"محمد مصطفى",1200,"Y",25,null,"",null,"",115,25,115,25,116,25,118,25,129,25,129,25,null,null,141,25,147,25,null,"",null,null,null,"",null,"",null,"",null,""]
[47,"الخط الرئيسي",650,675,25,null,2,"محمد مصطفى",1200,"Y",25,null,"",null,"",115,25,115,25,116,25,118,25,129,25,129,25,null,null,141,25,147,25,null,"",null,null,null,"",null,"",null,"",null,""]
[48,"الخط الرئيسي",675,700,25,null,2,"محمد مصطفى",1200,"Y",25,null,"",null,"",115,25,115,25,116,25,118,25,129,25,129,25,null,null,141,25,147,25,null,"",null,null,null,"",null,"",null,"",null,""]
[49,"الخط الرئيسي",700,725,25,null,1,"محمد مصطفى",1200,"Y",25,null,"",null,"",106,25,106,25,null,"",107,25,108,25,null,"",null,null,141,25,147,25,null,"",null,null,null,"",null,"",null,"",null,""]
[50,"الخط الرئيسي",725,750,25,null,1,"محمد مصطفى",1200,"Y",25,null,"",null,"",106,25,106,25,null,"",107,25,108,25,null,"",null,null,141,25,147,25,null,"",null,null,null,"",null,"",null,"",null,""]
[51,"الخط الرئيسي",750,775,25,null,1,"محمد مصطفى",1200,"Y",25,null,"",null,"",106,25,106,25,null,"",107,25,108,25,null,"",null,null,141,25,147,25,null,"",null,null,null,"",null,"",null,"",null,""]
[52,"الخط الرئيسي",775,784,9,null,1,"محمد مصطفى",1200,"Y",9,null,"",null,"",106,9,106,9,null,"",107,9,108,9,null,"",null,null,141,9,147,9,null,"",null,null,null,"",null,"",null,"",null,""]
[53,"الخط الرئيسي",784,{"$f":"D67+25","v":800},16,null,2,"محمد مصطفى",1200,"Y",16,null,"",null,"",102,16,102,16,103,16,null,"",108,16,null,"",null,null,141,16,147,16,null,"",null,null,null,"",null,"",null,"",null,""]
[54,"الخط الرئيسي",809,814,5,null,2,"محمد مصطفى",1200,"Y",5,null,"",null,"",102,5,102,5,103,5,null,"",108,5,null,"",null,null,141,5,147,5,null,"",null,null,null,"",null,"",null,"",null,""]
[55,"الخط الرئيسي",814,824,10,null,null,"محمد مصطفى",1200,"N",0,null,"",null,"",null,"",null,"",null,"",null,"",null,"",null,"",null,"",null,"",null,"",null,"",null,"",null,"",null,"",null,"",null,""]
["التنفيذ (م.ط)",null,null,null,null,null,null,null,null,null,null,{"$f":"SUM(M17:M71)","v":44},null,{"$f":"SUM(O17:O71)","v":0},null,null,null,null,null,null,null,null,null,null,null,null,null,null,null,null,null,null,null,{"$f":"SUM(AI17:AI71)","v":0},null,{"$f":"SUM(AK17:AK71)","v":0},null,{"$f":"SUM(AM17:AM71)","v":0},null,{"$f":"SUM(AO17:AO71)","v":0},null,{"$f":"SUM(AQ17:AQ71)","v":0},null,{"$f":"SUM(AS17:AS71)","v":0},null,{"$f":"SUM(L74:AR74)","v":0}]
["نسبة البند"]
["الإجمالى",null,null,null,null,null,null,null,null,null,null,{"$f":"L73*L72","v":0},null,{"$f":"N73*N72","v":0},null,null,null,null,null,null,null,null,null,null,null,null,null,null,null,null,null,null,null,{"$f":"AH73*AH72","v":0},null,{"$f":"AJ73*AJ72","v":0},null,{"$f":"AL73*AL72","v":0},null,{"$f":"AN73*AN72","v":0},null,{"$f":"AP73*AP72","v":0},null,{"$f":"AR73*AR72","v":0}]
[56,"الخط الرئيسي",824,850,26,null,0,"عبود (متكامل)",1000,{"$f":"IF(X75<>\"\",\"Y\",\"N\")","v":"Y"},{"$f":"IF(J75=\"Y\",E75,0)","v":26},null,{"$f":"IF(L75<>\"\",E75,\"\")","v":""},null,{"$f":"IF(N75<>\"\",E75,\"\")","v":""},109,{"$f":"IF(P75<>\"\",E75,\"\")","v":26},109,{"$f":"IF(R75<>\"\",E75,\"\")","v":26},null,{"$f":"IF(T75<>\"\",E75,\"\")","v":""},null,{"$f":"IF(V75<>\"\",E75,\"\")","v":""},110,{"$f":"IF(X75<>\"\",E75,\"\")","v":26},null,{"$f":"IF(Z75<>\"\",E75,\"\")","v":""},null,null,111,{"$f":"IF(AD75<>\"\",E75,\"\")","v":26},112,{"$f":"IF(AF75<>\"\",E75,\"\")","v":26},127,{"$f":"IF(AH75<>\"\",E75,\"\")","v":26},null,null,null,{"$f":"IF(AL75<>\"\",E75,\"\")","v":""},null,{"$f":"IF(AN75<>\"\",E75,\"\")","v":""},null,{"$f":"IF(AP75<>\"\",E75,\"\")","v":""},null,{"$f":"IF(AR75<>\"\",E75,\"\")","v":""}]
[null,null,850,875,25,null,0,null,1000,{"$f":"IF(X76<>\"\",\"Y\",\"N\")","v":"Y"},{"$f":"IF(J76=\"Y\",E76,0)","v":25},null,null,null,null,109,25,109,25,null,null,null,null,110,25,null,null,null,null,111,25,112,25,127,25]
[57,"الخط الرئيسي",875,900,25,null,0,"عبود (متكامل)",1000,{"$f":"IF(X77<>\"\",\"Y\",\"N\")","v":"Y"},{"$f":"IF(J77=\"Y\",E77,0)","v":25},null,"",null,"",109,25,109,25,null,"",null,"",110,25,null,"",null,null,111,25,112,25,127,25,null,null,null,{"$f":"IF(AL77<>\"\",E77,\"\")","v":""},null,"",null,"",null,""]
[58,"الخط الرئيسي",{"$f":"C77+25","v":900},925,25,null,0,"عبود (متكامل)",1000,"Y",25,null,"",null,"",109,25,109,25,null,"",null,"",110,25,null,"",null,null,111,25,112,25,127,25,null,null,null,"",null,"",null,"",null,""]
[59,"الخط الرئيسي",925,950,25,null,1,"عبود (متكامل)",1000,"Y",25,null,"",null,"",113,25,113,25,null,"",114,25,122,{"$f":"IF(X79<>\"\",E79,\"\")","v":25},null,"",null,null,132,25,140,25,null,"",null,null,null,"",null,"",null,"",null,""]
[60,"الخط الرئيسي",950,975,25,null,1,"عبود (متكامل)",1000,"Y",25,null,"",null,"",113,25,113,25,null,"",114,25,122,25,null,"",null,null,132,25,140,25,null,"",null,null,null,"",null,"",null,"",null,""]
[61,"الخط الرئيسي",975,1000,25,null,1,"عبود (متكامل)",1000,"Y",25,null,"",null,"",113,25,113,25,null,"",114,25,122,25,null,"",null,null,132,25,140,25,null,"",null,null,null,"",null,"",null,"",null,""]
[62,"الخط الرئيسي",1000,1025,25,null,1,"عبود (متكامل)",1000,"Y",25,null,"",null,"",113,25,113,25,null,"",114,25,122,25,null,"",null,null,132,25,140,25,null,"",null,null,null,"",null,"",null,"",null,""]
[63,"الخط الرئيسي",{"$f":"C82+25","v":1025},{"$f":"D82+25","v":1050},25,null,null,"عبود (متكامل)",1000,"Y",25,null,"",null,"",48,25,119,25,120,25,126,25,188,{"$f":"IF(X83<>\"\",E83,\"\")","v":25},189,25,null,null,null,"",null,"",null,"",null,null,null,"",null,"",null,"",null,""]
[64,"الخط الرئيسي",1050,1075,25,null,null,"عبود (متكامل)",1000,"Y",25,null,"",71,25,48,25,119,25,120,25,126,25,188,25,189,25,null,{"$f":"IF(AB84<>\"\",E84,\"\")","v":""},null,"",null,"",null,"",null,{"$f":"IF(AJ84<>\"\",E84,\"\")","v":""},null,"",null,"",null,"",null,""]
[65,"الخط الرئيسي",1075,1100,25,null,null,"عبود (متكامل)",1000,"Y",25,null,"",71,25,null,{"$f":"IF(P85<>\"\",E85,\"\")","v":""},123,{"$f":"IF(R85<>\"\",E85,\"\")","v":25},null,"",null,"",188,25,189,25,null,"",null,"",null,"",null,"",null,"",null,"",null,"",null,"",null,""]
[66,"الخط الرئيسي",1100,1125,{"$f":"D86-C86","v":25},null,null,"عبود (متكامل)",1000,"Y",25,null,"",71,25,null,"",123,25,null,"",null,"",188,25,189,25,null,"",null,"",null,{"$f":"IF(AF86<>\"\",E86,\"\")","v":""},null,"",null,"",null,"",null,"",null,"",null,""]
[67,"الخط الرئيسي",1125,1150,25,null,null,"عبود (متكامل)",1000,"Y",25,null,"",71,25,null,"",123,25,null,"",null,"",188,25,189,25,null,"",null,"",null,"",null,"",null,"",null,"",null,"",null,"",null,""]
[68,"الخط الرئيسي",1150,1175,25,null,null,"عبود (متكامل)",1000,"Y",25,null,"",71,25,null,"",123,25,null,"",null,"",188,25,189,25,null,"",null,"",null,"",null,{"$f":"IF(AH88<>\"\",E88,\"\")","v":""},null,"",null,"",null,"",null,"",null,""]
[69,"الخط الرئيسي",1175,1200,25,null,null,"عبود (متكامل)",1000,"Y",25,null,"",71,25,null,"",123,25,null,"",null,"",188,25,189,25,null,"",null,"",null,"",null,"",null,"",null,"",null,"",null,"",null,""]
[70,"الخط الرئيسي",1200,1225,25,null,null,"عبود (متكامل)",1000,"N",0,null,"",71,25,null,"",190,25,null,"",null,"",null,"",207,25,null,"",null,"",null,"",null,"",null,"",null,"",null,"",null,"",null,""]
[71,"الخط الرئيسي",1225,1250,25,null,null,"عبود (متكامل)",1000,"N",0,null,"",71,25,null,"",190,25,null,"",null,"",null,"",207,25,null,"",null,"",null,"",null,"",null,"",null,"",null,"",null,"",null,""]
[72,"الخط الرئيسي",1250,1275,25,null,null,"عبود (متكامل)",1000,"N",0,null,"",71,25,null,"",190,25,null,"",null,"",null,"",207,25,null,"",null,"",null,"",null,"",null,"",null,"",null,"",null,"",null,""]
[73,"الخط الرئيسي",1275,1300,25,null,null,"عبود (متكامل)",1000,"N",0,null,"",71,25,null,"",190,25,null,"",null,"",null,"",207,25,null,"",null,"",null,"",null,"",null,"",null,"",null,"",null,"",null,""]
[74,"الخط الرئيسي",1300,1325,25,null,null,"عبود (متكامل)",1000,"N",0,null,"",71,25,null,"",190,25,null,"",null,"",null,"","215-1",25,null,"",null,"",null,"",null,"",null,"",null,"",null,"",null,"",null,""]
[75,"الخط الرئيسي",1325,1350,25,null,null,"عبود (متكامل)",1000,"N",0,null,"",71,25,null,"",190,25,null,"",null,"",null,"","215-1",25,null,"",null,"",null,"",null,"",null,"",null,"",null,"",null,"",null,""]
[76,"الخط الرئيسي",1350,1375,25,null,null,"عبود (متكامل)",1000,"N",0,null,"",71,25,null,"",null,"",null,"",null,"",null,"","215-1",25,null,"",null,"",null,"",null,"",null,"",null,"",null,"",null,"",null,""]
[77,"الخط الرئيسي",1375,1400,25,null,null,"عبود (متكامل)",1000,"N",0,null,"",71,25,null,"",null,{"$f":"IF(R97<>\"\",E97,\"\")","v":""},null,"",null,"",null,"",null,"",null,"",null,"",null,"",null,"",null,"",null,"",null,"",null,"",null,""]
[78,"الخط الرئيسي",1400,1425,25,null,null,"عبود (متكامل)",1000,"N",0,null,"",71,25,null,"",null,"",null,"",null,"",null,"",null,"",null,"",null,"",null,"",null,"",null,"",null,"",null,"",null,"",null,""]
[79,"الخط الرئيسي",1425,1450,25,null,null,"عبود (متكامل)",1000,"N",0,null,"",71,25,null,"",null,"",null,"",null,"",null,"",null,"",null,"",null,"",null,"",null,"",null,"",null,"",null,"",null,"",null,""]
[80,"الخط الرئيسي",1450,1475,25,null,null,"عبود (متكامل)",1000,"N",0,null,"",71,25,null,"",null,"",null,"",null,"",null,"",null,"",null,"",null,"",null,"",null,"",null,"",null,"",null,"",null,"",null,""]
[81,"الخط الرئيسي",1475,1500,25,null,null,"عبود (متكامل)",1000,"N",0,null,"",71,25,null,"",null,"",null,"",null,"",null,"",null,"",null,"",null,"",null,"",null,"",null,"",null,"",null,"",null,"",null,""]
[82,"الخط الرئيسي",1500,1525,25,null,null,"عبود (متكامل)",1000,"N",0,null,"",71,25,null,"",null,"",null,"",null,"",null,"",null,"",null,"",null,"",null,"",null,"",null,"",null,"",null,"",null,"",null,""]
[83,"الخط الرئيسي",1525,1550,25,null,null,"عبود (متكامل)",1000,"N",0,null,"",71,25,null,"",null,"",null,"",null,"",null,"",null,"",null,"",null,"",null,"",null,"",null,"",null,"",null,"",null,"",null,""]
[84,"الخط الرئيسي",1550,1575,25,null,null,"عبود (متكامل)",1000,"N",0,null,"",71,25,null,"",null,"",null,"",null,"",null,"",null,"",null,"",null,"",null,"",null,"",null,"",null,"",null,"",null,"",null,""]
[85,"الخط الرئيسي",1575,1600,25,null,null,"عبود (متكامل)",1000,"N",0,null,"",71,25,null,"",null,"",null,"",null,"",null,"",null,"",null,"",null,"",null,"",null,"",null,"",null,"",null,"",null,"",null,""]
[86,"الخط الرئيسي",1600,1625,25,null,null,"عبود (متكامل)",1000,"N",0,null,"",71,25,null,"",null,"",null,"",null,"",null,"",null,"",null,"",null,"",null,"",null,"",null,"",null,"",null,"",null,"",null,""]
[87,"الخط الرئيسي",1625,1650,25,null,null,"عبود (متكامل)",1000,"N",0,null,"",71,25,null,"",null,"",null,"",null,"",null,"",null,"",null,"",null,"",null,"",null,"",null,"",null,"",null,"",null,"",null,""]
[88,"الخط الرئيسي",1650,1675,25,null,null,"عبود (متكامل)",1000,"N",0,null,"",71,25,null,"",null,"",null,"",null,"",null,"",null,"",null,"",null,"",null,"",null,"",null,"",null,"",null,"",null,"",null,""]
[89,"الخط الرئيسي",1675,1700,25,null,null,"عبود (متكامل)",1000,"N",0,null,"",71,25,null,"",null,"",null,"",null,"",null,"",null,"",null,"",null,"",null,"",null,"",null,"",null,"",null,"",null,"",null,""]
[90,"الخط الرئيسي",1700,1725,25,null,null,"عبود (متكامل)",1000,"N",0,null,"",71,25,null,"",null,"",null,"",null,"",null,"",null,"",null,"",null,"",null,"",null,"",null,"",null,"",null,"",null,"",null,""]
[91,"الخط الرئيسي",1725,1750,25,null,null,"عبود (متكامل)",1000,"N",0,null,"",71,25,null,"",null,"",null,"",null,"",null,"",null,"",null,"",null,"",null,"",null,"",null,"",null,"",null,"",null,"",null,""]
[92,"الخط الرئيسي",1750,1775,25,null,null,"عبود (متكامل)",1000,"N",0,null,"",71,25,null,"",null,"",null,"",null,"",null,"",null,"",null,"",null,"",null,"",null,"",null,"",null,"",null,"",null,"",null,""]
[93,"الخط الرئيسي",1775,1800,25,null,null,"عبود (متكامل)",1000,"N",0,null,"",71,25,null,"",null,"",null,"",null,"",null,"",null,"",null,"",null,"",null,"",null,"",null,"",null,"",null,"",null,"",null,""]
[94,"الخط الرئيسي",1800,1825,25,null,null,"عبود (متكامل)",1000,"N",0,null,"",71,25,null,"",null,"",null,"",null,"",null,"",null,"",null,"",null,"",null,"",null,"",null,"",null,"",null,"",null,"",null,""]
[95,"الخط الرئيسي",1825,1838.56,13.559999999999945,null,null,"عبود (متكامل)",1000,"N",0,null,"",71,13.559999999999945,50,13.559999999999945,50,13.559999999999945,null,"",null,"",null,"",null,"",null,"",null,"",null,"",null,"",null,"",null,"",null,"",null,"",null,""]
[96,"الخط الرئيسي",1838.56,1850,11.440000000000055,null,1,"عبود (متكامل)",1000,"Y",11.440000000000055,null,"",null,"",50,11.440000000000055,50,11.440000000000055,null,"",52,11.440000000000055,69,11.440000000000055,null,"",null,"",null,"",null,"",null,"",null,"",null,"",null,"",null,"",null,""]
[97,"الخط الرئيسي",1850,1875,25,null,1,"عبود (متكامل)",1000,"Y",25,null,"",null,"",50,25,50,25,null,"",52,25,69,25,null,"",null,"",null,"",null,"",null,"",null,"",null,"",null,"",null,"",null,""]
[98,"الخط الرئيسي",{"$f":"C117+25","v":1875},1900,25,null,2,"عبود (متكامل)",1000,"Y",25,null,"",null,"",49,25,49,25,null,null,51,25,69,25,null,"",null,"",null,"",null,"",null,"",null,"",null,"",null,"",null,"",null,""]
[99,"الخط الرئيسي",1900,1925,25,null,2,"عبود (متكامل)",1000,"Y",25,null,"",null,"",49,25,49,25,null,null,51,25,69,25,null,"",null,"",null,"",null,"",null,"",null,"",null,"",null,"",null,"",null,""]
[100,"الخط الرئيسي",1925,1950,25,null,0,"عبود (متكامل)",1000,"Y",25,null,"",null,"",48,25,48,25,null,"",null,"",69,25,null,"",null,"",null,{"$f":"IF(AD120<>\"\",E120,\"\")","v":""},null,"",null,"",null,"",null,"",null,"",null,"",null,""]
[101,"الخط الرئيسي",{"$f":"C120+25","v":1950},1969.78,19.779999999999973,null,0,"عبود (متكامل)",1000,"Y",19.779999999999973,null,"",null,"",48,19.779999999999973,48,19.779999999999973,null,"",null,"",69,19.779999999999973,null,"",null,"",null,"",null,"",null,"",null,"",null,"",null,"",null,"",null,""]
[102,"الخط الرئيسي",1969.78,1975,5.2200000000000273,null,null,"عبود (متكامل)",1000,"N",0,null,"",null,"",null,"",null,"",null,"",null,"",null,"",null,"",null,"",null,"",null,"",null,"",null,"",null,"",null,"",null,"",null,""]
[103,"الخط الرئيسي",1975,1978.2,3.2000000000000455,null,null,"عبود (متكامل)",1000,"N",0,null,"",null,"",null,"",null,"",null,"",null,"",null,"",null,"",null,"",null,"",null,"",null,"",null,"",null,"",null,"",null,"",null,""]
[104,"الخط الرئيسي",1978.2,2000,21.799999999999955,null,0,"عبود (متكامل)",1000,"Y",21.799999999999955,null,"",null,"",45,21.799999999999955,45,21.799999999999955,null,"",null,"",46,21.799999999999955,null,"",null,null,57,21.799999999999955,null,null,null,null,null,"",null,"",null,"",null,"",null,""]
[105,"الخط الرئيسي",2000,2025,25,null,null,null,1000,"Y",25,null,"",null,"",45,25,45,25,null,"",null,"",46,25,null,"",null,null,57,25,null,null,null,null,null,"",null,"",null,"",null,"",null,""]
[106,"الخط الرئيسي",2025,2050,25,null,0,"عبود (متكامل)",1000,"Y",25,null,"",null,"",45,25,45,25,null,"",null,"",46,25,null,"",null,null,57,25,null,null,null,null,null,"",null,"",null,"",null,"",null,""]
[107,"الخط الرئيسي",{"$f":"C126+25","v":2050},2075,25,null,0,"عبود (متكامل)",1000,"Y",25,null,"",null,"",45,25,45,25,null,"",null,"",46,25,null,"",null,null,57,25,null,null,null,null,null,"",null,"",null,"",null,"",null,""]
[108,"الخط الرئيسي",2075,2100,25,null,0,"عبود (متكامل)",1000,"Y",25,null,"",null,"",45,25,45,25,null,"",null,"",46,25,null,"",null,null,57,25,null,null,null,null,null,"",null,"",null,"",null,"",null,""]
[109,"الخط الرئيسي",2100,2125,25,null,0,"عبود (متكامل)",1000,"Y",25,null,"",null,"",45,25,45,25,null,"",null,"",46,25,null,"",null,null,57,25,null,null,null,null,null,"",null,"",null,"",null,"",null,""]
[110,"الخط الرئيسي",{"$f":"C129+25","v":2125},{"$f":"D129+25","v":2150},25,null,0,"عبود (متكامل)",1000,"Y",25,null,"",null,"",43,25,43,25,null,"",null,"",44,25,null,"",null,null,57,25,null,null,null,null,null,"",null,"",null,"",null,"",null,""]
[111,"الخط الرئيسي",2150,2175,25,null,0,"عبود (متكامل)",1000,"Y",25,null,"",null,"",43,25,43,25,null,"",null,"",44,25,null,"",null,null,57,25,null,null,null,null,null,"",null,"",null,"",null,"",null,""]
[112,"الخط الرئيسي",2175,2200,25,null,0,"عبود (متكامل)",1000,"Y",25,null,"",null,"",43,25,43,25,null,"",null,"",44,25,null,"",null,null,57,25,null,null,null,null,null,"",null,"",null,"",null,"",null,""]
[113,"الخط الرئيسي",2200,2225,25,null,0,"عبود (متكامل)",1000,"Y",25,null,"",null,"",43,25,43,25,null,"",null,"",44,25,null,"",null,null,57,25,null,null,null,null,null,"",null,"",null,"",null,"",null,""]
[114,"الخط الرئيسي",2225,2250,25,null,0,"عبود (متكامل)",1000,"Y",25,null,"",null,"",43,25,43,25,null,"",null,"",44,25,null,"",null,null,57,25,null,null,null,null,null,"",null,"",null,"",null,"",null,""]
[115,"الخط الرئيسي",2250,2275,25,null,0,"عبود (متكامل)",1000,"Y",25,null,"",null,"",43,25,43,25,null,"",null,"",44,25,null,"",null,null,57,25,null,null,null,null,null,"",null,"",null,"",null,"",null,""]
[116,"الخط الرئيسي",2275,2278.87,3.8699999999998909,null,0,"عبود (متكامل)",1000,"Y",3.8699999999998909,null,"",null,"",37,3.8699999999998909,37,3.8699999999998909,null,"",null,"",44,3.8699999999998909,null,"",null,null,57,3.8699999999998909,null,null,null,null,null,"",null,"",null,"",null,"",null,""]
[117,"الخط الرئيسي",2278.87,2300,21.130000000000109,null,0,"عبود (متكامل)",1000,"N",0,null,"",null,"",37,21.130000000000109,37,21.130000000000109,null,"",null,"",null,"",null,"",null,null,null,"",null,null,null,null,null,"",null,"",null,"",null,"",null,""]
[null,"الخط الرئيسي",2300,2325,25,null,null,null,1000,{"$f":"IF(X138<>\"\",\"Y\",\"N\")","v":"Y"},{"$f":"IF(J138=\"Y\",E138,0)","v":25},null,null,null,null,38,{"$f":"IF(P138<>\"\",E138,\"\")","v":25},38,{"$f":"IF(R138<>\"\",E138,\"\")","v":25},null,null,null,null,45,{"$f":"IF(X138<>\"\",E138,\"\")","v":25}]
[118,"الخط الرئيسي",2325,2350,25,null,0,"عبود (متكامل)",1000,"Y",25,null,"",null,"",37,25,37,25,null,"",null,"",44,25,null,"",null,null,null,"",null,null,null,null,null,"",null,"",null,"",null,"",null,""]
[119,"الخط الرئيسي",{"$f":"C139+25","v":2350},{"$f":"D139+25","v":2375},25,null,0,"عبود (متكامل)",1000,"Y",25,null,"",null,"",37,25,37,25,null,"",null,"",44,25,null,"",null,null,null,"",null,null,null,null,null,"",null,"",null,"",null,"",null,""]
[120,"الخط الرئيسي",{"$f":"C140+25","v":2375},{"$f":"D140+25","v":2400},25,null,0,"عبود (متكامل)",1000,"Y",25,null,"",null,"",41,25,41,25,null,"",null,"",42,25,null,"",null,null,null,"",null,null,null,null,null,"",null,"",null,"",null,"",null,""]
[121,"الخط الرئيسي",2400,2425,25,null,0,"عبود (متكامل)",1000,"Y",{"$f":"IF(J142=\"Y\",E142,0)","v":25},null,{"$f":"IF(L142<>\"\",E142,\"\")","v":""},null,{"$f":"IF(N142<>\"\",E142,\"\")","v":""},41,25,41,25,null,{"$f":"IF(T142<>\"\",E142,\"\")","v":""},null,{"$f":"IF(V142<>\"\",E142,\"\")","v":""},42,25,null,{"$f":"IF(Z142<>\"\",E142,\"\")","v":""},null,null,54,25,null,null,null,null,null,{"$f":"IF(AJ142<>\"\",E142,\"\")","v":""},null,"",null,{"$f":"IF(AN142<>\"\",E142,\"\")","v":""},null,{"$f":"IF(AP142<>\"\",E142,\"\")","v":""},null,{"$f":"IF(AR142<>\"\",E142,\"\")","v":""}]
[122,"الخط الرئيسي",2425,2450,25,null,0,"عبود (متكامل)",1000,"Y",25,null,"",null,"",41,25,41,25,null,"",null,"",42,25,null,"",null,null,54,25,null,null,null,null,null,"",null,{"$f":"IF(AL143<>\"\",E143,\"\")","v":""},null,"",null,"",null,""]
[123,"الخط الرئيسي",2450,2475,25,null,0,"عبود (متكامل)",1000,{"$f":"IF(X144<>\"\",\"Y\",\"N\")","v":"Y"},25,null,"",null,"",41,25,41,25,null,"",null,"",42,25,null,"",null,null,54,25,null,null,null,null,null,"",null,"",null,"",null,"",null,""]
[124,"الخط الرئيسي",2475,2500,25,null,0,"عبود (متكامل)",1000,"Y",25,null,"",null,"",41,25,41,25,null,"",null,"",42,25,null,"",null,null,54,25,null,null,null,null,null,"",null,"",null,"",null,"",null,""]
[125,"الخط الرئيسي",2500,2525,25,null,0,"عبود (متكامل)",1000,"Y",25,null,"",null,"",41,25,41,25,null,"",null,"",42,25,null,"",null,null,54,25,null,null,null,null,null,"",null,"",null,"",null,"",null,""]
[126,"الخط الرئيسي",2525,2550,25,null,0,"عبود (متكامل)",1000,"Y",25,null,"",null,"",41,25,41,25,null,"",null,"",42,25,null,"",null,null,54,25,null,null,null,null,null,"",null,"",null,"",null,"",null,""]
[127,"الخط الرئيسي",2550,2575,25,null,0,"عبود (متكامل)",1000,"Y",25,null,"",null,"",41,25,41,25,null,"",null,"",42,{"$f":"IF(X148<>\"\",E148,\"\")","v":25},null,"",null,null,54,25,null,null,null,null,null,"",null,"",null,"",null,"",null,""]
[128,"الخط الرئيسي",2575,2600,25,null,0,"عبود (متكامل)",1000,"Y",25,null,"",null,"",41,25,41,25,null,"",null,"",42,25,null,"",null,null,54,25,null,null,null,null,null,"",null,"",null,"",null,"",null,""]
[129,"الخط الرئيسي",2600,2625,25,null,0,"عبود (متكامل)",1000,"Y",25,null,"",null,"",41,{"$f":"IF(P150<>\"\",E150,\"\")","v":25},41,25,null,"",null,"",42,25,null,"",null,null,54,{"$f":"IF(AD150<>\"\",E150,\"\")","v":25},null,null,null,null,null,"",null,"",null,"",null,"",null,""]
[130,"الخط الرئيسي",2625,2650,25,null,0,"عبود (متكامل)",1000,"Y",25,null,"",null,"",41,25,41,25,null,"",null,"",42,25,null,"",null,null,54,25,null,null,null,null,null,"",null,"",null,"",null,"",null,""]
[131,"الخط الرئيسي",2650,2675,{"$f":"D152-C152","v":25},null,0,"عبود (متكامل)",1000,"Y",25,null,"",null,"",41,25,41,25,null,"",null,"",42,25,null,"",null,null,54,25,null,null,null,null,null,"",null,"",null,"",null,"",null,""]
[132,"الخط الرئيسي",2675,2700,25,null,0,"عبود (متكامل)",1000,"Y",25,null,"",null,"",41,25,41,25,null,"",null,"",42,25,null,"",null,null,54,25,null,null,null,null,null,"",null,"",null,"",null,"",null,""]
[133,"الخط الرئيسي",2700,2725,25,null,0,"عبود (متكامل)",1000,"Y",25,null,"",null,"",41,25,41,25,null,"",null,"",42,25,null,"",null,null,54,25,null,null,null,null,null,"",null,"",null,"",null,"",null,""]
[134,"الخط الرئيسي",2725,2750,25,null,null,"عبود (متكامل)",1000,"Y",25,null,"",null,"",null,{"$f":"IF(P155<>\"\",E155,\"\")","v":""},null,{"$f":"IF(R155<>\"\",E155,\"\")","v":""},null,"",null,"",67,null,null,"",null,null,null,"",null,null,null,null,null,"",null,"",null,"",null,"",null,""]
[135,"الخط الرئيسي",2750,2775,25,null,null,"عبود (متكامل)",1000,"Y",25,null,"",null,"",null,"",null,"",null,"",null,"",67,null,null,"",null,null,null,"",null,null,null,null,null,"",null,"",null,"",null,"",null,""]
[136,"الخط الرئيسي",2775,2800,25,null,null,"عبود (متكامل)",1000,"Y",25,null,"",null,"",null,"",null,"",null,"",null,"",67,null,null,"",null,null,null,"",null,null,null,null,null,"",null,"",null,"",null,"",null,""]
[137,"الخط الرئيسي",2800,2825,25,null,null,"عبود (متكامل)",1000,"Y",25,null,"",null,"",47,100,47,100,null,"",63,125,67,75,null,"",null,null,null,"",null,null,null,null,null,"",null,"",null,"",null,"",null,""]
[138,"الخط الرئيسي",2825,2850,25,null,1,"عبود (متكامل)",1000,"Y",25,null,"",null,"",47,null,47,null,null,"",63,null,67,null,null,"",null,null,null,"",null,null,null,null,null,"",null,"",null,"",null,"",null,""]
[139,"الخط الرئيسي",2850,2875,25,null,1,"عبود (متكامل)",1000,"Y",25,null,"",null,"",47,null,47,null,null,"",63,null,67,null,null,"",null,null,null,"",null,null,null,null,null,"",null,"",null,"",null,"",null,""]
[140,"الخط الرئيسي",2875,2900,25,null,1,"عبود (متكامل)",1000,"Y",25,null,"",null,"",47,null,47,null,null,"",63,null,68,175,null,"",null,null,null,"",null,null,null,null,null,"",null,"",null,"",null,"",null,""]
[141,"الخط الرئيسي",2900,2925,25,null,1,"عبود (متكامل)",1000,"Y",25,null,"",null,"",58,175,58,175,null,"",63,null,68,null,null,"",null,null,null,"",null,null,null,null,null,"",null,"",null,"",null,"",null,""]
[142,"الخط الرئيسي",2925,2950,25,null,1,"عبود (متكامل)",1000,"Y",25,null,"",null,"",58,null,58,null,null,"",64,150,68,null,null,"",null,null,null,"",null,null,null,null,null,"",null,"",null,"",null,"",null,""]
[143,"الخط الرئيسي",2950,2975,25,null,1,"عبود (متكامل)",1000,"Y",25,null,"",null,"",58,null,58,null,null,"",64,null,68,null,null,"",null,null,null,"",null,null,null,null,null,"",null,"",null,"",null,"",null,""]
[144,"الخط الرئيسي",2975,3000,25,null,1,"عبود (متكامل)",1000,"Y",25,null,"",null,"",58,null,58,null,null,"",64,null,68,null,null,"",null,null,null,"",null,null,null,null,null,"",null,"",null,"",null,"",null,""]
[145,"الخط الرئيسي",3000,3025,25,null,1,"عبود (متكامل)",1000,"Y",25,null,"",null,"",58,null,58,null,null,"",64,null,68,null,null,"",null,null,null,"",null,null,null,null,null,"",null,"",null,"",null,"",null,""]
[146,"الخط الرئيسي",3025,3050,25,null,1,"عبود (متكامل)",1000,"Y",25,null,"",null,"",58,null,58,null,null,"",64,null,68,null,null,"",null,null,null,"",null,null,null,null,null,"",null,"",null,"",null,"",null,""]
[147,"الخط الرئيسي",{"$f":"C167+25","v":3050},{"$f":"D167+25","v":3075},25,null,null,"عبود (متكامل)",1000,"N",0,null,"",null,"",58,null,58,null,null,"",64,null,null,{"$f":"IF(X168<>\"\",E168,\"\")","v":""},null,"",null,null,null,"",null,null,null,null,null,"",null,"",null,"",null,"",null,""]
[148,"الخط الرئيسي",3075,3100,25,null,null,"عبود (متكامل)",1000,"N",0,null,"",null,"",null,"",null,"",null,"",null,"",null,"",null,"",null,null,null,"",null,null,null,null,null,"",null,"",null,"",null,"",null,""]
[149,"الخط الرئيسي",3100,3125,25,null,null,"عبود (متكامل)",1000,"N",0,null,"",null,"",null,"",null,"",null,"",null,"",null,"",null,"",null,null,null,"",null,null,null,null,null,"",null,"",null,"",null,"",null,""]
[150,"الخط الرئيسي",3125,3150,25,null,null,"عبود (متكامل)",1000,"N",0,null,"",null,"",null,"",null,"",null,"",null,"",null,"",null,"",null,null,null,"",null,null,null,null,null,"",null,"",null,"",null,"",null,""]
[151,"الخط الرئيسي",3150,3175,25,null,null,"عبود (متكامل)",1000,"N",0,null,"",null,"",null,"",null,"",null,"",null,"",null,"",null,"",null,null,null,"",null,null,null,null,null,"",null,"",null,"",null,"",null,""]
[152,"الخط الرئيسي",3175,3200,25,null,null,"عبود (متكامل)",1000,"N",0,null,"",null,"",null,"",null,"",null,"",null,"",null,"",null,"",null,null,null,"",null,null,null,null,null,"",null,"",null,"",null,"",null,""]
[153,"الخط الرئيسي",3200,3225,25,null,null,"عبود (متكامل)",1000,"N",0,null,"",null,"",null,"",null,"",null,"",null,"",null,"",null,"",null,null,null,"",null,null,null,null,null,"",null,"",null,"",null,"",null,""]
[154,"الخط الرئيسي",3225,3250,25,null,null,"عبود (متكامل)",1000,"N",0,null,"",null,"",null,"",null,"",null,"",null,"",null,"",null,"",null,null,null,"",null,null,null,null,null,"",null,"",null,"",null,"",null,""]
[155,"الخط الرئيسي",3250,3275,25,null,null,"عبود (متكامل)",1000,"N",0,null,"",null,"",null,"",null,"",null,"",null,"",null,"",null,"",null,{"$f":"IF(AB176<>\"\",E176,\"\")","v":""},null,{"$f":"IF(AD176<>\"\",E176,\"\")","v":""},null,{"$f":"IF(AF176<>\"\",E176,\"\")","v":""},null,{"$f":"IF(AH176<>\"\",E176,\"\")","v":""},null,"",null,"",null,"",null,"",null,""]
[156,"الخط الرئيسي",3275,3285,10,null,null,"عبود (متكامل)",1000,"N",{"$f":"IF(J177=\"Y\",E177,0)","v":0},null,"",null,"",null,"",null,"",null,"",null,"",null,"",null,"",null,"",null,"",null,"",null,"",null,"",null,"",null,"",null,"",null,""]
["التنفيذ (م.ط)",null,null,null,null,null,null,null,null,null,null,{"$f":"SUM(M75:M177)","v":0},null,null,null,null,null,null,null,null,null,null,null,null,null,null,null,null,null,null,null,{"$f":"SUM(AG75:AG177)","v":201},null,{"$f":"SUM(AI75:AI177)","v":101},null,{"$f":"SUM(AK75:AK177)","v":0},null,{"$f":"SUM(AM75:AM177)","v":0},null,{"$f":"SUM(AO75:AO177)","v":0},null,{"$f":"SUM(AQ75:AQ177)","v":0},null,{"$f":"SUM(AS75:AS177)","v":0},null,{"$f":"SUM(L180:AR180)","v":0}]
["نسبة البند",null,null,null,null,null,null,null,null,null,null,{"$f":"M179","v":0},null,null,null,null,null,null,null,null,null,null,null,null,null,null,null,null,null,null,null,{"$f":"AG179","v":0},null,{"$f":"AI179","v":0},null,{"$f":"AK179","v":0},null,{"$f":"AM179","v":0},null,{"$f":"AO179","v":0},null,{"$f":"AQ179","v":0},null,{"$f":"AS179","v":0}]
["الإجمالى",null,null,null,null,null,null,null,null,null,null,{"$f":"L179*L178","v":0},null,null,null,null,null,null,null,null,null,null,null,null,null,null,null,null,null,null,null,{"$f":"AF179*AF178","v":0},null,{"$f":"AH179*AH178","v":0},null,{"$f":"AJ179*AJ178","v":0},null,{"$f":"AL179*AL178","v":0},null,{"$f":"AN179*AN178","v":0},null,{"$f":"AP179*AP178","v":0},null,{"$f":"AR179*AR178","v":0}]
[157,"الخط الرئيسي",3285,{"$f":"D176+25","v":3300},15,null,null,"عبود (متكامل)",900,"N",0,null,{"$f":"IF(L181<>\"\",E181,\"\")","v":""},null,{"$f":"IF(N181<>\"\",E181,\"\")","v":""},null,{"$f":"IF(P181<>\"\",E181,\"\")","v":""},null,{"$f":"IF(R181<>\"\",E181,\"\")","v":""},null,{"$f":"IF(T181<>\"\",E181,\"\")","v":""},null,{"$f":"IF(V181<>\"\",E181,\"\")","v":""},null,{"$f":"IF(X181<>\"\",E181,\"\")","v":""},null,{"$f":"IF(Z181<>\"\",E181,\"\")","v":""},null,{"$f":"IF(AB181<>\"\",E181,\"\")","v":""},null,{"$f":"IF(AD181<>\"\",E181,\"\")","v":""},null,{"$f":"IF(AF181<>\"\",E181,\"\")","v":""},null,{"$f":"IF(AH181<>\"\",E181,\"\")","v":""},null,{"$f":"IF(AJ181<>\"\",E181,\"\")","v":""},null,{"$f":"IF(AL181<>\"\",E181,\"\")","v":""},null,{"$f":"IF(AN181<>\"\",E181,\"\")","v":""},null,{"$f":"IF(AP181<>\"\",E181,\"\")","v":""},null,{"$f":"IF(AR181<>\"\",E181,\"\")","v":""}]
[158,"الخط الرئيسي",3300,3325,25,null,null,"عبود (متكامل)",900,"N",0,null,"",null,"",null,"",null,"",null,"",null,"",null,"",null,"",null,"",null,"",null,"",null,"",null,"",null,{"$f":"IF(AL182<>\"\",E182,\"\")","v":""},null,"",null,"",null,""]
[159,"الخط الرئيسي",3325,3350,25,null,null,"عبود (متكامل)",900,"N",0,null,"",null,"",null,"",null,"",null,"",null,"",null,"",null,"",null,"",null,"",null,"",null,"",null,"",null,"",null,"",null,"",null,""]
[160,"الخط الرئيسي",3350,3375,25,null,null,"عبود (متكامل)",900,"N",0,null,"",null,"",null,"",null,"",null,"",null,"",null,"",null,"",null,"",null,"",null,"",null,"",null,"",null,"",null,"",null,"",null,""]
[161,"الخط الرئيسي",3375,3400,25,null,null,"عبود (متكامل)",900,"N",0,null,"",null,"",null,"",null,"",null,"",null,"",null,"",null,"",null,"",null,"",null,"",null,"",null,"",null,"",null,"",null,"",null,""]
[162,"الخط الرئيسي",3400,3425,25,null,null,"عبود (متكامل)",900,"N",0,null,"",null,"",null,"",null,"",null,"",null,"",null,"",null,"",null,"",null,"",null,"",null,"",null,"",null,"",null,"",null,"",null,""]
[163,"الخط الرئيسي",3425,3450,25,null,null,"عبود (متكامل)",900,"N",0,null,"",null,"",null,"",null,"",null,"",null,"",null,"",null,"",null,"",null,"",null,"",null,"",null,"",null,"",null,"",null,"",null,""]
[164,"الخط الرئيسي",3450,3475,25,null,null,"عبود (متكامل)",900,"N",0,null,"",null,"",null,"",null,"",null,"",null,"",null,"",null,"",null,"",null,"",null,"",null,"",null,"",null,"",null,"",null,"",null,""]
[165,"الخط الرئيسي",3475,3500,25,null,null,"عبود (متكامل)",900,"N",0,null,"",null,"",null,"",null,"",null,"",null,"",null,"",null,"",null,"",null,"",null,"",null,"",null,"",null,"",null,"",null,"",null,""]
[166,"الخط الرئيسي",{"$f":"C189+25","v":3500},3525,25,null,null,"عبود (متكامل)",900,"N",0,null,"",null,"",null,"",null,"",null,"",null,"",null,"",null,"",null,"",null,"",null,"",null,"",null,"",null,"",null,"",null,"",null,""]
[167,"الخط الرئيسي",3525,3550,25,null,null,"عبود (متكامل)",900,"N",0,null,"",null,"",null,"",null,"",null,"",null,"",null,"",null,"",null,"",null,"",null,"",null,"",null,"",null,"",null,"",null,"",null,""]
[168,"الخط الرئيسي",3550,3575,25,null,null,"عبود (متكامل)",900,"N",0,null,"",null,"",null,"",null,"",null,"",null,"",null,"",null,"",null,"",null,"",null,"",null,"",null,"",null,"",null,"",null,"",null,""]
[169,"الخط الرئيسي",3575,3600,25,null,null,"عبود (متكامل)",900,"N",0,null,"",null,"",null,"",null,"",null,"",null,"",null,"",null,"",null,"",null,"",null,"",null,"",null,"",null,"",null,"",null,"",null,""]
[170,"الخط الرئيسي",3600,3625,25,null,null,"عبود (متكامل)",900,"N",0,null,"",null,"",null,"",null,"",null,"",null,"",null,"",null,"",null,"",null,"",null,"",null,"",null,"",null,"",null,"",null,"",null,""]
[171,"الخط الرئيسي",3625,3650,25,null,null,"عبود (متكامل)",900,"N",0,null,"",null,"",null,"",null,"",null,"",null,"",null,"",null,"",null,"",null,"",null,"",null,"",null,"",null,"",null,"",null,"",null,""]
[172,"الخط الرئيسي",3650,3675,25,null,2,"عبود (متكامل)",900,"Y",25,null,"",null,"",93,25,93,25,94,25,95,25,97,25,null,"",null,"",null,"",null,"",null,"",null,"",null,"",null,"",null,"",null,""]
[173,"الخط الرئيسي",{"$f":"C196+25","v":3675},{"$f":"D196+25","v":3700},25,null,2,"عبود (متكامل)",900,"Y",25,null,"",null,"",93,25,93,25,94,25,95,25,97,25,null,"",null,"",null,"",null,"",null,"",null,"",null,"",null,"",null,"",null,""]
[174,"الخط الرئيسي",{"$f":"C197+25","v":3700},{"$f":"D197+25","v":3725},25,null,2,"عبود (متكامل)",900,"Y",25,null,"",null,"",93,25,93,25,94,25,95,25,97,25,null,"",null,"",null,"",null,"",null,"",null,"",null,"",null,"",null,"",null,""]
[175,"الخط الرئيسي",3725,{"$f":"D198+25","v":3750},25,null,2,"عبود (متكامل)",900,"Y",25,null,"",null,"",93,25,93,25,94,25,95,25,97,25,null,"",null,"",null,"",null,"",null,"",null,"",null,"",null,"",null,"",null,""]
[176,"الخط الرئيسي",3750,{"$f":"D199+25","v":3775},25,null,0,"عبود (متكامل)",900,"Y",25,null,"",null,"",88,25,88,25,null,{"$f":"IF(T200<>\"\",E200,\"\")","v":""},null,{"$f":"IF(V200<>\"\",E200,\"\")","v":""},97,25,null,"",null,"",null,"",null,"",null,"",null,"",null,"",null,"",null,"",null,""]
[177,"الخط الرئيسي",3775,{"$f":"D200+25","v":3800},25,null,0,"عبود (متكامل)",900,"Y",25,null,"",null,"",85,25,85,25,null,"",null,"",97,25,null,"",null,"",null,"",null,"",null,"",null,"",null,"",null,"",null,"",null,""]
[178,"الخط الرئيسي",3800,{"$f":"D201+25","v":3825},25,null,0,"عبود (متكامل)",900,"Y",25,null,"",null,"",85,25,85,25,null,"",null,"",97,25,null,"",null,"",null,"",null,"",null,"",null,"",null,"",null,"",null,"",null,""]
[179,"الخط الرئيسي",3825,3831.82,6.8200000000001637,null,0,"عبود (متكامل)",900,"Y",6.8200000000001637,null,"",null,"",85,6.8200000000001637,85,6.8200000000001637,null,"",null,"",97,6.8200000000001637,null,"",null,"",null,"",null,"",null,"",null,"",null,"",null,"",null,"",null,""]
[180,"الخط الرئيسي",3831.82,3840.9,9.0799999999999272,null,null,"عبود (متكامل)",900,"N",0,null,"",null,"",85,9.0799999999999272,85,9.0799999999999272,null,"",null,"",null,"",null,"",null,"",null,"",null,"",null,"",null,"",null,"",null,"",null,"",null,""]
[181,"الخط الرئيسي",3840.9,3850,9.0999999999999091,null,0,"عبود (متكامل)",900,"Y",9.0999999999999091,null,"",null,"",85,9.0999999999999091,85,9.0999999999999091,null,null,null,"",92,9.0999999999999091,null,"",null,"",null,"",null,"",null,"",null,"",null,"",null,"",null,"",null,""]
[182,"الخط الرئيسي",3850,{"$f":"D205+25","v":3875},25,null,0,"عبود (متكامل)",900,"Y",25,null,"",null,"",85,25,85,25,null,null,null,"",92,25,null,"",null,"",null,"",null,"",null,"",null,"",null,"",null,"",null,"",null,""]
[183,"الخط الرئيسي",{"$f":"C206+25","v":3875},3900,25,null,0,"عبود (متكامل)",900,"Y",25,null,"",null,"",85,25,85,25,null,null,null,"",92,25,null,"",null,"",null,"",null,"",null,"",null,"",null,"",null,"",null,"",null,""]
[184,"الخط الرئيسي",3900,3925,25,null,0,"عبود (متكامل)",900,"Y",25,null,"",null,"",85,25,85,25,null,null,null,"",92,25,null,"",null,"",null,"",null,"",null,"",null,"",null,"",null,"",null,"",null,""]
[185,"الخط الرئيسي",3925,3950,25,null,0,"عبود (متكامل)",900,"Y",{"$f":"IF(J209=\"Y\",E209,0)","v":25},null,"",null,"",85,25,85,25,null,null,null,"",92,25,null,"",null,"",null,"",null,"",null,"",null,"",null,"",null,"",null,"",null,""]
[186,"الخط الرئيسي",3950,3975,25,null,0,"عبود (متكامل)",900,"Y",25,null,"",null,"",85,25,85,25,null,null,null,"",92,25,null,"",null,"",null,"",null,"",null,"",null,"",null,"",null,"",null,"",null,""]
[187,"الخط الرئيسي",3975,4000,25,null,1,"عبود (متكامل)",900,{"$f":"IF(X211<>\"\",\"Y\",\"N\")","v":"Y"},25,null,"",null,"",14,25,14,25,null,"",87,25,92,25,null,"",null,"",null,"",null,"",null,"",null,"",null,"",null,"",null,"",null,""]
[188,"الخط الرئيسي",4000,4025,25,null,1,"عبود (متكامل)",900,"Y",25,null,"",null,"",14,25,14,25,null,"",87,25,92,25,null,"",null,"",null,"",null,"",null,"",null,"",null,"",null,"",null,"",null,""]
[189,"الخط الرئيسي",4025,4042.62,17.619999999999891,null,2,"عبود (متكامل)",900,"Y",17.619999999999891,null,"",null,"",14,17.619999999999891,14,17.619999999999891,74,17.619999999999891,80,17.619999999999891,92,17.619999999999891,null,"",null,"",null,"",null,"",null,"",null,"",null,"",null,"",null,"",null,""]
[190,"الخط الرئيسي",4042.62,4050.6,7.9800000000000182,null,null,"عبود (متكامل)",900,"N",0,null,"",null,"",14,7.9800000000000182,14,7.9800000000000182,null,"",79,7.9800000000000182,null,"",null,"",null,"",null,"",null,"",null,"",null,"",null,"",null,"",null,"",null,""]
[191,"الخط الرئيسي",4050.6,4069.48,18.880000000000109,null,2,"عبود (متكامل)",900,"Y",18.880000000000109,null,"",null,"",14,18.880000000000109,14,18.880000000000109,73,18.880000000000109,null,"",91,18.880000000000109,null,"",null,"",null,"",null,"",null,"",null,"",null,"",null,"",null,"",null,""]
[192,"الخط الرئيسي",4069.48,4075,5.5199999999999818,null,null,"عبود (متكامل)",900,"N",0,null,"",null,"",14,5.5199999999999818,14,5.5199999999999818,null,"",null,"",null,"",null,"",null,"",null,"",null,"",null,"",null,"",null,"",null,"",null,"",null,""]
[193,"الخط الرئيسي",4075,4077.8,2.8000000000001819,null,null,"عبود (متكامل)",900,"N",0,null,"",null,"",14,2.8000000000001819,14,2.8000000000001819,null,"",null,"",null,"",null,"",null,"",null,"",null,"",null,"",null,"",null,"",null,"",null,"",null,""]
[194,"الخط الرئيسي",4077.8,4100,22.199999999999818,null,2,"عبود (متكامل)",900,"Y",22.199999999999818,null,"",null,"",14,22.199999999999818,14,22.199999999999818,72,22.199999999999818,78,22.199999999999818,90,22.199999999999818,null,"",null,"",null,"",null,"",null,"",null,"",null,"",null,"",null,"",null,""]
[195,"الخط الرئيسي",4100,{"$f":"D218+25","v":4125},{"$f":"D219-C219","v":25},null,1,"عبود (متكامل)",900,"Y",25,null,"",null,"",14,25,14,25,null,"",29,25,90,25,null,"",null,"",null,"",null,"",null,"",null,"",null,"",null,"",null,"",null,""]
[196,"الخط الرئيسي",{"$f":"C219+25","v":4125},4150,25,null,1,"عبود (متكامل)",900,"Y",25,null,"",null,"",14,25,14,25,null,"",29,25,35,25,null,""]
[197,"الخط الرئيسي",4150,4175,25,null,1,"عبود (متكامل)",900,"Y",25,null,"",null,"",26,25,26,25,null,"",29,25,35,25,null,""]
[198,"الخط الرئيسي",4175,4200,25,null,1,"عبود (متكامل)",900,"Y",25,null,"",null,"",26,25,26,25,null,"",29,25,35,25,null,""]
[199,"الخط الرئيسي",4200,4225,25,null,1,"عبود (متكامل)",900,"Y",25,null,"",null,"",26,25,26,25,null,"",29,25,35,25,null,""]
[200,"الخط الرئيسي",4225,4250,25,null,1,"عبود (متكامل)",900,"Y",25,null,"",null,"",26,25,26,25,null,"",29,25,31,25,null,""]
[201,"الخط الرئيسي",4250,4275,25,null,1,"عبود (متكامل)",900,"Y",25,null,"",null,"",26,25,26,25,null,"",29,25,31,25,null,""]
[202,"الخط الرئيسي",4275,4300,25,null,1,"عبود (متكامل)",900,"Y",25,null,"",null,"",26,25,26,25,null,"",29,25,31,25,null,""]
[203,"الخط الرئيسي",4300,4325,25,null,1,"عبود (متكامل)",900,"Y",25,null,"",null,"",26,25,26,25,null,"",29,25,31,25,null,""]
[204,"الخط الرئيسي",4325,4350,25,null,1,"عبود (متكامل)",900,"Y",25,null,"",null,"",26,25,26,25,null,"",29,25,31,25,null,""]
[205,"الخط الرئيسي",4350,4375,25,null,1,"عبود (متكامل)",900,"Y",25,null,"",null,"",26,25,26,25,null,"",29,25,31,25,null,""]
[206,"الخط الرئيسي",4375,4400,25,null,1,"عبود (متكامل)",900,"Y",25,null,"",null,"",19,25,19,25,null,"",23,25,25,25,null,""]
[207,"الخط الرئيسي",4400,4425,25,null,1,"عبود (متكامل)",900,"Y",25,null,"",null,"",19,25,19,25,null,"",23,25,25,25,null,""]
[208,"الخط الرئيسي",4425,4450,25,null,1,"عبود (متكامل)",900,"Y",25,null,"",null,"",19,25,19,25,null,"",23,25,25,25,null,""]
[209,"الخط الرئيسي",4450,4475,25,null,1,"عبود (متكامل)",900,"Y",25,null,"",null,"",19,25,19,25,null,"",23,25,25,25,null,""]
[210,"الخط الرئيسي",4475,4500,25,null,1,"عبود (متكامل)",900,"Y",25,null,"",null,"",18,25,18,25,null,"",22,25,25,25,null,""]
[211,"الخط الرئيسي",4500,4525,25,null,1,"عبود (متكامل)",900,"Y",25,null,"",null,"",18,25,18,25,null,"",22,25,25,25,null,""]
[212,"الخط الرئيسي",4525,4550,25,null,1,"عبود (متكامل)",900,"Y",25,null,"",null,"",18,25,18,25,null,"",22,25,25,25,null,""]
[213,"الخط الرئيسي",4550,4575,25,null,1,"عبود (متكامل)",900,"Y",25,null,"",null,"",18,25,18,25,null,"",22,25,25,25,null,"",null,"",null,"",null,"",null,"",null,"",null,"",null,"",null,"",null,""]
[214,"الخط الرئيسي",4575,4600,25,null,1,"عبود (متكامل)",900,"Y",25,null,"",null,"",5,25,5,25,null,"",12,25,21,25,null,"",null,"",null,"",null,"",null,"",null,"",null,"",null,"",null,"",null,""]
[215,"الخط الرئيسي",4600,4625,25,null,1,"عبود (متكامل)",900,"Y",25,null,"",null,"",5,25,5,25,null,"",12,25,21,25,null,"",null,"",null,"",null,"",null,"",null,"",null,"",null,"",null,"",null,""]
[216,"الخط الرئيسي",4625,4650,25,null,1,"عبود (متكامل)",900,"Y",25,null,"",null,"",5,25,5,25,null,"",12,25,21,25,null,"",null,"",null,"",null,"",null,"",null,"",null,"",null,"",null,"",null,""]
[217,"الخط الرئيسي",4650,4675,25,null,1,"عبود (متكامل)",900,"Y",25,null,"",null,"",5,25,5,25,null,"",12,25,21,25,null,"",null,"",null,"",null,"",null,"",null,"",null,"",null,"",null,"",null,""]
[218,"الخط الرئيسي",4675,4700,25,null,1,"عبود (متكامل)",900,"Y",25,null,"",null,"",5,25,5,25,null,"",12,25,21,25,null,"",null,"",null,"",null,"",null,"",null,"",null,"",null,"",null,"",null,""]
[219,"الخط الرئيسي",4700,4725,25,null,1,"عبود (متكامل)",900,"Y",25,null,"",null,"",5,25,5,25,null,"",12,25,21,25,null,"",null,"",null,"",null,"",null,"",null,"",null,"",null,"",null,"",null,""]
[220,"الخط الرئيسي",4725,4750,25,null,1,"عبود (متكامل)",900,"Y",25,null,"",null,"",5,25,5,25,null,"",12,25,21,25,null,"",null,"",null,"",null,"",null,"",null,"",null,"",null,"",null,"",null,""]
[221,"الخط الرئيسي",4750,4775,25,null,1,"عبود (متكامل)",900,"Y",25,null,{"$f":"IF(L245<>\"\",E245,\"\")","v":""},null,{"$f":"IF(N245<>\"\",E245,\"\")","v":""},5,{"$f":"IF(P245<>\"\",E245,\"\")","v":25},5,{"$f":"IF(R245<>\"\",E245,\"\")","v":25},null,{"$f":"IF(T245<>\"\",E245,\"\")","v":""},12,{"$f":"IF(V245<>\"\",E245,\"\")","v":25},21,{"$f":"IF(X245<>\"\",E245,\"\")","v":25},null,{"$f":"IF(Z245<>\"\",E245,\"\")","v":""},null,{"$f":"IF(AB245<>\"\",E245,\"\")","v":""},null,{"$f":"IF(AD245<>\"\",E245,\"\")","v":""},null,{"$f":"IF(AF245<>\"\",E245,\"\")","v":""},null,{"$f":"IF(AH245<>\"\",E245,\"\")","v":""},null,{"$f":"IF(AJ245<>\"\",E245,\"\")","v":""},null,"",null,{"$f":"IF(AN245<>\"\",E245,\"\")","v":""},null,{"$f":"IF(AP245<>\"\",E245,\"\")","v":""},null,{"$f":"IF(AR245<>\"\",E245,\"\")","v":""}]
[222,"الخط الرئيسي",4775,4800,25,null,1,"عبود (متكامل)",900,"Y",25,null,"",null,"",5,25,5,25,null,"",12,25,21,25,null,"",null,"",null,"",null,"",null,"",null,"",null,{"$f":"IF(AL246<>\"\",E246,\"\")","v":""},null,"",null,"",null,""]
[223,"الخط الرئيسي",4800,4825,25,null,1,"عبود (متكامل)",900,"Y",25,null,"",null,"",5,25,5,25,null,"",8,25,17,25,null,"",null,"",null,"",null,"",null,"",null,"",null,"",null,"",null,"",null,""]
[224,"الخط الرئيسي",4825,4850,25,null,1,"عبود (متكامل)",900,"Y",25,null,"",null,"",5,25,5,25,null,"",8,25,17,25,null,"",null,"",null,"",null,"",null,"",null,"",null,"",null,"",null,"",null,""]
[225,"الخط الرئيسي",4850,4875,25,null,1,"عبود (متكامل)",900,"Y",25,null,"",null,"",5,25,5,25,null,"",8,25,17,25,null,"",null,"",null,"",null,"",null,"",null,"",null,"",null,"",null,"",null,""]
[226,"الخط الرئيسي",4875,4900,25,null,1,"عبود (متكامل)",900,"Y",25,null,"",null,"",5,25,5,25,null,"",8,25,17,25,null,"",null,"",null,"",null,"",null,"",null,"",null,"",null,"",null,"",null,""]
[227,"الخط الرئيسي",4900,4925,25,null,1,"عبود (متكامل)",900,"Y",25,null,"",null,"",5,25,5,25,null,"",8,25,17,25,null,"",null,"",null,"",null,"",null,"",null,"",null,"",null,"",null,"",null,""]
[228,"الخط الرئيسي",4925,4950,25,null,1,"عبود (متكامل)",900,"Y",25,null,"",null,"",5,25,5,25,null,"",8,25,17,25,null,"",null,"",null,"",null,"",null,"",null,"",null,"",null,"",null,"",null,""]
[229,"الخط الرئيسي",4950,4975,25,null,1,"عبود (متكامل)",900,"Y",25,null,"",null,"",5,25,5,25,null,"",8,25,17,25,null,"",null,"",null,"",null,"",null,"",null,"",null,"",null,"",null,"",null,""]
[230,"الخط الرئيسي",4975,5000,25,null,1,"عبود (متكامل)",900,"Y",25,null,"",null,"",5,25,5,25,null,"",8,25,17,25,null,"",null,"",null,"",null,"",null,"",null,"",null,"",null,"",null,"",null,""]
[231,"الخط الرئيسي",5000,5025,25,null,1,"عبود (متكامل)",900,"Y",25,null,"",null,"",5,25,5,25,null,"",8,25,17,25,null,"",null,"",null,"",null,"",null,"",null,"",null,"",null,"",null,"",null,""]
[232,"الخط الرئيسي",5025,5050,25,null,1,"عبود (متكامل)",900,"Y",25,null,"",7,25,5,25,5,25,null,"",6,25,16,25,null,"",null,"",null,"",null,"",null,"",null,"",null,"",null,"",null,"",null,""]
[233,"الخط الرئيسي",5050,5075,25,null,1,"عبود (متكامل)",900,"Y",25,null,"",7,25,5,25,5,25,null,"",6,25,16,25,null,"",null,"",null,"",null,"",null,"",null,"",null,"",null,"",null,"",null,""]
[234,"الخط الرئيسي",5075,5100,25,null,1,"عبود (متكامل)",900,"Y",25,null,"",7,25,3,25,3,25,null,"",6,25,16,25,null,"",null,"",null,"",null,"",null,"",null,"",null,"",null,"",null,"",null,""]
[235,"الخط الرئيسي",5100,5125,25,null,1,"عبود (متكامل)",900,"Y",25,null,"",7,25,3,25,3,25,null,"",6,25,16,25,null,"",null,"",null,"",null,"",null,"",null,"",null,"",null,"",null,"",null,""]
[236,"الخط الرئيسي",5125,5150,25,null,1,"عبود (متكامل)",900,"Y",25,null,"",7,25,3,25,3,25,null,"",6,25,16,25,null,"",null,"",null,"",null,"",null,"",null,"",null,"",null,"",null,"",null,""]
[237,"الخط الرئيسي",5150,5175,25,null,1,"عبود (متكامل)",900,"Y",25,null,"",7,25,3,25,3,25,null,"",6,25,16,25,null,"",null,"",null,"",null,"",null,"",null,"",null,"",null,"",null,"",null,""]
[238,"الخط الرئيسي",5175,5200,25,null,1,"عبود (متكامل)",900,"Y",25,null,"",7,25,3,25,3,25,null,"",6,25,16,25,null,"",null,"",null,"",null,"",null,"",null,"",null,"",null,"",null,"",null,""]
[239,"الخط الرئيسي",5200,5225,25,null,1,"عبود (متكامل)",900,"Y",25,null,"",7,25,3,25,3,25,null,"",6,25,16,25,null,"",null,"",null,"",null,"",null,"",null,"",null,"",null,"",null,"",null,""]
[240,"الخط الرئيسي",5225,5248.8,23.800000000000182,null,1,"عبود (متكامل)",900,"Y",23.800000000000182,null,"",7,23.800000000000182,3,23.800000000000182,3,23.800000000000182,null,"",6,23.800000000000182,16,23.800000000000182,null,"",null,"",null,"",null,"",null,"",null,"",null,"",null,"",null,"",null,""]
[241,"الخط الرئيسي",5248.8,5275,26.199999999999818,null,null,"عبود (متكامل)",900,"N",0,null,"",null,"",3,26.199999999999818,3,26.199999999999818,null,"",null,"",null,{"$f":"IF(X265<>\"\",E265,\"\")","v":""},null,"",null,"",null,"",null,"",null,"",null,"",null,"",null,"",null,"",null,""]
[242,"الخط الرئيسي",5275,5300,25,null,null,"عبود (متكامل)",900,"N",0,null,"",null,"",3,25,3,25,null,{"$f":"IF(T266<>\"\",E266,\"\")","v":""},null,"",null,"",null,"",null,"",null,"",null,"",null,"",null,"",null,"",null,"",null,"",null,""]
["نسبة البند",null,null,null,null,null,null,null,null,null,null,{"$f":"SUM(M181:M266)","v":0},null,{"$f":"SUM(O181:O266)","v":223.80000000000018},null,null,null,null,null,null,null,null,null,null,null,null,null,null,null,null,null,{"$f":"SUM(AG181:AG266)","v":0},null,{"$f":"SUM(AI181:AI266)","v":0},null,{"$f":"SUM(AK181:AK266)","v":0},null,{"$f":"SUM(AM181:AM266)","v":0},null,{"$f":"SUM(AO181:AO266)","v":0},null,{"$f":"SUM(AQ181:AQ266)","v":0},null,{"$f":"SUM(AS181:AS266)","v":0},null,{"$f":"SUM(L269:AR269)","v":0}]
["المنفذ (م.ط)"]
["الإجمالى",null,null,null,null,null,null,null,null,null,null,{"$f":"L268*L267","v":0},null,{"$f":"N268*N267","v":0},null,null,null,null,null,null,null,null,null,null,null,null,null,null,null,null,null,{"$f":"AF268*AF267","v":0},null,{"$f":"AH268*AH267","v":0},null,{"$f":"AJ268*AJ267","v":0},null,{"$f":"AL268*AL267","v":0},null,{"$f":"AN268*AN267","v":0},null,{"$f":"AP268*AP267","v":0},null,{"$f":"AR268*AR267","v":0}]

{"sheet":"مقاولين","index":1,"n_rows":18,"n_cols":14,"rows_kept":18,"cut":false,"hidden":false,"merged":[[3,10,3,13],[3,6,3,9],[1,1,1,3],[15,0,15,1],[17,0,17,1],[16,0,16,1],[3,1,5,1],[3,0,5,0],[3,2,3,5]]}
[]
[null,"شركة كونكورد للهندسة والمقاولات \nالعاصمة الادارية الجديدة\nالمكتب الفني"]
[]
["م","المقاول","حفر",null,null,null,"تركيب",null,null,null,"اختبار"]
[null,null,"قطر","قطر","قطر","قطر","قطر","قطر","قطر","قطر","قطر","قطر","قطر","قطر"]
[null,null,900,1000,1200,1400,900,1000,1200,1400,900,1000,1200,1400]
[1,"عبود (متكامل)",{"$f":"SUMIFS(مياه!$S$17:$S$269,مياه!$H$17:$H$269,B7,مياه!$I$17:$I$269,$C$6)","v":1650},{"$f":"SUMIFS(مياه!$S$17:$S$269,مياه!$H$17:$H$269,B7,مياه!$I$17:$I$269,$D$6)","v":1617.58},{"$f":"SUMIFS(مياه!$S$17:$S$269,مياه!$H$17:$H$269,B7,مياه!$I$17:$I$269,E$6)","v":0},{"$f":"SUMIFS(مياه!$S$17:$S$269,مياه!$H$17:$H$269,B7,مياه!$I$17:$I$269,F$6)","v":0},{"$f":"SUMIFS(مياه!$Y$17:$Y$269,مياه!$H$17:$H$269,B7,مياه!$I$17:$I$269,$G$6)","v":1573.42},{"$f":"SUMIFS(مياه!$Y$17:$Y$269,مياه!$H$17:$H$269,B7,مياه!$I$17:$I$269,$H$6)","v":1407.8899999999999},{"$f":"SUMIFS(مياه!$Y$17:$Y$269,مياه!$H$17:$H$269,B7,مياه!$I$17:$I$269,I$6)","v":0},{"$f":"SUMIFS(مياه!$Y$17:$Y$269,مياه!$H$17:$H$269,B7,مياه!$I$17:$I$269,J$6)","v":0},{"$f":"SUMIFS(مياه!$AJ$17:$AJ$269,مياه!$H$17:$H$269,B7,مياه!$I$17:$I$269,$K$6)","v":0},{"$f":"SUMIFS(مياه!$AJ$17:$AJ$269,مياه!$H$17:$H$269,B7,مياه!$I$17:$I$269,$L$6)","v":0},{"$f":"SUMIFS(مياه!$AJ$17:$AJ$269,مياه!$H$17:$H$269,F7,مياه!$I$17:$I$269,M$6)","v":0},{"$f":"SUMIFS(مياه!$AJ$17:$AJ$269,مياه!$H$17:$H$269,F7,مياه!$I$17:$I$269,N$6)","v":0}]
[2,"محمد مصطفى",{"$f":"SUMIFS(مياه!$S$17:$S$269,مياه!$H$17:$H$269,B8,مياه!$I$17:$I$269,$C$6)","v":0},{"$f":"SUMIFS(مياه!$S$17:$S$269,مياه!$H$17:$H$269,B8,مياه!$I$17:$I$269,$D$6)","v":0},{"$f":"SUMIFS(مياه!$S$17:$S$269,مياه!$H$17:$H$269,B8,مياه!$I$17:$I$269,E$6)","v":1005},{"$f":"SUMIFS(مياه!$S$17:$S$269,مياه!$H$17:$H$269,B8,مياه!$I$17:$I$269,F$6)","v":0},{"$f":"SUMIFS(مياه!$Y$17:$Y$269,مياه!$H$17:$H$269,B8,مياه!$I$17:$I$269,$G$6)","v":0},{"$f":"SUMIFS(مياه!$Y$17:$Y$269,مياه!$H$17:$H$269,B8,مياه!$I$17:$I$269,$H$6)","v":0},{"$f":"SUMIFS(مياه!$Y$17:$Y$269,مياه!$H$17:$H$269,B8,مياه!$I$17:$I$269,I$6)","v":996},{"$f":"SUMIFS(مياه!$Y$17:$Y$269,مياه!$H$17:$H$269,B8,مياه!$I$17:$I$269,J$6)","v":0},{"$f":"SUMIFS(مياه!$AJ$17:$AJ$269,مياه!$H$17:$H$269,B8,مياه!$I$17:$I$269,$K$6)","v":0},{"$f":"SUMIFS(مياه!$AJ$17:$AJ$269,مياه!$H$17:$H$269,B8,مياه!$I$17:$I$269,$L$6)","v":0},{"$f":"SUMIFS(مياه!$AJ$17:$AJ$269,مياه!$H$17:$H$269,F8,مياه!$I$17:$I$269,M$6)","v":0},{"$f":"SUMIFS(مياه!$AJ$17:$AJ$269,مياه!$H$17:$H$269,F8,مياه!$I$17:$I$269,N$6)","v":0}]
[3,null,{"$f":"SUMIFS(مياه!$S$17:$S$269,مياه!$H$17:$H$269,B9,مياه!$I$17:$I$269,$C$6)","v":0},{"$f":"SUMIFS(مياه!$S$17:$S$269,مياه!$H$17:$H$269,B9,مياه!$I$17:$I$269,$D$6)","v":0},{"$f":"SUMIFS(مياه!$S$17:$S$269,مياه!$H$17:$H$269,B9,مياه!$I$17:$I$269,E$6)","v":0},{"$f":"SUMIFS(مياه!$S$17:$S$269,مياه!$H$17:$H$269,B9,مياه!$I$17:$I$269,F$6)","v":0},{"$f":"SUMIFS(مياه!$Y$17:$Y$269,مياه!$H$17:$H$269,B9,مياه!$I$17:$I$269,$G$6)","v":0},{"$f":"SUMIFS(مياه!$Y$17:$Y$269,مياه!$H$17:$H$269,B9,مياه!$I$17:$I$269,$H$6)","v":0},{"$f":"SUMIFS(مياه!$Y$17:$Y$269,مياه!$H$17:$H$269,B9,مياه!$I$17:$I$269,I$6)","v":0},{"$f":"SUMIFS(مياه!$Y$17:$Y$269,مياه!$H$17:$H$269,B9,مياه!$I$17:$I$269,J$6)","v":0},{"$f":"SUMIFS(مياه!$AJ$17:$AJ$269,مياه!$H$17:$H$269,B9,مياه!$I$17:$I$269,$K$6)","v":0},{"$f":"SUMIFS(مياه!$AJ$17:$AJ$269,مياه!$H$17:$H$269,B9,مياه!$I$17:$I$269,$L$6)","v":0},{"$f":"SUMIFS(مياه!$AJ$17:$AJ$269,مياه!$H$17:$H$269,F9,مياه!$I$17:$I$269,M$6)","v":0},{"$f":"SUMIFS(مياه!$AJ$17:$AJ$269,مياه!$H$17:$H$269,F9,مياه!$I$17:$I$269,N$6)","v":0}]
[4,null,{"$f":"SUMIFS(مياه!$S$17:$S$269,مياه!$H$17:$H$269,B10,مياه!$I$17:$I$269,$C$6)","v":0},{"$f":"SUMIFS(مياه!$S$17:$S$269,مياه!$H$17:$H$269,B10,مياه!$I$17:$I$269,$D$6)","v":0},{"$f":"SUMIFS(مياه!$S$17:$S$269,مياه!$H$17:$H$269,B10,مياه!$I$17:$I$269,E$6)","v":0},{"$f":"SUMIFS(مياه!$S$17:$S$269,مياه!$H$17:$H$269,B10,مياه!$I$17:$I$269,F$6)","v":0},{"$f":"SUMIFS(مياه!$Y$17:$Y$269,مياه!$H$17:$H$269,B10,مياه!$I$17:$I$269,$G$6)","v":0},{"$f":"SUMIFS(مياه!$Y$17:$Y$269,مياه!$H$17:$H$269,B10,مياه!$I$17:$I$269,$H$6)","v":0},{"$f":"SUMIFS(مياه!$Y$17:$Y$269,مياه!$H$17:$H$269,B10,مياه!$I$17:$I$269,I$6)","v":0},{"$f":"SUMIFS(مياه!$Y$17:$Y$269,مياه!$H$17:$H$269,B10,مياه!$I$17:$I$269,J$6)","v":0},{"$f":"SUMIFS(مياه!$AJ$17:$AJ$269,مياه!$H$17:$H$269,B10,مياه!$I$17:$I$269,$K$6)","v":0},{"$f":"SUMIFS(مياه!$AJ$17:$AJ$269,مياه!$H$17:$H$269,B10,مياه!$I$17:$I$269,$L$6)","v":0},{"$f":"SUMIFS(مياه!$AJ$17:$AJ$269,مياه!$H$17:$H$269,F10,مياه!$I$17:$I$269,M$6)","v":0},{"$f":"SUMIFS(مياه!$AJ$17:$AJ$269,مياه!$H$17:$H$269,F10,مياه!$I$17:$I$269,N$6)","v":0}]
[5,null,{"$f":"SUMIFS(مياه!$S$17:$S$269,مياه!$H$17:$H$269,B11,مياه!$I$17:$I$269,$C$6)","v":0},{"$f":"SUMIFS(مياه!$S$17:$S$269,مياه!$H$17:$H$269,B11,مياه!$I$17:$I$269,$D$6)","v":0},{"$f":"SUMIFS(مياه!$S$17:$S$269,مياه!$H$17:$H$269,B11,مياه!$I$17:$I$269,E$6)","v":0},{"$f":"SUMIFS(مياه!$S$17:$S$269,مياه!$H$17:$H$269,B11,مياه!$I$17:$I$269,F$6)","v":0},{"$f":"SUMIFS(مياه!$Y$17:$Y$269,مياه!$H$17:$H$269,B11,مياه!$I$17:$I$269,$G$6)","v":0},{"$f":"SUMIFS(مياه!$Y$17:$Y$269,مياه!$H$17:$H$269,B11,مياه!$I$17:$I$269,$H$6)","v":0},{"$f":"SUMIFS(مياه!$Y$17:$Y$269,مياه!$H$17:$H$269,B11,مياه!$I$17:$I$269,I$6)","v":0},{"$f":"SUMIFS(مياه!$Y$17:$Y$269,مياه!$H$17:$H$269,B11,مياه!$I$17:$I$269,J$6)","v":0},{"$f":"SUMIFS(مياه!$AJ$17:$AJ$269,مياه!$H$17:$H$269,B11,مياه!$I$17:$I$269,$K$6)","v":0},{"$f":"SUMIFS(مياه!$AJ$17:$AJ$269,مياه!$H$17:$H$269,B11,مياه!$I$17:$I$269,$L$6)","v":0},{"$f":"SUMIFS(مياه!$AJ$17:$AJ$269,مياه!$H$17:$H$269,F11,مياه!$I$17:$I$269,M$6)","v":0},{"$f":"SUMIFS(مياه!$AJ$17:$AJ$269,مياه!$H$17:$H$269,F11,مياه!$I$17:$I$269,N$6)","v":0}]
[6,null,{"$f":"SUMIFS(مياه!$S$17:$S$269,مياه!$H$17:$H$269,B12,مياه!$I$17:$I$269,$C$6)","v":0},{"$f":"SUMIFS(مياه!$S$17:$S$269,مياه!$H$17:$H$269,B12,مياه!$I$17:$I$269,$D$6)","v":0},{"$f":"SUMIFS(مياه!$S$17:$S$269,مياه!$H$17:$H$269,B12,مياه!$I$17:$I$269,E$6)","v":0},{"$f":"SUMIFS(مياه!$S$17:$S$269,مياه!$H$17:$H$269,B12,مياه!$I$17:$I$269,F$6)","v":0},{"$f":"SUMIFS(مياه!$Y$17:$Y$269,مياه!$H$17:$H$269,B12,مياه!$I$17:$I$269,$G$6)","v":0},{"$f":"SUMIFS(مياه!$Y$17:$Y$269,مياه!$H$17:$H$269,B12,مياه!$I$17:$I$269,$H$6)","v":0},{"$f":"SUMIFS(مياه!$Y$17:$Y$269,مياه!$H$17:$H$269,B12,مياه!$I$17:$I$269,I$6)","v":0},{"$f":"SUMIFS(مياه!$Y$17:$Y$269,مياه!$H$17:$H$269,B12,مياه!$I$17:$I$269,J$6)","v":0},{"$f":"SUMIFS(مياه!$AJ$17:$AJ$269,مياه!$H$17:$H$269,B12,مياه!$I$17:$I$269,$K$6)","v":0},{"$f":"SUMIFS(مياه!$AJ$17:$AJ$269,مياه!$H$17:$H$269,B12,مياه!$I$17:$I$269,$L$6)","v":0},{"$f":"SUMIFS(مياه!$AJ$17:$AJ$269,مياه!$H$17:$H$269,F12,مياه!$I$17:$I$269,M$6)","v":0},{"$f":"SUMIFS(مياه!$AJ$17:$AJ$269,مياه!$H$17:$H$269,F12,مياه!$I$17:$I$269,N$6)","v":0}]
[7,null,{"$f":"SUMIFS(مياه!$S$17:$S$269,مياه!$H$17:$H$269,B13,مياه!$I$17:$I$269,$C$6)","v":0},{"$f":"SUMIFS(مياه!$S$17:$S$269,مياه!$H$17:$H$269,B13,مياه!$I$17:$I$269,$D$6)","v":0},{"$f":"SUMIFS(مياه!$S$17:$S$269,مياه!$H$17:$H$269,B13,مياه!$I$17:$I$269,E$6)","v":0},{"$f":"SUMIFS(مياه!$S$17:$S$269,مياه!$H$17:$H$269,B13,مياه!$I$17:$I$269,F$6)","v":0},{"$f":"SUMIFS(مياه!$Y$17:$Y$269,مياه!$H$17:$H$269,B13,مياه!$I$17:$I$269,$G$6)","v":0},{"$f":"SUMIFS(مياه!$Y$17:$Y$269,مياه!$H$17:$H$269,B13,مياه!$I$17:$I$269,$H$6)","v":0},{"$f":"SUMIFS(مياه!$Y$17:$Y$269,مياه!$H$17:$H$269,B13,مياه!$I$17:$I$269,I$6)","v":0},{"$f":"SUMIFS(مياه!$Y$17:$Y$269,مياه!$H$17:$H$269,B13,مياه!$I$17:$I$269,J$6)","v":0},{"$f":"SUMIFS(مياه!$AJ$17:$AJ$269,مياه!$H$17:$H$269,B13,مياه!$I$17:$I$269,$K$6)","v":0},{"$f":"SUMIFS(مياه!$AJ$17:$AJ$269,مياه!$H$17:$H$269,B13,مياه!$I$17:$I$269,$L$6)","v":0},{"$f":"SUMIFS(مياه!$AJ$17:$AJ$269,مياه!$H$17:$H$269,F13,مياه!$I$17:$I$269,M$6)","v":0},{"$f":"SUMIFS(مياه!$AJ$17:$AJ$269,مياه!$H$17:$H$269,F13,مياه!$I$17:$I$269,N$6)","v":0}]
[8,null,{"$f":"SUMIFS(مياه!$S$17:$S$269,مياه!$H$17:$H$269,B14,مياه!$I$17:$I$269,$C$6)","v":0},{"$f":"SUMIFS(مياه!$S$17:$S$269,مياه!$H$17:$H$269,B14,مياه!$I$17:$I$269,$D$6)","v":0},{"$f":"SUMIFS(مياه!$S$17:$S$269,مياه!$H$17:$H$269,B14,مياه!$I$17:$I$269,E$6)","v":0},{"$f":"SUMIFS(مياه!$S$17:$S$269,مياه!$H$17:$H$269,B14,مياه!$I$17:$I$269,F$6)","v":0},{"$f":"SUMIFS(مياه!$Y$17:$Y$269,مياه!$H$17:$H$269,B14,مياه!$I$17:$I$269,$G$6)","v":0},{"$f":"SUMIFS(مياه!$Y$17:$Y$269,مياه!$H$17:$H$269,B14,مياه!$I$17:$I$269,$H$6)","v":0},{"$f":"SUMIFS(مياه!$Y$17:$Y$269,مياه!$H$17:$H$269,B14,مياه!$I$17:$I$269,I$6)","v":0},{"$f":"SUMIFS(مياه!$Y$17:$Y$269,مياه!$H$17:$H$269,B14,مياه!$I$17:$I$269,J$6)","v":0},{"$f":"SUMIFS(مياه!$AJ$17:$AJ$269,مياه!$H$17:$H$269,B14,مياه!$I$17:$I$269,$K$6)","v":0},{"$f":"SUMIFS(مياه!$AJ$17:$AJ$269,مياه!$H$17:$H$269,B14,مياه!$I$17:$I$269,$L$6)","v":0},{"$f":"SUMIFS(مياه!$AJ$17:$AJ$269,مياه!$H$17:$H$269,F14,مياه!$I$17:$I$269,M$6)","v":0},{"$f":"SUMIFS(مياه!$AJ$17:$AJ$269,مياه!$H$17:$H$269,F14,مياه!$I$17:$I$269,N$6)","v":0}]
[9,null,{"$f":"SUMIFS(مياه!$S$17:$S$269,مياه!$H$17:$H$269,B15,مياه!$I$17:$I$269,$C$6)","v":0},{"$f":"SUMIFS(مياه!$S$17:$S$269,مياه!$H$17:$H$269,B15,مياه!$I$17:$I$269,$D$6)","v":0},{"$f":"SUMIFS(مياه!$S$17:$S$269,مياه!$H$17:$H$269,B15,مياه!$I$17:$I$269,E$6)","v":0},{"$f":"SUMIFS(مياه!$S$17:$S$269,مياه!$H$17:$H$269,B15,مياه!$I$17:$I$269,F$6)","v":0},{"$f":"SUMIFS(مياه!$Y$17:$Y$269,مياه!$H$17:$H$269,B15,مياه!$I$17:$I$269,$G$6)","v":0},{"$f":"SUMIFS(مياه!$Y$17:$Y$269,مياه!$H$17:$H$269,B15,مياه!$I$17:$I$269,$H$6)","v":0},{"$f":"SUMIFS(مياه!$Y$17:$Y$269,مياه!$H$17:$H$269,B15,مياه!$I$17:$I$269,I$6)","v":0},{"$f":"SUMIFS(مياه!$Y$17:$Y$269,مياه!$H$17:$H$269,B15,مياه!$I$17:$I$269,J$6)","v":0},{"$f":"SUMIFS(مياه!$AJ$17:$AJ$269,مياه!$H$17:$H$269,B15,مياه!$I$17:$I$269,$K$6)","v":0},{"$f":"SUMIFS(مياه!$AJ$17:$AJ$269,مياه!$H$17:$H$269,B15,مياه!$I$17:$I$269,$L$6)","v":0},{"$f":"SUMIFS(مياه!$AJ$17:$AJ$269,مياه!$H$17:$H$269,F15,مياه!$I$17:$I$269,M$6)","v":0},{"$f":"SUMIFS(مياه!$AJ$17:$AJ$269,مياه!$H$17:$H$269,F15,مياه!$I$17:$I$269,N$6)","v":0}]
["الاجمالي  المنفذ",null,{"$f":"SUM(C7:C15)","v":1650},1617.58,1005,0,1573.42,1407.8899999999999,996,0,0,0,0,0]
["الاجمالي الكلي",null,{"$f":"SUMIFS(مياه!$E$17:$E$269,مياه!$I$17:$I$269,C6)","v":2015},{"$f":"SUMIFS(مياه!$E$17:$E$269,مياه!$I$17:$I$269,D6)","v":2461},{"$f":"SUMIFS(مياه!$E$17:$E$269,مياه!$I$17:$I$269,E6)","v":1240},{"$f":"SUMIFS(مياه!$E$17:$E$269,مياه!$I$17:$I$269,F6)","v":0},{"$f":"SUMIFS(مياه!$E$17:$E$269,مياه!$I$17:$I$269,G6)","v":2015},{"$f":"SUMIFS(مياه!$E$17:$E$269,مياه!$I$17:$I$269,H6)","v":2461},{"$f":"SUMIFS(مياه!$E$17:$E$269,مياه!$I$17:$I$269,I6)","v":1240},{"$f":"SUMIFS(مياه!$E$17:$E$269,مياه!$I$17:$I$269,J6)","v":0},{"$f":"SUMIFS(مياه!$E$17:$E$269,مياه!$I$17:$I$269,K6)","v":2015},{"$f":"SUMIFS(مياه!$E$17:$E$269,مياه!$I$17:$I$269,L6)","v":2461},{"$f":"SUMIFS(مياه!$E$17:$E$269,مياه!$I$17:$I$269,M6)","v":1240},{"$f":"SUMIFS(مياه!$E$17:$E$269,مياه!$I$17:$I$269,N6)","v":0}]
["نسبة التنفيذ",null,{"$f":"C16/C17","v":0.81885856079404462},0.65728565623730184,0.81048387096774188,{"$error":"#DIV/0!"},0.78085359801488841,0.57208045509955296,0.8032258064516129,{"$error":"#DIV/0!"},0,0,0,{"$error":"#DIV/0!"}]

{"sheet":"العميل","index":2,"n_rows":0,"n_cols":0,"rows_kept":0,"cut":false,"hidden":false,"merged":[]}

{"sheet":"Daily Log","index":3,"n_rows":1006,"n_cols":33,"rows_kept":1006,"cut":false,"hidden":false,"merged":[[4,31,5,31],[4,32,5,32],[4,30,5,30],[0,13,1,13],[0,28,1,28],[0,26,1,26],[0,25,1,25],[0,24,1,24],[0,23,1,23],[0,27,1,27],[0,16,1,16],[0,17,1,17],[0,14,1,14],[0,15,1,15],[0,29,1,29],[0,12,1,12],[0,8,1,8],[0,9,1,9],[0,10,1,10],[0,11,1,11],[0,0,1,0],[0,4,1,4],[0,6,1,6],[0,7,1,7],[0,1,1,1],[0,3,1,3],[0,2,1,2],[0,5,1,5]]}
["م","رقم الطلب","تاريخ تقديم الطلب","اسم المشروع","اسم الطريق","نوع الأعمال","اسم الخط / منهول","وصف الطلب","من","الى","طول (م)","قطر مم","الاعتماد","المكتب الاستشارى","rev no","مهندس المقاول","ملاحظات","hyperlink",null,null,null,null,null,"المكتب الاستشارى","مهندس المقاول","المشاريع","وصف الطلب","طبيعة الاعمال","الاعتماد","نوع الاعمال"]
[]
[0,null,null,null,null,null,null,null,null,null,{"$f":"IF(E3<>\"\",J3-I3,\"\")","v":""},{"$f":"IF(E3<>\"\",IF(E3=$S$4,$U$4,IF(E3=$S$5,$U$5,IF(E3=$S$6,$U$6,IF(E3=$S$8,$U$8,IF(E3=$S$9,$U$9,IF(E3=$S$10,$U$10,IF(E3=$S$11,$U$11,IF(E3=$S$12,$U$12,IF(E3=$S$13,$U$13,IF(E3=$S$14,$AA$8,IF(E3=$S$15,$AA$9,IF(E3=$S$16,$AA$10,IF(E3=$S$17,$AA$11,IF(E3=$S$18,#REF!,IF(E3=$S$19,$AA$12,IF(E3=$S$20,$AA$13,IF(E3=$S$21,$AA$15,IF(E3=$S$22,$AA$16,IF(E3=$S$23,$AA$17,IF(E3=$S$24,$AA$18,IF(E3=$S$25,$AA$19,IF(E3=$S$26,$AA$20,IF(E3=$S$27,$AA$21,IF(E3=$S$28,$AA$22,IF(E3=$S$29,$AA$23,IF(E3=$S$30,$AA$24,IF(E3=$S$31,$AA$25,IF(E3=$S$32,$AA$26,IF(E3=$S$33,$AA$27,IF(E3=$S$34,$AA$28,IF(E3=$S$35,$U$35,IF(E3=$S$38,$U$38,IF(E3=$S$41,$U$41,IF(E3=$S$44,$U$44,IF(E3=$S$46,$U$46,\"\"))))))))))))))))))))))))))))))))))),\"\")","v":""}]
[1,1,"2018-03-11",null,null,"استلام نقاط ثوابت مساحية استناد الى الجدول المرفق من وحدة الاستشارات المساحيه - جامعة عين شمس ","من 3525الى 5357",null,null,null,{"$f":"J4-I4","v":0},900,null,"A","A"]
[2,2,"2018-03-11",null,null,"استلام الرفع المساحى لمسار خط ال 900 ","من 5300الى 5075","توقيع المسار",5075,5300,{"$f":"J5-I5","v":225},900,null,"D","D",null,null,null,null,null,null,null,null,null,null,null,null,null,null,null,"م","وصف الطلب","ملاحظات"]
[3,3,"2018-03-13",null,null,"معاينة قاع حفر + مسار خط ال 900 مم ","من 4475الى 4325","استلام قطاع الحفر",4325,4475,150,900,null,"A","A"]
[4,4,"2018-03-02",null,null,"معاينة صخر ","من 4475الى4325",null,4325,4475,150,900,null,"C","C"]
[5,5,"2018-03-21",null,null,"معاينة قاع حفر ","من 5075الى 4575","استلام قطاع الحفر",4075,5075,1000,900,null,"A","A",null,null,null,null,null,null,null,null,"بيت الخبرة","عشري عبدالرحمن","طرق بن زايد الشمالى والجنوبى","الميزانية الشبكية","صرف","A","مساحة",1,"الميزانية الشبكية","مساح"]
[6,6,"2018-03-21",null,null,"استلام فرشة (طبقة تأسيس)","من 5250الى 5025","استلام طبقة الفرشة 25 سم",5025,5250,225,900,null,"A","A",null,null,null,null,null,null,null,null,"عبدالوارث","مصطفى غازى","طريق 9","توقيع المسار","مياه","B","معمل",2,"توقيع المسار","مساح"]
[7,7,"2018-03-24",null,null,"استلام الرفع المساحى لمسار خط ال 900 ","من 225+3الى 357+5","توقيع المسار",3225,5357,2132,900,null,"A","A",null,null,null,null,null,null,null,null,null,"أحمد علاء","الخط العاجل","استلام قطاع الحفر","ري","C",null,3,"استلام قطاع الحفر","مهندس+توجيه معمل"]
[8,8,"2018-03-25",null,null,"استلام طبقة تأسيس (الفرشة) + المسار ","من 5025الى 4800","استلام طبقة الفرشة 25 سم",4800,5025,225,900,null,"C","C",null,null,null,null,null,null,null,null,null,"عيد عادل",null,"منسوب قاع حفر","كهرباء","D",null,4,"منسوب قاع حفر","مساحة"]
[9,9,"2018-03-26",null,null,"استلام ظهر مواسير (تركيب مواسير)","من 5200الى 5025","استلام مناسيب ظهر الماسورة والاستقامة",5025,5200,175,900,null,"D","D",null,null,null,null,null,null,null,null,null,"حازم",null,"طبقة الأولى 25 سم",null,null,null,5,"طبقة الأولى 25 سم","مهندس + توجيه المعمل"]
[10,10,"2018-03-27",null,null,"نتائج الاختبارات المعملية التي تم اجراؤها على الرمل المورد المستخدم في الردم والاحلال والتاسيس على خط ال 900 مياة رئيسيى ","نتائج ",null,null,null,0,900,null,null,null,null,null,null,null,null,null,null,null,null,null,null,"استلام طبقة الفرشة 25 سم",null,null,null,6,"الفرشة","مهندس + توجيه المعمل"]
[11,11,"2018-03-27",null,null,"استلام فرشة (طبقة تأسيس)","من 5250الى 5025","استلام طبقة الفرشة 25 سم",5025,5250,225,900,null,"A","A",null,null,null,null,null,null,null,null,null,null,null,"استلام منسوب طبقة الفرشة 25 سم",null,null,null,7,"استلام مناسيب ظهر الماسورة والاستقامة","مساح"]
[12,12,"2018-03-27",null,null,"استلام طبقة أساس (فرشة )","من 4800الى 4575","استلام طبقة الفرشة 25 سم",4575,4800,225,900,null,"A","A",null,null,null,null,null,null,null,null,null,null,null,"استلام مناسيب ظهر الماسورة والاستقامة",null,null,null,8,"استلام تعميم وصلات المواسير","فى حالة المواسير الخرسانية"]
[13,13,"2018-03-27",null,null,"استلام طبقة تأسيس (فرشة ) نتيجة اختبار ","من 4800الى 5025 ","استلام طبقة الفرشة 25 سم",4800,5025,225,900,null,null,null,null,null,null,null,null,null,null,null,null,null,null,"استلام تعميم وصلات المواسير",null,null,null,9,"استلام تغليف بولى ايثيلين (الكم)","مهندس"]
[14,14,"2018-04-01",null,null,"معاينه قاع حفر","من 4150الى 3975","استلام قطاع الحفر",3975,4150,175,900,null,"A","A",null,null,null,null,null,null,null,null,null,null,null,"استلام تغليف بولى ايثيلين (الكم)",null,null,null,10,"ردم  حول الماسورة( طبقة أولـى  وطبقة ثانية) بسمك 50 سم","مهندس + توجيه المعمل"]
[15,15,"2018-04-03",null,null,"استلام طبقة أساس (نتائج اختبار الدمك )","من 4800الى 4575 ",null,4575,4800,225,900,null,null,null,null,null,null,null,null,null,null,null,null,null,null,"ردم  حول الماسورة( طبقة أولـى  وطبقة ثانية) بسمك 50 سم",null,null,null,11,"ردم حول الماسورة( طبقة ثالثة وطبقة رابعة ) بسمك 50 سم","مهندس + توجيه المعمل"]
[16,16,"2018-04-03",null,null,"تسليم تركيب مواسير  مناسيب فقط ","من 5248.8الى 5025","استلام مناسيب ظهر الماسورة والاستقامة",5025,5248.8,223.80000000000018,900,null,"A","A",null,null,null,null,null,null,null,null,null,null,null,"ردم حول الماسورة( طبقة ثالثة وطبقة رابعة ) بسمك 50 سم",null,null,null,12,"تغليف المواسير","مهندس + توجيه المعمل"]
[17,17,"2018-04-03",null,null,"تسليم تركيب مواسير  مناسيب فقط ","من 5025الى 4800","استلام مناسيب ظهر الماسورة والاستقامة",4800,5025,225,900,null,"A","A",null,null,null,null,null,null,null,null,null,null,null,"تغليف المواسير",null,null,null,13,"تجربة الاختبار بالهواء المضغوط","مهندس"]
[18,18,"2018-04-05",null,null,"استلام قاع حفر (رمل + زلط )","من 4575الى 4475","استلام مناسيب ظهر الماسورة والاستقامة",4475,4575,100,900,null,"A","A",null,null,null,null,null,null,null,null,null,null,null,"تجربة الاختبار بالهواء المضغوط",null,null,null,14,"ردم فوق التغليف (طبقة أولى)","مهندس + توجيه المعمل"]
[19,19,"4/5/2018.",null,null,"استلام قاع حفر ","من 4475الى 4375","منسوب قاع حفر",4375,4475,100,900,null,"A","A",null,null,null,null,null,null,null,null,null,null,null,"ردم فوق التغليف (طبقة أولى)",null,null,null,15,"ردم فوق التغليف (طبقة ثانية)","مهندس + توجيه المعمل"]
[20,20,"2018-04-05",null,null,"صلاحيه رمل مورد ","من 5250الى 3625",null,3625,5250,1625,900,null,"C","C",null,null,null,null,null,null,null,null,null,null,null,"ردم فوق التغليف (طبقة ثانية)",null,null,null,16,"ردم فوق التغليف (طبقة ثالثة)","مهندس + توجيه المعمل"]
[21,21,"2018-04-07",null,null,"استلام تركيب مواسير مناسيب فقط ","من 4800الى 4575","استلام مناسيب ظهر الماسورة والاستقامة",4575,4800,225,900,null,"A","A",null,null,null,null,null,null,null,null,null,null,null,"ردم فوق التغليف (طبقة ثالثة)",null,null,null,17,"ردم فوق التغليف (طبقة رابعة)","مهندس + توجيه المعمل"]
[22,22,"2018-04-07",null,null,"استلام فرشة ( تأسيس)","من 4575الى 4475","استلام طبقة الفرشة 25 سم",4475,4575,100,900,null,"C","C",null,null,null,null,null,null,null,null,null,null,null,"ردم فوق التغليف (طبقة رابعة)",null,null,null,18,"صلاحية تربة زلطية","توجيه المعمل"]
[23,23,"2018-04-07",null,null,"استلام فرشة (تأسيس )","من 4475الى 4375","استلام طبقة الفرشة 25 سم",4375,4475,100,900,null,"C","C",null,null,null,null,null,null,null,null,null,null,null,"صلاحية تربة زلطية",null,null,null,19,"صلاحية رمال نظيفة","توجيه المعمل"]
[24,24,"2018-04-10",null,null,"استلام فرشة (نتيجه اختبار دمك)","4575الى4375","استلام طبقة الفرشة 25 سم",4375,4575,200,900,null,null,null,null,null,null,null,null,null,null,null,null,null,null,"صلاحية رمال نظيفة",null,null,null,20,"أخذ عينات صخر","توجيه المعمل"]
[25,25,"2018-04-14",null,null,"استلام ظهر ماسورة ","من 4575الى 4375","استلام مناسيب ظهر الماسورة والاستقامة",4375,4575,200,900,null,"A","A",null,null,null,null,null,null,null,null,null,null,null,"أخذ عينات صخر",null,null,null,21,"أخذ عينات من ناتج الحفر","توجيه المعمل"]
[26,26,"2018-04-14",null,null,"استلام قاع حفر صخر ","من 4375الى 4150","منسوب قاع حفر",4150,4375,225,900,null,null,null,null,null,null,null,null,null,null,null,null,null,null,"أخذ عينات من ناتج الحفر",null,null,null,22]
[27,27,null,null,null,null,null,null,null,null,0,null,null,null,null,null,null,null,null,null,null,null,null,null,null,null,null,null,null,null,23]
[28,28,null,null,null,null,null,null,null,null,0,null,null,null,null,null,null,null,null,null,null,null,null,null,null,null,null,null,null,null,24]
[29,29,"2018-04-16",null,null,"استلام فرشة اسفل المواسير ","من 4375الى 4100","استلام طبقة الفرشة 25 سم",4100,4375,275,900,null,"A","A",null,null,null,null,null,null,null,null,null,null,null,null,null,null,null,25]
[30,30,"2018-04-18",null,null,"استلام فرشة طبقة تأسيس نتيجة اختبار دمك ","من 4375الى 4100",null,null,null,0,900,null,null,null,null,null,null,null,null,null,null,null,null,null,null,null,null,null,null,26]
[31,31,"2018-04-22",null,null,"استلام مناسيب ظهر مواسير ","من 4375الى 4225","استلام مناسيب ظهر الماسورة والاستقامة",4225,4375,150,900,null,"A","A",null,null,null,null,null,null,null,null,null,null,null,null,null,null,null,27]
[32,32,"2018-04-01",null,null,"رفع مساحى للصخر ","من 4467الى 4350",null,4350,4467,117,900,null,null,null,null,null,null,null,null,null,null,null,null,null,null,null,null,null,null,28]
[33,33,"2018-04-14",null,null,"رفع مساحى للصخر ","من 4350الى 4150",null,4150,4350,200,900]
[34,34,"2018-05-01",null,null,"ردم طبقة أولى اعلى المواسير ","من 4375الى 4225",null,4225,4375,150,900,null,"C","C"]
[35,35,"2018-06-09",null,null,"استلام تركيب مواسير ","من 225+4الى 125+4","استلام مناسيب ظهر الماسورة والاستقامة",4125,4225,100,900,null,"A","A"]
[36,36,"2018-04-24",null,null,"استلام ثوابت مساحية على خط 1000مم ","من 1825الى 3275",null,null,null,0,1000]
[37,37,"2018-04-28",null,null,"استلام قاع حفر ","من 2275الى 2375","منسوب قاع حفر",2275,2375,100,1000,null,"A","A"]
[38,38,"2018-04-29",null,null,"استلام فرشة (طبقة تاسيس)","من 2275الى 2375","استلام طبقة الفرشة 25 سم",2275,2375,100,1000,null,"D","D"]
[39,39,"2018-04-30",null,null,"استلام تركيب مواسير (مناسيب ظهر المواسير)","من 2275الى 2375","استلام مناسيب ظهر الماسورة والاستقامة",2275,2375,100,1000,null,"A","A"]
[40,40,"2018-05-01",null,null,"ردم طبقة أولى حول المواسير","من 2275الى 2375",null,2275,2375,100,1000]
[41,41,"2018-05-11",null,null,"استلام قاع حفر ","من 2725الى 2375","منسوب قاع حفر",2375,2725,350,1000,null,"A","A"]
[42,42,"2018-05-13",null,null,"تركيب مواسير (مناسيب ظهر الماسورة )","من 2375الى 2725","استلام مناسيب ظهر الماسورة والاستقامة",2375,2725,350,1000,null,"A","A"]
[43,43,"2018-05-16",null,null,"استلام قاع حفر ","2+278.87الى 2125","منسوب قاع حفر",2125,2278.87,153.86999999999989,1000,null,"A","A"]
[44,44,"2018-05-16",null,null,"استلام تركيب مواسير (مناسيب ظهر الماسورة)","2+278.87الى 2125","استلام مناسيب ظهر الماسورة والاستقامة",2125,2278.87,153.86999999999989,1000,null,"A","A"]
[45,45,"2018-05-17",null,null,"استلام قاع حفر ","2125الى 1978.2","منسوب قاع حفر",1978.2,2125,146.79999999999995,1000,null,"A","A"]
[46,46,"2018-05-19",null,null,"استلام تركيب مواسير (مناسيب ظهر ماسورة)","من 2125الى 1978.2","استلام مناسيب ظهر الماسورة والاستقامة",1978.2,2125,146.79999999999995,1000,null,"A","A"]
[47,47,"2018-05-22",null,null,"استلام قاع حفر ","من 2800الى 2900","منسوب قاع حفر",2800,2900,100,1000,null,"A","A"]
[48,48,"2018-05-22",null,null,"استلام قاع حفر ","من 969.78+1الى 925+1","منسوب قاع حفر",1925,1969.78,44.779999999999973,1000,null,"A","A"]
[49,49,"2018-05-23",null,null,"استلام قاغ حفر ","من 925+1الى 875+1","منسوب قاع حفر",1875,1925,50,1000,null,"A","A"]
[50,50,"2018-05-23",null,null,"استلام قاع حفر ","من 875+1الى 839+1","منسوب قاع حفر",1839,1875,36,1000,null,"A","A"]
[51,51,"2018-05-26",null,null,"استلام فرشة تأسيس ","من 925+1الى 875+1","استلام طبقة الفرشة 25 سم",1875,1925,50,1000,null,"C","C"]
[52,52,"2018-05-26",null,null,"استلام فرشة طبقة تأسيس ","من 875+1الى 839+1","استلام طبقة الفرشة 25 سم",1839,1875,36,1000,null,"C","C"]
[53,53,"2018-05-26",null,null,"استلام فرشة طبقة تأسيس ","من 800+2الى 900+2 ","استلام طبقة الفرشة 25 سم",2800,2900,100,1000,null,"C","C"]
[54,54,"2018-05-26",null,null,"طبقة ردم تغليف حول المواسير بارتفاع نصف الماسورة ","من 400+2الى 725+2","ردم  حول الماسورة( طبقة أولـى  وطبقة ثانية) بسمك 50 سم",2400,2725,325,1000,null,"A","A"]
[55,55,"2018-05-29",null,null,"ردم طبقة تانية حول المواسير","من 725+2الى 400+2 ",null,2400,2725,325,1000,null,"C","C"]
[56,56,"2018-05-30",null,null,"استلام قاع حفر ","من 050+3الى 900+2 ",null,2900,3050,150,1000,null,"D","D"]
[57,57,"2018-05-30",null,null,"استلام طبقة ردم وتغليف (طبقه أولى ) 50سم ","من 2278.87الى 1978.2","ردم  حول الماسورة( طبقة أولـى  وطبقة ثانية) بسمك 50 سم",1978.2,2278.87,300.66999999999985,1000,null,"A","A"]
[58,58,"2018-06-05",null,null,"استلام قاع حفر ","من 900+2الى 075+3","منسوب قاع حفر",2900,3075,175,1000,null,"A","A"]
[59,59,"2018-06-06",null,null,"استلام فرشة اسفل المواسير ","من 900+2الى 075+3","استلام طبقة الفرشة 25 سم",2900,3075,175,1000,null,"D","D"]
[60,60,"2018-06-09",null,null,"استلام طبقة أساس (فرشة أساس)","من 2900الى 3075","استلام طبقة الفرشة 25 سم",2900,3075,175,1000,null,"C","C"]
[61,61,"2018-06-09",null,null,"استلام طبقة أساس (نتائج اختبار دمك ) ","من 925+1الى 875+1",null,null,null,0,1000]
[62,62,"2018-06-09",null,null,"استلام طبقة أساس (نتائج اختبار دمك ) ","من 1875الى 1839",null,null,null,0,1000]
[63,63,"2018-06-09",null,null,"استلام طبقه أساس (نتائج اختباردمك )","من 2800الى 2900",null,null,null,0,1000]
[64,64,"2018-06-10",null,null,"استلام فرشة (نتيجة اختبار الدمك )","من 900+2الى 075+3",null,null,null,0,1000]
[65,65,"2018-06-11",null,null,"نتائج الاختبار المعملية التي تم اجراؤها على الرمل المستخدم في الردم والاحلال والتاسيس على خط 1000 رقم 1","من 3100الى 1838.54",null,null,null,0,1000]
[66,66,"2018-06-11",null,null,"نتائج الاختبار المعملية التي تم اجراؤها على الرمل المستخدم في الردم والاحلال والتاسيس على خط 900 رقم 2","من 5250الى 3625",null,null,null,{"$f":"J69-I69","v":0},900]
[67,67,"2018-06-11",null,null,"استلام تركيب مواسير (مناسيب ظهر المواسير )","من 725+2الى 875+2","استلام مناسيب ظهر الماسورة والاستقامة",2725,2875,150,1000,null,"A","A"]
[68,68,"2018-06-12",null,null,"استلام تركيب مواسير (مناسيب ظهر المواسير)","من 875+2الى 050+3","استلام مناسيب ظهر الماسورة والاستقامة",2875,3050,175,1000,null,"A","A"]
[69,69,"2018-06-27",null,null,"استلام تركيب مواسير (مناسيب ظهر المواسير)","من 969.78+1الى 838.56+1 ","استلام مناسيب ظهر الماسورة والاستقامة",1838.56,1969.78,131.22000000000003,1000,null,"A","A"]
[70,70,"2018-06-27",null,null,"استلام ردم طبقة أولى حول المواسير (نتيجة اختبار دمك )","من 375+4الى 225+4",null,4225,4375,150,900,null,"D","D"]
[71,71,"2018-06-27",null,null,"الرفع المساحى لمسار خط 1000 مم ف حرم الطريق الاقليمى ","من 050+1الى 839+1","توقيع المسار",1050,1839,789,1000,null,"A","A"]
[72,72,"2018-07-04",null,null,"طبقه إحلال أولى (2.5)","من 4078الى 4100",null,4078,4100,22,900]
[73,73,"2018-07-04",null,null,"طبقه إحلال أولى (2.5)","من 4050.79الى 4069.69",null,4050.79,4069.69,18.900000000000091,900]
[74,74,"2018-07-04",null,null,"طبقه إحلال أولى (2.5)","من 4025الى 4042.81",null,4025,4042.81,17.809999999999945,900]
[75,75,"2018-07-07",null,null,"نتيجة اختبار دمك (طبقه إحلال أولى 2.5سم ","من 4078الى 4100",null,4078,4100,22,900]
[76,76,"2018-07-07",null,null,"نتيجة اختبار دمك (طبقه إحلال أولى 2.5سم ","من 4050.79الى 4069.69",null,4050.79,1069.69,-2981.1,900]
[77,77,"2018-07-07",null,null,"نتيجة اختبار دمك (طبقه إحلال أولى 2.5سم ","من 4025الى 4042.81",null,4025,4042.81,17.809999999999945,900]
[78,78,"2018-07-07",null,null,"طبقة إحلال ثانية 25 سم ","من 4078الى 4100",null,4078,4100,22,900,null,"A","A"]
[79,79,"2018-07-07",null,null,"طبقة إحلال ثانية 25 سم ","من  4050.79الى 4069.69",null,4050,4069.69,19.690000000000055,900,null,"A","A"]
[80,80,"2018-07-07",null,null,"طبقة إحلال ثانية 25 سم ","من4025الى 4042.81",null,4025,4042.81,17.809999999999945,900,null,"A","A"]
[81,81,"2018-07-08",null,null,"نتيجة اختبار دمك (طبقه إحلال أولى 2.5سم ","من 4078الى 4100",null,4078,4100,22,900]
[82,82,"2018-08-07",null,null,"نتيجة اختبار دمك (طبقه إحلال أولى 2.5سم ","من 4050.79الى 4069.69",null,4050.79,4069.69,18.900000000000091,900]
[83,83,"2018-07-08",null,null,"نتيجة اختبار دمك (طبقه إحلال أولى 2.5سم ","من 4025الى 4042.81",null,4025,4042.81,17.809999999999945,900]
[84,84,"2018-07-08",null,null,"استلام فرش تأسيس","من 3975الى 4025","استلام طبقة الفرشة 25 سم",3975,4025,50,900,null,"A","A"]
[85,85,"2018-07-08",null,null,"استلام قاع حفر ","من 3775الى 3975","منسوب قاع حفر",3775,3975,200,900,null,"A","A"]
[86,86,"2018-07-08",null,null,"استلام قاع حفر ","من 3625الى 3775","منسوب قاع حفر",3625,3775,150,900,null,"D","D"]
[87,87,"2018-07-10",null,null,"استلام فرشة تأسيس","من 3975الى 4025","استلام طبقة الفرشة 25 سم",3975,4025,50,900,null,"A","A"]
[88,88,"2018-07-10",null,null,"استلام قاع حفر ","من 775+3الى 750+3","منسوب قاع حفر",3750,3775,25,900,null,"A","A"]
[89,89,"2018-07-11",null,null,"استلام قاع حفر ","من 750+3الى 650+3","منسوب قاع حفر",3650,3750,100,900,null,"D","D"]
[90,90,"2018-07-14",null,null,"استلام تركيب مواسير (منسوب ظهر الماسوره)","من 125+4الى 077.80+4","استلام مناسيب ظهر الماسورة والاستقامة",4077.8,4125,47.199999999999818,900,null,"A","A"]
[91,91,"2018-07-15",null,null,"استلام تركيب مواسير (منسوب ظهر الماسوره)","من 069.48+4الى 050.60+4","استلام مناسيب ظهر الماسورة والاستقامة",4050.6,4069.48,18.880000000000109,900,null,"A","A"]
[92,92,"2018-07-14",null,null,"استلام تركيب مواسير (منسوب ظهر الماسوره)","من 042.62+4الى 840.90+3","استلام مناسيب ظهر الماسورة والاستقامة",3840.9,4042.62,201.7199999999998,900,null,"A","A"]
[93,93,"2018-07-14",null,null,"استلام قاع حفر ","من 750+3الى 650+3","منسوب قاع حفر",3650,3750,100,900,null,"A","A"]
[94,94,"2018-07-15",null,null,"استلام تركيب إحلال أولى 25 سم ","من 750+3الى 650+4",null,3750,4650,900,900]
[95,95,"2018-07-17",null,null,"استلام فرشة تأسيس 25 سم ","من 750+3الى 650+5","استلام طبقة الفرشة 25 سم",3650,3750,100,900,null,"A","A"]
[96,96,"2018-07-21",null,null,"بدء تركيب مواسير ","من 3831.82الى 3650",null,null,null,0,900]
[97,97,"2018-07-25",null,null,"استلام تركيب مواسير(مناسيب ظهر ماسوره)","من 3831.82الى 3650","استلام مناسيب ظهر الماسورة والاستقامة",3650,3831.82,181.82000000000016,900,null,"A","A"]
[98,98,"2018-09-18",null,null,"صلاحية قاع حفر  ","من 825 الى 925",null,null,null,0,1000,null,"C","C"]
[99,99,"2018-09-16",null,null,"صلاحيه رمل مورد ","من 300 الى 800 ",null,null,null,0,1200,null,"C","C"]
[100,100,"2018-09-16",null,null,"استلام ثوابت مساحية على خط  قطر 1200 مم  (الخط العاجل ) ",null,null,null,null,0,1200]
[101,101,"2018-09-20",null,null,"رفع مساحى للصخر  ","من (300+0) الى (625+0) ومن (675+0) الى (800+0) ",null,null,null,0,1200,null,"C","C"]
[102,102,"2018-09-22",null,null,"معاينه واستلام قاع حفر ","من (814+0) الى (784+0) ","استلام قطاع الحفر",784,814,30,1200,null,"A","A"]
[103,103,"2018-09-22",null,null,"استلام طبقة أولى إحلال ","من (814+0) الى (784+0) ",null,784,814,30,1200]
[104,104,"2018-09-24",null,null,"صلاحيه رمل مورد  على خط قطر 1200 مم ",null,null,null,null,0,1200,null,"C","C"]
[105,105,"2018-10-02",null,null,"الرفع المساحى للقطع حتى منسوب التسوية للخط العاجل ","من 087.5+1 الى 430+1 ",null,null,null,0,1000,null,"C","C"]
[106,106,"2018-09-22",null,null,"معاينة واستلام قاع حفر ","من 784 الى 700 ","استلام قطاع الحفر",700,784,84,1200,null,"A","A"]
[107,107,"2018-09-24",null,null,"استلام فرشة تأسيس 25 سم ","من 784 الى 700 ","استلام طبقة الفرشة 25 سم",700,784,84,1200,null,"A","A"]
[108,108,"2018-09-26",null,null,"استلام تركيب مواسير ( مناسيب ظهر ماسورة ) ","من 814 الى 700 ","استلام مناسيب ظهر الماسورة والاستقامة",700,814,114,1200,null,"A","A"]
[109,109,"2018-09-27",null,null,"استلام قاع حفر ( تربة رملية ) ","من 824 الى 925 ","منسوب قاع حفر",824,925,101,1000,null,"B","B"]
[110,110,"2018-09-29",null,null,"استلام تركيب مواسير ( ظهر ماسوره )","من 824 الى 925 ","استلام مناسيب ظهر الماسورة والاستقامة",824,925,101,1000,null,"B","B"]
[111,111,"2018-09-30",null,null,"استلام طبقة أولى وتانية ردم حول المواسير سمك 50 سم ","من 824 الى 925 ","ردم  حول الماسورة( طبقة أولـى  وطبقة ثانية) بسمك 50 سم",824,925,101,1000,null,"B","B"]
[112,112,"2018-10-01",null,null,"استلام طبقة تالتة ورابعة ردم حول المواسير سمك 50 سم ","من 824 الى 925 ","ردم حول الماسورة( طبقة ثالثة وطبقة رابعة ) بسمك 50 سم",824,925,101,1000,null,"B","B"]
[113,113,"2018-10-02",null,null,"معاينة واستلام قاع حفر (تربة صخرية ) ","من 925 الى 1025","استلام قطاع الحفر",925,1025,100,1000,null,"B","B"]
[114,114,"2018-10-03",null,null,"استلام فرشة تأسيس 25 سم ","من 925 الى 1025","استلام طبقة الفرشة 25 سم",925,1025,100,1000,null,"B","B"]
[115,115,"2018-09-30",null,null,"معاينة واستلام قاع حفر  (تربة طفلية ) ","من 700 الى 475 ","استلام قطاع الحفر",475,700,225,1200,null,"A","A"]
[116,116,"2018-10-01",null,null,"استلام طبقة أولى إحلال ","من 700 الى 475 ",null,475,700,225,1200]
[117,117,"2018-10-03",null,null,"معاينة واستلام قاع حفر (تربة طفلية )","من 475 الى 225","استلام قطاع الحفر",225,475,250,1200,null,"A","A"]
[118,118,"2018-10-03",null,null,"استلام طبقة تانية إحلال ( اسفل المواسير ) ","من 700 الى 475 ","استلام طبقة الفرشة 25 سم",475,700,225,1200,null,"A","A"]
[119,119,"2018-10-04",null,null,"معاينة قاع حفر ( تربة طفلية ) ","من 1075 الى 1200 ","استلام قطاع الحفر",1025,1075,50,1000,null,"B","B"]
[120,120,"2018-10-07",null,null,"استلام طبقة أولى إحلال ","من 1025 الى 1075","طبقة الأولى 25 سم",1025,1075,50,1000]
[121,121,"2018-10-07",null,null,"صلاحية رمل قاع  حفر ","من 1075 الى 1200 ",null,1075,1200,125,1000,null,"C","C"]
[122,122,"2018-10-07",null,null,"استلام تركيب مواسير ( مناسيب ظهر ماسورة ) ","من 925الى 1025","استلام مناسيب ظهر الماسورة والاستقامة",925,1025,100,1000,null,"B","B"]
[123,123,"2018-10-07",null,null,"استلام قاع حفر ( تربة رملية ) ","من 1075 الى 1200 ","منسوب قاع حفر",1075,1200,125,1000,null,"C","C"]
[124,124,"2018-10-07",null,null,"صلاحية رمل مورد ","خط 1000",null,null,null,0,1000,null,"C","C"]
[125,125,"2018-10-08",null,null,"الرفع المساحى لمنسوب الصخر ","من 925+0 الى 025+1 ",null,925,1025,100,1000]
[126,126,"2018-10-09",null,null,"استلام فرشة تأسيس 25 سم (طبقة تانية ) ","من 1025 الى 1075","استلام طبقة الفرشة 25 سم",1025,1075,50,1000,null,"B","B"]
[127,127,"2018-10-09",null,null,"استلام طبقة تغليف 30 سم فوق المواسير ","من 824 الى 925 ","تغليف المواسير",824,925,101,1000,null,"B","B"]
[128,128,"2018-10-09",null,null,"استلام طبقة أولى إحلال 25 سم ","من 475 الى 300 ",null,300,475,175,1200]
[129,129,"2018-10-09",null,null,"استلام تركيب مواسير (مناسيب ظهر ماسورة)","من 700 الى 625 ","استلام تعميم وصلات المواسير",625,700,75,1200,null,"B","B"]
[130,130,"2018-10-09",null,null,"استلام تركيب مواسير (مناسيب ظهر ماسورة)","من 616 الى 525","استلام مناسيب ظهر الماسورة والاستقامة",525,616,{"$f":"J133-I133","v":91},1200,null,"B","B"]
[131,131,"2018-10-10",null,null,"استلام طبقة تانية إحلال ( اسفل المواسير ) ","من 475+0 الى 300+0 ",null,300,475,175,1200,null,"B","B"]
[132,132,"2018-10-13",null,null,"استلام طبقة أولى وتانية ردم حول المواسير ","من 925+0 الى 025+1 ","ردم  حول الماسورة( طبقة أولـى  وطبقة ثانية) بسمك 50 سم",925,1025,100,1000,null,"B","B"]
[133,133,"2018-10-13",null,null,"استلام دمك طبقة تانية إحلال اسفل المواسير","من 475+0 الى 300+0 ",null,300,475,175,1200]
[134,134,"2018-10-14",null,null,"استلام دمك طبقة تانية إحلال اسفل المواسير","من 475+0 الى 300+0 ",null,300,475,175,1200]
[135,135,"2018-10-14",null,null,"استلام طبقة أولى وتانية ردم حول المواسير","من 545+0 الى 0+475","ردم  حول الماسورة( طبقة أولـى  وطبقة ثانية) بسمك 50 سم",475,545,70,1200,null,"B","B"]
[136,136,"2018-10-14",null,null,"استلام طبقة إحلال أولى 25 سم ","من 300+0 الى 225+0","طبقة الأولى 25 سم",225,300,75,1200]
[137,137,"2018-10-14",null,null,"استلام طبقة أحلال أولى 25 سم ","من 300+0 الى 225+0","طبقة الأولى 25 سم",225,300,75,1200,null,"B","B"]
[138,138,"2018-10-17",null,null,"استلام دمك فرشة تأسيس 25 سم ","من 300+0 الى 225+0",null,225,300,75,1200]
[139,139,"2018-10-17",null,null,"استلام دمك فرشة تأسيس 25 سم ","من 300+0 الى 225+0",null,225,300,75,1200]
[140,140,"2018-10-17",null,null,"استلام طبقة تالتة ورابعة ردم حول المواسير ","من 925+0 الى1025+0","ردم حول الماسورة( طبقة ثالثة وطبقة رابعة ) بسمك 50 سم",925,1025,100,1000,null,"B","B"]
[141,141,"2018-10-18",null,null,"استلام طبقة أولى وتانية ردم حول المواسير ","من 814 +0  الى 545+0","ردم  حول الماسورة( طبقة أولـى  وطبقة ثانية) بسمك 50 سم",545,814,269,1200,null,"B","B"]
[142,142,"2018-10-18",null,null,"استلام طبقة تغليف 30 سم فوق المواسير ","من 825+0 الى 925+0","تغليف المواسير",825,925,100,1000,null,"C","C"]
[143,143,"2018-10-22",null,null,"استلام تركيب مواسير        (مناسيب ظهر ماسورة ) ","من 0+525 الى 0+250","استلام مناسيب ظهر الماسورة والاستقامة",250,525,275,1200,null,"D","D"]
[144,144,"2018-10-25",null,null,"استلام طبقة ثالثة ورابعة ردم حول المواسير ","من 0+814 الى 0+525","ردم حول الماسورة( طبقة ثالثة وطبقة رابعة ) بسمك 50 سم",525,814,289,1200,null,"D","D"]
[145,145,"2018-10-22",null,null,"استلام تركيب مواسير (مناسيب ظهر ماسورة)","من525+0 الى 250+0 ","استلام مناسيب ظهر الماسورة والاستقامة",250,525,275,1200,null,"B","B"]
[146,146,"2018-10-30",null,null,"معاينة واستلام قاع حفر( تربة طفلية)","من 225+0 الى 000+0 ","استلام قطاع الحفر",0,225,225,1200,null,"B","B"]
[147,147,"2018-11-01",null,null,"استلام طبقة ثالثة ورابعة ردم حول المواسير من محطة (814+0 الى 475+0 )","من 814+0الى 475+0","ردم حول الماسورة( طبقة ثالثة وطبقة رابعة ) بسمك 50 سم",475,814,339,1200,null,"B","B"]
[148,148,"2018-11-04",null,null,"استلام طبقة إحلال أولى 25 سم  من محطة 225+0 الى  000+0","من محطة 225+0 الى  000+0","طبقة الأولى 25 سم",0,225,225,1200,null,"B","B"]
[149,149,"2018-11-05",null,null,"استلام طبقه اولي وثانيه ردم حول المواسير من محطه 475+0 الي محطه 275+0","من محطه 475+0 الي محطه 275+0","ردم  حول الماسورة( طبقة أولـى  وطبقة ثانية) بسمك 50 سم",275,475,200,1200,null,"D","D"]
[150,150,"2018-11-07",null,null,"استلام فرشه تأسيس 25 سم اسفل المواسير من محطه  225+0  الي محطه 000+0","من محطه  225+0  الي محطه 000+0","استلام طبقة الفرشة 25 سم",0,225,225,1200,null,"D","D"]
[151,151,"2018-11-07",null,null,"استلام طبقه اولي وثانيه ردم حول المواسير من محطه 475+0 الي محطه 275+0","من محطه 475+0 الي محطه 275+0","ردم  حول الماسورة( طبقة أولـى  وطبقة ثانية) بسمك 50 سم",275,475,200,1200,null,"B","B"]
[152,152,"2018-11-07",null,null,"استلام فرشه تأسيس 25 سم اسفل المواسير من محطه  225+0  الي محطه 000+0","من محطه  225+0  الي محطه 000+0","استلام طبقة الفرشة 25 سم",0,225,225,1200,null,"B","B"]
[153,153,"2018-11-07",null,null,"استلام فرشه تأسيس 25 سم اسفل المواسير من محطه  225+0  الي محطه 000+0 + اعمال مساحية ","من محطه  225+0  الي محطه 000+0","استلام طبقة الفرشة 25 سم",0,225,225,1200]
[154,154,"2018-11-13",null,null,"استلام  مناسيب ظهر ماسوره","من 0+250 الى 0+218","استلام مناسيب ظهر الماسورة والاستقامة",218,250,32,1200,null,"B","B"]
[155,155,"2018-11-13",null,null,"استلام  مناسيب ظهر ماسوره","من 0+211 الى 0+075","استلام مناسيب ظهر الماسورة والاستقامة",75,211,136,1200,null,"B","B"]
[156,156,"2018-11-15",null,null,"استلام التعميم الخارجي  لفواصل المواسير من محطة 250 الى 000 ","من   0+250 الى 0+000","استلام تعميم وصلات المواسير",0,250,250,1200,null,"B","B"]
[157,157,"2018-11-15",null,null,"الرفع المساحى لخط 1000 مم مياة قائم المتقاطع مع مسار الخط العاجل 1200 مم مياة","من    الى   ",null,null,null,0,"1200/1000"]
[158,158,"2018-11-19",null,null,"معاينه قاع حفر خط ال 1200 مم من محطه 000+0 الي محطه 125+0-","من  000+0  الى    -0+125",null,-125,0,125,1200,null,"B","B"]
[159,159,"2018-11-21",null,null,"استلام قاع حفر على خط 1200 مم من محطه 000+0 الى محطة 125-","من  0+000  الى   125-",null,-125,0,125,1200,null,"B","B"]
[160,160,"2018-11-24",null,null,"استلام ثوابت مساحية على مسار الخط العاجل ","من  الى  ",null,null,null,0,1200]
[161,161,"2018-11-25",null,null,"استلام فرشه اسقل المواسير علي خط ال 1200 مم من محطه 000+0 الي محطه 050+0-","من    000+0  الى    050+0-",null,-50,0,50,1200,null,"B","B"]
[162,162,"2018-11-25",null,null,"استلام طبقه اولي وثانيه ردم حول المواسير خط 1200 مم من محطه 000+0 الي محطه 225+0","من  000+0  الى   0+225",null,0,225,225,1200,null,"B","B"]
[163,163,"2018-11-25",null,null,"استلام طبقه ثالته ورابعه ردم حول المواسير خط 1200 مم محطه 225+0 الي محطه 475+0","من 0+225   الى   0+475",null,225,475,250,1200,null,"B","B"]
[164,164,"2018-11-25",null,null,"استلام فرشه اسقل المواسير علي خط ال 1200 مم من محطه 000+0 الي محطه 050+0- (اعمال مساحيه )","من  0+000  الى    -0+050",null,-50,0,50,1200,null,"B","B"]
[165,165,"2018-11-25",null,null,"الرفع المساحي لمنسوب اللبشه الخاصه بنفق B المتقاطع مع الطريق الدائري الإقليمي","من    الى   ",null,null,null,0,1200,null,"B","B"]
[166,166,"2018-11-26",null,null,"استلام طبقه تغليف اعلي المواسير 30 سم علي خط ال 1200 مم من محطه 475+0 الي محطه 675+0","من  0+475  الى   0+675",null,475,675,{"$f":"J169-I169","v":200},1200,null,"C","C"]
[166,166,"2018-11-26",null,null,"استلام طبقه تغليف اعلي المواسير 30 سم علي خط ال 1200 مم من محطه 475+0 الي محطه 675+0","من  0+475  الى   0+675",null,475,675,200,1200,null,"A","A",null,null,"Scane خط -900-1000مم\\Scan\\-R1166.pdf"]
[167,167,"2018-11-27",null,null,"استلام تركيب مواسير مناسيب ظهر ماسورة على خط ال 1200 م من محطة 075+0 الى محطة 040+0 - ","من 075+0    الى    -  0+040",null,-40,75,115,1200,null,"B","B"]
[168,168,"2018-11-27",null,null,"استلام التعميم الخارجي للفواصل المواسير على خط ال 1200 مم من محطة 019+0 الى محطة 025+0 - ","من  0+019   الى      -   0+025",null,-25,19,44,1200,null,"B","B"]
[169,169,"2018-11-27",null,null,"استلام فرشة اسفل المواسير من محطة 050+0 - الى محطة 125 +0 - على خط ال 1200 مم ","من - 0+050    الى  -  0+125",null,-125,-50,{"$f":"J173-I173","v":75},1200,null,"C","C"]
[169,169,"2018-11-27",null,null,"استلام فرشة اسفل المواسير من محطة 050+0 - الى محطة 125 +0 - على خط ال 1200 مم ","من - 0+050    الى  -  0+125",null,-125,-50,75,1200,null,null,null,null,null,"Scane خط -900-1000مم\\Scan\\-R1169.pdf"]
[170,170,"2018-11-27",null,null,"استلام فرشة اسفل المواسير من محطة 050+0 - الى محطة 125 +0 - على خط ال 1200 مم (اعمال مساحية ) ","من - 0+050   الى   -  0+125",null,-125,-50,75,1200,null,"B","B"]
[171,171,"2018-11-27",null,null,"معاينة قاع حفر من محطة 125+0 - الى محطة 200 +0  - على خط ال 1200 مم ","من   -  0+125   الى  -  0+200 ",null,-200,-125,75,1200,null,"B","B"]
[172,172,"2018-11-27",null,null,"استلام طبقة تالتة ورابعة ردم حول المواسير من محطة 000+0 الى محطة 210 +0  على خط ال 1200 مم ","من  0+000  الى  0+210  ",null,0,210,{"$f":"J177-I177","v":210},1200,null,"C","C",null,null,"Scane خط -900-1000مم\\Scan\\172_28112018114243.PDF"]
[172,172,"2018-11-27",null,null,"استلام طبقة تالتة ورابعة ردم حول المواسير من محطة 000+0 الى محطة 210 +0  على خط ال 1200 مم ","من  0+000  الى  0+210  ",null,0,210,210,1200,null,"A","A",null,null,"Scane خط -900-1000مم\\Scan\\-R1172.pdf"]
[173,173,"2018-11-27",null,null,"الرفع المساحى لمنسوب الكتلة الخرسانية المتقاطعة مع الخط العاجل قطر 1000 مم (الدقار) من محطة 1825 الى محطة1839 ","من 1825   الى 1839  ",null,1825,1839,14,1000]
[174,174,"2018-12-01",null,null,"استلام  (مناسيب ظهر ماسوره على خط ال 1200 ) من محطة  040+0 - الى محطة 125+0  -","من    040+0  الى    125+0  -",null,-125,40,165,1200,null,"B","B"]
[175,175,"2018-12-02",null,null,"استلام التعميم الخارجي لفواصل المواسير علي خط ال 1200 مم من محطه 025+0 - الي محطه 125+0 -","من   025+0 -  الى    125+0 -",null,-125,-25,100,1200,null,"B","B"]
[176,176,"2018-12-02",null,null,"استلام طبقة الرمل اعلى المواسير قطر 1200 مم سمك 30 سم  من محطه 475+0 الي محطه 235+0","من  475+0  الى    235+0",null,235,475,240,1200,null,"C","C"]
[177,177,"2018-12-02",null,null,"استلام  قاع حفر من محطة 125+0 - الى محطة 200 +0  - على خط ال 1200 مم (اعمال مساحيه )","من   125+0   الى    200 +0  -",null,-200,125,325,1200,null,"B","B"]
[178,178,"2018-12-04",null,null,"استلام طبقه اولي وثانيه ردم حول المواسير علي خط ال 1200 مم من محطه 000+0 الي 125+0 -","من   000+0  الى    125+0 -",null,-125,0,125,1200,null,"C","C"]
[179,179,"2018-12-04",null,null,"استلام طبقة الرمل اعلى المواسير قطر 1200 مم سمك 30 سم  من محطه 210+0 الي محطه 000+0","من   210+0  الى    000+0",null,0,210,210,1200,null,"C","C"]
[180,180,"2018-12-04",null,null,"استلام فرشه تأسيس سمك 25 سم اسفل المواسير خط ال 1200 مم من محطه 125+0 - الي محطه 200+0 -","من   125+0 -    الى 200+0 -",null,-125,-200,-75,1200,null,"C","C"]
[181,181,"2018-12-05",null,null,"استلام فرشه تأسيس سمك 25 سم اسفل المواسير خط ال 1200 مم من محطه 125+0 - الي محطه 200+0 - (اعمال مساحيه","من  125+0 -      الى 200+0 -",null,-125,-200,-75,1200,null,"B","B"]
[182,182,"2018-12-06",null,null,"استلام طبقه من الرمل اعلي المواسير سمك 30 سم  من محطه 804+0 الي محطه 675+0 علي خط ال 1200 مم","من     804+0 الى  675+0",null,675,804,{"$f":"IF(I188<>\"\",J188-I188,\"\")","v":129},1200,null,null,"C","عيد عادل"]
[183,183,"2018-12-09",null,null,null,null,"استلام قطاع الحفر",-200,-244,{"$f":"IF(I189<>\"\",J189-I189,\"\")","v":-44},1200,null,null,"B","عيد عادل"]
[184,184,"2018-12-09",null,null,null,null,"منسوب قاع حفر",-244,-200,{"$f":"IF(I190<>\"\",J190-I190,\"\")","v":44},1200,"B",null,null,"عيد عادل",null,"Scane خط -900-1000مم\\Scan\\184_17122018105352.PDF"]
[185,185,"2018-12-09",null,null,null,null,"استلام تعميم وصلات المواسير",-125,-200,-75,1200,"B",null,null,"عيد عادل",null,"Scane خط -900-1000مم\\Scan\\185_10122018115536.PDF"]
[186,186,"2018-12-09",null,null,null,null,"ردم حول الماسورة( طبقة ثالثة ) بسمك 25 سم",-125,0,null,1200,"C",null,null,"عيد عادل",null,"Scane خط -900-1000مم\\Scan\\186_10122018115647.PDF"]
[187,186,"2018-12-09",null,null,null,null,"ردم حول الماسورة( طبقة رابعة ) بسمك 25 سم",-125,0,125,1200,"C",null,null,"عيد عادل",null,"Scane خط -900-1000مم\\Scan\\186_10122018115647.PDF"]
[188,187,"2018-12-09",null,null,null,null,"استلام مناسيب ظهر الماسورة والاستقامة",-125,-200,-75,1200,"B",null,null,"عيد عادل",null,"Scane خط -900-1000مم\\Scan\\187_15122018145157.PDF"]
[189,188,"2018-12-09",null,null,null,null,"استلام مناسيب ظهر الماسورة والاستقامة",1025,1200,175,1000,"B",null,null,"عيد عادل",null,"Scane خط -900-1000مم\\Scan\\188_15122018145218.PDF"]
[190,189,"2018-12-09",null,null,null,null,"استلام تعميم وصلات المواسير",1025,1200,175,1000,"B",null,null,"عيد عادل",null,"Scane خط -900-1000مم\\Scan\\189_10122018115620.PDF"]
[191,190,"2018-12-09",null,null,null,null,"استلام قطاع الحفر",1200,1350,150,1000,"B",null,null,"عيد عادل",null,"Scane خط -900-1000مم\\Scan\\190_10122018115555.PDF"]
[192,191,"2018-12-09",null,null,null,null,"منسوب قاع حفر",1200,1350,150,1000,"C",null,null,"عيد عادل",null,"Scane خط -900-1000مم\\Scan\\191_10122018151823.PDF"]
[193,192,"2018-11-12",null,null,"استلام مناسيب ظهر الماسورة والاستقامة",null,null,3412.5,3512.5,100,2000,"B",null,null,"عيد عادل","فواريغ","Scane خط -900-1000مم\\Scan\\192_18122018111637.PDF"]
[194,193,"2018-12-11",null,null,null,null,"ردم  حول الماسورة( طبقة أولـى  وطبقة ثانية) بسمك 50 سم",3412.5,3512.5,100,2000,"C",null,null,"عيد عادل",null,"Scane خط -900-1000مم\\Scan\\193_12122018140346.PDF"]
[195,194,"2018-12-12",null,null,null,null,"استلام طبقة الفرشة 25 سم",-200,-237,{"$f":"IF(I201<>\"\",J201-I201,\"\")","v":-37},1200,"D",null,null,"عيد عادل",null,"Scane خط -900-1000مم\\Scan\\194_12122018140321.PDF"]
[195,"194-1","23/12/2018",null,null,null,null,"استلام طبقة الفرشة 25 سم",-200,-244,-44,1200,null,null,null,"عيد عادل"]
[196,195,"2018-12-12",null,null,null,null,"استلام تغليف بولى ايثيلين (الكم)",925,1025,100,1000,"C",null,null,"عيد عادل",null,"Scane خط -900-1000مم\\Scan\\195_12122018140429.PDF"]
[197,196,"2018-12-12",null,null,null,null,"ردم  حول الماسورة( طبقة أولـى  وطبقة ثانية) بسمك 50 سم",1025,1150,125,1000,"C",null,null,"عيد عادل",null,"Scane خط -900-1000مم\\Scan\\196_12122018140410.PDF"]
[198,197,"2018-12-12",null,null,null,null,"استلام طبقة الفرشة 25 سم",-244,-200,44,1200,"D",null,null,"عيد عادل",null,"Scane خط -900-1000مم\\Scan\\197_17122018105320.PDF"]
[199,198,"2018-12-12",null,null,"الرفع المساحى لمنسوب الصخر لخط المياة العاجل قطر 1000 مم من محطة 250+1 الى محطة 320+1 ","الرفع المساحى لمنسوب الصخر لخط المياة العاجل قطر 1000 مم من محطة 250+1 الى محطة 320+2","الرفع المساحى لمنسوب الصخر لخط المياة العاجل قطر 1000 مم من محطة 250+1 الى محطة 320+3",1250,1320,70,1000]
[200,199,"2018-12-13",null,null,null,null,"استلام طبقة الفرشة 25 سم",1200,1350,150,1000,"C",null,null,"عيد عادل",null,"Scane خط -900-1000مم\\Scan\\199_13122018114739.PDF"]
[201,200,"2018-12-13",null,null,null,null,"ردم حول الماسورة( طبقة ثالثة وطبقة رابعة ) بسمك 50 سم",3412.5,3512.5,100,2000,"C",null,null,"عيد عادل",null,"Scane خط -900-1000مم\\Scan\\200_13122018114801.PDF"]
[202,201,"15/12/2018",null,null,null,null,"استلام طبقة الفرشة 25 سم",1200,1350,150,1000,"C",null,null,"عيد عادل",null,"Scane خط -900-1000مم\\Scan\\201_18122018111614.PDF"]
[203,202,"2018-12-15",null,null,null,null,"ردم حول الماسورة( طبقة ثالثة وطبقة رابعة ) بسمك 50 سم",1025,1150,125,1000,"C",null,null,"عيد عادل",null,"Scane خط -900-1000مم\\Scan\\202_17122018105229.PDF"]
[204,203,"16/12/2018",null,null,null,null,"استلام قطاع الحفر",1350,1400,{"$f":"IF(I211<>\"\",J211-I211,\"\")","v":50},1000,"C",null,null,"عيد عادل",null,"Scane خط -900-1000مم\\Scan\\203_18122018111450.PDF"]
[204,"203-1","23/12/2018",null,null,null,null,"استلام قطاع الحفر",1350,1400,50,1000,null,null,1,"عيد عادل"]
[205,204,"16/12/2018",null,null,null,null,"استلام قطاع الحفر",1839,1775,-64,1000,"C",null,null,"عيد عادل",null,"Scane خط -900-1000مم\\Scan\\204_18122018111433.PDF"]
[206,205,"2018-12-16",null,null,null,null,"ردم حول الماسورة( طبقة ثالثة وطبقة رابعة ) بسمك 50 سم",3412.5,3512.5,100,2000,"C",null,null,"عيد عادل",null,"Scane خط -900-1000مم\\Scan\\205_17122018105410.PDF"]
[207,206,"19/12/2018",null,null,"استلام ردم حول الماسورة (طبقة خامسة وسادسة ) سمك 50 سم  ",null,null,3412.5,3512.5,100,2000,"C",null,null,"عيد عادل","فواريغ ","Scane خط -900-1000مم\\Scan\\206_19122018115756.PDF"]
[208,207,"19/12/2018",null,null,null,null,"استلام تعميم وصلات المواسير",1200,1300,100,1000,"B",null,null,"عيد عادل",null,"Scane خط -900-1000مم\\Scan\\207_19122018153726.PDF"]
[209,208,"18/12/2018",null,null,null,null,"استلام طبقة الفرشة 25 سم",1350,1400,{"$f":"IF(I217<>\"\",J217-I217,\"\")","v":50},1000,"C",null,null,"عيد عادل",null,"Scane خط -900-1000مم\\Scan\\208_19122018115205.PDF"]
[210,209,"20/12/2018",null,null,null,null,"استلام منسوب طبقة الفرشة 25 سم",1350,1400,50,1000,"C",null,"0","عيد عادل",null,"Scane خط -900-1000مم\\Scan\\209_22122018112639.PDF"]
[211,210,"18/12/2018",null,null,null,null,"تغليف المواسير",1025,1150,125,1000,"C",null,null,"عيد عادل",null,"Scane خط -900-1000مم\\Scan\\210_19122018115234.PDF"]
[212,211,"20/12/2018",null,null,null,null,"استلام ردم حول الماسورة (طبقة سابعة وثامنة) سمك 50 سم",3412.5,3512.5,100,2000,"C",null,"0","عيد عادل","فواريغ ","Scane خط -900-1000مم\\Scan\\211_23122018142434.PDF"]
[213,212,"23/12/2018",null,null,null,null,"استلام قطاع الحفر",5250,5334,84,900,null,null,null,"عيد عادل"]
[214,213,"22/12/2018",null,null,null,null,"استلام منسوب طبقة الفرشة 25 سم",-244,-200,44,1200,"B",null,"0","عيد عادل",null,"Scane خط -900-1000مم\\Scan\\213_23122018155945.PDF"]
[215,214,"17/12/2018",null,null,null,null,"منسوب قاع حفر",1350,1400,50,1000,"C",null,"0","عيد عادل",null,"Scane خط -900-1000مم\\Scan\\214_22122018123355.PDF"]
[216,215,"20/12/2018",null,null,null,null,"استلام تعميم وصلات المواسير",1300,1375,{"$f":"IF(I224<>\"\",J224-I224,\"\")","v":75},1000,"C",null,"0","عيد عادل",null,"Scane خط -900-1000مم\\Scan\\215_23122018142415.PDF"]
[216,"215-1","22/12/2018",null,null,null,null,"استلام تعميم وصلات المواسير",1300,1375,75,1000,"B",null,"001","عيد عادل",null,"Scane خط -900-1000مم\\Scan\\215-1 -R .PDF"]
[217,216,"22/12/2018",null,null,"استلام ردم حول الماسورة (طبقة تاسعة) سمك 25 سم",null,"استلام ردم حول الماسورة (طبقة تاسعة) سمك 25 سم",3412.5,3512.5,100,2000,null,null,null,"عيد عادل"]
[218,217,"23/12/2018",null,null,null,null,"استلام قطاع الحفر",-425,-244,181,1200,null,null,null,"عيد عادل"]
[220,218,"23/12/2018",null,null,null,null,"استلام تعميم وصلات المواسير",-237,-200,37,1200,null,null,null,"عيد عادل"]
[221,219,"23/12/2018",null,null,null,null,"استلام مناسيب ظهر الماسورة والاستقامة",-237,200,437,1200,null,null,null,"عيد عادل"]
[222,220,null,null,null,null,null,null,null,null,null,null,null,null,null,"عيد عادل"]
[223,221,null,null,null,null,null,null,null,null,null,null,null,null,null,"عيد عادل"]
[224,222,null,null,null,null,null,null,null,null,null,null,null,null,null,"عيد عادل"]
[225,223,null,null,null,null,null,null,null,null,null,null,null,null,null,"عيد عادل"]
[226,224,null,null,null,null,null,null,null,null,"",null,null,null,null,"عيد عادل"]
[227,225,null,null,null,null,null,null,null,null,""]
[228,null,null,null,null,null,null,null,null,null,""]
[229,null,null,null,null,null,null,null,null,null,""]
[230,null,null,null,null,null,null,null,null,null,""]
[231,null,null,null,null,null,null,null,null,null,""]
[232,null,null,null,null,null,null,null,null,null,""]
[233,null,null,null,null,null,null,null,null,null,""]
[234,null,null,null,null,null,null,null,null,null,""]
[235,null,null,null,null,null,null,null,null,null,""]
[236,null,null,null,null,null,null,null,null,null,""]
[237,null,null,null,null,null,null,null,null,null,""]
[238,null,null,null,null,null,null,null,null,null,""]
[239,null,null,null,null,null,null,null,null,null,""]
[240,null,null,null,null,null,null,null,null,null,""]
[241,null,null,null,null,null,null,null,null,null,""]
[242,null,null,null,null,null,null,null,null,null,""]
[243,null,null,null,null,null,null,null,null,null,""]
[244,null,null,null,null,null,null,null,null,null,""]
[245,null,null,null,null,null,null,null,null,null,""]
[246,null,null,null,null,null,null,null,null,null,""]
[247,null,null,null,null,null,null,null,null,null,""]
[248,null,null,null,null,null,null,null,null,null,{"$f":"IF(I256<>\"\",J256-I256,\"\")","v":""}]
[249,null,null,null,null,null,null,null,null,null,""]
[250,null,null,null,null,null,null,null,null,null,""]
[251,null,null,null,null,null,null,null,null,null,""]
[252,null,null,null,null,null,null,null,null,null,""]
[253,null,null,null,null,null,null,null,null,null,""]
[254,null,null,null,null,null,null,null,null,null,""]
[255,null,null,null,null,null,null,null,null,null,""]
[256,null,null,null,null,null,null,null,null,null,""]
[257,null,null,null,null,null,null,null,null,null,""]
[258,null,null,null,null,null,null,null,null,null,""]
[259,null,null,null,null,null,null,null,null,null,""]
[260,null,null,null,null,null,null,null,null,null,""]
[261,null,null,null,null,null,null,null,null,null,""]
[262,null,null,null,null,null,null,null,null,null,""]
[263,null,null,null,null,null,null,null,null,null,""]
[264,null,null,null,null,null,null,null,null,null,""]
[265,null,null,null,null,null,null,null,null,null,""]
[266,null,null,null,null,null,null,null,null,null,""]
[267,null,null,null,null,null,null,null,null,null,""]
[268,null,null,null,null,null,null,null,null,null,""]
[269,null,null,null,null,null,null,null,null,null,""]
[270,null,null,null,null,null,null,null,null,null,""]
[271,null,null,null,null,null,null,null,null,null,""]
[272,null,null,null,null,null,null,null,null,null,""]
[273,null,null,null,null,null,null,null,null,null,""]
[274,null,null,null,null,null,null,null,null,null,""]
[275,null,null,null,null,null,null,null,null,null,""]
[276,null,null,null,null,null,null,null,null,null,""]
[277,null,null,null,null,null,null,null,null,null,""]
[278,null,null,null,null,null,null,null,null,null,""]
[279,null,null,null,null,null,null,null,null,null,""]
[280,null,null,null,null,null,null,null,null,null,""]
[281,null,null,null,null,null,null,null,null,null,""]
[282,null,null,null,null,null,null,null,null,null,""]
[283,null,null,null,null,null,null,null,null,null,""]
[284,null,null,null,null,null,null,null,null,null,""]
[285,null,null,null,null,null,null,null,null,null,""]
[286,null,null,null,null,null,null,null,null,null,""]
[287,null,null,null,null,null,null,null,null,null,""]
[288,null,null,null,null,null,null,null,null,null,""]
[289,null,null,null,null,null,null,null,null,null,""]
[290,null,null,null,null,null,null,null,null,null,""]
[291,null,null,null,null,null,null,null,null,null,""]
[292,null,null,null,null,null,null,null,null,null,""]
[293,null,null,null,null,null,null,null,null,null,""]
[294,null,null,null,null,null,null,null,null,null,""]
[295,null,null,null,null,null,null,null,null,null,""]
[296,null,null,null,null,null,null,null,null,null,""]
[297,null,null,null,null,null,null,null,null,null,""]
[298,null,null,null,null,null,null,null,null,null,""]
[299,null,null,null,null,null,null,null,null,null,""]
[300,null,null,null,null,null,null,null,null,null,""]
[301,null,null,null,null,null,null,null,null,null,""]
[302,null,null,null,null,null,null,null,null,null,""]
[303,null,null,null,null,null,null,null,null,null,""]
[304,null,null,null,null,null,null,null,null,null,""]
[305,null,null,null,null,null,null,null,null,null,""]
[306,null,null,null,null,null,null,null,null,null,""]
[307,null,null,null,null,null,null,null,null,null,""]
[308,null,null,null,null,null,null,null,null,null,""]
[309,null,null,null,null,null,null,null,null,null,""]
[310,null,null,null,null,null,null,null,null,null,""]
[311,null,null,null,null,null,null,null,null,null,""]
[312,null,null,null,null,null,null,null,null,null,{"$f":"IF(I320<>\"\",J320-I320,\"\")","v":""}]
[313,null,null,null,null,null,null,null,null,null,""]
[314,null,null,null,null,null,null,null,null,null,""]
[315,null,null,null,null,null,null,null,null,null,""]
[316,null,null,null,null,null,null,null,null,null,""]
[317,null,null,null,null,null,null,null,null,null,""]
[318,null,null,null,null,null,null,null,null,null,""]
[319,null,null,null,null,null,null,null,null,null,""]
[320,null,null,null,null,null,null,null,null,null,""]
[321,null,null,null,null,null,null,null,null,null,""]
[322,null,null,null,null,null,null,null,null,null,""]
[323,null,null,null,null,null,null,null,null,null,""]
[324,null,null,null,null,null,null,null,null,null,""]
[325,null,null,null,null,null,null,null,null,null,""]
[326,null,null,null,null,null,null,null,null,null,""]
[327,null,null,null,null,null,null,null,null,null,""]
[328,null,null,null,null,null,null,null,null,null,""]
[329,null,null,null,null,null,null,null,null,null,""]
[330,null,null,null,null,null,null,null,null,null,""]
[331,null,null,null,null,null,null,null,null,null,""]
[332,null,null,null,null,null,null,null,null,null,""]
[333,null,null,null,null,null,null,null,null,null,""]
[334,null,null,null,null,null,null,null,null,null,""]
[335,null,null,null,null,null,null,null,null,null,""]
[336,null,null,null,null,null,null,null,null,null,""]
[337,null,null,null,null,null,null,null,null,null,""]
[338,null,null,null,null,null,null,null,null,null,""]
[339,null,null,null,null,null,null,null,null,null,""]
[340,null,null,null,null,null,null,null,null,null,""]
[341,null,null,null,null,null,null,null,null,null,""]
[342,null,null,null,null,null,null,null,null,null,""]
[343,null,null,null,null,null,null,null,null,null,""]
[344,null,null,null,null,null,null,null,null,null,""]
[345,null,null,null,null,null,null,null,null,null,""]
[346,null,null,null,null,null,null,null,null,null,""]
[347,null,null,null,null,null,null,null,null,null,""]
[348,null,null,null,null,null,null,null,null,null,""]
[349,null,null,null,null,null,null,null,null,null,""]
[350,null,null,null,null,null,null,null,null,null,""]
[351,null,null,null,null,null,null,null,null,null,""]
[352,null,null,null,null,null,null,null,null,null,""]
[353,null,null,null,null,null,null,null,null,null,""]
[354,null,null,null,null,null,null,null,null,null,""]
[355,null,null,null,null,null,null,null,null,null,""]
[356,null,null,null,null,null,null,null,null,null,""]
[357,null,null,null,null,null,null,null,null,null,""]
[358,null,null,null,null,null,null,null,null,null,""]
[359,null,null,null,null,null,null,null,null,null,""]
[360,null,null,null,null,null,null,null,null,null,""]
[361,null,null,null,null,null,null,null,null,null,""]
[362,null,null,null,null,null,null,null,null,null,""]
[363,null,null,null,null,null,null,null,null,null,""]
[364,null,null,null,null,null,null,null,null,null,""]
[365,null,null,null,null,null,null,null,null,null,""]
[366,null,null,null,null,null,null,null,null,null,""]
[367,null,null,null,null,null,null,null,null,null,""]
[368,null,null,null,null,null,null,null,null,null,""]
[369,null,null,null,null,null,null,null,null,null,""]
[370,null,null,null,null,null,null,null,null,null,""]
[371,null,null,null,null,null,null,null,null,null,""]
[372,null,null,null,null,null,null,null,null,null,""]
[373,null,null,null,null,null,null,null,null,null,""]
[374,null,null,null,null,null,null,null,null,null,""]
[375,null,null,null,null,null,null,null,null,null,""]
[376,null,null,null,null,null,null,null,null,null,{"$f":"IF(I384<>\"\",J384-I384,\"\")","v":""}]
[377,null,null,null,null,null,null,null,null,null,""]
[378,null,null,null,null,null,null,null,null,null,""]
[379,null,null,null,null,null,null,null,null,null,""]
[380,null,null,null,null,null,null,null,null,null,""]
[381,null,null,null,null,null,null,null,null,null,""]
[382,null,null,null,null,null,null,null,null,null,""]
[383,null,null,null,null,null,null,null,null,null,""]
[384,null,null,null,null,null,null,null,null,null,""]
[385,null,null,null,null,null,null,null,null,null,""]
[386,null,null,null,null,null,null,null,null,null,""]
[387,null,null,null,null,null,null,null,null,null,""]
[388,null,null,null,null,null,null,null,null,null,""]
[389,null,null,null,null,null,null,null,null,null,""]
[390,null,null,null,null,null,null,null,null,null,""]
[391,null,null,null,null,null,null,null,null,null,""]
[392,null,null,null,null,null,null,null,null,null,""]
[393,null,null,null,null,null,null,null,null,null,""]
[394,null,null,null,null,null,null,null,null,null,""]
[395,null,null,null,null,null,null,null,null,null,""]
[396,null,null,null,null,null,null,null,null,null,""]
[397,null,null,null,null,null,null,null,null,null,""]
[398,null,null,null,null,null,null,null,null,null,""]
[399,null,null,null,null,null,null,null,null,null,""]
[400,null,null,null,null,null,null,null,null,null,""]
[401,null,null,null,null,null,null,null,null,null,""]
[402,null,null,null,null,null,null,null,null,null,""]
[403,null,null,null,null,null,null,null,null,null,""]
[404,null,null,null,null,null,null,null,null,null,""]
[405,null,null,null,null,null,null,null,null,null,""]
[406,null,null,null,null,null,null,null,null,null,""]
[407,null,null,null,null,null,null,null,null,null,""]
[408,null,null,null,null,null,null,null,null,null,""]
[409,null,null,null,null,null,null,null,null,null,""]
[410,null,null,null,null,null,null,null,null,null,""]
[411,null,null,null,null,null,null,null,null,null,""]
[412,null,null,null,null,null,null,null,null,null,""]
[413,null,null,null,null,null,null,null,null,null,""]
[414,null,null,null,null,null,null,null,null,null,""]
[415,null,null,null,null,null,null,null,null,null,""]
[416,null,null,null,null,null,null,null,null,null,""]
[417,null,null,null,null,null,null,null,null,null,""]
[418,null,null,null,null,null,null,null,null,null,""]
[419,null,null,null,null,null,null,null,null,null,""]
[420,null,null,null,null,null,null,null,null,null,""]
[421,null,null,null,null,null,null,null,null,null,""]
[422,null,null,null,null,null,null,null,null,null,""]
[423,null,null,null,null,null,null,null,null,null,""]
[424,null,null,null,null,null,null,null,null,null,""]
[425,null,null,null,null,null,null,null,null,null,""]
[426,null,null,null,null,null,null,null,null,null,""]
[427,null,null,null,null,null,null,null,null,null,""]
[428,null,null,null,null,null,null,null,null,null,""]
[429,null,null,null,null,null,null,null,null,null,""]
[430,null,null,null,null,null,null,null,null,null,""]
[431,null,null,null,null,null,null,null,null,null,""]
[432,null,null,null,null,null,null,null,null,null,""]
[433,null,null,null,null,null,null,null,null,null,""]
[434,null,null,null,null,null,null,null,null,null,""]
[435,null,null,null,null,null,null,null,null,null,""]
[436,null,null,null,null,null,null,null,null,null,""]
[437,null,null,null,null,null,null,null,null,null,""]
[438,null,null,null,null,null,null,null,null,null,""]
[439,null,null,null,null,null,null,null,null,null,""]
[440,null,null,null,null,null,null,null,null,null,{"$f":"IF(I448<>\"\",J448-I448,\"\")","v":""}]
[441,null,null,null,null,null,null,null,null,null,""]
[442,null,null,null,null,null,null,null,null,null,""]
[443,null,null,null,null,null,null,null,null,null,""]
[444,null,null,null,null,null,null,null,null,null,""]
[445,null,null,null,null,null,null,null,null,null,""]
[446,null,null,null,null,null,null,null,null,null,""]
[447,null,null,null,null,null,null,null,null,null,""]
[448,null,null,null,null,null,null,null,null,null,""]
[449,null,null,null,null,null,null,null,null,null,""]
[450,null,null,null,null,null,null,null,null,null,""]
[451,null,null,null,null,null,null,null,null,null,""]
[452,null,null,null,null,null,null,null,null,null,""]
[453,null,null,null,null,null,null,null,null,null,""]
[454,null,null,null,null,null,null,null,null,null,""]
[455,null,null,null,null,null,null,null,null,null,""]
[456,null,null,null,null,null,null,null,null,null,""]
[457,null,null,null,null,null,null,null,null,null,""]
[458,null,null,null,null,null,null,null,null,null,""]
[459,null,null,null,null,null,null,null,null,null,""]
[460,null,null,null,null,null,null,null,null,null,""]
[461,null,null,null,null,null,null,null,null,null,""]
[462,null,null,null,null,null,null,null,null,null,""]
[463,null,null,null,null,null,null,null,null,null,""]
[464,null,null,null,null,null,null,null,null,null,""]
[465,null,null,null,null,null,null,null,null,null,""]
[466,null,null,null,null,null,null,null,null,null,""]
[467,null,null,null,null,null,null,null,null,null,""]
[468,null,null,null,null,null,null,null,null,null,""]
[469,null,null,null,null,null,null,null,null,null,""]
[470,null,null,null,null,null,null,null,null,null,""]
[471,null,null,null,null,null,null,null,null,null,""]
[472,null,null,null,null,null,null,null,null,null,""]
[473,null,null,null,null,null,null,null,null,null,""]
[474,null,null,null,null,null,null,null,null,null,""]
[475,null,null,null,null,null,null,null,null,null,""]
[476,null,null,null,null,null,null,null,null,null,""]
[477,null,null,null,null,null,null,null,null,null,""]
[478,null,null,null,null,null,null,null,null,null,""]
[479,null,null,null,null,null,null,null,null,null,""]
[480,null,null,null,null,null,null,null,null,null,""]
[481,null,null,null,null,null,null,null,null,null,""]
[482,null,null,null,null,null,null,null,null,null,""]
[483,null,null,null,null,null,null,null,null,null,""]
[484,null,null,null,null,null,null,null,null,null,""]
[485,null,null,null,null,null,null,null,null,null,""]
[486,null,null,null,null,null,null,null,null,null,""]
[487,null,null,null,null,null,null,null,null,null,""]
[488,null,null,null,null,null,null,null,null,null,""]
[489,null,null,null,null,null,null,null,null,null,""]
[490,null,null,null,null,null,null,null,null,null,""]
[491,null,null,null,null,null,null,null,null,null,""]
[492,null,null,null,null,null,null,null,null,null,""]
[493,null,null,null,null,null,null,null,null,null,""]
[494,null,null,null,null,null,null,null,null,null,""]
[495,null,null,null,null,null,null,null,null,null,""]
[496,null,null,null,null,null,null,null,null,null,""]
[497,null,null,null,null,null,null,null,null,null,""]
[498,null,null,null,null,null,null,null,null,null,""]
[499,null,null,null,null,null,null,null,null,null,""]
[500,null,null,null,null,null,null,null,null,null,""]
[501,null,null,null,null,null,null,null,null,null,""]
[502,null,null,null,null,null,null,null,null,null,""]
[503,null,null,null,null,null,null,null,null,null,""]
[504,null,null,null,null,null,null,null,null,null,{"$f":"IF(I512<>\"\",J512-I512,\"\")","v":""}]
[505,null,null,null,null,null,null,null,null,null,""]
[506,null,null,null,null,null,null,null,null,null,""]
[507,null,null,null,null,null,null,null,null,null,""]
[508,null,null,null,null,null,null,null,null,null,""]
[509,null,null,null,null,null,null,null,null,null,""]
[510,null,null,null,null,null,null,null,null,null,""]
[511,null,null,null,null,null,null,null,null,null,""]
[512,null,null,null,null,null,null,null,null,null,""]
[513,null,null,null,null,null,null,null,null,null,""]
[514,null,null,null,null,null,null,null,null,null,""]
[515,null,null,null,null,null,null,null,null,null,""]
[516,null,null,null,null,null,null,null,null,null,""]
[517,null,null,null,null,null,null,null,null,null,""]
[518,null,null,null,null,null,null,null,null,null,""]
[519,null,null,null,null,null,null,null,null,null,""]
[520,null,null,null,null,null,null,null,null,null,""]
[521,null,null,null,null,null,null,null,null,null,""]
[522,null,null,null,null,null,null,null,null,null,""]
[523,null,null,null,null,null,null,null,null,null,""]
[524,null,null,null,null,null,null,null,null,null,""]
[525,null,null,null,null,null,null,null,null,null,""]
[526,null,null,null,null,null,null,null,null,null,""]
[527,null,null,null,null,null,null,null,null,null,""]
[528,null,null,null,null,null,null,null,null,null,""]
[529,null,null,null,null,null,null,null,null,null,""]
[530,null,null,null,null,null,null,null,null,null,""]
[531,null,null,null,null,null,null,null,null,null,""]
[532,null,null,null,null,null,null,null,null,null,""]
[533,null,null,null,null,null,null,null,null,null,""]
[534,null,null,null,null,null,null,null,null,null,""]
[535,null,null,null,null,null,null,null,null,null,""]
[536,null,null,null,null,null,null,null,null,null,""]
[537,null,null,null,null,null,null,null,null,null,""]
[538,null,null,null,null,null,null,null,null,null,""]
[539,null,null,null,null,null,null,null,null,null,""]
[540,null,null,null,null,null,null,null,null,null,""]
[541,null,null,null,null,null,null,null,null,null,""]
[542,null,null,null,null,null,null,null,null,null,""]
[543,null,null,null,null,null,null,null,null,null,""]
[544,null,null,null,null,null,null,null,null,null,""]
[545,null,null,null,null,null,null,null,null,null,""]
[546,null,null,null,null,null,null,null,null,null,""]
[547,null,null,null,null,null,null,null,null,null,""]
[548,null,null,null,null,null,null,null,null,null,""]
[549,null,null,null,null,null,null,null,null,null,""]
[550,null,null,null,null,null,null,null,null,null,""]
[551,null,null,null,null,null,null,null,null,null,""]
[552,null,null,null,null,null,null,null,null,null,""]
[553,null,null,null,null,null,null,null,null,null,""]
[554,null,null,null,null,null,null,null,null,null,""]
[555,null,null,null,null,null,null,null,null,null,""]
[556,null,null,null,null,null,null,null,null,null,""]
[557,null,null,null,null,null,null,null,null,null,""]
[558,null,null,null,null,null,null,null,null,null,""]
[559,null,null,null,null,null,null,null,null,null,""]
[560,null,null,null,null,null,null,null,null,null,""]
[561,null,null,null,null,null,null,null,null,null,""]
[562,null,null,null,null,null,null,null,null,null,""]
[563,null,null,null,null,null,null,null,null,null,""]
[564,null,null,null,null,null,null,null,null,null,""]
[565,null,null,null,null,null,null,null,null,null,""]
[566,null,null,null,null,null,null,null,null,null,""]
[567,null,null,null,null,null,null,null,null,null,""]
[568,null,null,null,null,null,null,null,null,null,{"$f":"IF(I576<>\"\",J576-I576,\"\")","v":""}]
[569,null,null,null,null,null,null,null,null,null,""]
[570,null,null,null,null,null,null,null,null,null,""]
[571,null,null,null,null,null,null,null,null,null,""]
[572,null,null,null,null,null,null,null,null,null,""]
[573,null,null,null,null,null,null,null,null,null,""]
[574,null,null,null,null,null,null,null,null,null,""]
[575,null,null,null,null,null,null,null,null,null,""]
[576,null,null,null,null,null,null,null,null,null,""]
[577,null,null,null,null,null,null,null,null,null,""]
[578,null,null,null,null,null,null,null,null,null,""]
[579,null,null,null,null,null,null,null,null,null,""]
[580,null,null,null,null,null,null,null,null,null,""]
[581,null,null,null,null,null,null,null,null,null,""]
[582,null,null,null,null,null,null,null,null,null,""]
[583,null,null,null,null,null,null,null,null,null,""]
[584,null,null,null,null,null,null,null,null,null,""]
[585,null,null,null,null,null,null,null,null,null,""]
[586,null,null,null,null,null,null,null,null,null,""]
[587,null,null,null,null,null,null,null,null,null,""]
[588,null,null,null,null,null,null,null,null,null,""]
[589,null,null,null,null,null,null,null,null,null,""]
[590,null,null,null,null,null,null,null,null,null,""]
[591,null,null,null,null,null,null,null,null,null,""]
[592,null,null,null,null,null,null,null,null,null,""]
[593,null,null,null,null,null,null,null,null,null,""]
[594,null,null,null,null,null,null,null,null,null,""]
[595,null,null,null,null,null,null,null,null,null,""]
[596,null,null,null,null,null,null,null,null,null,""]
[597,null,null,null,null,null,null,null,null,null,""]
[598,null,null,null,null,null,null,null,null,null,""]
[599,null,null,null,null,null,null,null,null,null,""]
[600,null,null,null,null,null,null,null,null,null,""]
[601,null,null,null,null,null,null,null,null,null,""]
[602,null,null,null,null,null,null,null,null,null,""]
[603,null,null,null,null,null,null,null,null,null,""]
[604,null,null,null,null,null,null,null,null,null,""]
[605,null,null,null,null,null,null,null,null,null,""]
[606,null,null,null,null,null,null,null,null,null,""]
[607,null,null,null,null,null,null,null,null,null,""]
[608,null,null,null,null,null,null,null,null,null,""]
[609,null,null,null,null,null,null,null,null,null,""]
[610,null,null,null,null,null,null,null,null,null,""]
[611,null,null,null,null,null,null,null,null,null,""]
[612,null,null,null,null,null,null,null,null,null,""]
[613,null,null,null,null,null,null,null,null,null,""]
[614,null,null,null,null,null,null,null,null,null,""]
[615,null,null,null,null,null,null,null,null,null,""]
[616,null,null,null,null,null,null,null,null,null,""]
[617,null,null,null,null,null,null,null,null,null,""]
[618,null,null,null,null,null,null,null,null,null,""]
[619,null,null,null,null,null,null,null,null,null,""]
[620,null,null,null,null,null,null,null,null,null,""]
[621,null,null,null,null,null,null,null,null,null,""]
[622,null,null,null,null,null,null,null,null,null,""]
[623,null,null,null,null,null,null,null,null,null,""]
[624,null,null,null,null,null,null,null,null,null,""]
[625,null,null,null,null,null,null,null,null,null,""]
[626,null,null,null,null,null,null,null,null,null,""]
[627,null,null,null,null,null,null,null,null,null,""]
[628,null,null,null,null,null,null,null,null,null,""]
[629,null,null,null,null,null,null,null,null,null,""]
[630,null,null,null,null,null,null,null,null,null,""]
[631,null,null,null,null,null,null,null,null,null,""]
[632,null,null,null,null,null,null,null,null,null,{"$f":"IF(I640<>\"\",J640-I640,\"\")","v":""}]
[633,null,null,null,null,null,null,null,null,null,""]
[634,null,null,null,null,null,null,null,null,null,""]
[635,null,null,null,null,null,null,null,null,null,""]
[636,null,null,null,null,null,null,null,null,null,""]
[637,null,null,null,null,null,null,null,null,null,""]
[638,null,null,null,null,null,null,null,null,null,""]
[639,null,null,null,null,null,null,null,null,null,""]
[640,null,null,null,null,null,null,null,null,null,""]
[641,null,null,null,null,null,null,null,null,null,""]
[642,null,null,null,null,null,null,null,null,null,""]
[643,null,null,null,null,null,null,null,null,null,""]
[644,null,null,null,null,null,null,null,null,null,""]
[645,null,null,null,null,null,null,null,null,null,""]
[646,null,null,null,null,null,null,null,null,null,""]
[647,null,null,null,null,null,null,null,null,null,""]
[648,null,null,null,null,null,null,null,null,null,""]
[649,null,null,null,null,null,null,null,null,null,""]
[650,null,null,null,null,null,null,null,null,null,""]
[651,null,null,null,null,null,null,null,null,null,""]
[652,null,null,null,null,null,null,null,null,null,""]
[653,null,null,null,null,null,null,null,null,null,""]
[654,null,null,null,null,null,null,null,null,null,""]
[655,null,null,null,null,null,null,null,null,null,""]
[656,null,null,null,null,null,null,null,null,null,""]
[657,null,null,null,null,null,null,null,null,null,""]
[658,null,null,null,null,null,null,null,null,null,""]
[659,null,null,null,null,null,null,null,null,null,""]
[660,null,null,null,null,null,null,null,null,null,""]
[661,null,null,null,null,null,null,null,null,null,""]
[662,null,null,null,null,null,null,null,null,null,""]
[663,null,null,null,null,null,null,null,null,null,""]
[664,null,null,null,null,null,null,null,null,null,""]
[665,null,null,null,null,null,null,null,null,null,""]
[666,null,null,null,null,null,null,null,null,null,""]
[667,null,null,null,null,null,null,null,null,null,""]
[668,null,null,null,null,null,null,null,null,null,""]
[669,null,null,null,null,null,null,null,null,null,""]
[670,null,null,null,null,null,null,null,null,null,""]
[671,null,null,null,null,null,null,null,null,null,""]
[672,null,null,null,null,null,null,null,null,null,""]
[673,null,null,null,null,null,null,null,null,null,""]
[674,null,null,null,null,null,null,null,null,null,""]
[675,null,null,null,null,null,null,null,null,null,""]
[676,null,null,null,null,null,null,null,null,null,""]
[677,null,null,null,null,null,null,null,null,null,""]
[678,null,null,null,null,null,null,null,null,null,""]
[679,null,null,null,null,null,null,null,null,null,""]
[680,null,null,null,null,null,null,null,null,null,""]
[681,null,null,null,null,null,null,null,null,null,""]
[682,null,null,null,null,null,null,null,null,null,""]
[683,null,null,null,null,null,null,null,null,null,""]
[684,null,null,null,null,null,null,null,null,null,""]
[685,null,null,null,null,null,null,null,null,null,""]
[686,null,null,null,null,null,null,null,null,null,""]
[687,null,null,null,null,null,null,null,null,null,""]
[688,null,null,null,null,null,null,null,null,null,""]
[689,null,null,null,null,null,null,null,null,null,""]
[690,null,null,null,null,null,null,null,null,null,""]
[691,null,null,null,null,null,null,null,null,null,""]
[692,null,null,null,null,null,null,null,null,null,""]
[693,null,null,null,null,null,null,null,null,null,""]
[694,null,null,null,null,null,null,null,null,null,""]
[695,null,null,null,null,null,null,null,null,null,""]
[696,null,null,null,null,null,null,null,null,null,{"$f":"IF(I704<>\"\",J704-I704,\"\")","v":""}]
[697,null,null,null,null,null,null,null,null,null,""]
[698,null,null,null,null,null,null,null,null,null,""]
[699,null,null,null,null,null,null,null,null,null,""]
[700,null,null,null,null,null,null,null,null,null,""]
[701,null,null,null,null,null,null,null,null,null,""]
[702,null,null,null,null,null,null,null,null,null,""]
[703,null,null,null,null,null,null,null,null,null,""]
[704,null,null,null,null,null,null,null,null,null,""]
[705,null,null,null,null,null,null,null,null,null,""]
[706,null,null,null,null,null,null,null,null,null,""]
[707,null,null,null,null,null,null,null,null,null,""]
[708,null,null,null,null,null,null,null,null,null,""]
[709,null,null,null,null,null,null,null,null,null,""]
[710,null,null,null,null,null,null,null,null,null,""]
[711,null,null,null,null,null,null,null,null,null,""]
[712,null,null,null,null,null,null,null,null,null,""]
[713,null,null,null,null,null,null,null,null,null,""]
[714,null,null,null,null,null,null,null,null,null,""]
[715,null,null,null,null,null,null,null,null,null,""]
[716,null,null,null,null,null,null,null,null,null,""]
[717,null,null,null,null,null,null,null,null,null,""]
[718,null,null,null,null,null,null,null,null,null,""]
[719,null,null,null,null,null,null,null,null,null,""]
[720,null,null,null,null,null,null,null,null,null,""]
[721,null,null,null,null,null,null,null,null,null,""]
[722,null,null,null,null,null,null,null,null,null,""]
[723,null,null,null,null,null,null,null,null,null,""]
[724,null,null,null,null,null,null,null,null,null,""]
[725,null,null,null,null,null,null,null,null,null,""]
[726,null,null,null,null,null,null,null,null,null,""]
[727,null,null,null,null,null,null,null,null,null,""]
[728,null,null,null,null,null,null,null,null,null,""]
[729,null,null,null,null,null,null,null,null,null,""]
[730,null,null,null,null,null,null,null,null,null,""]
[731,null,null,null,null,null,null,null,null,null,""]
[732,null,null,null,null,null,null,null,null,null,""]
[733,null,null,null,null,null,null,null,null,null,""]
[734,null,null,null,null,null,null,null,null,null,""]
[735,null,null,null,null,null,null,null,null,null,""]
[736,null,null,null,null,null,null,null,null,null,""]
[737,null,null,null,null,null,null,null,null,null,""]
[738,null,null,null,null,null,null,null,null,null,""]
[739,null,null,null,null,null,null,null,null,null,""]
[740,null,null,null,null,null,null,null,null,null,""]
[741,null,null,null,null,null,null,null,null,null,""]
[742,null,null,null,null,null,null,null,null,null,""]
[743,null,null,null,null,null,null,null,null,null,""]
[744,null,null,null,null,null,null,null,null,null,""]
[745,null,null,null,null,null,null,null,null,null,""]
[746,null,null,null,null,null,null,null,null,null,""]
[747,null,null,null,null,null,null,null,null,null,""]
[748,null,null,null,null,null,null,null,null,null,""]
[749,null,null,null,null,null,null,null,null,null,""]
[750,null,null,null,null,null,null,null,null,null,""]
[751,null,null,null,null,null,null,null,null,null,""]
[752,null,null,null,null,null,null,null,null,null,""]
[753,null,null,null,null,null,null,null,null,null,""]
[754,null,null,null,null,null,null,null,null,null,""]
[755,null,null,null,null,null,null,null,null,null,""]
[756,null,null,null,null,null,null,null,null,null,""]
[757,null,null,null,null,null,null,null,null,null,""]
[758,null,null,null,null,null,null,null,null,null,""]
[759,null,null,null,null,null,null,null,null,null,""]
[760,null,null,null,null,null,null,null,null,null,{"$f":"IF(I768<>\"\",J768-I768,\"\")","v":""}]
[761,null,null,null,null,null,null,null,null,null,""]
[762,null,null,null,null,null,null,null,null,null,""]
[763,null,null,null,null,null,null,null,null,null,""]
[764,null,null,null,null,null,null,null,null,null,""]
[765,null,null,null,null,null,null,null,null,null,""]
[766,null,null,null,null,null,null,null,null,null,""]
[767,null,null,null,null,null,null,null,null,null,""]
[768,null,null,null,null,null,null,null,null,null,""]
[769,null,null,null,null,null,null,null,null,null,""]
[770,null,null,null,null,null,null,null,null,null,""]
[771,null,null,null,null,null,null,null,null,null,""]
[772,null,null,null,null,null,null,null,null,null,""]
[773,null,null,null,null,null,null,null,null,null,""]
[774,null,null,null,null,null,null,null,null,null,""]
[775,null,null,null,null,null,null,null,null,null,""]
[776,null,null,null,null,null,null,null,null,null,""]
[777,null,null,null,null,null,null,null,null,null,""]
[778,null,null,null,null,null,null,null,null,null,""]
[779,null,null,null,null,null,null,null,null,null,""]
[780,null,null,null,null,null,null,null,null,null,""]
[781,null,null,null,null,null,null,null,null,null,""]
[782,null,null,null,null,null,null,null,null,null,""]
[783,null,null,null,null,null,null,null,null,null,""]
[784,null,null,null,null,null,null,null,null,null,""]
[785,null,null,null,null,null,null,null,null,null,""]
[786,null,null,null,null,null,null,null,null,null,""]
[787,null,null,null,null,null,null,null,null,null,""]
[788,null,null,null,null,null,null,null,null,null,""]
[789,null,null,null,null,null,null,null,null,null,""]
[790,null,null,null,null,null,null,null,null,null,""]
[791,null,null,null,null,null,null,null,null,null,""]
[792,null,null,null,null,null,null,null,null,null,""]
[793,null,null,null,null,null,null,null,null,null,""]
[794,null,null,null,null,null,null,null,null,null,""]
[795,null,null,null,null,null,null,null,null,null,""]
[796,null,null,null,null,null,null,null,null,null,""]
[797,null,null,null,null,null,null,null,null,null,""]
[798,null,null,null,null,null,null,null,null,null,""]
[799,null,null,null,null,null,null,null,null,null,""]
[800,null,null,null,null,null,null,null,null,null,""]
[801,null,null,null,null,null,null,null,null,null,""]
[802,null,null,null,null,null,null,null,null,null,""]
[803,null,null,null,null,null,null,null,null,null,""]
[804,null,null,null,null,null,null,null,null,null,""]
[805,null,null,null,null,null,null,null,null,null,""]
[806,null,null,null,null,null,null,null,null,null,""]
[807,null,null,null,null,null,null,null,null,null,""]
[808,null,null,null,null,null,null,null,null,null,""]
[809,null,null,null,null,null,null,null,null,null,""]
[810,null,null,null,null,null,null,null,null,null,""]
[811,null,null,null,null,null,null,null,null,null,""]
[812,null,null,null,null,null,null,null,null,null,""]
[813,null,null,null,null,null,null,null,null,null,""]
[814,null,null,null,null,null,null,null,null,null,""]
[815,null,null,null,null,null,null,null,null,null,""]
[816,null,null,null,null,null,null,null,null,null,""]
[817,null,null,null,null,null,null,null,null,null,""]
[818,null,null,null,null,null,null,null,null,null,""]
[819,null,null,null,null,null,null,null,null,null,""]
[820,null,null,null,null,null,null,null,null,null,""]
[821,null,null,null,null,null,null,null,null,null,""]
[822,null,null,null,null,null,null,null,null,null,""]
[823,null,null,null,null,null,null,null,null,null,""]
[824,null,null,null,null,null,null,null,null,null,{"$f":"IF(I832<>\"\",J832-I832,\"\")","v":""}]
[825,null,null,null,null,null,null,null,null,null,""]
[826,null,null,null,null,null,null,null,null,null,""]
[827,null,null,null,null,null,null,null,null,null,""]
[828,null,null,null,null,null,null,null,null,null,""]
[829,null,null,null,null,null,null,null,null,null,""]
[830,null,null,null,null,null,null,null,null,null,""]
[831,null,null,null,null,null,null,null,null,null,""]
[832,null,null,null,null,null,null,null,null,null,""]
[833,null,null,null,null,null,null,null,null,null,""]
[834,null,null,null,null,null,null,null,null,null,""]
[835,null,null,null,null,null,null,null,null,null,""]
[836,null,null,null,null,null,null,null,null,null,""]
[837,null,null,null,null,null,null,null,null,null,""]
[838,null,null,null,null,null,null,null,null,null,""]
[839,null,null,null,null,null,null,null,null,null,""]
[840,null,null,null,null,null,null,null,null,null,""]
[841,null,null,null,null,null,null,null,null,null,""]
[842,null,null,null,null,null,null,null,null,null,""]
[843,null,null,null,null,null,null,null,null,null,""]
[844,null,null,null,null,null,null,null,null,null,""]
[845,null,null,null,null,null,null,null,null,null,""]
[846,null,null,null,null,null,null,null,null,null,""]
[847,null,null,null,null,null,null,null,null,null,""]
[848,null,null,null,null,null,null,null,null,null,""]
[849,null,null,null,null,null,null,null,null,null,""]
[850,null,null,null,null,null,null,null,null,null,""]
[851,null,null,null,null,null,null,null,null,null,""]
[852,null,null,null,null,null,null,null,null,null,""]
[853,null,null,null,null,null,null,null,null,null,""]
[854,null,null,null,null,null,null,null,null,null,""]
[855,null,null,null,null,null,null,null,null,null,""]
[856,null,null,null,null,null,null,null,null,null,""]
[857,null,null,null,null,null,null,null,null,null,""]
[858,null,null,null,null,null,null,null,null,null,""]
[859,null,null,null,null,null,null,null,null,null,""]
[860,null,null,null,null,null,null,null,null,null,""]
[861,null,null,null,null,null,null,null,null,null,""]
[862,null,null,null,null,null,null,null,null,null,""]
[863,null,null,null,null,null,null,null,null,null,""]
[864,null,null,null,null,null,null,null,null,null,""]
[865,null,null,null,null,null,null,null,null,null,""]
[866,null,null,null,null,null,null,null,null,null,""]
[867,null,null,null,null,null,null,null,null,null,""]
[868,null,null,null,null,null,null,null,null,null,""]
[869,null,null,null,null,null,null,null,null,null,""]
[870,null,null,null,null,null,null,null,null,null,""]
[871,null,null,null,null,null,null,null,null,null,""]
[872,null,null,null,null,null,null,null,null,null,""]
[873,null,null,null,null,null,null,null,null,null,""]
[874,null,null,null,null,null,null,null,null,null,""]
[875,null,null,null,null,null,null,null,null,null,""]
[876,null,null,null,null,null,null,null,null,null,""]
[877,null,null,null,null,null,null,null,null,null,""]
[878,null,null,null,null,null,null,null,null,null,""]
[879,null,null,null,null,null,null,null,null,null,""]
[880,null,null,null,null,null,null,null,null,null,""]
[881,null,null,null,null,null,null,null,null,null,""]
[882,null,null,null,null,null,null,null,null,null,""]
[883,null,null,null,null,null,null,null,null,null,""]
[884,null,null,null,null,null,null,null,null,null,""]
[885,null,null,null,null,null,null,null,null,null,""]
[886,null,null,null,null,null,null,null,null,null,""]
[887,null,null,null,null,null,null,null,null,null,""]
[888,null,null,null,null,null,null,null,null,null,{"$f":"IF(I896<>\"\",J896-I896,\"\")","v":""}]
[889,null,null,null,null,null,null,null,null,null,""]
[890,null,null,null,null,null,null,null,null,null,""]
[891,null,null,null,null,null,null,null,null,null,""]
[892,null,null,null,null,null,null,null,null,null,""]
[893,null,null,null,null,null,null,null,null,null,""]
[894,null,null,null,null,null,null,null,null,null,""]
[895,null,null,null,null,null,null,null,null,null,""]
[896,null,null,null,null,null,null,null,null,null,""]
[897,null,null,null,null,null,null,null,null,null,""]
[898,null,null,null,null,null,null,null,null,null,""]
[899,null,null,null,null,null,null,null,null,null,""]
[900,null,null,null,null,null,null,null,null,null,""]
[901,null,null,null,null,null,null,null,null,null,""]
[902,null,null,null,null,null,null,null,null,null,""]
[903,null,null,null,null,null,null,null,null,null,""]
[904,null,null,null,null,null,null,null,null,null,""]
[905,null,null,null,null,null,null,null,null,null,""]
[906,null,null,null,null,null,null,null,null,null,""]
[907,null,null,null,null,null,null,null,null,null,""]
[908,null,null,null,null,null,null,null,null,null,""]
[909,null,null,null,null,null,null,null,null,null,""]
[910,null,null,null,null,null,null,null,null,null,""]
[911,null,null,null,null,null,null,null,null,null,""]
[912,null,null,null,null,null,null,null,null,null,""]
[913,null,null,null,null,null,null,null,null,null,""]
[914,null,null,null,null,null,null,null,null,null,""]
[915,null,null,null,null,null,null,null,null,null,""]
[916,null,null,null,null,null,null,null,null,null,""]
[917,null,null,null,null,null,null,null,null,null,""]
[918,null,null,null,null,null,null,null,null,null,""]
[919,null,null,null,null,null,null,null,null,null,""]
[920,null,null,null,null,null,null,null,null,null,""]
[921,null,null,null,null,null,null,null,null,null,""]
[922,null,null,null,null,null,null,null,null,null,""]
[923,null,null,null,null,null,null,null,null,null,""]
[924,null,null,null,null,null,null,null,null,null,""]
[925,null,null,null,null,null,null,null,null,null,""]
[926,null,null,null,null,null,null,null,null,null,""]
[927,null,null,null,null,null,null,null,null,null,""]
[928,null,null,null,null,null,null,null,null,null,""]
[929,null,null,null,null,null,null,null,null,null,""]
[930,null,null,null,null,null,null,null,null,null,""]
[931,null,null,null,null,null,null,null,null,null,""]
[932,null,null,null,null,null,null,null,null,null,""]
[933,null,null,null,null,null,null,null,null,null,""]
[934,null,null,null,null,null,null,null,null,null,""]
[935,null,null,null,null,null,null,null,null,null,""]
[936,null,null,null,null,null,null,null,null,null,""]
[937,null,null,null,null,null,null,null,null,null,""]
[938,null,null,null,null,null,null,null,null,null,""]
[939,null,null,null,null,null,null,null,null,null,""]
[940,null,null,null,null,null,null,null,null,null,""]
[941,null,null,null,null,null,null,null,null,null,""]
[942,null,null,null,null,null,null,null,null,null,""]
[943,null,null,null,null,null,null,null,null,null,""]
[944,null,null,null,null,null,null,null,null,null,""]
[945,null,null,null,null,null,null,null,null,null,""]
[946,null,null,null,null,null,null,null,null,null,""]
[947,null,null,null,null,null,null,null,null,null,""]
[948,null,null,null,null,null,null,null,null,null,""]
[949,null,null,null,null,null,null,null,null,null,""]
[950,null,null,null,null,null,null,null,null,null,""]
[951,null,null,null,null,null,null,null,null,null,""]
[952,null,null,null,null,null,null,null,null,null,{"$f":"IF(I960<>\"\",J960-I960,\"\")","v":""}]
[953,null,null,null,null,null,null,null,null,null,""]
[954,null,null,null,null,null,null,null,null,null,""]
[955,null,null,null,null,null,null,null,null,null,""]
[956,null,null,null,null,null,null,null,null,null,""]
[957,null,null,null,null,null,null,null,null,null,""]
[958,null,null,null,null,null,null,null,null,null,""]
[959,null,null,null,null,null,null,null,null,null,""]
[960,null,null,null,null,null,null,null,null,null,""]
[961,null,null,null,null,null,null,null,null,null,""]
[962,null,null,null,null,null,null,null,null,null,""]
[963,null,null,null,null,null,null,null,null,null,""]
[964,null,null,null,null,null,null,null,null,null,""]
[965,null,null,null,null,null,null,null,null,null,""]
[966,null,null,null,null,null,null,null,null,null,""]
[967,null,null,null,null,null,null,null,null,null,""]
[968,null,null,null,null,null,null,null,null,null,""]
[969,null,null,null,null,null,null,null,null,null,""]
[970,null,null,null,null,null,null,null,null,null,""]
[971,null,null,null,null,null,null,null,null,null,""]
[972,null,null,null,null,null,null,null,null,null,""]
[973,null,null,null,null,null,null,null,null,null,""]
[974,null,null,null,null,null,null,null,null,null,""]
[975,null,null,null,null,null,null,null,null,null,""]
[976,null,null,null,null,null,null,null,null,null,""]
[977,null,null,null,null,null,null,null,null,null,""]
[978,null,null,null,null,null,null,null,null,null,""]
[979,null,null,null,null,null,null,null,null,null,""]
[980,null,null,null,null,null,null,null,null,null,""]
[981,null,null,null,null,null,null,null,null,null,""]
[982,null,null,null,null,null,null,null,null,null,""]
[983,null,null,null,null,null,null,null,null,null,""]
[984,null,null,null,null,null,null,null,null,null,""]
[985,null,null,null,null,null,null,null,null,null,""]
[986,null,null,null,null,null,null,null,null,null,""]
[987,null,null,null,null,null,null,null,null,null,""]
[988,null,null,null,null,null,null,null,null,null,""]
[989,null,null,null,null,null,null,null,null,null,""]
[990,null,null,null,null,null,null,null,null,null,""]
[991,null,null,null,null,null,null,null,null,null,""]
[992,null,null,null,null,null,null,null,null,null,""]
[993,null,null,null,null,null,null,null,null,null,""]
[994,null,null,null,null,null,null,null,null,null,""]
[995,null,null,null,null,null,null,null,null,null,""]
[996,null,null,null,null,null,null,null,null,null,""]
[997,null,null,null,null,null,null,null,null,null,""]
[998,null,null,null,null,null,null,null,null,null,""]

{"sheet":"نتائج الاختبارات","index":4,"n_rows":101,"n_cols":14,"rows_kept":101,"cut":false,"hidden":false,"merged":[]}
["الرقم ","التاريخ ","الموضوع ","نوع الاختبار","من ","الى","AC","تاريخ اخذ العينة ","Hyperlink"]
[1,"2018-03-12","تقرير الدرسات الهندسية لابحاث التربة والاساسات لشبكة المياه وشبكة الرى ",null,null,null,null,null,null,null,null,null,"صلاحية","A"]
[2,"2018-03-21","تقرير معاينة قاع الحفر ومنسوب التأسيس خط المياة الرئيسى قطر 900 مم ",null,null,null,null,null,null,null,null,null,"دمك","B"]
[3,"2018-03-28","شهادة اختبار مصنع عثمان جروب ",null,null,null,null,null,null,null,null,null,null,"C"]
[4,"2018-03-27","نتائج الاختبارات المعملية التي تم اجراؤها على الرمل المورد المستخدم في الردم والاحلال والتاسيس على خط 900 مم مياه رئيسى لمنطقة المستثمرين رقم 1 ","صلاحية",null,null,"A","2018-03-27",null,null,null,null,null,"D"]
[5,"2018-03-27","فرشة تأسيس ","دمك",5020,5250,"A","2018-03-27"]
[6,"2018-03-27","فرشة تأسيس ","دمك",4800,5025,"A","2018-03-27"]
[7,"2018-04-03","فرشة أساس ","دمك",4800,4575,"A","2018-04-03"]
[8,"2018-04-10","فرشة تأسيس ","دمك",4575,4375,"A","2018-04-10"]
[9,"2018-04-18","فرشة تأسيس ","دمك",4375,4100,"A","2018-04-18"]
[10,"2018-06-09","فرشة أساس ","دمك",1925,1875,"A","2018-06-09"]
[11,"2018-06-09","فرشة أساس ","دمك",1875,1839,"A","2018-06-09"]
[12,"2018-06-09","فرشة أساس ","دمك",2800,2900,"A","2018-06-09"]
[13,"2018-06-10","فرشة تأسيس ","دمك",2900,3075,"A","2018-06-10"]
[14,"2018-06-11","نتائج الاختبارات المعملية التي تم اجراؤها على الرمل المورد المستخدم في الردم والاحلال والتاسيس على خط 1000 مم  رقم 1 ","صلاحية",3100,1838.54,"A","2018-06-11"]
[15,"2018-06-11","نتائج الاختبارات المعملية التي تم اجراؤها على الرمل المورد المستخدم في الردم والاحلال والتاسيس على خط 900 مم مياه رئيسى لمنطقة المستثمرين رقم 2","صلاحية",5250,3625,"A","2018-06-11"]
[16,"2018-06-27","طبقة أولى احلال  25 سم ","دمك",4375,4225,"D","2018-06-27"]
[17,"2018-07-07","طبقة أولى احلال  25 سم ","دمك",4078,4100,"A","2018-07-07"]
[18,"2018-07-07","طبقة أولى احلال  25 سم ","دمك",4050.79,4069.69,"A","2018-07-07"]
[19,"2018-07-07","طبقة أولى احلال  25 سم ","دمك",4025,4042,"A","2018-07-07"]
[20,"2018-07-08","طبقة أولى احلال  25 سم ","دمك",4078,4100,"A","2018-07-08"]
[21,"2018-07-08","فرشة أساس ","دمك",4050.79,4069.69,"A","2018-07-08"]
[22,"2018-07-08","فرشة أساس ","دمك",4025,4042.81,"A","2018-07-08"]
[23,"2018-07-10"," فرش تأسيس ","دمك",3975,4025,"A","2018-07-10"]
[24,"2018-07-17"," طبقة أولى احلال 25 سم  ","دمك",3750,3650,"D","2018-07-17"]
[25,"2018-07-21"," طبقة اولى احلال 25 سم  ","دمك",4375,4225,"A","2018-07-21"]
[26,"2018-07-21","طبقة أولى إحلال وطبقة ثانيه  ","دمك",3750,3650,"A","2018-07-21"]
[27,"2018-09-23","نتيجة اختبار دمك طبقة أولى إحلال  ","دمك",814,784,"A","2018-09-23"]
[28,"2018-09-24","نتيجة اختبار صلاحية رمل مورد  ","صلاحية",300,800,"A","2018-09-24"]
[29,"2018-09-27","نتيجة اختبار فرشة تأسيس  ","دمك",784,700,"A","2018-09-27"]
[30,"2018-09-27","نتيجة صلاحية قاع حفر  ","صلاحية",825,925,"A","2018-09-27"]
[31,"2018-09-27","نتيجة صلاحية زمل مورد ","صلاحية",null,null,"A","2018-09-27"]
[32,"2018-10-02","نتيجة اختبار طبقة أولى إحلال   ","دمك",475,700,"A","2018-10-02"]
[33,"2018-10-04","فرشة أساس ","دمك",475,700,"A","2018-10-04"]
[34,"2018-09-25","فرشة أساس ","دمك"," 784+0","814+0 ","A","2018-09-25"]
[35,"2018-10-10"," طبقة أولى احلال  25 سم  ","دمك","300+0","475+0","A","2018-10-10"]
[36,"2018-10-15","فرشة أساس ","دمك","300+0","475+0","A","2018-10-15"]
[37,"2018-10-15","طبقة أولى و  تانية ردم حول المواسير  ","دمك","475+0"," 545+0","A","2018-10-15"]
[38,"2018-10-15","نتيجة اختبار طبقة أولى إحلال سمك 25 سم  ","دمك","225+0","300+0","A","2018-10-15"]
[39,"2018-10-22","نتيجة اختبار طبقة أولى وتانية ردم حول المواسير ","دمك","545+0"," 814+0","A","2018-10-22"]
[40,"2018-11-06","نتيجة صلاحية رمل مورد على خط 1000 مم ","صلاحية",null,null,"A","2018-11-06"]
[41,"2018-11-06","نتيجة صلاحية رمل قاع حفر على خط 1000 مم ","صلاحية",null,null,"A","2018-11-06"]
[42,"2018-09-27","نتيجه اختبار دمك قاع الحفر  ","دمك","925+0"," 824+0","A","2018-09-27"]
[43,"2018-09-30","نتيجه اختبار دمك طبقه اولي وثانيه ردم حول المواسير  ","دمك","925+0","824+0","A","2018-09-30"]
[44,"2018-10-01","نتيجه اختبار دمك طبقه تلته ورابعه  ردم حول المواسير  ","دمك","925+0"," 824+0","A","2018-10-01"]
[45,null,"رقم  ساقط ",null,null,null,"A"]
[46,"2018-10-03"," فرشة تأسيس   ","دمك",1025,"925+0","A","2018-10-03"]
[47,"2018-10-07"," طبقه اولي إحلال 25 سم  ","دمك",1075,1025,"A","2018-10-07"]
[48,"2018-10-17"," طبقه اولي وثانيه ردم حول المواسير  ","دمك",1025,"925+0","A","2018-10-17"]
[49,"2018-10-22"," طبقه تالته ورابعه  ردم حول المواسير  ","دمك",1025," 925+0","A","2018-10-22"]
[50,"2018-11-01"," طبقه تالته ورابعه  ردم حول المواسير  ","دمك"," 475+0","814+0","A","2018-11-01"]
[51,"2018-11-05"," طبقة أولى احلال  25 سم  ","دمك","000+0","225+0","A","2018-11-05"]
[52]
[53]
[54]
[55]
[56]
[57]
[58]
[59]
[60]
[61]
[62]
[63]
[64]
[65]
[66]
[67]
[68]
[69]
[70]
[71]
[72]
[73]
[74]
[75]
[76]
[77]
[78]
[79]
[80]
[81]
[82]
[83]
[84]
[85]
[86]
[87]
[88]
[89]
[90]
[91]
[92]
[93]
[94]
[95]
[96]
[97]
[98]
[99]
[100]

{"sheet":"3-إستلام أعمال بنيه تحتية","index":5,"n_rows":35,"n_cols":15,"rows_kept":35,"cut":false,"hidden":false,"merged":[[20,2,20,5],[20,10,21,13],[21,2,21,9],[22,2,22,4],[22,5,22,13],[32,2,32,8],[32,9,32,13],[33,2,33,8],[33,9,33,13],[28,2,28,7],[28,10,28,13],[34,2,34,13],[4,6,4,7],[4,3,4,4],[5,9,5,10],[6,9,6,10],[29,2,29,8],[29,10,29,13],[30,2,30,8],[30,9,30,13],[31,2,31,8],[31,9,31,13],[23,2,23,13],[24,2,24,13],[25,2,25,13],[26,2,26,13],[27,2,27,13],[12,2,12,13],[13,2,13,13],[14,2,14,5],[14,10,14,13],[15,2,15,7],[15,8,15,9],[16,2,16,13],[18,5,18,6],[18,7,18,9],[19,2,19,3],[19,4,19,5],[19,6,19,7],[19,8,19,9],[19,12,19,13],[17,2,17,5],[17,9,17,12],[18,2,18,4],[19,10,19,11],[11,12,11,13],[10,2,10,3],[10,4,10,5],[10,6,10,7],[10,8,10,9],[10,10,10,11],[10,12,10,13],[11,2,11,3],[11,4,11,5],[11,6,11,7],[11,8,11,9],[11,10,11,11],[8,2,8,13],[9,2,9,3],[9,4,9,5],[9,6,9,7],[9,8,9,9],[9,10,9,11],[9,12,9,13],[6,2,6,4],[6,5,6,7],[7,5,7,7],[7,9,7,13],[4,8,4,10],[4,11,5,13],[5,5,5,7],[5,3,5,4],[7,3,7,4],[6,11,6,12],[1,2,1,13],[2,2,2,6],[2,7,2,10],[2,11,2,13],[3,2,3,11],[3,12,3,13]]}
[]
[null,null,"مشروع العاصمة الإدارية الجديدة"]
[null,null,"المالــك\n",null,null,null,null,"الشركة المنفذة",null,null,null,"الاستشاري العام للإشراف"]
[null,null,"طلب معاينة وإستلام أعمال بنيه تحتية ( Infra Structure Inspection Request )",null,null,null,null,null,null,null,null,null,"نموذج رقم (03)",null,157]
[null,null,"رقم الطلب:",{"$f":"O4","v":157},null,"تاريخ تقديم الطلب:",{"$f":"VLOOKUP($O$4,'Daily Log'!B4:O505,2,FALSE)","v":"2018-11-15"},null,"طريق رقم",null,null,"رقم اللوحة المعتمدة"]
[null,null,{"$f":"VLOOKUP($O$4,'Daily Log'!B4:O505,14,FALSE)","v":0},"REV no.",null,"تاريخ المعاينة:",null,null,"خط/ منهول رقم:"]
[null,null,"الخط الرئيسى",null,null,"وقت المعاينة",null,null,"من محطة كم/ منهول:",-200,null,"الي محطة كم/ منهول:",null,-237]
[null,null,"مواسير قطر:",{"$f":"VLOOKUP($O$4,'Daily Log'!B4:O505,11,FALSE)","v":"1200/1000"},null,null,null,null,"المادة:",{"$f":"VLOOKUP($O$4,'Daily Log'!B4:O505,7,FALSE)","v":0}]
[]
[null,null,"  مساحة",null,"صرف مياه الأمطار",null,"مياه الشرب",null,"انارة",null,"    اشارات مرورية",null,"كهرباء جهد متوسط"]
[null,null,"صرف صحي",null,"مضخات",null,"خزانات",null,"اتصالات",null,"ري",null,"كهرباء جهد منخفض"]
[null,null,"     تنقية مياه",null,"     تنسيق موقع",null,"طرق",null,"بردورات",null,"أرصفة",null,"أخري"]
[null,null,"يتعهد المقاول بأن الأعمال المذكورة أعلاه قد تم معاينتها من قبله بناءً على مواصفات المشروع و مخططات الورشة المعتمدة و وثائق العقد ."]
[null,null,"بيـــــــان الأعمـــــال"]
[null,null,"السيد مدير المشروع (الاستشاري)"]
[null,null,"يرجى ترتيب معاينة الاعمال السابق بيانها مع مندوب المقاول المهندس :",null,null,null,null,null,{"$f":"VLOOKUP($O$4,'Daily Log'!B4:P505,15,FALSE)","v":0}]
[null,null,"ملاحظة اضافية :"]
[null,null,"توقيع مدير التنفيذ",null,null,null,null,null,null,"توقيع مدير المشروع"]
[null,null,"المختص بالاعتماد"]
[null,null,"  مساحة",null,"طرق",null,"ميكانيكا",null,"كهرباء",null,"شبكات",null,"أخري"]
[null,null,"السيد المهندس/ المهندسين",null,null,null,null,null,null,null,"توقيع مدير المشروع (الاستشاري)"]
[null,null,"لمعاينة الأعمال السابق بيانها حسب طلب المقاول"]
[null,null,"ملاحظات الاستشاري:-"]
[]
[]
[]
[]
[null,null,"كود إعتماد الطلب"]
[null,null,"               معتمد",null,null,null,null,null,null,null,"       معتمد مع ملاحظات ويجب إعادة التقديم"]
[null,null,"               معتمد مع ملاحظات (إعادة التقديم غير ضرورية)",null,null,null,null,null,null,null,"           الطلب مرقوض"]
[null,null,"مهندس المقاول",null,null,null,null,null,null,"إعتماد مدير المشروع للاستشاري"]
[null,null,"الاسم:",null,null,null,null,null,null,"الاسم:"]
[null,null,"التوقيع:",null,null,null,null,null,null,"التوقيع:"]
[null,null,"التاريخ:",null,null,null,null,null,null,"التاريخ:"]
[null,null,"صورة لممثل المالك"]