{"text_format":"1","workbook":"xlsx","n_sheets":3,"sheets":["العملاء","الادخال","الحركة"],"not_rendered":{"charts":0,"images":0,"macros":1,"external_links":0,"defined_names":0,"comments":0,"pivot_tables":0},"unopened":[],"bounds":{"document_bytes":16777216,"sheet_cells":100000,"rows_first":2000,"rows_last":500,"rows_between":2000,"halvings":0,"cell_chars":16384,"cell_head_chars":4096},"cells_cut":0,"cells_raw":0,"read":"whole","date_system":"1900"}

{"sheet":"العملاء","index":0,"n_rows":6,"n_cols":6,"rows_kept":6,"cut":false,"hidden":false,"merged":[]}
["اسم العميل","سعر الجهاز","الاشتراك الشهري","رسوم التركيب","المندوب","نوع العقد"]
["احمد علي",50,6,5,"مجد","بيع"]
["محمد راغب",0,7,0,"علي","اجار"]
["سامي يوسف",60,6,0,"علي","بيع"]
["عبدالرحمن الهلالي",0,8,5,"مجد","اجار"]
["جمال ابوسليمان",70,5,5,"رامي","بيع"]

{"sheet":"الادخال","index":1,"n_rows":24,"n_cols":11,"rows_kept":24,"cut":false,"hidden":false,"merged":[]}
["اسم العميل ","الحركة","التاريخ","العدد","سعر الجهاز","الاشتراك الشهري","المندوب ","نوع العقد","رقم الجهاز","رقم المركبة ","ملاحظة"]
["احمد علي","اضافة","2019-01-01",1,{"$f":"IF($A2=\"\",\"\",INDEX(العملاء!B:B,MATCH(الادخال!$A2,العملاء!$A:$A,0)))","v":50},{"$f":"IF($A2=\"\",\"\",INDEX(العملاء!C:C,MATCH(الادخال!$A2,العملاء!$A:$A,0)))","v":6},{"$f":"IF($A2=\"\",\"\",INDEX(العملاء!E:E,MATCH(الادخال!$A2,العملاء!$A:$A,0)))","v":"مجد"},{"$f":"IF($A2=\"\",\"\",INDEX(العملاء!F:F,MATCH(الادخال!$A2,العملاء!$A:$A,0)))","v":"بيع"},"65582","17-125452","ككممننن"]
["احمد علي","اضافة","2019-01-01",1,{"$f":"IF($A3=\"\",\"\",INDEX(العملاء!B:B,MATCH(الادخال!$A3,العملاء!$A:$A,0)))","v":50},{"$f":"IF($A3=\"\",\"\",INDEX(العملاء!C:C,MATCH(الادخال!$A3,العملاء!$A:$A,0)))","v":6},{"$f":"IF($A3=\"\",\"\",INDEX(العملاء!E:E,MATCH(الادخال!$A3,العملاء!$A:$A,0)))","v":"مجد"},{"$f":"IF($A3=\"\",\"\",INDEX(العملاء!F:F,MATCH(الادخال!$A3,العملاء!$A:$A,0)))","v":"بيع"},"65982","17-125486","خهناتنلتات"]
["محمد راغب","اضافة","2019-01-01",1,{"$f":"IF($A4=\"\",\"\",INDEX(العملاء!B:B,MATCH(الادخال!$A4,العملاء!$A:$A,0)))","v":0},{"$f":"IF($A4=\"\",\"\",INDEX(العملاء!C:C,MATCH(الادخال!$A4,العملاء!$A:$A,0)))","v":7},{"$f":"IF($A4=\"\",\"\",INDEX(العملاء!E:E,MATCH(الادخال!$A4,العملاء!$A:$A,0)))","v":"علي"},{"$f":"IF($A4=\"\",\"\",INDEX(العملاء!F:F,MATCH(الادخال!$A4,العملاء!$A:$A,0)))","v":"اجار"},"65894","17-654525","نتاراار"]
["احمد علي","فك","2019-01-02",1,{"$f":"IF($A5=\"\",\"\",INDEX(العملاء!B:B,MATCH(الادخال!$A5,العملاء!$A:$A,0)))","v":50},{"$f":"IF($A5=\"\",\"\",INDEX(العملاء!C:C,MATCH(الادخال!$A5,العملاء!$A:$A,0)))","v":6},{"$f":"IF($A5=\"\",\"\",INDEX(العملاء!E:E,MATCH(الادخال!$A5,العملاء!$A:$A,0)))","v":"مجد"},{"$f":"IF($A5=\"\",\"\",INDEX(العملاء!F:F,MATCH(الادخال!$A5,العملاء!$A:$A,0)))","v":"بيع"}]
["محمد راغب","فك","2019-01-03",1,{"$f":"IF($A6=\"\",\"\",INDEX(العملاء!B:B,MATCH(الادخال!$A6,العملاء!$A:$A,0)))","v":0},{"$f":"IF($A6=\"\",\"\",INDEX(العملاء!C:C,MATCH(الادخال!$A6,العملاء!$A:$A,0)))","v":7},{"$f":"IF($A6=\"\",\"\",INDEX(العملاء!E:E,MATCH(الادخال!$A6,العملاء!$A:$A,0)))","v":"علي"},{"$f":"IF($A6=\"\",\"\",INDEX(العملاء!F:F,MATCH(الادخال!$A6,العملاء!$A:$A,0)))","v":"اجار"}]
["احمد علي","فك","2019-01-03",3,{"$f":"IF($A7=\"\",\"\",INDEX(العملاء!B:B,MATCH(الادخال!$A7,العملاء!$A:$A,0)))","v":50},{"$f":"IF($A7=\"\",\"\",INDEX(العملاء!C:C,MATCH(الادخال!$A7,العملاء!$A:$A,0)))","v":6},{"$f":"IF($A7=\"\",\"\",INDEX(العملاء!E:E,MATCH(الادخال!$A7,العملاء!$A:$A,0)))","v":"مجد"},{"$f":"IF($A7=\"\",\"\",INDEX(العملاء!F:F,MATCH(الادخال!$A7,العملاء!$A:$A,0)))","v":"بيع"}]
["سامي يوسف","فك","2019-01-03",1,{"$f":"IF($A8=\"\",\"\",INDEX(العملاء!B:B,MATCH(الادخال!$A8,العملاء!$A:$A,0)))","v":60},{"$f":"IF($A8=\"\",\"\",INDEX(العملاء!C:C,MATCH(الادخال!$A8,العملاء!$A:$A,0)))","v":6},{"$f":"IF($A8=\"\",\"\",INDEX(العملاء!E:E,MATCH(الادخال!$A8,العملاء!$A:$A,0)))","v":"علي"},{"$f":"IF($A8=\"\",\"\",INDEX(العملاء!F:F,MATCH(الادخال!$A8,العملاء!$A:$A,0)))","v":"بيع"}]
["سامي يوسف","فك","2019-01-03",1,{"$f":"IF($A9=\"\",\"\",INDEX(العملاء!B:B,MATCH(الادخال!$A9,العملاء!$A:$A,0)))","v":60},{"$f":"IF($A9=\"\",\"\",INDEX(العملاء!C:C,MATCH(الادخال!$A9,العملاء!$A:$A,0)))","v":6},{"$f":"IF($A9=\"\",\"\",INDEX(العملاء!E:E,MATCH(الادخال!$A9,العملاء!$A:$A,0)))","v":"علي"},{"$f":"IF($A9=\"\",\"\",INDEX(العملاء!F:F,MATCH(الادخال!$A9,العملاء!$A:$A,0)))","v":"بيع"}]
[null,null,null,null,{"$f":"IF($A10=\"\",\"\",INDEX(العملاء!B:B,MATCH(الادخال!$A10,العملاء!$A:$A,0)))","v":""},{"$f":"IF($A10=\"\",\"\",INDEX(العملاء!C:C,MATCH(الادخال!$A10,العملاء!$A:$A,0)))","v":""},{"$f":"IF($A10=\"\",\"\",INDEX(العملاء!E:E,MATCH(الادخال!$A10,العملاء!$A:$A,0)))","v":""},{"$f":"IF($A10=\"\",\"\",INDEX(العملاء!F:F,MATCH(الادخال!$A10,العملاء!$A:$A,0)))","v":""}]
[null,null,null,null,{"$f":"IF($A11=\"\",\"\",INDEX(العملاء!B:B,MATCH(الادخال!$A11,العملاء!$A:$A,0)))","v":""},{"$f":"IF($A11=\"\",\"\",INDEX(العملاء!C:C,MATCH(الادخال!$A11,العملاء!$A:$A,0)))","v":""},{"$f":"IF($A11=\"\",\"\",INDEX(العملاء!E:E,MATCH(الادخال!$A11,العملاء!$A:$A,0)))","v":""},{"$f":"IF($A11=\"\",\"\",INDEX(العملاء!F:F,MATCH(الادخال!$A11,العملاء!$A:$A,0)))","v":""}]
[null,null,null,null,{"$f":"IF($A12=\"\",\"\",INDEX(العملاء!B:B,MATCH(الادخال!$A12,العملاء!$A:$A,0)))","v":""},{"$f":"IF($A12=\"\",\"\",INDEX(العملاء!C:C,MATCH(الادخال!$A12,العملاء!$A:$A,0)))","v":""},{"$f":"IF($A12=\"\",\"\",INDEX(العملاء!E:E,MATCH(الادخال!$A12,العملاء!$A:$A,0)))","v":""},{"$f":"IF($A12=\"\",\"\",INDEX(العملاء!F:F,MATCH(الادخال!$A12,العملاء!$A:$A,0)))","v":""}]
[null,null,null,null,{"$f":"IF($A13=\"\",\"\",INDEX(العملاء!B:B,MATCH(الادخال!$A13,العملاء!$A:$A,0)))","v":""},{"$f":"IF($A13=\"\",\"\",INDEX(العملاء!C:C,MATCH(الادخال!$A13,العملاء!$A:$A,0)))","v":""},{"$f":"IF($A13=\"\",\"\",INDEX(العملاء!E:E,MATCH(الادخال!$A13,العملاء!$A:$A,0)))","v":""},{"$f":"IF($A13=\"\",\"\",INDEX(العملاء!F:F,MATCH(الادخال!$A13,العملاء!$A:$A,0)))","v":""}]
[null,null,null,null,{"$f":"IF($A14=\"\",\"\",INDEX(العملاء!B:B,MATCH(الادخال!$A14,العملاء!$A:$A,0)))","v":""},{"$f":"IF($A14=\"\",\"\",INDEX(العملاء!C:C,MATCH(الادخال!$A14,العملاء!$A:$A,0)))","v":""},{"$f":"IF($A14=\"\",\"\",INDEX(العملاء!E:E,MATCH(الادخال!$A14,العملاء!$A:$A,0)))","v":""},{"$f":"IF($A14=\"\",\"\",INDEX(العملاء!F:F,MATCH(الادخال!$A14,العملاء!$A:$A,0)))","v":""}]
[null,null,null,null,{"$f":"IF($A15=\"\",\"\",INDEX(العملاء!B:B,MATCH(الادخال!$A15,العملاء!$A:$A,0)))","v":""},{"$f":"IF($A15=\"\",\"\",INDEX(العملاء!C:C,MATCH(الادخال!$A15,العملاء!$A:$A,0)))","v":""},{"$f":"IF($A15=\"\",\"\",INDEX(العملاء!E:E,MATCH(الادخال!$A15,العملاء!$A:$A,0)))","v":""},{"$f":"IF($A15=\"\",\"\",INDEX(العملاء!F:F,MATCH(الادخال!$A15,العملاء!$A:$A,0)))","v":""}]
[null,null,null,null,{"$f":"IF($A16=\"\",\"\",INDEX(العملاء!B:B,MATCH(الادخال!$A16,العملاء!$A:$A,0)))","v":""},{"$f":"IF($A16=\"\",\"\",INDEX(العملاء!C:C,MATCH(الادخال!$A16,العملاء!$A:$A,0)))","v":""},{"$f":"IF($A16=\"\",\"\",INDEX(العملاء!E:E,MATCH(الادخال!$A16,العملاء!$A:$A,0)))","v":""},{"$f":"IF($A16=\"\",\"\",INDEX(العملاء!F:F,MATCH(الادخال!$A16,العملاء!$A:$A,0)))","v":""}]
[null,null,null,null,{"$f":"IF($A17=\"\",\"\",INDEX(العملاء!B:B,MATCH(الادخال!$A17,العملاء!$A:$A,0)))","v":""},{"$f":"IF($A17=\"\",\"\",INDEX(العملاء!C:C,MATCH(الادخال!$A17,العملاء!$A:$A,0)))","v":""},{"$f":"IF($A17=\"\",\"\",INDEX(العملاء!E:E,MATCH(الادخال!$A17,العملاء!$A:$A,0)))","v":""},{"$f":"IF($A17=\"\",\"\",INDEX(العملاء!F:F,MATCH(الادخال!$A17,العملاء!$A:$A,0)))","v":""}]
[null,null,null,null,{"$f":"IF($A18=\"\",\"\",INDEX(العملاء!B:B,MATCH(الادخال!$A18,العملاء!$A:$A,0)))","v":""},{"$f":"IF($A18=\"\",\"\",INDEX(العملاء!C:C,MATCH(الادخال!$A18,العملاء!$A:$A,0)))","v":""},{"$f":"IF($A18=\"\",\"\",INDEX(العملاء!E:E,MATCH(الادخال!$A18,العملاء!$A:$A,0)))","v":""},{"$f":"IF($A18=\"\",\"\",INDEX(العملاء!F:F,MATCH(الادخال!$A18,العملاء!$A:$A,0)))","v":""}]
[null,null,null,null,{"$f":"IF($A19=\"\",\"\",INDEX(العملاء!B:B,MATCH(الادخال!$A19,العملاء!$A:$A,0)))","v":""},{"$f":"IF($A19=\"\",\"\",INDEX(العملاء!C:C,MATCH(الادخال!$A19,العملاء!$A:$A,0)))","v":""},{"$f":"IF($A19=\"\",\"\",INDEX(العملاء!E:E,MATCH(الادخال!$A19,العملاء!$A:$A,0)))","v":""},{"$f":"IF($A19=\"\",\"\",INDEX(العملاء!F:F,MATCH(الادخال!$A19,العملاء!$A:$A,0)))","v":""}]
[null,null,null,null,{"$f":"IF($A20=\"\",\"\",INDEX(العملاء!B:B,MATCH(الادخال!$A20,العملاء!$A:$A,0)))","v":""},{"$f":"IF($A20=\"\",\"\",INDEX(العملاء!C:C,MATCH(الادخال!$A20,العملاء!$A:$A,0)))","v":""},{"$f":"IF($A20=\"\",\"\",INDEX(العملاء!E:E,MATCH(الادخال!$A20,العملاء!$A:$A,0)))","v":""},{"$f":"IF($A20=\"\",\"\",INDEX(العملاء!F:F,MATCH(الادخال!$A20,العملاء!$A:$A,0)))","v":""}]
[null,null,null,null,{"$f":"IF($A21=\"\",\"\",INDEX(العملاء!B:B,MATCH(الادخال!$A21,العملاء!$A:$A,0)))","v":""},{"$f":"IF($A21=\"\",\"\",INDEX(العملاء!C:C,MATCH(الادخال!$A21,العملاء!$A:$A,0)))","v":""},{"$f":"IF($A21=\"\",\"\",INDEX(العملاء!E:E,MATCH(الادخال!$A21,العملاء!$A:$A,0)))","v":""},{"$f":"IF($A21=\"\",\"\",INDEX(العملاء!F:F,MATCH(الادخال!$A21,العملاء!$A:$A,0)))","v":""}]
[null,null,null,null,{"$f":"IF($A22=\"\",\"\",INDEX(العملاء!B:B,MATCH(الادخال!$A22,العملاء!$A:$A,0)))","v":""},{"$f":"IF($A22=\"\",\"\",INDEX(العملاء!C:C,MATCH(الادخال!$A22,العملاء!$A:$A,0)))","v":""},{"$f":"IF($A22=\"\",\"\",INDEX(العملاء!E:E,MATCH(الادخال!$A22,العملاء!$A:$A,0)))","v":""},{"$f":"IF($A22=\"\",\"\",INDEX(العملاء!F:F,MATCH(الادخال!$A22,العملاء!$A:$A,0)))","v":""}]
[null,null,null,null,{"$f":"IF($A23=\"\",\"\",INDEX(العملاء!B:B,MATCH(الادخال!$A23,العملاء!$A:$A,0)))","v":""},{"$f":"IF($A23=\"\",\"\",INDEX(العملاء!C:C,MATCH(الادخال!$A23,العملاء!$A:$A,0)))","v":""},{"$f":"IF($A23=\"\",\"\",INDEX(العملاء!E:E,MATCH(الادخال!$A23,العملاء!$A:$A,0)))","v":""},{"$f":"IF($A23=\"\",\"\",INDEX(العملاء!F:F,MATCH(الادخال!$A23,العملاء!$A:$A,0)))","v":""}]
[null,null,null,null,{"$f":"IF($A24=\"\",\"\",INDEX(العملاء!B:B,MATCH(الادخال!$A24,العملاء!$A:$A,0)))","v":""},{"$f":"IF($A24=\"\",\"\",INDEX(العملاء!C:C,MATCH(الادخال!$A24,العملاء!$A:$A,0)))","v":""},{"$f":"IF($A24=\"\",\"\",INDEX(العملاء!E:E,MATCH(الادخال!$A24,العملاء!$A:$A,0)))","v":""},{"$f":"IF($A24=\"\",\"\",INDEX(العملاء!F:F,MATCH(الادخال!$A24,العملاء!$A:$A,0)))","v":""}]

{"sheet":"الحركة","index":2,"n_rows":300,"n_cols":6,"rows_kept":300,"cut":false,"hidden":false,"merged":[[0,5,1,5],[0,0,0,3]]}
[null,null,null,null,null,"الاجمالي"]
["اسم العميل",null,"التاريخ","رصيد الاضافات","رصيد الفك"]
["احمد علي","اضافة","2019-01-01",{"$f":"SUMIFS(الادخال!$D$2:$D$24,الادخال!$A$2:$A$24,الحركة!A3,الادخال!$C$2:$C$24,الحركة!C3,الادخال!$B$2:$B$24,الحركة!B3)","v":2},{"$f":"SUMIFS(الادخال!$D$2:$D$24,الادخال!$A$2:$A$24,الحركة!B3,الادخال!$C$2:$C$24,الحركة!D3,الادخال!$B$2:$B$24,الحركة!C3)","v":0},{"$f":"IF(A3=\"\",\"\",D3-E3)","v":2}]
["احمد علي","اضافة","2019-01-01",{"$f":"SUMIFS(الادخال!D3:D25,الادخال!A3:A25,الحركة!A4,الادخال!C3:C25,الحركة!C4,الادخال!B3:B25,الحركة!B4)","v":1},{"$f":"SUMIFS(الادخال!$D$2:$D$24,الادخال!$A$2:$A$24,الحركة!B4,الادخال!$C$2:$C$24,الحركة!D4,الادخال!$B$2:$B$24,الحركة!C4)","v":0},{"$f":"IF(A4=\"\",\"\",D4-E4)","v":1}]
["محمد راغب","اضافة","2019-01-01",{"$f":"SUMIFS(الادخال!D4:D26,الادخال!A4:A26,الحركة!A5,الادخال!C4:C26,الحركة!C5,الادخال!B4:B26,الحركة!B5)","v":1},{"$f":"SUMIFS(الادخال!$D$2:$D$24,الادخال!$A$2:$A$24,الحركة!B5,الادخال!$C$2:$C$24,الحركة!D5,الادخال!$B$2:$B$24,الحركة!C5)","v":0},{"$f":"IF(A5=\"\",\"\",D5-E5)","v":1}]
["احمد علي","فك","2019-01-02",{"$f":"SUMIFS(الادخال!D5:D27,الادخال!A5:A27,الحركة!A6,الادخال!C5:C27,الحركة!C6,الادخال!B5:B27,الحركة!B6)","v":1},{"$f":"SUMIFS(الادخال!$D$2:$D$24,الادخال!$A$2:$A$24,الحركة!B6,الادخال!$C$2:$C$24,الحركة!D6,الادخال!$B$2:$B$24,الحركة!C6)","v":0},{"$f":"IF(A6=\"\",\"\",D6-E6)","v":1}]
["محمد راغب","فك","2019-01-03",{"$f":"SUMIFS(الادخال!D6:D28,الادخال!A6:A28,الحركة!A7,الادخال!C6:C28,الحركة!C7,الادخال!B6:B28,الحركة!B7)","v":1},{"$f":"SUMIFS(الادخال!$D$2:$D$24,الادخال!$A$2:$A$24,الحركة!B7,الادخال!$C$2:$C$24,الحركة!D7,الادخال!$B$2:$B$24,الحركة!C7)","v":0},{"$f":"IF(A7=\"\",\"\",D7-E7)","v":1}]
["احمد علي","فك","2019-01-03",{"$f":"SUMIFS(الادخال!D7:D29,الادخال!A7:A29,الحركة!A8,الادخال!C7:C29,الحركة!C8,الادخال!B7:B29,الحركة!B8)","v":3},{"$f":"SUMIFS(الادخال!$D$2:$D$24,الادخال!$A$2:$A$24,الحركة!B8,الادخال!$C$2:$C$24,الحركة!D8,الادخال!$B$2:$B$24,الحركة!C8)","v":0},{"$f":"IF(A8=\"\",\"\",D8-E8)","v":3}]
["سامي يوسف","فك","2019-01-03",{"$f":"SUMIFS(الادخال!D8:D30,الادخال!A8:A30,الحركة!A9,الادخال!C8:C30,الحركة!C9,الادخال!B8:B30,الحركة!B9)","v":2},{"$f":"SUMIFS(الادخال!$D$2:$D$24,الادخال!$A$2:$A$24,الحركة!B9,الادخال!$C$2:$C$24,الحركة!D9,الادخال!$B$2:$B$24,الحركة!C9)","v":0},2]
["سامي يوسف","فك","2019-01-03",{"$f":"SUMIFS(الادخال!D9:D31,الادخال!A9:A31,الحركة!A10,الادخال!C9:C31,الحركة!C10,الادخال!B9:B31,الحركة!B10)","v":1},{"$f":"SUMIFS(الادخال!$D$2:$D$24,الادخال!$A$2:$A$24,الحركة!B10,الادخال!$C$2:$C$24,الحركة!D10,الادخال!$B$2:$B$24,الحركة!C10)","v":0},1]
[null,null,null,{"$f":"SUMIFS(الادخال!D10:D32,الادخال!A10:A32,الحركة!A11,الادخال!C10:C32,الحركة!C11,الادخال!B10:B32,الحركة!B11)","v":0},{"$f":"SUMIFS(الادخال!$D$2:$D$24,الادخال!$A$2:$A$24,الحركة!B11,الادخال!$C$2:$C$24,الحركة!D11,الادخال!$B$2:$B$24,الحركة!C11)","v":0},""]
[null,null,null,{"$f":"SUMIFS(الادخال!D11:D33,الادخال!A11:A33,الحركة!A12,الادخال!C11:C33,الحركة!C12,الادخال!B11:B33,الحركة!B12)","v":0},{"$f":"SUMIFS(الادخال!$D$2:$D$24,الادخال!$A$2:$A$24,الحركة!B12,الادخال!$C$2:$C$24,الحركة!D12,الادخال!$B$2:$B$24,الحركة!C12)","v":0},""]
[null,null,null,{"$f":"SUMIFS(الادخال!D12:D34,الادخال!A12:A34,الحركة!A13,الادخال!C12:C34,الحركة!C13,الادخال!B12:B34,الحركة!B13)","v":0},{"$f":"SUMIFS(الادخال!$D$2:$D$24,الادخال!$A$2:$A$24,الحركة!B13,الادخال!$C$2:$C$24,الحركة!D13,الادخال!$B$2:$B$24,الحركة!C13)","v":0},""]
[null,null,null,{"$f":"SUMIFS(الادخال!D13:D35,الادخال!A13:A35,الحركة!A14,الادخال!C13:C35,الحركة!C14,الادخال!B13:B35,الحركة!B14)","v":0},{"$f":"SUMIFS(الادخال!$D$2:$D$24,الادخال!$A$2:$A$24,الحركة!B14,الادخال!$C$2:$C$24,الحركة!D14,الادخال!$B$2:$B$24,الحركة!C14)","v":0},""]
[null,null,null,{"$f":"SUMIFS(الادخال!D14:D36,الادخال!A14:A36,الحركة!A15,الادخال!C14:C36,الحركة!C15,الادخال!B14:B36,الحركة!B15)","v":0},{"$f":"SUMIFS(الادخال!$D$2:$D$24,الادخال!$A$2:$A$24,الحركة!B15,الادخال!$C$2:$C$24,الحركة!D15,الادخال!$B$2:$B$24,الحركة!C15)","v":0},""]
[null,null,null,{"$f":"SUMIFS(الادخال!D15:D37,الادخال!A15:A37,الحركة!A16,الادخال!C15:C37,الحركة!C16,الادخال!B15:B37,الحركة!B16)","v":0},{"$f":"SUMIFS(الادخال!$D$2:$D$24,الادخال!$A$2:$A$24,الحركة!B16,الادخال!$C$2:$C$24,الحركة!D16,الادخال!$B$2:$B$24,الحركة!C16)","v":0},""]
[null,null,null,{"$f":"SUMIFS(الادخال!D16:D38,الادخال!A16:A38,الحركة!A17,الادخال!C16:C38,الحركة!C17,الادخال!B16:B38,الحركة!B17)","v":0},{"$f":"SUMIFS(الادخال!$D$2:$D$24,الادخال!$A$2:$A$24,الحركة!B17,الادخال!$C$2:$C$24,الحركة!D17,الادخال!$B$2:$B$24,الحركة!C17)","v":0},""]
[null,null,null,{"$f":"SUMIFS(الادخال!D17:D39,الادخال!A17:A39,الحركة!A18,الادخال!C17:C39,الحركة!C18,الادخال!B17:B39,الحركة!B18)","v":0},{"$f":"SUMIFS(الادخال!$D$2:$D$24,الادخال!$A$2:$A$24,الحركة!B18,الادخال!$C$2:$C$24,الحركة!D18,الادخال!$B$2:$B$24,الحركة!C18)","v":0},""]
[null,null,null,{"$f":"SUMIFS(الادخال!D18:D40,الادخال!A18:A40,الحركة!A19,الادخال!C18:C40,الحركة!C19,الادخال!B18:B40,الحركة!B19)","v":0},{"$f":"SUMIFS(الادخال!$D$2:$D$24,الادخال!$A$2:$A$24,الحركة!B19,الادخال!$C$2:$C$24,الحركة!D19,الادخال!$B$2:$B$24,الحركة!C19)","v":0},""]
[null,null,null,{"$f":"SUMIFS(الادخال!D19:D41,الادخال!A19:A41,الحركة!A20,الادخال!C19:C41,الحركة!C20,الادخال!B19:B41,الحركة!B20)","v":0},{"$f":"SUMIFS(الادخال!$D$2:$D$24,الادخال!$A$2:$A$24,الحركة!B20,الادخال!$C$2:$C$24,الحركة!D20,الادخال!$B$2:$B$24,الحركة!C20)","v":0},""]
[null,null,null,{"$f":"SUMIFS(الادخال!D20:D42,الادخال!A20:A42,الحركة!A21,الادخال!C20:C42,الحركة!C21,الادخال!B20:B42,الحركة!B21)","v":0},{"$f":"SUMIFS(الادخال!$D$2:$D$24,الادخال!$A$2:$A$24,الحركة!B21,الادخال!$C$2:$C$24,الحركة!D21,الادخال!$B$2:$B$24,الحركة!C21)","v":0},""]
[null,null,null,{"$f":"SUMIFS(الادخال!D21:D43,الادخال!A21:A43,الحركة!A22,الادخال!C21:C43,الحركة!C22,الادخال!B21:B43,الحركة!B22)","v":0},{"$f":"SUMIFS(الادخال!$D$2:$D$24,الادخال!$A$2:$A$24,الحركة!B22,الادخال!$C$2:$C$24,الحركة!D22,الادخال!$B$2:$B$24,الحركة!C22)","v":0},""]
[null,null,null,{"$f":"SUMIFS(الادخال!D22:D44,الادخال!A22:A44,الحركة!A23,الادخال!C22:C44,الحركة!C23,الادخال!B22:B44,الحركة!B23)","v":0},{"$f":"SUMIFS(الادخال!$D$2:$D$24,الادخال!$A$2:$A$24,الحركة!B23,الادخال!$C$2:$C$24,الحركة!D23,الادخال!$B$2:$B$24,الحركة!C23)","v":0},""]
[null,null,null,{"$f":"SUMIFS(الادخال!D23:D45,الادخال!A23:A45,الحركة!A24,الادخال!C23:C45,الحركة!C24,الادخال!B23:B45,الحركة!B24)","v":0},{"$f":"SUMIFS(الادخال!$D$2:$D$24,الادخال!$A$2:$A$24,الحركة!B24,الادخال!$C$2:$C$24,الحركة!D24,الادخال!$B$2:$B$24,الحركة!C24)","v":0},""]
[null,null,null,{"$f":"SUMIFS(الادخال!D24:D46,الادخال!A24:A46,الحركة!A25,الادخال!C24:C46,الحركة!C25,الادخال!B24:B46,الحركة!B25)","v":0},{"$f":"SUMIFS(الادخال!$D$2:$D$24,الادخال!$A$2:$A$24,الحركة!B25,الادخال!$C$2:$C$24,الحركة!D25,الادخال!$B$2:$B$24,الحركة!C25)","v":0},""]
[null,null,null,{"$f":"IF(A26=\"\",\"\",SUMIF($C$2:$C$2,\"العدد\",C26:C26))","v":""},{"$f":"IF(A26=\"\",\"\",SUMIF(#REF!,\"العدد\",#REF!))","v":""},{"$f":"IF(A26=\"\",\"\",D26-E26)","v":""}]
[null,null,null,{"$f":"IF(A27=\"\",\"\",SUMIF($C$2:$C$2,\"العدد\",C27:C27))","v":""},{"$f":"IF(A27=\"\",\"\",SUMIF(#REF!,\"العدد\",#REF!))","v":""},{"$f":"IF(A27=\"\",\"\",D27-E27)","v":""}]
[null,null,null,{"$f":"IF(A28=\"\",\"\",SUMIF($C$2:$C$2,\"العدد\",C28:C28))","v":""},{"$f":"IF(A28=\"\",\"\",SUMIF(#REF!,\"العدد\",#REF!))","v":""},{"$f":"IF(A28=\"\",\"\",D28-E28)","v":""}]
[null,null,null,{"$f":"IF(A29=\"\",\"\",SUMIF($C$2:$C$2,\"العدد\",C29:C29))","v":""},{"$f":"IF(A29=\"\",\"\",SUMIF(#REF!,\"العدد\",#REF!))","v":""},{"$f":"IF(A29=\"\",\"\",D29-E29)","v":""}]
[null,null,null,{"$f":"IF(A30=\"\",\"\",SUMIF($C$2:$C$2,\"العدد\",C30:C30))","v":""},{"$f":"IF(A30=\"\",\"\",SUMIF(#REF!,\"العدد\",#REF!))","v":""},{"$f":"IF(A30=\"\",\"\",D30-E30)","v":""}]
[null,null,null,{"$f":"IF(A31=\"\",\"\",SUMIF($C$2:$C$2,\"العدد\",C31:C31))","v":""},{"$f":"IF(A31=\"\",\"\",SUMIF(#REF!,\"العدد\",#REF!))","v":""},{"$f":"IF(A31=\"\",\"\",D31-E31)","v":""}]
[null,null,null,{"$f":"IF(A32=\"\",\"\",SUMIF($C$2:$C$2,\"العدد\",C32:C32))","v":""},{"$f":"IF(A32=\"\",\"\",SUMIF(#REF!,\"العدد\",#REF!))","v":""},{"$f":"IF(A32=\"\",\"\",D32-E32)","v":""}]
[null,null,null,{"$f":"IF(A33=\"\",\"\",SUMIF($C$2:$C$2,\"العدد\",C33:C33))","v":""},{"$f":"IF(A33=\"\",\"\",SUMIF(#REF!,\"العدد\",#REF!))","v":""},{"$f":"IF(A33=\"\",\"\",D33-E33)","v":""}]
[null,null,null,{"$f":"IF(A34=\"\",\"\",SUMIF($C$2:$C$2,\"العدد\",C34:C34))","v":""},{"$f":"IF(A34=\"\",\"\",SUMIF(#REF!,\"العدد\",#REF!))","v":""},{"$f":"IF(A34=\"\",\"\",D34-E34)","v":""}]
[null,null,null,{"$f":"IF(A35=\"\",\"\",SUMIF($C$2:$C$2,\"العدد\",C35:C35))","v":""},{"$f":"IF(A35=\"\",\"\",SUMIF(#REF!,\"العدد\",#REF!))","v":""},{"$f":"IF(A35=\"\",\"\",D35-E35)","v":""}]
[null,null,null,{"$f":"IF(A36=\"\",\"\",SUMIF($C$2:$C$2,\"العدد\",C36:C36))","v":""},{"$f":"IF(A36=\"\",\"\",SUMIF(#REF!,\"العدد\",#REF!))","v":""},{"$f":"IF(A36=\"\",\"\",D36-E36)","v":""}]
[null,null,null,{"$f":"IF(A37=\"\",\"\",SUMIF($C$2:$C$2,\"العدد\",C37:C37))","v":""},{"$f":"IF(A37=\"\",\"\",SUMIF(#REF!,\"العدد\",#REF!))","v":""},{"$f":"IF(A37=\"\",\"\",D37-E37)","v":""}]
[null,null,null,{"$f":"IF(A38=\"\",\"\",SUMIF($C$2:$C$2,\"العدد\",C38:C38))","v":""},{"$f":"IF(A38=\"\",\"\",SUMIF(#REF!,\"العدد\",#REF!))","v":""},{"$f":"IF(A38=\"\",\"\",D38-E38)","v":""}]
[null,null,null,{"$f":"IF(A39=\"\",\"\",SUMIF($C$2:$C$2,\"العدد\",C39:C39))","v":""},{"$f":"IF(A39=\"\",\"\",SUMIF(#REF!,\"العدد\",#REF!))","v":""},{"$f":"IF(A39=\"\",\"\",D39-E39)","v":""}]
[null,null,null,{"$f":"IF(A40=\"\",\"\",SUMIF($C$2:$C$2,\"العدد\",C40:C40))","v":""},{"$f":"IF(A40=\"\",\"\",SUMIF(#REF!,\"العدد\",#REF!))","v":""},{"$f":"IF(A40=\"\",\"\",D40-E40)","v":""}]
[null,null,null,{"$f":"IF(A41=\"\",\"\",SUMIF($C$2:$C$2,\"العدد\",C41:C41))","v":""},{"$f":"IF(A41=\"\",\"\",SUMIF(#REF!,\"العدد\",#REF!))","v":""},{"$f":"IF(A41=\"\",\"\",D41-E41)","v":""}]
[null,null,null,{"$f":"IF(A42=\"\",\"\",SUMIF($C$2:$C$2,\"العدد\",C42:C42))","v":""},{"$f":"IF(A42=\"\",\"\",SUMIF(#REF!,\"العدد\",#REF!))","v":""},{"$f":"IF(A42=\"\",\"\",D42-E42)","v":""}]
[null,null,null,{"$f":"IF(A43=\"\",\"\",SUMIF($C$2:$C$2,\"العدد\",C43:C43))","v":""},{"$f":"IF(A43=\"\",\"\",SUMIF(#REF!,\"العدد\",#REF!))","v":""},{"$f":"IF(A43=\"\",\"\",D43-E43)","v":""}]
[null,null,null,{"$f":"IF(A44=\"\",\"\",SUMIF($C$2:$C$2,\"العدد\",C44:C44))","v":""},{"$f":"IF(A44=\"\",\"\",SUMIF(#REF!,\"العدد\",#REF!))","v":""},{"$f":"IF(A44=\"\",\"\",D44-E44)","v":""}]
[null,null,null,{"$f":"IF(A45=\"\",\"\",SUMIF($C$2:$C$2,\"العدد\",C45:C45))","v":""},{"$f":"IF(A45=\"\",\"\",SUMIF(#REF!,\"العدد\",#REF!))","v":""},{"$f":"IF(A45=\"\",\"\",D45-E45)","v":""}]
[null,null,null,{"$f":"IF(A46=\"\",\"\",SUMIF($C$2:$C$2,\"العدد\",C46:C46))","v":""},{"$f":"IF(A46=\"\",\"\",SUMIF(#REF!,\"العدد\",#REF!))","v":""},{"$f":"IF(A46=\"\",\"\",D46-E46)","v":""}]
[null,null,null,{"$f":"IF(A47=\"\",\"\",SUMIF($C$2:$C$2,\"العدد\",C47:C47))","v":""},{"$f":"IF(A47=\"\",\"\",SUMIF(#REF!,\"العدد\",#REF!))","v":""},{"$f":"IF(A47=\"\",\"\",D47-E47)","v":""}]
[null,null,null,{"$f":"IF(A48=\"\",\"\",SUMIF($C$2:$C$2,\"العدد\",C48:C48))","v":""},{"$f":"IF(A48=\"\",\"\",SUMIF(#REF!,\"العدد\",#REF!))","v":""},{"$f":"IF(A48=\"\",\"\",D48-E48)","v":""}]
[null,null,null,{"$f":"IF(A49=\"\",\"\",SUMIF($C$2:$C$2,\"العدد\",C49:C49))","v":""},{"$f":"IF(A49=\"\",\"\",SUMIF(#REF!,\"العدد\",#REF!))","v":""},{"$f":"IF(A49=\"\",\"\",D49-E49)","v":""}]
[null,null,null,{"$f":"IF(A50=\"\",\"\",SUMIF($C$2:$C$2,\"العدد\",C50:C50))","v":""},{"$f":"IF(A50=\"\",\"\",SUMIF(#REF!,\"العدد\",#REF!))","v":""},{"$f":"IF(A50=\"\",\"\",D50-E50)","v":""}]
[null,null,null,{"$f":"IF(A51=\"\",\"\",SUMIF($C$2:$C$2,\"العدد\",C51:C51))","v":""},{"$f":"IF(A51=\"\",\"\",SUMIF(#REF!,\"العدد\",#REF!))","v":""},{"$f":"IF(A51=\"\",\"\",D51-E51)","v":""}]
[null,null,null,{"$f":"IF(A52=\"\",\"\",SUMIF($C$2:$C$2,\"العدد\",C52:C52))","v":""},{"$f":"IF(A52=\"\",\"\",SUMIF(#REF!,\"العدد\",#REF!))","v":""},{"$f":"IF(A52=\"\",\"\",D52-E52)","v":""}]
[null,null,null,{"$f":"IF(A53=\"\",\"\",SUMIF($C$2:$C$2,\"العدد\",C53:C53))","v":""},{"$f":"IF(A53=\"\",\"\",SUMIF(#REF!,\"العدد\",#REF!))","v":""},{"$f":"IF(A53=\"\",\"\",D53-E53)","v":""}]
[null,null,null,{"$f":"IF(A54=\"\",\"\",SUMIF($C$2:$C$2,\"العدد\",C54:C54))","v":""},{"$f":"IF(A54=\"\",\"\",SUMIF(#REF!,\"العدد\",#REF!))","v":""},{"$f":"IF(A54=\"\",\"\",D54-E54)","v":""}]
[null,null,null,{"$f":"IF(A55=\"\",\"\",SUMIF($C$2:$C$2,\"العدد\",C55:C55))","v":""},{"$f":"IF(A55=\"\",\"\",SUMIF(#REF!,\"العدد\",#REF!))","v":""},{"$f":"IF(A55=\"\",\"\",D55-E55)","v":""}]
[null,null,null,{"$f":"IF(A56=\"\",\"\",SUMIF($C$2:$C$2,\"العدد\",C56:C56))","v":""},{"$f":"IF(A56=\"\",\"\",SUMIF(#REF!,\"العدد\",#REF!))","v":""},{"$f":"IF(A56=\"\",\"\",D56-E56)","v":""}]
[null,null,null,{"$f":"IF(A57=\"\",\"\",SUMIF($C$2:$C$2,\"العدد\",C57:C57))","v":""},{"$f":"IF(A57=\"\",\"\",SUMIF(#REF!,\"العدد\",#REF!))","v":""},{"$f":"IF(A57=\"\",\"\",D57-E57)","v":""}]
[null,null,null,{"$f":"IF(A58=\"\",\"\",SUMIF($C$2:$C$2,\"العدد\",C58:C58))","v":""},{"$f":"IF(A58=\"\",\"\",SUMIF(#REF!,\"العدد\",#REF!))","v":""},{"$f":"IF(A58=\"\",\"\",D58-E58)","v":""}]
[null,null,null,{"$f":"IF(A59=\"\",\"\",SUMIF($C$2:$C$2,\"العدد\",C59:C59))","v":""},{"$f":"IF(A59=\"\",\"\",SUMIF(#REF!,\"العدد\",#REF!))","v":""},{"$f":"IF(A59=\"\",\"\",D59-E59)","v":""}]
[null,null,null,{"$f":"IF(A60=\"\",\"\",SUMIF($C$2:$C$2,\"العدد\",C60:C60))","v":""},{"$f":"IF(A60=\"\",\"\",SUMIF(#REF!,\"العدد\",#REF!))","v":""},{"$f":"IF(A60=\"\",\"\",D60-E60)","v":""}]
{"$rows_left_out":240}