{"text_format":"1","workbook":"xlsx","n_sheets":2,"sheets":["Sheet1","Search"],"not_rendered":{"charts":0,"images":0,"macros":0,"external_links":0,"defined_names":1,"comments":0,"pivot_tables":0},"unopened":[],"bounds":{"document_bytes":16777216,"sheet_cells":100000,"rows_first":2000,"rows_last":500,"rows_between":2000,"halvings":0,"cell_chars":16384,"cell_head_chars":4096},"cells_cut":0,"cells_raw":0,"read":"whole","date_system":"1900"}

{"sheet":"Sheet1","index":0,"n_rows":22,"n_cols":7,"rows_kept":22,"cut":false,"hidden":false,"merged":[]}
[]
["م","رقم الموظف","الاسم","العمر","المؤهل","الجنس","الحالة الاجتماعية"]
[1,100,"محمد عبدالله عمر احمد رويس",22,"جامعي","ذكر","عازب"]
[2,116,"حسام حبيب هائل محمد",34,"جامعي","ذكر","متزوج"]
[3,101,"محسن عارف صالح ",22,"جامعي","ذكر","عازب"]
[4,110,"ادهم علي ناجي العماري",32,"جامعي","ذكر","عازب"]
[5,104,"بندر علي عسكر علي ",23,"ثانوي","ذكر","عازب"]
[6,105,"اسلام حسين محمد حسن ",23,"ثانوي","ذكر","عازب"]
[7,117,"انيس احمد عبداللاه عوض",44,"ثانوي","ذكر","متزوج"]
[8,113,"أنس أحمد عبداللاه ",33,"ثانوي","ذكر","متزوج"]
[9,114,"احمد صبري محمد سعيد",33,"متوسط","ذكر","متزوج"]
[10,106,"أحمد صبري محمد سعيد",23,"متوسط","ذكر","عازب"]
[11,102,"حمزة ناصر سالم حسين",22,"متوسط","ذكر","عازب"]
[12,107,"فارس محمد علي الشعيبي",23,"جامعي","ذكر","عازب"]
[13,111,"صالح صالح أحمد مثنى ",32,"جامعي","ذكر","متزوج"]
[14,109,"فضل صالح مقبل",24,"جامعي","ذكر","عازب"]
[15,119,"احمد امين محمد علي",53,"جامعي","ذكر","متزوج"]
[16,103,"بلال قائد عبدالوهاب",22,"متوسط","ذكر","عازب"]
[17,115,"وليد منيف عبدالرقيب فتح",33,"ثانوي","ذكر","متزوج"]
[18,112,"موسى عمر موسى ناجي ",32,"جامعي","ذكر","متزوج"]
[19,108,"عمر فهمي عبدالله عزعزي",23,"جامعي","ذكر","عازب"]
[20,118,"محمود عبدالرزاق محمود جبريل ",44,"جامعي","ذكر","متزوج"]

{"sheet":"Search","index":1,"n_rows":17,"n_cols":10,"rows_kept":17,"cut":false,"hidden":false,"merged":[[3,9,3,13]]}
[]
[null,null,null,null,null,109]
["م","رقم الموظف","الاسم","العمر","المؤهل","الجنس","الحالة الاجتماعية"]
[{"$f":"IFERROR(INDEX(Sheet1!$A$3:$A$10000,SMALL(IFERROR(IF(--(ISNUMBER(FIND(MID($F$2,1,3),Sheet1!$B$3:$B$10000))),ROW($A3:$A$10000)-ROW($A$3)+1),\"\"),ROWS($A$1:A1))),\"\")","v":14},{"$f":"IFERROR(INDEX(Sheet1!$B$3:$B$10000,SMALL(IFERROR(IF(--(ISNUMBER(FIND(MID($F$2,1,3),Sheet1!$B$3:$B$10000))),ROW($A3:$A$10000)-ROW($A$3)+1),\"\"),ROWS($A$1:B1))),\"\")","v":109},{"$f":"IFERROR(INDEX(Sheet1!C$3:$C$10000,SMALL(IFERROR(IF(--(ISNUMBER(FIND(MID($F$2,1,3),Sheet1!$B$3:$B$10000))),ROW($A3:$A$10000)-ROW($A$3)+1),\"\"),ROWS($A$1:C1))),\"\")","v":"فضل صالح مقبل"},{"$f":"IFERROR(INDEX(Sheet1!$D$3:$D$10000,SMALL(IFERROR(IF(--(ISNUMBER(FIND(MID($F$2,1,3),Sheet1!$B$3:$B$10000))),ROW($A3:$A$10000)-ROW($A$3)+1),\"\"),ROWS($A$1:D1))),\"\")","v":24},{"$f":"IFERROR(INDEX(Sheet1!$E$3:$E$10000,SMALL(IFERROR(IF(--(ISNUMBER(FIND(MID($F$2,1,3),Sheet1!$B$3:$B$10000))),ROW($A3:$A$10000)-ROW($A$3)+1),\"\"),ROWS($A$1:E1))),\"\")","v":"جامعي"},{"$f":"IFERROR(INDEX(Sheet1!$F$3:$F$10000,SMALL(IFERROR(IF(--(ISNUMBER(FIND(MID($F$2,1,3),Sheet1!$B$3:$B$10000))),ROW($A3:$A$10000)-ROW($A$3)+1),\"\"),ROWS($A$1:F1))),\"\")","v":"ذكر"},{"$f":"IFERROR(INDEX(Sheet1!$G$3:$G$10000,SMALL(IFERROR(IF(--(ISNUMBER(FIND(MID($F$2,1,3),Sheet1!$B$3:$B$10000))),ROW($A3:$A$10000)-ROW($A$3)+1),\"\"),ROWS($A$1:G1))),\"\")","v":"عازب"},null,null,"اختر من هذه القائمة"]
[{"$f":"IFERROR(INDEX(Sheet1!$A$3:$A$10000,SMALL(IFERROR(IF(--(ISNUMBER(FIND(MID($F$2,1,3),Sheet1!$B$3:$B$10000))),ROW($A4:$A$10000)-ROW($A$3)+1),\"\"),ROWS($A$1:A2))),\"\")","v":""},{"$f":"IFERROR(INDEX(Sheet1!$B$3:$B$10000,SMALL(IFERROR(IF(--(ISNUMBER(FIND(MID($F$2,1,3),Sheet1!$B$3:$B$10000))),ROW($A4:$A$10000)-ROW($A$3)+1),\"\"),ROWS($A$1:B2))),\"\")","v":""},{"$f":"IFERROR(INDEX(Sheet1!C$3:$C$10000,SMALL(IFERROR(IF(--(ISNUMBER(FIND(MID($F$2,1,3),Sheet1!$B$3:$B$10000))),ROW($A4:$A$10000)-ROW($A$3)+1),\"\"),ROWS($A$1:C2))),\"\")","v":""},{"$f":"IFERROR(INDEX(Sheet1!$D$3:$D$10000,SMALL(IFERROR(IF(--(ISNUMBER(FIND(MID($F$2,1,3),Sheet1!$B$3:$B$10000))),ROW($A4:$A$10000)-ROW($A$3)+1),\"\"),ROWS($A$1:D2))),\"\")","v":""},{"$f":"IFERROR(INDEX(Sheet1!$E$3:$E$10000,SMALL(IFERROR(IF(--(ISNUMBER(FIND(MID($F$2,1,3),Sheet1!$B$3:$B$10000))),ROW($A4:$A$10000)-ROW($A$3)+1),\"\"),ROWS($A$1:E2))),\"\")","v":""},{"$f":"IFERROR(INDEX(Sheet1!$F$3:$F$10000,SMALL(IFERROR(IF(--(ISNUMBER(FIND(MID($F$2,1,3),Sheet1!$B$3:$B$10000))),ROW($A4:$A$10000)-ROW($A$3)+1),\"\"),ROWS($A$1:F2))),\"\")","v":""},{"$f":"IFERROR(INDEX(Sheet1!$G$3:$G$10000,SMALL(IFERROR(IF(--(ISNUMBER(FIND(MID($F$2,1,3),Sheet1!$B$3:$B$10000))),ROW($A4:$A$10000)-ROW($A$3)+1),\"\"),ROWS($A$1:G2))),\"\")","v":""}]
[{"$f":"IFERROR(INDEX(Sheet1!$A$3:$A$10000,SMALL(IFERROR(IF(--(ISNUMBER(FIND(MID($F$2,1,3),Sheet1!$B$3:$B$10000))),ROW($A5:$A$10000)-ROW($A$3)+1),\"\"),ROWS($A$1:A3))),\"\")","v":""},{"$f":"IFERROR(INDEX(Sheet1!$B$3:$B$10000,SMALL(IFERROR(IF(--(ISNUMBER(FIND(MID($F$2,1,3),Sheet1!$B$3:$B$10000))),ROW($A5:$A$10000)-ROW($A$3)+1),\"\"),ROWS($A$1:B3))),\"\")","v":""},{"$f":"IFERROR(INDEX(Sheet1!C$3:$C$10000,SMALL(IFERROR(IF(--(ISNUMBER(FIND(MID($F$2,1,3),Sheet1!$B$3:$B$10000))),ROW($A5:$A$10000)-ROW($A$3)+1),\"\"),ROWS($A$1:C3))),\"\")","v":""},{"$f":"IFERROR(INDEX(Sheet1!$D$3:$D$10000,SMALL(IFERROR(IF(--(ISNUMBER(FIND(MID($F$2,1,3),Sheet1!$B$3:$B$10000))),ROW($A5:$A$10000)-ROW($A$3)+1),\"\"),ROWS($A$1:D3))),\"\")","v":""},{"$f":"IFERROR(INDEX(Sheet1!$E$3:$E$10000,SMALL(IFERROR(IF(--(ISNUMBER(FIND(MID($F$2,1,3),Sheet1!$B$3:$B$10000))),ROW($A5:$A$10000)-ROW($A$3)+1),\"\"),ROWS($A$1:E3))),\"\")","v":""},{"$f":"IFERROR(INDEX(Sheet1!$F$3:$F$10000,SMALL(IFERROR(IF(--(ISNUMBER(FIND(MID($F$2,1,3),Sheet1!$B$3:$B$10000))),ROW($A5:$A$10000)-ROW($A$3)+1),\"\"),ROWS($A$1:F3))),\"\")","v":""},{"$f":"IFERROR(INDEX(Sheet1!$G$3:$G$10000,SMALL(IFERROR(IF(--(ISNUMBER(FIND(MID($F$2,1,3),Sheet1!$B$3:$B$10000))),ROW($A5:$A$10000)-ROW($A$3)+1),\"\"),ROWS($A$1:G3))),\"\")","v":""}]
[{"$f":"IFERROR(INDEX(Sheet1!$A$3:$A$10000,SMALL(IFERROR(IF(--(ISNUMBER(FIND(MID($F$2,1,3),Sheet1!$B$3:$B$10000))),ROW($A6:$A$10000)-ROW($A$3)+1),\"\"),ROWS($A$1:A4))),\"\")","v":""},{"$f":"IFERROR(INDEX(Sheet1!$B$3:$B$10000,SMALL(IFERROR(IF(--(ISNUMBER(FIND(MID($F$2,1,3),Sheet1!$B$3:$B$10000))),ROW($A6:$A$10000)-ROW($A$3)+1),\"\"),ROWS($A$1:B4))),\"\")","v":""},{"$f":"IFERROR(INDEX(Sheet1!C$3:$C$10000,SMALL(IFERROR(IF(--(ISNUMBER(FIND(MID($F$2,1,3),Sheet1!$B$3:$B$10000))),ROW($A6:$A$10000)-ROW($A$3)+1),\"\"),ROWS($A$1:C4))),\"\")","v":""},{"$f":"IFERROR(INDEX(Sheet1!$D$3:$D$10000,SMALL(IFERROR(IF(--(ISNUMBER(FIND(MID($F$2,1,3),Sheet1!$B$3:$B$10000))),ROW($A6:$A$10000)-ROW($A$3)+1),\"\"),ROWS($A$1:D4))),\"\")","v":""},{"$f":"IFERROR(INDEX(Sheet1!$E$3:$E$10000,SMALL(IFERROR(IF(--(ISNUMBER(FIND(MID($F$2,1,3),Sheet1!$B$3:$B$10000))),ROW($A6:$A$10000)-ROW($A$3)+1),\"\"),ROWS($A$1:E4))),\"\")","v":""},{"$f":"IFERROR(INDEX(Sheet1!$F$3:$F$10000,SMALL(IFERROR(IF(--(ISNUMBER(FIND(MID($F$2,1,3),Sheet1!$B$3:$B$10000))),ROW($A6:$A$10000)-ROW($A$3)+1),\"\"),ROWS($A$1:F4))),\"\")","v":""},{"$f":"IFERROR(INDEX(Sheet1!$G$3:$G$10000,SMALL(IFERROR(IF(--(ISNUMBER(FIND(MID($F$2,1,3),Sheet1!$B$3:$B$10000))),ROW($A6:$A$10000)-ROW($A$3)+1),\"\"),ROWS($A$1:G4))),\"\")","v":""}]
[{"$f":"IFERROR(INDEX(Sheet1!$A$3:$A$10000,SMALL(IFERROR(IF(--(ISNUMBER(FIND(MID($F$2,1,3),Sheet1!$B$3:$B$10000))),ROW($A7:$A$10000)-ROW($A$3)+1),\"\"),ROWS($A$1:A5))),\"\")","v":""},{"$f":"IFERROR(INDEX(Sheet1!$B$3:$B$10000,SMALL(IFERROR(IF(--(ISNUMBER(FIND(MID($F$2,1,3),Sheet1!$B$3:$B$10000))),ROW($A7:$A$10000)-ROW($A$3)+1),\"\"),ROWS($A$1:B5))),\"\")","v":""},{"$f":"IFERROR(INDEX(Sheet1!C$3:$C$10000,SMALL(IFERROR(IF(--(ISNUMBER(FIND(MID($F$2,1,3),Sheet1!$B$3:$B$10000))),ROW($A7:$A$10000)-ROW($A$3)+1),\"\"),ROWS($A$1:C5))),\"\")","v":""},{"$f":"IFERROR(INDEX(Sheet1!$D$3:$D$10000,SMALL(IFERROR(IF(--(ISNUMBER(FIND(MID($F$2,1,3),Sheet1!$B$3:$B$10000))),ROW($A7:$A$10000)-ROW($A$3)+1),\"\"),ROWS($A$1:D5))),\"\")","v":""},{"$f":"IFERROR(INDEX(Sheet1!$E$3:$E$10000,SMALL(IFERROR(IF(--(ISNUMBER(FIND(MID($F$2,1,3),Sheet1!$B$3:$B$10000))),ROW($A7:$A$10000)-ROW($A$3)+1),\"\"),ROWS($A$1:E5))),\"\")","v":""},{"$f":"IFERROR(INDEX(Sheet1!$F$3:$F$10000,SMALL(IFERROR(IF(--(ISNUMBER(FIND(MID($F$2,1,3),Sheet1!$B$3:$B$10000))),ROW($A7:$A$10000)-ROW($A$3)+1),\"\"),ROWS($A$1:F5))),\"\")","v":""},{"$f":"IFERROR(INDEX(Sheet1!$G$3:$G$10000,SMALL(IFERROR(IF(--(ISNUMBER(FIND(MID($F$2,1,3),Sheet1!$B$3:$B$10000))),ROW($A7:$A$10000)-ROW($A$3)+1),\"\"),ROWS($A$1:G5))),\"\")","v":""}]
[{"$f":"IFERROR(INDEX(Sheet1!$A$3:$A$10000,SMALL(IFERROR(IF(--(ISNUMBER(FIND(MID($F$2,1,3),Sheet1!$B$3:$B$10000))),ROW($A8:$A$10000)-ROW($A$3)+1),\"\"),ROWS($A$1:A6))),\"\")","v":""},{"$f":"IFERROR(INDEX(Sheet1!$B$3:$B$10000,SMALL(IFERROR(IF(--(ISNUMBER(FIND(MID($F$2,1,3),Sheet1!$B$3:$B$10000))),ROW($A8:$A$10000)-ROW($A$3)+1),\"\"),ROWS($A$1:B6))),\"\")","v":""},{"$f":"IFERROR(INDEX(Sheet1!C$3:$C$10000,SMALL(IFERROR(IF(--(ISNUMBER(FIND(MID($F$2,1,3),Sheet1!$B$3:$B$10000))),ROW($A8:$A$10000)-ROW($A$3)+1),\"\"),ROWS($A$1:C6))),\"\")","v":""},{"$f":"IFERROR(INDEX(Sheet1!$D$3:$D$10000,SMALL(IFERROR(IF(--(ISNUMBER(FIND(MID($F$2,1,3),Sheet1!$B$3:$B$10000))),ROW($A8:$A$10000)-ROW($A$3)+1),\"\"),ROWS($A$1:D6))),\"\")","v":""},{"$f":"IFERROR(INDEX(Sheet1!$E$3:$E$10000,SMALL(IFERROR(IF(--(ISNUMBER(FIND(MID($F$2,1,3),Sheet1!$B$3:$B$10000))),ROW($A8:$A$10000)-ROW($A$3)+1),\"\"),ROWS($A$1:E6))),\"\")","v":""},{"$f":"IFERROR(INDEX(Sheet1!$F$3:$F$10000,SMALL(IFERROR(IF(--(ISNUMBER(FIND(MID($F$2,1,3),Sheet1!$B$3:$B$10000))),ROW($A8:$A$10000)-ROW($A$3)+1),\"\"),ROWS($A$1:F6))),\"\")","v":""},{"$f":"IFERROR(INDEX(Sheet1!$G$3:$G$10000,SMALL(IFERROR(IF(--(ISNUMBER(FIND(MID($F$2,1,3),Sheet1!$B$3:$B$10000))),ROW($A8:$A$10000)-ROW($A$3)+1),\"\"),ROWS($A$1:G6))),\"\")","v":""}]
[{"$f":"IFERROR(INDEX(Sheet1!$A$3:$A$10000,SMALL(IFERROR(IF(--(ISNUMBER(FIND(MID($F$2,1,3),Sheet1!$B$3:$B$10000))),ROW($A9:$A$10000)-ROW($A$3)+1),\"\"),ROWS($A$1:A7))),\"\")","v":""},{"$f":"IFERROR(INDEX(Sheet1!$B$3:$B$10000,SMALL(IFERROR(IF(--(ISNUMBER(FIND(MID($F$2,1,3),Sheet1!$B$3:$B$10000))),ROW($A9:$A$10000)-ROW($A$3)+1),\"\"),ROWS($A$1:B7))),\"\")","v":""},{"$f":"IFERROR(INDEX(Sheet1!C$3:$C$10000,SMALL(IFERROR(IF(--(ISNUMBER(FIND(MID($F$2,1,3),Sheet1!$B$3:$B$10000))),ROW($A9:$A$10000)-ROW($A$3)+1),\"\"),ROWS($A$1:C7))),\"\")","v":""},{"$f":"IFERROR(INDEX(Sheet1!$D$3:$D$10000,SMALL(IFERROR(IF(--(ISNUMBER(FIND(MID($F$2,1,3),Sheet1!$B$3:$B$10000))),ROW($A9:$A$10000)-ROW($A$3)+1),\"\"),ROWS($A$1:D7))),\"\")","v":""},{"$f":"IFERROR(INDEX(Sheet1!$E$3:$E$10000,SMALL(IFERROR(IF(--(ISNUMBER(FIND(MID($F$2,1,3),Sheet1!$B$3:$B$10000))),ROW($A9:$A$10000)-ROW($A$3)+1),\"\"),ROWS($A$1:E7))),\"\")","v":""},{"$f":"IFERROR(INDEX(Sheet1!$F$3:$F$10000,SMALL(IFERROR(IF(--(ISNUMBER(FIND(MID($F$2,1,3),Sheet1!$B$3:$B$10000))),ROW($A9:$A$10000)-ROW($A$3)+1),\"\"),ROWS($A$1:F7))),\"\")","v":""},{"$f":"IFERROR(INDEX(Sheet1!$G$3:$G$10000,SMALL(IFERROR(IF(--(ISNUMBER(FIND(MID($F$2,1,3),Sheet1!$B$3:$B$10000))),ROW($A9:$A$10000)-ROW($A$3)+1),\"\"),ROWS($A$1:G7))),\"\")","v":""}]
[{"$f":"IFERROR(INDEX(Sheet1!$A$3:$A$10000,SMALL(IFERROR(IF(--(ISNUMBER(FIND(MID($F$2,1,3),Sheet1!$B$3:$B$10000))),ROW($A10:$A$10000)-ROW($A$3)+1),\"\"),ROWS($A$1:A8))),\"\")","v":""},{"$f":"IFERROR(INDEX(Sheet1!$B$3:$B$10000,SMALL(IFERROR(IF(--(ISNUMBER(FIND(MID($F$2,1,3),Sheet1!$B$3:$B$10000))),ROW($A10:$A$10000)-ROW($A$3)+1),\"\"),ROWS($A$1:B8))),\"\")","v":""},{"$f":"IFERROR(INDEX(Sheet1!C$3:$C$10000,SMALL(IFERROR(IF(--(ISNUMBER(FIND(MID($F$2,1,3),Sheet1!$B$3:$B$10000))),ROW($A10:$A$10000)-ROW($A$3)+1),\"\"),ROWS($A$1:C8))),\"\")","v":""},{"$f":"IFERROR(INDEX(Sheet1!$D$3:$D$10000,SMALL(IFERROR(IF(--(ISNUMBER(FIND(MID($F$2,1,3),Sheet1!$B$3:$B$10000))),ROW($A10:$A$10000)-ROW($A$3)+1),\"\"),ROWS($A$1:D8))),\"\")","v":""},{"$f":"IFERROR(INDEX(Sheet1!$E$3:$E$10000,SMALL(IFERROR(IF(--(ISNUMBER(FIND(MID($F$2,1,3),Sheet1!$B$3:$B$10000))),ROW($A10:$A$10000)-ROW($A$3)+1),\"\"),ROWS($A$1:E8))),\"\")","v":""},{"$f":"IFERROR(INDEX(Sheet1!$F$3:$F$10000,SMALL(IFERROR(IF(--(ISNUMBER(FIND(MID($F$2,1,3),Sheet1!$B$3:$B$10000))),ROW($A10:$A$10000)-ROW($A$3)+1),\"\"),ROWS($A$1:F8))),\"\")","v":""},{"$f":"IFERROR(INDEX(Sheet1!$G$3:$G$10000,SMALL(IFERROR(IF(--(ISNUMBER(FIND(MID($F$2,1,3),Sheet1!$B$3:$B$10000))),ROW($A10:$A$10000)-ROW($A$3)+1),\"\"),ROWS($A$1:G8))),\"\")","v":""}]
[{"$f":"IFERROR(INDEX(Sheet1!$A$3:$A$10000,SMALL(IFERROR(IF(--(ISNUMBER(FIND(MID($F$2,1,3),Sheet1!$B$3:$B$10000))),ROW($A11:$A$10000)-ROW($A$3)+1),\"\"),ROWS($A$1:A9))),\"\")","v":""},{"$f":"IFERROR(INDEX(Sheet1!$B$3:$B$10000,SMALL(IFERROR(IF(--(ISNUMBER(FIND(MID($F$2,1,3),Sheet1!$B$3:$B$10000))),ROW($A11:$A$10000)-ROW($A$3)+1),\"\"),ROWS($A$1:B9))),\"\")","v":""},{"$f":"IFERROR(INDEX(Sheet1!C$3:$C$10000,SMALL(IFERROR(IF(--(ISNUMBER(FIND(MID($F$2,1,3),Sheet1!$B$3:$B$10000))),ROW($A11:$A$10000)-ROW($A$3)+1),\"\"),ROWS($A$1:C9))),\"\")","v":""},{"$f":"IFERROR(INDEX(Sheet1!$D$3:$D$10000,SMALL(IFERROR(IF(--(ISNUMBER(FIND(MID($F$2,1,3),Sheet1!$B$3:$B$10000))),ROW($A11:$A$10000)-ROW($A$3)+1),\"\"),ROWS($A$1:D9))),\"\")","v":""},{"$f":"IFERROR(INDEX(Sheet1!$E$3:$E$10000,SMALL(IFERROR(IF(--(ISNUMBER(FIND(MID($F$2,1,3),Sheet1!$B$3:$B$10000))),ROW($A11:$A$10000)-ROW($A$3)+1),\"\"),ROWS($A$1:E9))),\"\")","v":""},{"$f":"IFERROR(INDEX(Sheet1!$F$3:$F$10000,SMALL(IFERROR(IF(--(ISNUMBER(FIND(MID($F$2,1,3),Sheet1!$B$3:$B$10000))),ROW($A11:$A$10000)-ROW($A$3)+1),\"\"),ROWS($A$1:F9))),\"\")","v":""},{"$f":"IFERROR(INDEX(Sheet1!$G$3:$G$10000,SMALL(IFERROR(IF(--(ISNUMBER(FIND(MID($F$2,1,3),Sheet1!$B$3:$B$10000))),ROW($A11:$A$10000)-ROW($A$3)+1),\"\"),ROWS($A$1:G9))),\"\")","v":""}]
[{"$f":"IFERROR(INDEX(Sheet1!$A$3:$A$10000,SMALL(IFERROR(IF(--(ISNUMBER(FIND(MID($F$2,1,3),Sheet1!$B$3:$B$10000))),ROW($A12:$A$10000)-ROW($A$3)+1),\"\"),ROWS($A$1:A10))),\"\")","v":""},{"$f":"IFERROR(INDEX(Sheet1!$B$3:$B$10000,SMALL(IFERROR(IF(--(ISNUMBER(FIND(MID($F$2,1,3),Sheet1!$B$3:$B$10000))),ROW($A12:$A$10000)-ROW($A$3)+1),\"\"),ROWS($A$1:B10))),\"\")","v":""},{"$f":"IFERROR(INDEX(Sheet1!C$3:$C$10000,SMALL(IFERROR(IF(--(ISNUMBER(FIND(MID($F$2,1,3),Sheet1!$B$3:$B$10000))),ROW($A12:$A$10000)-ROW($A$3)+1),\"\"),ROWS($A$1:C10))),\"\")","v":""},{"$f":"IFERROR(INDEX(Sheet1!$D$3:$D$10000,SMALL(IFERROR(IF(--(ISNUMBER(FIND(MID($F$2,1,3),Sheet1!$B$3:$B$10000))),ROW($A12:$A$10000)-ROW($A$3)+1),\"\"),ROWS($A$1:D10))),\"\")","v":""},{"$f":"IFERROR(INDEX(Sheet1!$E$3:$E$10000,SMALL(IFERROR(IF(--(ISNUMBER(FIND(MID($F$2,1,3),Sheet1!$B$3:$B$10000))),ROW($A12:$A$10000)-ROW($A$3)+1),\"\"),ROWS($A$1:E10))),\"\")","v":""},{"$f":"IFERROR(INDEX(Sheet1!$F$3:$F$10000,SMALL(IFERROR(IF(--(ISNUMBER(FIND(MID($F$2,1,3),Sheet1!$B$3:$B$10000))),ROW($A12:$A$10000)-ROW($A$3)+1),\"\"),ROWS($A$1:F10))),\"\")","v":""},{"$f":"IFERROR(INDEX(Sheet1!$G$3:$G$10000,SMALL(IFERROR(IF(--(ISNUMBER(FIND(MID($F$2,1,3),Sheet1!$B$3:$B$10000))),ROW($A12:$A$10000)-ROW($A$3)+1),\"\"),ROWS($A$1:G10))),\"\")","v":""}]
[{"$f":"IFERROR(INDEX(Sheet1!$A$3:$A$10000,SMALL(IFERROR(IF(--(ISNUMBER(FIND(MID($F$2,1,3),Sheet1!$B$3:$B$10000))),ROW($A13:$A$10000)-ROW($A$3)+1),\"\"),ROWS($A$1:A11))),\"\")","v":""},{"$f":"IFERROR(INDEX(Sheet1!$B$3:$B$10000,SMALL(IFERROR(IF(--(ISNUMBER(FIND(MID($F$2,1,3),Sheet1!$B$3:$B$10000))),ROW($A13:$A$10000)-ROW($A$3)+1),\"\"),ROWS($A$1:B11))),\"\")","v":""},{"$f":"IFERROR(INDEX(Sheet1!C$3:$C$10000,SMALL(IFERROR(IF(--(ISNUMBER(FIND(MID($F$2,1,3),Sheet1!$B$3:$B$10000))),ROW($A13:$A$10000)-ROW($A$3)+1),\"\"),ROWS($A$1:C11))),\"\")","v":""},{"$f":"IFERROR(INDEX(Sheet1!$D$3:$D$10000,SMALL(IFERROR(IF(--(ISNUMBER(FIND(MID($F$2,1,3),Sheet1!$B$3:$B$10000))),ROW($A13:$A$10000)-ROW($A$3)+1),\"\"),ROWS($A$1:D11))),\"\")","v":""},{"$f":"IFERROR(INDEX(Sheet1!$E$3:$E$10000,SMALL(IFERROR(IF(--(ISNUMBER(FIND(MID($F$2,1,3),Sheet1!$B$3:$B$10000))),ROW($A13:$A$10000)-ROW($A$3)+1),\"\"),ROWS($A$1:E11))),\"\")","v":""},{"$f":"IFERROR(INDEX(Sheet1!$F$3:$F$10000,SMALL(IFERROR(IF(--(ISNUMBER(FIND(MID($F$2,1,3),Sheet1!$B$3:$B$10000))),ROW($A13:$A$10000)-ROW($A$3)+1),\"\"),ROWS($A$1:F11))),\"\")","v":""},{"$f":"IFERROR(INDEX(Sheet1!$G$3:$G$10000,SMALL(IFERROR(IF(--(ISNUMBER(FIND(MID($F$2,1,3),Sheet1!$B$3:$B$10000))),ROW($A13:$A$10000)-ROW($A$3)+1),\"\"),ROWS($A$1:G11))),\"\")","v":""}]
[{"$f":"IFERROR(INDEX(Sheet1!$A$3:$A$10000,SMALL(IFERROR(IF(--(ISNUMBER(FIND(MID($F$2,1,3),Sheet1!$B$3:$B$10000))),ROW($A14:$A$10000)-ROW($A$3)+1),\"\"),ROWS($A$1:A12))),\"\")","v":""},{"$f":"IFERROR(INDEX(Sheet1!$B$3:$B$10000,SMALL(IFERROR(IF(--(ISNUMBER(FIND(MID($F$2,1,3),Sheet1!$B$3:$B$10000))),ROW($A14:$A$10000)-ROW($A$3)+1),\"\"),ROWS($A$1:B12))),\"\")","v":""},{"$f":"IFERROR(INDEX(Sheet1!C$3:$C$10000,SMALL(IFERROR(IF(--(ISNUMBER(FIND(MID($F$2,1,3),Sheet1!$B$3:$B$10000))),ROW($A14:$A$10000)-ROW($A$3)+1),\"\"),ROWS($A$1:C12))),\"\")","v":""},{"$f":"IFERROR(INDEX(Sheet1!$D$3:$D$10000,SMALL(IFERROR(IF(--(ISNUMBER(FIND(MID($F$2,1,3),Sheet1!$B$3:$B$10000))),ROW($A14:$A$10000)-ROW($A$3)+1),\"\"),ROWS($A$1:D12))),\"\")","v":""},{"$f":"IFERROR(INDEX(Sheet1!$E$3:$E$10000,SMALL(IFERROR(IF(--(ISNUMBER(FIND(MID($F$2,1,3),Sheet1!$B$3:$B$10000))),ROW($A14:$A$10000)-ROW($A$3)+1),\"\"),ROWS($A$1:E12))),\"\")","v":""},{"$f":"IFERROR(INDEX(Sheet1!$F$3:$F$10000,SMALL(IFERROR(IF(--(ISNUMBER(FIND(MID($F$2,1,3),Sheet1!$B$3:$B$10000))),ROW($A14:$A$10000)-ROW($A$3)+1),\"\"),ROWS($A$1:F12))),\"\")","v":""},{"$f":"IFERROR(INDEX(Sheet1!$G$3:$G$10000,SMALL(IFERROR(IF(--(ISNUMBER(FIND(MID($F$2,1,3),Sheet1!$B$3:$B$10000))),ROW($A14:$A$10000)-ROW($A$3)+1),\"\"),ROWS($A$1:G12))),\"\")","v":""}]
[{"$f":"IFERROR(INDEX(Sheet1!$A$3:$A$10000,SMALL(IFERROR(IF(--(ISNUMBER(FIND(MID($F$2,1,3),Sheet1!$B$3:$B$10000))),ROW($A15:$A$10000)-ROW($A$3)+1),\"\"),ROWS($A$1:A13))),\"\")","v":""},{"$f":"IFERROR(INDEX(Sheet1!$B$3:$B$10000,SMALL(IFERROR(IF(--(ISNUMBER(FIND(MID($F$2,1,3),Sheet1!$B$3:$B$10000))),ROW($A15:$A$10000)-ROW($A$3)+1),\"\"),ROWS($A$1:B13))),\"\")","v":""},{"$f":"IFERROR(INDEX(Sheet1!C$3:$C$10000,SMALL(IFERROR(IF(--(ISNUMBER(FIND(MID($F$2,1,3),Sheet1!$B$3:$B$10000))),ROW($A15:$A$10000)-ROW($A$3)+1),\"\"),ROWS($A$1:C13))),\"\")","v":""},{"$f":"IFERROR(INDEX(Sheet1!$D$3:$D$10000,SMALL(IFERROR(IF(--(ISNUMBER(FIND(MID($F$2,1,3),Sheet1!$B$3:$B$10000))),ROW($A15:$A$10000)-ROW($A$3)+1),\"\"),ROWS($A$1:D13))),\"\")","v":""},{"$f":"IFERROR(INDEX(Sheet1!$E$3:$E$10000,SMALL(IFERROR(IF(--(ISNUMBER(FIND(MID($F$2,1,3),Sheet1!$B$3:$B$10000))),ROW($A15:$A$10000)-ROW($A$3)+1),\"\"),ROWS($A$1:E13))),\"\")","v":""},{"$f":"IFERROR(INDEX(Sheet1!$F$3:$F$10000,SMALL(IFERROR(IF(--(ISNUMBER(FIND(MID($F$2,1,3),Sheet1!$B$3:$B$10000))),ROW($A15:$A$10000)-ROW($A$3)+1),\"\"),ROWS($A$1:F13))),\"\")","v":""},{"$f":"IFERROR(INDEX(Sheet1!$G$3:$G$10000,SMALL(IFERROR(IF(--(ISNUMBER(FIND(MID($F$2,1,3),Sheet1!$B$3:$B$10000))),ROW($A15:$A$10000)-ROW($A$3)+1),\"\"),ROWS($A$1:G13))),\"\")","v":""}]
[{"$f":"IFERROR(INDEX(Sheet1!$A$3:$A$10000,SMALL(IFERROR(IF(--(ISNUMBER(FIND(MID($F$2,1,3),Sheet1!$B$3:$B$10000))),ROW($A16:$A$10000)-ROW($A$3)+1),\"\"),ROWS($A$1:A14))),\"\")","v":""},{"$f":"IFERROR(INDEX(Sheet1!$B$3:$B$10000,SMALL(IFERROR(IF(--(ISNUMBER(FIND(MID($F$2,1,3),Sheet1!$B$3:$B$10000))),ROW($A16:$A$10000)-ROW($A$3)+1),\"\"),ROWS($A$1:B14))),\"\")","v":""},{"$f":"IFERROR(INDEX(Sheet1!C$3:$C$10000,SMALL(IFERROR(IF(--(ISNUMBER(FIND(MID($F$2,1,3),Sheet1!$B$3:$B$10000))),ROW($A16:$A$10000)-ROW($A$3)+1),\"\"),ROWS($A$1:C14))),\"\")","v":""},{"$f":"IFERROR(INDEX(Sheet1!$D$3:$D$10000,SMALL(IFERROR(IF(--(ISNUMBER(FIND(MID($F$2,1,3),Sheet1!$B$3:$B$10000))),ROW($A16:$A$10000)-ROW($A$3)+1),\"\"),ROWS($A$1:D14))),\"\")","v":""},{"$f":"IFERROR(INDEX(Sheet1!$E$3:$E$10000,SMALL(IFERROR(IF(--(ISNUMBER(FIND(MID($F$2,1,3),Sheet1!$B$3:$B$10000))),ROW($A16:$A$10000)-ROW($A$3)+1),\"\"),ROWS($A$1:E14))),\"\")","v":""},{"$f":"IFERROR(INDEX(Sheet1!$F$3:$F$10000,SMALL(IFERROR(IF(--(ISNUMBER(FIND(MID($F$2,1,3),Sheet1!$B$3:$B$10000))),ROW($A16:$A$10000)-ROW($A$3)+1),\"\"),ROWS($A$1:F14))),\"\")","v":""},{"$f":"IFERROR(INDEX(Sheet1!$G$3:$G$10000,SMALL(IFERROR(IF(--(ISNUMBER(FIND(MID($F$2,1,3),Sheet1!$B$3:$B$10000))),ROW($A16:$A$10000)-ROW($A$3)+1),\"\"),ROWS($A$1:G14))),\"\")","v":""}]