{"text_format":"1","workbook":"xlsx","n_sheets":2,"sheets":["100%","Feuil1"],"not_rendered":{"charts":0,"images":0,"macros":1,"external_links":2,"defined_names":1,"comments":0,"pivot_tables":0},"unopened":[],"bounds":{"document_bytes":16777216,"sheet_cells":100000,"rows_first":2000,"rows_last":500,"rows_between":2000,"halvings":0,"cell_chars":16384,"cell_head_chars":4096},"cells_cut":0,"cells_raw":0,"read":"whole","date_system":"1900"}

{"sheet":"100%","index":0,"n_rows":35,"n_cols":39,"rows_kept":35,"cut":false,"hidden":false,"merged":[[25,0,25,5],[6,11,6,14],[17,11,17,14],[17,15,17,17],[6,15,6,17],[9,7,9,8],[10,7,10,9],[2,0,2,3],[6,5,6,6],[19,0,19,9],[7,2,7,5],[9,1,9,3],[7,7,7,10],[12,22,13,22],[7,35,8,36],[7,37,10,37],[8,32,8,34],[11,23,11,24],[7,22,10,22],[7,23,10,24],[7,27,9,27],[7,28,8,31],[7,32,7,34]]}
[null,null,null,"الجمهورية الجزائرية الديمقراطية الشعبية"]
["وزارة الداخلية و الجماعات المحلية "]
["و التهيئة العمرانية"]
["المديرية العامة للحماية المدنية",null,null,null,null,null,null,null,null,null,null,null,null,null,"خلاصة"]
[]
[null,null,null,null,null,"جدول مصاريف",null,null,null,null,null,"اولا : مصاريف النقل"]
[null,null,null,null,null,"التنقل",null,null,null,null,null,"وسائل النقل",null,null,null,"عدد الكيلومترات المقطوعة",null,null,"الثمن","حسابات",null,"ترحيــــل"]
["السيد (ة) :",null," هواري بومدين",null,null,null,"خلال شهر:","فيفري ,نوفمبر ,ديسمبر ,افريل ,اوت .",null,null,null,"أ) النقل العمومي",null,null,null,null,null,null,null,null,null,null,"أسباب التنقل","المسلك ( حدد أسباب التوقف )",null,"تاريخ الدخول","اوقات الدخول","وسيلة النقل","ثمن النقل الحقيقي",null,null,null,"سيارة خاصة",null,null,"عدد التعويضات الأساسية (6)",null,"ملاحظات"]
["الإسم و اللقب",null,null,null,null,null,null,null,null,null,null,"السكة الحديدية",null,null,null,null,null,null,null,null,null,null,null,null,null,"و الخروج","و الخروج",null,null,null,null,null,"كيلومترات مقطوعة (5)"]
["الرتبة:",{"$f":"VLOOKUP(H10,'[1]w26 10 2018'!$A$2:$W$1382,15,0)","v":"ملازم أول"},null,null,null,null,"القيد :",2600596,null,null,null,"الحافلة",null,null,null,null,null,null,null,null,null,null,null,null,null,null,null,null,"سكة حديدية","حافلة","باخرة أو طائرة","سيلرة الكراء","سيارة ","دراجة نارية","دراجة","عادية","المبيت"]
["الإقامة الإدارية:",null,"المدية",null,null,"رقم الحساب البريدي:",null,716594348,null,null,null,"الباخرة او الطائرة",null,null,null,null,null,null,null,null,null,null,null,null,null,null,"(2)","(3)","(4)","(4)","(4)","(4)"]
["الرقم الإستدلالي أو الراتب الأساسي :",null,null,null,{"$f":"VLOOKUP(H10,'[1]w26 10 2018'!$A$2:$W$1382,14,0)","v":14},null,"المجموعة :....................................",null,null,null,null,"سيارة إيجار",null,null,null,null,null,null,null,0,null,null,null,"(2)",null,"(3)","(4)","(5)","(6)","(7)","(8)","(9)","(10)","(11)","(12)","(13)","(14)","(15)"]
[null,null,null,null,null,null,null,null,null,null,null,"ب) التعويضات عن الكيلومترات",null,null,null,null,null,null,null,null,null,null,"مهمة","المدية","الجزائر","2018-02-01","08:00:00","كل الوسائل",null,null,null,0,null,null,null,{"$f":"AK13*2+1","v":1},{"$f":"Z14-Z13","v":0},null,{"$f":"IF(Z13=\"\",\"\",VLOOKUP(TEXT(Z13,\"MMM\"),{\"Jan\",\"جانفي\";\"Feb\",\"فيفري\";\"Mar\",\"مارس\";\"Apr\",\"افريل\";\"May\",\"ماي\";\"Jun\",\"جوان\";\"Jul\",\"جويلية\";\"Aug\",\"اوت\";\"Sep\",\"سبتمبر\";\"Oct\",\"اكتوبر\";\"Nov\",\"نوفمبر\";\"Dec\",\"ديسمبر\"},2,0))","v":"فيفري"}]
[null,null,null,null,null,null,null,null,null,null,null,"عن السيارة الـ 10000 كلم الاولى",null,null,null,null,null,null,null,null,null,null,null,{"$f":"Y13","v":"الجزائر"},{"$f":"X13","v":"المدية"},{"$f":"Z13","v":"2018-02-01"},"16:00:00","كل الوسائل",null,null,null,null,null,null,null,null,null,null,{"$f":"IF(Z14=\"\",\"\",VLOOKUP(TEXT(Z14,\"MMM\"),{\"Jan\",\"جانفي\";\"Feb\",\"فيفري\";\"Mar\",\"مارس\";\"Apr\",\"افريل\";\"May\",\"ماي\";\"Jun\",\"جوان\";\"Jul\",\"جويلية\";\"Aug\",\"اوت\";\"Sep\",\"سبتمبر\";\"Oct\",\"اكتوبر\";\"Nov\",\"نوفمبر\";\"Dec\",\"ديسمبر\"},2,0))","v":"فيفري"}]
[null,null,null,null,null,null,null,null,null,null,null,"بعد 10000 كلم",null,null,null,null,null,null,null,null,null,null,"مهمة","المدية","الجزائر","2018-11-14","08:00:00","كل الوسائل",null,null,null,0,null,null,null,{"$f":"AK15*2+1","v":35},{"$f":"Z16-Z15","v":17},null,{"$f":"IF(Z15=\"\",\"\",VLOOKUP(TEXT(Z15,\"MMM\"),{\"Jan\",\"جانفي\";\"Feb\",\"فيفري\";\"Mar\",\"مارس\";\"Apr\",\"افريل\";\"May\",\"ماي\";\"Jun\",\"جوان\";\"Jul\",\"جويلية\";\"Aug\",\"اوت\";\"Sep\",\"سبتمبر\";\"Oct\",\"اكتوبر\";\"Nov\",\"نوفمبر\";\"Dec\",\"ديسمبر\"},2,0))","v":"نوفمبر"}]
[null,null,null,null,"نقــــــل عمومـــــي",null,null,null,null,null,null,null,null,null,null,null,null,null,"المجموع",{"$f":"SUM(T12:T15)","v":0},null,null,null,{"$f":"Y15","v":"الجزائر"},{"$f":"X15","v":"المدية"},"2018-12-01","16:00:00","كل الوسائل",null,null,null,null,null,null,null,null,null,null,{"$f":"IF(Z16=\"\",\"\",VLOOKUP(TEXT(Z16,\"MMM\"),{\"Jan\",\"جانفي\";\"Feb\",\"فيفري\";\"Mar\",\"مارس\";\"Apr\",\"افريل\";\"May\",\"ماي\";\"Jun\",\"جوان\";\"Jul\",\"جويلية\";\"Aug\",\"اوت\";\"Sep\",\"سبتمبر\";\"Oct\",\"اكتوبر\";\"Nov\",\"نوفمبر\";\"Dec\",\"ديسمبر\"},2,0))","v":"ديسمبر"}]
["أصرح انني استفدت بتخفيض قدره .....................................................% عن المبلغ:.............",null,null,null,null,null,null,null,null,null,null,"ثانيا : التعويضات اليومية",null,null,null,null,null,null,null,null,null,null,"مهمة","المدية","الجزائر","2018-12-09","08:00:00","كل الوسائل",null,null,null,0,null,null,null,{"$f":"AK17*2+1","v":1},{"$f":"Z18-Z17","v":0},null,{"$f":"IF(Z17=\"\",\"\",VLOOKUP(TEXT(Z17,\"MMM\"),{\"Jan\",\"جانفي\";\"Feb\",\"فيفري\";\"Mar\",\"مارس\";\"Apr\",\"افريل\";\"May\",\"ماي\";\"Jun\",\"جوان\";\"Jul\",\"جويلية\";\"Aug\",\"اوت\";\"Sep\",\"سبتمبر\";\"Oct\",\"اكتوبر\";\"Nov\",\"نوفمبر\";\"Dec\",\"ديسمبر\"},2,0))","v":"ديسمبر"}]
["بصفتي : ................................................................................................................................................................................",null,null,null,null,null,"(1)",null,null,null,null,"طبيعة التنقلات",null,null,null,"عدد التعويضات الاساسية",null,null,"الثمن","حسابات",null,null,null,{"$f":"Y17","v":"الجزائر"},{"$f":"X17","v":"المدية"},{"$f":"Z17","v":"2018-12-09"},"16:00:00","كل الوسائل",null,null,null,null,null,null,null,null,null,null,{"$f":"IF(Z18=\"\",\"\",VLOOKUP(TEXT(Z18,\"MMM\"),{\"Jan\",\"جانفي\";\"Feb\",\"فيفري\";\"Mar\",\"مارس\";\"Apr\",\"افريل\";\"May\",\"ماي\";\"Jun\",\"جوان\";\"Jul\",\"جويلية\";\"Aug\",\"اوت\";\"Sep\",\"سبتمبر\";\"Oct\",\"اكتوبر\";\"Nov\",\"نوفمبر\";\"Dec\",\"ديسمبر\"},2,0))","v":"ديسمبر"}]
["أصرح بأنني لم أستفد بأي إمتياز شخصي،و باي صيغة كانت تتعلق بوسائل النقل العمومي",null,null,null,null,null,null,null,null,null,null,"عادية",null,null,null,"تعويضات عادية",null,2,{"$f":"VLOOKUP(H10,'[1]w26 10 2018'!$A$2:$W$1382,22,0)","v":400},{"$f":"R19*S19","v":800},null,null,"مهمة","المدية","الجزائر","2018-12-09","08:00:00","كل الوسائل",null,null,null,0,null,null,null,{"$f":"AK19*2+1","v":1},{"$f":"Z20-Z19","v":0},null,{"$f":"IF(Z19=\"\",\"\",VLOOKUP(TEXT(Z19,\"MMM\"),{\"Jan\",\"جانفي\";\"Feb\",\"فيفري\";\"Mar\",\"مارس\";\"Apr\",\"افريل\";\"May\",\"ماي\";\"Jun\",\"جوان\";\"Jul\",\"جويلية\";\"Aug\",\"اوت\";\"Sep\",\"سبتمبر\";\"Oct\",\"اكتوبر\";\"Nov\",\"نوفمبر\";\"Dec\",\"ديسمبر\"},2,0))","v":"ديسمبر"}]
[" (1)....................................................................................................................................................................................................................................................................................................................................................................",null,null,null,null,null,null,null,null,null,null,"المبيت",null,null,null,"التعويضات بثمن 100%",null,1,{"$f":"VLOOKUP(H10,'[1]w26 10 2018'!$A$2:$W$1382,23,0)","v":1200},{"$f":"S20*R20","v":1200},null,null,null,{"$f":"Y19","v":"الجزائر"},{"$f":"X19","v":"المدية"},{"$f":"Z19","v":"2018-12-09"},"16:00:00","كل الوسائل",null,null,null,null,null,null,null,null,null,null,{"$f":"IF(Z20=\"\",\"\",VLOOKUP(TEXT(Z20,\"MMM\"),{\"Jan\",\"جانفي\";\"Feb\",\"فيفري\";\"Mar\",\"مارس\";\"Apr\",\"افريل\";\"May\",\"ماي\";\"Jun\",\"جوان\";\"Jul\",\"جويلية\";\"Aug\",\"اوت\";\"Sep\",\"سبتمبر\";\"Oct\",\"اكتوبر\";\"Nov\",\"نوفمبر\";\"Dec\",\"ديسمبر\"},2,0))","v":"ديسمبر"}]
[null,null,null,null,null,null,null,null,null,null,null,"خاصة",null,null,null,"التعويضات بثمن 50%",null,null,null,null,null,null,"مهمة","المدية","الجزائر","2019-04-01","08:00:00","كل الوسائل",null,null,null,0,null,null,null,{"$f":"AK21*2+1","v":1},{"$f":"Z22-Z21","v":0},null,{"$f":"IF(Z21=\"\",\"\",VLOOKUP(TEXT(Z21,\"MMM\"),{\"Jan\",\"جانفي\";\"Feb\",\"فيفري\";\"Mar\",\"مارس\";\"Apr\",\"افريل\";\"May\",\"ماي\";\"Jun\",\"جوان\";\"Jul\",\"جويلية\";\"Aug\",\"اوت\";\"Sep\",\"سبتمبر\";\"Oct\",\"اكتوبر\";\"Nov\",\"نوفمبر\";\"Dec\",\"ديسمبر\"},2,0))","v":"افريل"}]
[null,null,null,null,null,null,null,null,null,null,null,"الخاصة للخارج",null,null,null,"تعويضات",null,null,null,null,null,null,null,{"$f":"Y21","v":"الجزائر"},{"$f":"X21","v":"المدية"},{"$f":"Z21","v":"2019-04-01"},"16:00:00","كل الوسائل",null,null,null,null,null,null,null,null,null,null,{"$f":"IF(Z22=\"\",\"\",VLOOKUP(TEXT(Z22,\"MMM\"),{\"Jan\",\"جانفي\";\"Feb\",\"فيفري\";\"Mar\",\"مارس\";\"Apr\",\"افريل\";\"May\",\"ماي\";\"Jun\",\"جوان\";\"Jul\",\"جويلية\";\"Aug\",\"اوت\";\"Sep\",\"سبتمبر\";\"Oct\",\"اكتوبر\";\"Nov\",\"نوفمبر\";\"Dec\",\"ديسمبر\"},2,0))","v":"افريل"}]
[null,null,null,null,"سيــارة خاصة",null,null,null,null,null,null,null,null,null,null,null,null,null,null,null,null,null,"مهمة","المدية","الجزائر","2018-12-09","08:00:00","كل الوسائل",null,null,null,0,null,null,null,{"$f":"AK23*2+1","v":1},{"$f":"Z24-Z23","v":0},null,{"$f":"IF(Z23=\"\",\"\",VLOOKUP(TEXT(Z23,\"MMM\"),{\"Jan\",\"جانفي\";\"Feb\",\"فيفري\";\"Mar\",\"مارس\";\"Apr\",\"افريل\";\"May\",\"ماي\";\"Jun\",\"جوان\";\"Jul\",\"جويلية\";\"Aug\",\"اوت\";\"Sep\",\"سبتمبر\";\"Oct\",\"اكتوبر\";\"Nov\",\"نوفمبر\";\"Dec\",\"ديسمبر\"},2,0))","v":"ديسمبر"}]
[null,null,null,null,null,null,null,null,null,null,null,null,null,null,null,null,null,null,"المجموع",{"$f":"SUM(T19:T23)","v":2000},null,null,null,{"$f":"Y23","v":"الجزائر"},{"$f":"X23","v":"المدية"},{"$f":"Z23","v":"2018-12-09"},"16:00:00","كل الوسائل",null,null,null,null,null,null,null,null,null,null,{"$f":"IF(Z24=\"\",\"\",VLOOKUP(TEXT(Z24,\"MMM\"),{\"Jan\",\"جانفي\";\"Feb\",\"فيفري\";\"Mar\",\"مارس\";\"Apr\",\"افريل\";\"May\",\"ماي\";\"Jun\",\"جوان\";\"Jul\",\"جويلية\";\"Aug\",\"اوت\";\"Sep\",\"سبتمبر\";\"Oct\",\"اكتوبر\";\"Nov\",\"نوفمبر\";\"Dec\",\"ديسمبر\"},2,0))","v":"ديسمبر"}]
["تاريخ مقرر الترخيص",null,null,null,null,null,null,null,null,null,null,null,"مجموع عام لمصروفات النقل + التعويضات اليومية..........................",null,null,null,null,null,null,{"$f":"T24","v":2000},null,null,"مهمة","المدية","الجزائر","2018-12-09","08:00:00","كل الوسائل",null,null,null,0,null,null,null,{"$f":"AK25*2+1","v":1},{"$f":"Z26-Z25","v":0},null,{"$f":"IF(Z25=\"\",\"\",VLOOKUP(TEXT(Z25,\"MMM\"),{\"Jan\",\"جانفي\";\"Feb\",\"فيفري\";\"Mar\",\"مارس\";\"Apr\",\"افريل\";\"May\",\"ماي\";\"Jun\",\"جوان\";\"Jul\",\"جويلية\";\"Aug\",\"اوت\";\"Sep\",\"سبتمبر\";\"Oct\",\"اكتوبر\";\"Nov\",\"نوفمبر\";\"Dec\",\"ديسمبر\"},2,0))","v":"ديسمبر"}]
["المنطقة الإقليمية المذكورة في المقرر",null,null,null,null,null,null,null,null,null,null,null,"للطرح تسبيقات مستوفاة لنفقات الإنتقال........................................",null,null,null,null,null,null,0,null,null,null,{"$f":"Y25","v":"الجزائر"},{"$f":"X25","v":"المدية"},{"$f":"Z25","v":"2018-12-09"},"16:00:00","كل الوسائل",null,null,null,null,null,null,null,null,null,null,{"$f":"IF(Z26=\"\",\"\",VLOOKUP(TEXT(Z26,\"MMM\"),{\"Jan\",\"جانفي\";\"Feb\",\"فيفري\";\"Mar\",\"مارس\";\"Apr\",\"افريل\";\"May\",\"ماي\";\"Jun\",\"جوان\";\"Jul\",\"جويلية\";\"Aug\",\"اوت\";\"Sep\",\"سبتمبر\";\"Oct\",\"اكتوبر\";\"Nov\",\"نوفمبر\";\"Dec\",\"ديسمبر\"},2,0))","v":"ديسمبر"}]
["مقدار الضريبة الحقيقية للسيارة",null,null,null,null,null,null,null,null,null,null,null,"تخفيض 20% إبتداءا من 31 يوما",null,null,null,null,null,null,0,null,null,"مهمة","المدية","الجزائر","2018-08-09","08:00:00","كل الوسائل",null,null,null,0,null,null,null,{"$f":"AK27*2+1","v":1},{"$f":"Z28-Z27","v":0},null,{"$f":"IF(Z27=\"\",\"\",VLOOKUP(TEXT(Z27,\"MMM\"),{\"Jan\",\"جانفي\";\"Feb\",\"فيفري\";\"Mar\",\"مارس\";\"Apr\",\"افريل\";\"May\",\"ماي\";\"Jun\",\"جوان\";\"Jul\",\"جويلية\";\"Aug\",\"اوت\";\"Sep\",\"سبتمبر\";\"Oct\",\"اكتوبر\";\"Nov\",\"نوفمبر\";\"Dec\",\"ديسمبر\"},2,0))","v":"اوت"}]
["عدد الكيلومترات الموافق للموظف بقطعها سنويا",null,null,null,null,null,null,null,null,null,null,null,null,null,"المجموع الصافي",null,null,null,null,{"$f":"T25","v":2000},null,null,null,{"$f":"Y27","v":"الجزائر"},{"$f":"X27","v":"المدية"},{"$f":"Z27","v":"2018-08-09"},"16:00:00","كل الوسائل",null,null,null,null,null,null,null,null,null,null,{"$f":"IF(Z28=\"\",\"\",VLOOKUP(TEXT(Z28,\"MMM\"),{\"Jan\",\"جانفي\";\"Feb\",\"فيفري\";\"Mar\",\"مارس\";\"Apr\",\"افريل\";\"May\",\"ماي\";\"Jun\",\"جوان\";\"Jul\",\"جويلية\";\"Aug\",\"اوت\";\"Sep\",\"سبتمبر\";\"Oct\",\"اكتوبر\";\"Nov\",\"نوفمبر\";\"Dec\",\"ديسمبر\"},2,0))","v":"اوت"}]
["عدد الكيلومترات المقطوعة منذ إستعمالها",null,null,null,null,null,null,null,null,null,null,null,null,null,null,null,null,null,null,null,null,null,"                                                                                                                  المجموع العام للتعويضات",null,null,null,null,null,null,null,null,null,null,null,null,{"$f":"SUM(AJ21:AJ28)","v":4},{"$f":"SUM(AK21:AK28)","v":0}]
[null,null,null,null,null,null,null,null,null,null,null,"انا الموقع ادناه مححر هذا الجدول : أصادق على صحة البيانات المدرجة فيه و اطلب تسديد مبلغ :"]
[null,null,null,null,null,null,null,null,null,null,null,{"$f":"[2]!ar(T28)","v":" ألفين دينار جزائري"}]
[null,null,null,null,null,null,null,null,null,null,null,null,null,null,null,null,null,null,"حرر بالجزائر في",{"$f":"TODAY()","v":"2019-01-13"}]
[null,null,null,null,null,null,null,null,null,null,null,"شوهد"]
[null,null,null,null,null,null,null,null,null,null,null,null,null,null,null,null,null,"الأمر بالصرف"]
[null,null,null,null,null,null,null,null,null,null,null,"توقيع الموظف"]

{"sheet":"Feuil1","index":1,"n_rows":13,"n_cols":4,"rows_kept":13,"cut":false,"hidden":false,"merged":[]}
[]
[{"$f":"IF(COUNTIF($D$2:D2,D2)-1=0,ROWS($D$2:D2),\"\")","v":1},{"$f":"IF(COUNTIF($D$2:D2,D2)-1<>0,ROWS($D$2:D2),\"\")","v":""},"جانفي",1]
[{"$f":"IF(COUNTIF($D$2:D3,D3)-1=0,ROWS($D$2:D3),\"\")","v":2},{"$f":"IF(COUNTIF($D$2:D3,D3)-1<>0,ROWS($D$2:D3),\"\")","v":""},"فيفري",2]
[{"$f":"IF(COUNTIF($D$2:D4,D4)-1=0,ROWS($D$2:D4),\"\")","v":3},{"$f":"IF(COUNTIF($D$2:D4,D4)-1<>0,ROWS($D$2:D4),\"\")","v":""},"فيفري",3]
[{"$f":"IF(COUNTIF($D$2:D5,D5)-1=0,ROWS($D$2:D5),\"\")","v":4},{"$f":"IF(COUNTIF($D$2:D5,D5)-1<>0,ROWS($D$2:D5),\"\")","v":""},"أفريل",4]
[{"$f":"IF(COUNTIF($D$2:D6,D6)-1=0,ROWS($D$2:D6),\"\")","v":5},{"$f":"IF(COUNTIF($D$2:D14,D6)-1<>0,ROWS($D$2:D6),\"\")","v":""},"ماي",5]
[{"$f":"IF(COUNTIF($D$2:D7,D7)-1=0,ROWS($D$2:D7),\"\")","v":6},{"$f":"IF(COUNTIF($D$2:D24,D7)-1<>0,ROWS($D$2:D7),\"\")","v":""},"جوان",6]
[{"$f":"IF(COUNTIF($D$2:D8,D8)-1=0,ROWS($D$2:D8),\"\")","v":7},{"$f":"IF(COUNTIF($D$2:D8,D8)-1<>0,ROWS($D$2:D8),\"\")","v":""},"جويلية",7]
[{"$f":"IF(COUNTIF($D$2:D9,D9)-1=0,ROWS($D$2:D9),\"\")","v":8},{"$f":"IF(COUNTIF($D$2:D9,D9)-1<>0,ROWS($D$2:D9),\"\")","v":""},"أوت",8]
[{"$f":"IF(COUNTIF($D$2:D14,D10)-1=0,ROWS($D$2:D10),\"\")","v":9},{"$f":"IF(COUNTIF($D$2:D10,D10)-1<>0,ROWS($D$2:D10),\"\")","v":""},"سبتمبر",9]
[{"$f":"IF(COUNTIF($D$2:D11,D11)-1=0,ROWS($D$2:D11),\"\")","v":10},{"$f":"IF(COUNTIF($D$2:D11,D11)-1<>0,ROWS($D$2:D11),\"\")","v":""},"أكتوبر",10]
[{"$f":"IF(COUNTIF($D$2:D12,D12)-1=0,ROWS($D$2:D12),\"\")","v":11},{"$f":"IF(COUNTIF($D$2:D12,D12)-1<>0,ROWS($D$2:D12),\"\")","v":""},"نوفمبر",11]
[{"$f":"IF(COUNTIF($D$2:D13,D13)-1=0,ROWS($D$2:D13),\"\")","v":12},{"$f":"IF(COUNTIF($D$2:D13,D13)-1<>0,ROWS($D$2:D13),\"\")","v":""},"ديسمبر",12]