{"text_format":"1","workbook":"xlsx","n_sheets":4,"sheets":["العاملين","الراحات","Sheet1","رصيد ملابس نهائى"],"not_rendered":{"charts":0,"images":1,"macros":1,"external_links":0,"defined_names":6,"comments":0,"pivot_tables":0},"unopened":[],"bounds":{"document_bytes":16777216,"sheet_cells":100000,"rows_first":2000,"rows_last":500,"rows_between":2000,"halvings":0,"cell_chars":16384,"cell_head_chars":4096},"cells_cut":0,"cells_raw":0,"read":"whole","date_system":"1900"}

{"sheet":"العاملين","index":0,"n_rows":6,"n_cols":12,"rows_kept":6,"cut":false,"hidden":false,"merged":[[0,11,0,12]]}
["Group","الاسم","الوظيفة","المكان","الشهادة الصحية","Mobile Number","Dayoff",null,null,null,null,"البحث"]
["B","محمد","مدير","المحل","2019-02-18",null,"Wed"]
["B","رفعت","نائب","المحل","2019-08-04",null,"Wed"]
["B","سعيد","عامل","المحل","2019-02-26",null,"Sun"]
["B","عمرو","مثال1","المحل","2019-11-24",null,"______"]
["B","ايمن","مثال2","المحل","لا يوجد",null,"Thu"]

{"sheet":"الراحات","index":1,"n_rows":319,"n_cols":14,"rows_kept":319,"cut":false,"hidden":false,"merged":[]}
["Sat","الوظيفة","Sun","الوظيفة","Mon","الوظيفة","Tue","الوظيفة","Wed","الوظيفة","Thu","الوظيفة","Fri","الوظيفة"]
[{"$f":"IFERROR(INDEX(العاملين!$B$2:'العاملين'!$B$999,SMALL(IF(العاملين!$G$2:'العاملين'!$G$999=\"Sat\",ROW(العاملين!$B$2:'العاملين'!$B$999)-ROW(العاملين!$B$2)+1),ROWS($A$2:A2))),\"\")","v":""},{"$f":"IFERROR(INDEX(العاملين!$C$2:$C$999,MATCH($A2,العاملين!$B$2:'العاملين'!$B$999,0)),\"\")","v":""},{"$f":"IFERROR(INDEX(العاملين!$B$2:'العاملين'!$B$999,SMALL(IF(العاملين!$G$2:'العاملين'!$G$999=\"Sun\",ROW(العاملين!$B$2:'العاملين'!$B$999)-ROW(العاملين!$B$2)+1),ROWS($C$2:C2))),\"\")","v":"سعيد"},{"$f":"IFERROR(INDEX(العاملين!$C$2:$C$999,MATCH($C2,العاملين!$B$2:'العاملين'!$B$999,0)),\"\")","v":"عامل"},{"$f":"IFERROR(INDEX(العاملين!$B$2:'العاملين'!$B$999,SMALL(IF(العاملين!$G$2:'العاملين'!$G$999=\"Mon\",ROW(العاملين!$B$2:'العاملين'!$B$999)-ROW(العاملين!$B$2)+1),ROWS($E$2:E2))),\"\")","v":""},{"$f":"IFERROR(INDEX(العاملين!$C$2:$C$999,MATCH($E2,العاملين!$B$2:'العاملين'!$B$999,0)),\"\")","v":""},{"$f":"IFERROR(INDEX(العاملين!$B$2:'العاملين'!$B$999,SMALL(IF(العاملين!$G$2:'العاملين'!$G$999=\"Tue\",ROW(العاملين!$B$2:'العاملين'!$B$999)-ROW(العاملين!$B$2)+1),ROWS($G$2:G2))),\"\")","v":""},{"$f":"IFERROR(INDEX(العاملين!$C$2:$C$999,MATCH($G2,العاملين!$B$2:'العاملين'!$B$999,0)),\"\")","v":""},{"$f":"IFERROR(INDEX(العاملين!$B$2:'العاملين'!$B$999,SMALL(IF(العاملين!$G$2:'العاملين'!$G$999=\"Wed\",ROW(العاملين!$B$2:'العاملين'!$B$999)-ROW(العاملين!$B$2)+1),ROWS($I$2:I2))),\"\")","v":"محمد"},{"$f":"IFERROR(INDEX(العاملين!$C$2:$C$999,MATCH($I2,العاملين!$B$2:'العاملين'!$B$999,0)),\"\")","v":"مدير"},{"$f":"IFERROR(INDEX(العاملين!$B$2:'العاملين'!$B$999,SMALL(IF(العاملين!$G$2:'العاملين'!$G$999=\"Thu\",ROW(العاملين!$B$2:'العاملين'!$B$999)-ROW(العاملين!$B$2)+1),ROWS($K$2:K2))),\"\")","v":"ايمن"},{"$f":"IFERROR(INDEX(العاملين!$C$2:$C$999,MATCH($K2,العاملين!$B$2:'العاملين'!$B$999,0)),\"\")","v":"مثال2"},{"$f":"IFERROR(INDEX(العاملين!$B$2:'العاملين'!$B$999,SMALL(IF(العاملين!$G$2:'العاملين'!$G$999=\"Fri\",ROW(العاملين!$B$2:'العاملين'!$B$999)-ROW(العاملين!$B$2)+1),ROWS($M$2:M2))),\"\")","v":""},{"$f":"IFERROR(INDEX(العاملين!$C$2:$C$999,MATCH($M2,العاملين!$B$2:'العاملين'!$B$999,0)),\"\")","v":""}]
[{"$f":"IFERROR(INDEX(العاملين!$B$2:'العاملين'!$B$999,SMALL(IF(العاملين!$G$2:'العاملين'!$G$999=\"Sat\",ROW(العاملين!$B$2:'العاملين'!$B$999)-ROW(العاملين!$B$2)+1),ROWS($A$2:A3))),\"\")","v":""},{"$f":"IFERROR(INDEX(العاملين!$C$2:$C$999,MATCH($A3,العاملين!$B$2:'العاملين'!$B$999,0)),\"\")","v":""},{"$f":"IFERROR(INDEX(العاملين!$B$2:'العاملين'!$B$999,SMALL(IF(العاملين!$G$2:'العاملين'!$G$999=\"Sun\",ROW(العاملين!$B$2:'العاملين'!$B$999)-ROW(العاملين!$B$2)+1),ROWS($C$2:C3))),\"\")","v":""},{"$f":"IFERROR(INDEX(العاملين!$C$2:$C$999,MATCH($C3,العاملين!$B$2:'العاملين'!$B$999,0)),\"\")","v":""},{"$f":"IFERROR(INDEX(العاملين!$B$2:'العاملين'!$B$999,SMALL(IF(العاملين!$G$2:'العاملين'!$G$999=\"Mon\",ROW(العاملين!$B$2:'العاملين'!$B$999)-ROW(العاملين!$B$2)+1),ROWS($E$2:E3))),\"\")","v":""},{"$f":"IFERROR(INDEX(العاملين!$C$2:$C$999,MATCH($E3,العاملين!$B$2:'العاملين'!$B$999,0)),\"\")","v":""},{"$f":"IFERROR(INDEX(العاملين!$B$2:'العاملين'!$B$999,SMALL(IF(العاملين!$G$2:'العاملين'!$G$999=\"Tue\",ROW(العاملين!$B$2:'العاملين'!$B$999)-ROW(العاملين!$B$2)+1),ROWS($G$2:G3))),\"\")","v":""},{"$f":"IFERROR(INDEX(العاملين!$C$2:$C$999,MATCH($G3,العاملين!$B$2:'العاملين'!$B$999,0)),\"\")","v":""},{"$f":"IFERROR(INDEX(العاملين!$B$2:'العاملين'!$B$999,SMALL(IF(العاملين!$G$2:'العاملين'!$G$999=\"Wed\",ROW(العاملين!$B$2:'العاملين'!$B$999)-ROW(العاملين!$B$2)+1),ROWS($I$2:I3))),\"\")","v":"رفعت"},{"$f":"IFERROR(INDEX(العاملين!$C$2:$C$999,MATCH($I3,العاملين!$B$2:'العاملين'!$B$999,0)),\"\")","v":"نائب"},{"$f":"IFERROR(INDEX(العاملين!$B$2:'العاملين'!$B$999,SMALL(IF(العاملين!$G$2:'العاملين'!$G$999=\"Thu\",ROW(العاملين!$B$2:'العاملين'!$B$999)-ROW(العاملين!$B$2)+1),ROWS($K$2:K3))),\"\")","v":""},{"$f":"IFERROR(INDEX(العاملين!$C$2:$C$999,MATCH($K3,العاملين!$B$2:'العاملين'!$B$999,0)),\"\")","v":""},{"$f":"IFERROR(INDEX(العاملين!$B$2:'العاملين'!$B$999,SMALL(IF(العاملين!$G$2:'العاملين'!$G$999=\"Fri\",ROW(العاملين!$B$2:'العاملين'!$B$999)-ROW(العاملين!$B$2)+1),ROWS($M$2:M3))),\"\")","v":""},{"$f":"IFERROR(INDEX(العاملين!$C$2:$C$999,MATCH($M3,العاملين!$B$2:'العاملين'!$B$999,0)),\"\")","v":""}]
[{"$f":"IFERROR(INDEX(العاملين!$B$2:'العاملين'!$B$999,SMALL(IF(العاملين!$G$2:'العاملين'!$G$999=\"Sat\",ROW(العاملين!$B$2:'العاملين'!$B$999)-ROW(العاملين!$B$2)+1),ROWS($A$2:A4))),\"\")","v":""},{"$f":"IFERROR(INDEX(العاملين!$C$2:$C$999,MATCH($A4,العاملين!$B$2:'العاملين'!$B$999,0)),\"\")","v":""},{"$f":"IFERROR(INDEX(العاملين!$B$2:'العاملين'!$B$999,SMALL(IF(العاملين!$G$2:'العاملين'!$G$999=\"Sun\",ROW(العاملين!$B$2:'العاملين'!$B$999)-ROW(العاملين!$B$2)+1),ROWS($C$2:C4))),\"\")","v":""},{"$f":"IFERROR(INDEX(العاملين!$C$2:$C$999,MATCH($C4,العاملين!$B$2:'العاملين'!$B$999,0)),\"\")","v":""},{"$f":"IFERROR(INDEX(العاملين!$B$2:'العاملين'!$B$999,SMALL(IF(العاملين!$G$2:'العاملين'!$G$999=\"Mon\",ROW(العاملين!$B$2:'العاملين'!$B$999)-ROW(العاملين!$B$2)+1),ROWS($E$2:E4))),\"\")","v":""},{"$f":"IFERROR(INDEX(العاملين!$C$2:$C$999,MATCH($E4,العاملين!$B$2:'العاملين'!$B$999,0)),\"\")","v":""},{"$f":"IFERROR(INDEX(العاملين!$B$2:'العاملين'!$B$999,SMALL(IF(العاملين!$G$2:'العاملين'!$G$999=\"Tue\",ROW(العاملين!$B$2:'العاملين'!$B$999)-ROW(العاملين!$B$2)+1),ROWS($G$2:G4))),\"\")","v":""},{"$f":"IFERROR(INDEX(العاملين!$C$2:$C$999,MATCH($G4,العاملين!$B$2:'العاملين'!$B$999,0)),\"\")","v":""},{"$f":"IFERROR(INDEX(العاملين!$B$2:'العاملين'!$B$999,SMALL(IF(العاملين!$G$2:'العاملين'!$G$999=\"Wed\",ROW(العاملين!$B$2:'العاملين'!$B$999)-ROW(العاملين!$B$2)+1),ROWS($I$2:I4))),\"\")","v":""},{"$f":"IFERROR(INDEX(العاملين!$C$2:$C$999,MATCH($I4,العاملين!$B$2:'العاملين'!$B$999,0)),\"\")","v":""},{"$f":"IFERROR(INDEX(العاملين!$B$2:'العاملين'!$B$999,SMALL(IF(العاملين!$G$2:'العاملين'!$G$999=\"Thu\",ROW(العاملين!$B$2:'العاملين'!$B$999)-ROW(العاملين!$B$2)+1),ROWS($K$2:K4))),\"\")","v":""},{"$f":"IFERROR(INDEX(العاملين!$C$2:$C$999,MATCH($K4,العاملين!$B$2:'العاملين'!$B$999,0)),\"\")","v":""},{"$f":"IFERROR(INDEX(العاملين!$B$2:'العاملين'!$B$999,SMALL(IF(العاملين!$G$2:'العاملين'!$G$999=\"Fri\",ROW(العاملين!$B$2:'العاملين'!$B$999)-ROW(العاملين!$B$2)+1),ROWS($M$2:M4))),\"\")","v":""},{"$f":"IFERROR(INDEX(العاملين!$C$2:$C$999,MATCH($M4,العاملين!$B$2:'العاملين'!$B$999,0)),\"\")","v":""}]
[{"$f":"IFERROR(INDEX(العاملين!$B$2:'العاملين'!$B$999,SMALL(IF(العاملين!$G$2:'العاملين'!$G$999=\"Sat\",ROW(العاملين!$B$2:'العاملين'!$B$999)-ROW(العاملين!$B$2)+1),ROWS($A$2:A5))),\"\")","v":""},{"$f":"IFERROR(INDEX(العاملين!$C$2:$C$999,MATCH($A5,العاملين!$B$2:'العاملين'!$B$999,0)),\"\")","v":""},{"$f":"IFERROR(INDEX(العاملين!$B$2:'العاملين'!$B$999,SMALL(IF(العاملين!$G$2:'العاملين'!$G$999=\"Sun\",ROW(العاملين!$B$2:'العاملين'!$B$999)-ROW(العاملين!$B$2)+1),ROWS($C$2:C5))),\"\")","v":""},{"$f":"IFERROR(INDEX(العاملين!$C$2:$C$999,MATCH($C5,العاملين!$B$2:'العاملين'!$B$999,0)),\"\")","v":""},{"$f":"IFERROR(INDEX(العاملين!$B$2:'العاملين'!$B$999,SMALL(IF(العاملين!$G$2:'العاملين'!$G$999=\"Mon\",ROW(العاملين!$B$2:'العاملين'!$B$999)-ROW(العاملين!$B$2)+1),ROWS($E$2:E5))),\"\")","v":""},{"$f":"IFERROR(INDEX(العاملين!$C$2:$C$999,MATCH($E5,العاملين!$B$2:'العاملين'!$B$999,0)),\"\")","v":""},{"$f":"IFERROR(INDEX(العاملين!$B$2:'العاملين'!$B$999,SMALL(IF(العاملين!$G$2:'العاملين'!$G$999=\"Tue\",ROW(العاملين!$B$2:'العاملين'!$B$999)-ROW(العاملين!$B$2)+1),ROWS($G$2:G5))),\"\")","v":""},{"$f":"IFERROR(INDEX(العاملين!$C$2:$C$999,MATCH($G5,العاملين!$B$2:'العاملين'!$B$999,0)),\"\")","v":""},{"$f":"IFERROR(INDEX(العاملين!$B$2:'العاملين'!$B$999,SMALL(IF(العاملين!$G$2:'العاملين'!$G$999=\"Wed\",ROW(العاملين!$B$2:'العاملين'!$B$999)-ROW(العاملين!$B$2)+1),ROWS($I$2:I5))),\"\")","v":""},{"$f":"IFERROR(INDEX(العاملين!$C$2:$C$999,MATCH($I5,العاملين!$B$2:'العاملين'!$B$999,0)),\"\")","v":""},{"$f":"IFERROR(INDEX(العاملين!$B$2:'العاملين'!$B$999,SMALL(IF(العاملين!$G$2:'العاملين'!$G$999=\"Thu\",ROW(العاملين!$B$2:'العاملين'!$B$999)-ROW(العاملين!$B$2)+1),ROWS($K$2:K5))),\"\")","v":""},{"$f":"IFERROR(INDEX(العاملين!$C$2:$C$999,MATCH($K5,العاملين!$B$2:'العاملين'!$B$999,0)),\"\")","v":""},{"$f":"IFERROR(INDEX(العاملين!$B$2:'العاملين'!$B$999,SMALL(IF(العاملين!$G$2:'العاملين'!$G$999=\"Fri\",ROW(العاملين!$B$2:'العاملين'!$B$999)-ROW(العاملين!$B$2)+1),ROWS($M$2:M5))),\"\")","v":""},{"$f":"IFERROR(INDEX(العاملين!$C$2:$C$999,MATCH($M5,العاملين!$B$2:'العاملين'!$B$999,0)),\"\")","v":""}]
[{"$f":"IFERROR(INDEX(العاملين!$B$2:'العاملين'!$B$999,SMALL(IF(العاملين!$G$2:'العاملين'!$G$999=\"Sat\",ROW(العاملين!$B$2:'العاملين'!$B$999)-ROW(العاملين!$B$2)+1),ROWS($A$2:A6))),\"\")","v":""},{"$f":"IFERROR(INDEX(العاملين!$C$2:$C$999,MATCH($A6,العاملين!$B$2:'العاملين'!$B$999,0)),\"\")","v":""},{"$f":"IFERROR(INDEX(العاملين!$B$2:'العاملين'!$B$999,SMALL(IF(العاملين!$G$2:'العاملين'!$G$999=\"Sun\",ROW(العاملين!$B$2:'العاملين'!$B$999)-ROW(العاملين!$B$2)+1),ROWS($C$2:C6))),\"\")","v":""},{"$f":"IFERROR(INDEX(العاملين!$C$2:$C$999,MATCH($C6,العاملين!$B$2:'العاملين'!$B$999,0)),\"\")","v":""},{"$f":"IFERROR(INDEX(العاملين!$B$2:'العاملين'!$B$999,SMALL(IF(العاملين!$G$2:'العاملين'!$G$999=\"Mon\",ROW(العاملين!$B$2:'العاملين'!$B$999)-ROW(العاملين!$B$2)+1),ROWS($E$2:E6))),\"\")","v":""},{"$f":"IFERROR(INDEX(العاملين!$C$2:$C$999,MATCH($E6,العاملين!$B$2:'العاملين'!$B$999,0)),\"\")","v":""},{"$f":"IFERROR(INDEX(العاملين!$B$2:'العاملين'!$B$999,SMALL(IF(العاملين!$G$2:'العاملين'!$G$999=\"Tue\",ROW(العاملين!$B$2:'العاملين'!$B$999)-ROW(العاملين!$B$2)+1),ROWS($G$2:G6))),\"\")","v":""},{"$f":"IFERROR(INDEX(العاملين!$C$2:$C$999,MATCH($G6,العاملين!$B$2:'العاملين'!$B$999,0)),\"\")","v":""},{"$f":"IFERROR(INDEX(العاملين!$B$2:'العاملين'!$B$999,SMALL(IF(العاملين!$G$2:'العاملين'!$G$999=\"Wed\",ROW(العاملين!$B$2:'العاملين'!$B$999)-ROW(العاملين!$B$2)+1),ROWS($I$2:I6))),\"\")","v":""},{"$f":"IFERROR(INDEX(العاملين!$C$2:$C$999,MATCH($I6,العاملين!$B$2:'العاملين'!$B$999,0)),\"\")","v":""},{"$f":"IFERROR(INDEX(العاملين!$B$2:'العاملين'!$B$999,SMALL(IF(العاملين!$G$2:'العاملين'!$G$999=\"Thu\",ROW(العاملين!$B$2:'العاملين'!$B$999)-ROW(العاملين!$B$2)+1),ROWS($K$2:K6))),\"\")","v":""},{"$f":"IFERROR(INDEX(العاملين!$C$2:$C$999,MATCH($K6,العاملين!$B$2:'العاملين'!$B$999,0)),\"\")","v":""},{"$f":"IFERROR(INDEX(العاملين!$B$2:'العاملين'!$B$999,SMALL(IF(العاملين!$G$2:'العاملين'!$G$999=\"Fri\",ROW(العاملين!$B$2:'العاملين'!$B$999)-ROW(العاملين!$B$2)+1),ROWS($M$2:M6))),\"\")","v":""},{"$f":"IFERROR(INDEX(العاملين!$C$2:$C$999,MATCH($M6,العاملين!$B$2:'العاملين'!$B$999,0)),\"\")","v":""}]
[{"$f":"IFERROR(INDEX(العاملين!$B$2:'العاملين'!$B$999,SMALL(IF(العاملين!$G$2:'العاملين'!$G$999=\"Sat\",ROW(العاملين!$B$2:'العاملين'!$B$999)-ROW(العاملين!$B$2)+1),ROWS($A$2:A7))),\"\")","v":""},{"$f":"IFERROR(INDEX(العاملين!$C$2:$C$999,MATCH($A7,العاملين!$B$2:'العاملين'!$B$999,0)),\"\")","v":""},{"$f":"IFERROR(INDEX(العاملين!$B$2:'العاملين'!$B$999,SMALL(IF(العاملين!$G$2:'العاملين'!$G$999=\"Sun\",ROW(العاملين!$B$2:'العاملين'!$B$999)-ROW(العاملين!$B$2)+1),ROWS($C$2:C7))),\"\")","v":""},{"$f":"IFERROR(INDEX(العاملين!$C$2:$C$999,MATCH($C7,العاملين!$B$2:'العاملين'!$B$999,0)),\"\")","v":""},{"$f":"IFERROR(INDEX(العاملين!$B$2:'العاملين'!$B$999,SMALL(IF(العاملين!$G$2:'العاملين'!$G$999=\"Mon\",ROW(العاملين!$B$2:'العاملين'!$B$999)-ROW(العاملين!$B$2)+1),ROWS($E$2:E7))),\"\")","v":""},{"$f":"IFERROR(INDEX(العاملين!$C$2:$C$999,MATCH($E7,العاملين!$B$2:'العاملين'!$B$999,0)),\"\")","v":""},{"$f":"IFERROR(INDEX(العاملين!$B$2:'العاملين'!$B$999,SMALL(IF(العاملين!$G$2:'العاملين'!$G$999=\"Tue\",ROW(العاملين!$B$2:'العاملين'!$B$999)-ROW(العاملين!$B$2)+1),ROWS($G$2:G7))),\"\")","v":""},{"$f":"IFERROR(INDEX(العاملين!$C$2:$C$999,MATCH($G7,العاملين!$B$2:'العاملين'!$B$999,0)),\"\")","v":""},{"$f":"IFERROR(INDEX(العاملين!$B$2:'العاملين'!$B$999,SMALL(IF(العاملين!$G$2:'العاملين'!$G$999=\"Wed\",ROW(العاملين!$B$2:'العاملين'!$B$999)-ROW(العاملين!$B$2)+1),ROWS($I$2:I7))),\"\")","v":""},{"$f":"IFERROR(INDEX(العاملين!$C$2:$C$999,MATCH($I7,العاملين!$B$2:'العاملين'!$B$999,0)),\"\")","v":""},{"$f":"IFERROR(INDEX(العاملين!$B$2:'العاملين'!$B$999,SMALL(IF(العاملين!$G$2:'العاملين'!$G$999=\"Thu\",ROW(العاملين!$B$2:'العاملين'!$B$999)-ROW(العاملين!$B$2)+1),ROWS($K$2:K7))),\"\")","v":""},{"$f":"IFERROR(INDEX(العاملين!$C$2:$C$999,MATCH($K7,العاملين!$B$2:'العاملين'!$B$999,0)),\"\")","v":""},{"$f":"IFERROR(INDEX(العاملين!$B$2:'العاملين'!$B$999,SMALL(IF(العاملين!$G$2:'العاملين'!$G$999=\"Fri\",ROW(العاملين!$B$2:'العاملين'!$B$999)-ROW(العاملين!$B$2)+1),ROWS($M$2:M7))),\"\")","v":""},{"$f":"IFERROR(INDEX(العاملين!$C$2:$C$999,MATCH($M7,العاملين!$B$2:'العاملين'!$B$999,0)),\"\")","v":""}]
[{"$f":"IFERROR(INDEX(العاملين!$B$2:'العاملين'!$B$999,SMALL(IF(العاملين!$G$2:'العاملين'!$G$999=\"Sat\",ROW(العاملين!$B$2:'العاملين'!$B$999)-ROW(العاملين!$B$2)+1),ROWS($A$2:A8))),\"\")","v":""},{"$f":"IFERROR(INDEX(العاملين!$C$2:$C$999,MATCH($A8,العاملين!$B$2:'العاملين'!$B$999,0)),\"\")","v":""},{"$f":"IFERROR(INDEX(العاملين!$B$2:'العاملين'!$B$999,SMALL(IF(العاملين!$G$2:'العاملين'!$G$999=\"Sun\",ROW(العاملين!$B$2:'العاملين'!$B$999)-ROW(العاملين!$B$2)+1),ROWS($C$2:C8))),\"\")","v":""},{"$f":"IFERROR(INDEX(العاملين!$C$2:$C$999,MATCH($C8,العاملين!$B$2:'العاملين'!$B$999,0)),\"\")","v":""},{"$f":"IFERROR(INDEX(العاملين!$B$2:'العاملين'!$B$999,SMALL(IF(العاملين!$G$2:'العاملين'!$G$999=\"Mon\",ROW(العاملين!$B$2:'العاملين'!$B$999)-ROW(العاملين!$B$2)+1),ROWS($E$2:E8))),\"\")","v":""},{"$f":"IFERROR(INDEX(العاملين!$C$2:$C$999,MATCH($E8,العاملين!$B$2:'العاملين'!$B$999,0)),\"\")","v":""},{"$f":"IFERROR(INDEX(العاملين!$B$2:'العاملين'!$B$999,SMALL(IF(العاملين!$G$2:'العاملين'!$G$999=\"Tue\",ROW(العاملين!$B$2:'العاملين'!$B$999)-ROW(العاملين!$B$2)+1),ROWS($G$2:G8))),\"\")","v":""},{"$f":"IFERROR(INDEX(العاملين!$C$2:$C$999,MATCH($G8,العاملين!$B$2:'العاملين'!$B$999,0)),\"\")","v":""},{"$f":"IFERROR(INDEX(العاملين!$B$2:'العاملين'!$B$999,SMALL(IF(العاملين!$G$2:'العاملين'!$G$999=\"Wed\",ROW(العاملين!$B$2:'العاملين'!$B$999)-ROW(العاملين!$B$2)+1),ROWS($I$2:I8))),\"\")","v":""},{"$f":"IFERROR(INDEX(العاملين!$C$2:$C$999,MATCH($I8,العاملين!$B$2:'العاملين'!$B$999,0)),\"\")","v":""},{"$f":"IFERROR(INDEX(العاملين!$B$2:'العاملين'!$B$999,SMALL(IF(العاملين!$G$2:'العاملين'!$G$999=\"Thu\",ROW(العاملين!$B$2:'العاملين'!$B$999)-ROW(العاملين!$B$2)+1),ROWS($K$2:K8))),\"\")","v":""},{"$f":"IFERROR(INDEX(العاملين!$C$2:$C$999,MATCH($K8,العاملين!$B$2:'العاملين'!$B$999,0)),\"\")","v":""},{"$f":"IFERROR(INDEX(العاملين!$B$2:'العاملين'!$B$999,SMALL(IF(العاملين!$G$2:'العاملين'!$G$999=\"Fri\",ROW(العاملين!$B$2:'العاملين'!$B$999)-ROW(العاملين!$B$2)+1),ROWS($M$2:M8))),\"\")","v":""},{"$f":"IFERROR(INDEX(العاملين!$C$2:$C$999,MATCH($M8,العاملين!$B$2:'العاملين'!$B$999,0)),\"\")","v":""}]
[{"$f":"IFERROR(INDEX(العاملين!$B$2:'العاملين'!$B$999,SMALL(IF(العاملين!$G$2:'العاملين'!$G$999=\"Sat\",ROW(العاملين!$B$2:'العاملين'!$B$999)-ROW(العاملين!$B$2)+1),ROWS($A$2:A9))),\"\")","v":""},{"$f":"IFERROR(INDEX(العاملين!$C$2:$C$999,MATCH($A9,العاملين!$B$2:'العاملين'!$B$999,0)),\"\")","v":""},{"$f":"IFERROR(INDEX(العاملين!$B$2:'العاملين'!$B$999,SMALL(IF(العاملين!$G$2:'العاملين'!$G$999=\"Sun\",ROW(العاملين!$B$2:'العاملين'!$B$999)-ROW(العاملين!$B$2)+1),ROWS($C$2:C9))),\"\")","v":""},{"$f":"IFERROR(INDEX(العاملين!$C$2:$C$999,MATCH($C9,العاملين!$B$2:'العاملين'!$B$999,0)),\"\")","v":""},{"$f":"IFERROR(INDEX(العاملين!$B$2:'العاملين'!$B$999,SMALL(IF(العاملين!$G$2:'العاملين'!$G$999=\"Mon\",ROW(العاملين!$B$2:'العاملين'!$B$999)-ROW(العاملين!$B$2)+1),ROWS($E$2:E9))),\"\")","v":""},{"$f":"IFERROR(INDEX(العاملين!$C$2:$C$999,MATCH($E9,العاملين!$B$2:'العاملين'!$B$999,0)),\"\")","v":""},{"$f":"IFERROR(INDEX(العاملين!$B$2:'العاملين'!$B$999,SMALL(IF(العاملين!$G$2:'العاملين'!$G$999=\"Tue\",ROW(العاملين!$B$2:'العاملين'!$B$999)-ROW(العاملين!$B$2)+1),ROWS($G$2:G9))),\"\")","v":""},{"$f":"IFERROR(INDEX(العاملين!$C$2:$C$999,MATCH($G9,العاملين!$B$2:'العاملين'!$B$999,0)),\"\")","v":""},{"$f":"IFERROR(INDEX(العاملين!$B$2:'العاملين'!$B$999,SMALL(IF(العاملين!$G$2:'العاملين'!$G$999=\"Wed\",ROW(العاملين!$B$2:'العاملين'!$B$999)-ROW(العاملين!$B$2)+1),ROWS($I$2:I9))),\"\")","v":""},{"$f":"IFERROR(INDEX(العاملين!$C$2:$C$999,MATCH($I9,العاملين!$B$2:'العاملين'!$B$999,0)),\"\")","v":""},{"$f":"IFERROR(INDEX(العاملين!$B$2:'العاملين'!$B$999,SMALL(IF(العاملين!$G$2:'العاملين'!$G$999=\"Thu\",ROW(العاملين!$B$2:'العاملين'!$B$999)-ROW(العاملين!$B$2)+1),ROWS($K$2:K9))),\"\")","v":""},{"$f":"IFERROR(INDEX(العاملين!$C$2:$C$999,MATCH($K9,العاملين!$B$2:'العاملين'!$B$999,0)),\"\")","v":""},{"$f":"IFERROR(INDEX(العاملين!$B$2:'العاملين'!$B$999,SMALL(IF(العاملين!$G$2:'العاملين'!$G$999=\"Fri\",ROW(العاملين!$B$2:'العاملين'!$B$999)-ROW(العاملين!$B$2)+1),ROWS($M$2:M9))),\"\")","v":""},{"$f":"IFERROR(INDEX(العاملين!$C$2:$C$999,MATCH($M9,العاملين!$B$2:'العاملين'!$B$999,0)),\"\")","v":""}]
[{"$f":"IFERROR(INDEX(العاملين!$B$2:'العاملين'!$B$999,SMALL(IF(العاملين!$G$2:'العاملين'!$G$999=\"Sat\",ROW(العاملين!$B$2:'العاملين'!$B$999)-ROW(العاملين!$B$2)+1),ROWS($A$2:A10))),\"\")","v":""},{"$f":"IFERROR(INDEX(العاملين!$C$2:$C$999,MATCH($A10,العاملين!$B$2:'العاملين'!$B$999,0)),\"\")","v":""},{"$f":"IFERROR(INDEX(العاملين!$B$2:'العاملين'!$B$999,SMALL(IF(العاملين!$G$2:'العاملين'!$G$999=\"Sun\",ROW(العاملين!$B$2:'العاملين'!$B$999)-ROW(العاملين!$B$2)+1),ROWS($C$2:C10))),\"\")","v":""},{"$f":"IFERROR(INDEX(العاملين!$C$2:$C$999,MATCH($C10,العاملين!$B$2:'العاملين'!$B$999,0)),\"\")","v":""},{"$f":"IFERROR(INDEX(العاملين!$B$2:'العاملين'!$B$999,SMALL(IF(العاملين!$G$2:'العاملين'!$G$999=\"Mon\",ROW(العاملين!$B$2:'العاملين'!$B$999)-ROW(العاملين!$B$2)+1),ROWS($E$2:E10))),\"\")","v":""},{"$f":"IFERROR(INDEX(العاملين!$C$2:$C$999,MATCH($E10,العاملين!$B$2:'العاملين'!$B$999,0)),\"\")","v":""},{"$f":"IFERROR(INDEX(العاملين!$B$2:'العاملين'!$B$999,SMALL(IF(العاملين!$G$2:'العاملين'!$G$999=\"Tue\",ROW(العاملين!$B$2:'العاملين'!$B$999)-ROW(العاملين!$B$2)+1),ROWS($G$2:G10))),\"\")","v":""},{"$f":"IFERROR(INDEX(العاملين!$C$2:$C$999,MATCH($G10,العاملين!$B$2:'العاملين'!$B$999,0)),\"\")","v":""},{"$f":"IFERROR(INDEX(العاملين!$B$2:'العاملين'!$B$999,SMALL(IF(العاملين!$G$2:'العاملين'!$G$999=\"Wed\",ROW(العاملين!$B$2:'العاملين'!$B$999)-ROW(العاملين!$B$2)+1),ROWS($I$2:I10))),\"\")","v":""},{"$f":"IFERROR(INDEX(العاملين!$C$2:$C$999,MATCH($I10,العاملين!$B$2:'العاملين'!$B$999,0)),\"\")","v":""},{"$f":"IFERROR(INDEX(العاملين!$B$2:'العاملين'!$B$999,SMALL(IF(العاملين!$G$2:'العاملين'!$G$999=\"Thu\",ROW(العاملين!$B$2:'العاملين'!$B$999)-ROW(العاملين!$B$2)+1),ROWS($K$2:K10))),\"\")","v":""},{"$f":"IFERROR(INDEX(العاملين!$C$2:$C$999,MATCH($K10,العاملين!$B$2:'العاملين'!$B$999,0)),\"\")","v":""},{"$f":"IFERROR(INDEX(العاملين!$B$2:'العاملين'!$B$999,SMALL(IF(العاملين!$G$2:'العاملين'!$G$999=\"Fri\",ROW(العاملين!$B$2:'العاملين'!$B$999)-ROW(العاملين!$B$2)+1),ROWS($M$2:M10))),\"\")","v":""},{"$f":"IFERROR(INDEX(العاملين!$C$2:$C$999,MATCH($M10,العاملين!$B$2:'العاملين'!$B$999,0)),\"\")","v":""}]
{"$rows_left_out":310}
{"sheet":"Sheet1","index":2,"n_rows":326,"n_cols":14,"rows_kept":326,"cut":false,"hidden":false,"merged":[]}
["الاسم","الوظيفة","التاريخ",34,36,38,40,42,44,"ايبرون رجالى","ايبرون بناتى","بابيون","سكارف","بادج"]
[{"$f":"العاملين!B2","v":"محمد"},{"$f":"العاملين!C2","v":"مدير"}]
[{"$f":"العاملين!B3","v":"رفعت"},{"$f":"العاملين!C3","v":"نائب"}]
[{"$f":"العاملين!B4","v":"سعيد"},{"$f":"العاملين!C4","v":"عامل"}]
[{"$f":"العاملين!B5","v":"عمرو"},{"$f":"العاملين!C5","v":"مثال1"}]
[{"$f":"العاملين!B6","v":"ايمن"},{"$f":"العاملين!C6","v":"مثال2"}]
[{"$f":"العاملين!B7","v":0},{"$f":"العاملين!C7","v":0}]
[{"$f":"العاملين!B8","v":0},{"$f":"العاملين!C8","v":0}]
[{"$f":"العاملين!B9","v":0},{"$f":"العاملين!C9","v":0}]
[{"$f":"العاملين!B10","v":0},{"$f":"العاملين!C10","v":0}]
{"$rows_left_out":317}
{"sheet":"رصيد ملابس نهائى","index":3,"n_rows":7,"n_cols":26,"rows_kept":7,"cut":false,"hidden":false,"merged":[[1,24,2,24],[0,16,2,16],[0,17,0,25],[1,17,2,17],[1,18,2,18],[1,19,2,19],[1,20,2,20],[1,21,2,21],[1,22,2,22],[1,23,2,23],[1,25,2,25],[1,0,2,1],[0,15,2,15],[0,13,2,13],[1,7,2,7],[1,8,2,8],[0,3,0,8],[1,3,2,3],[1,4,2,4],[1,5,2,5],[1,6,2,6],[0,0,0,1],[0,9,0,10],[0,11,2,11],[0,12,2,12],[0,14,2,14]]}
["النوع",null,null,"قميص",null,null,null,null,null,"جاكت شيف",null,"ابرون رجالى","ابرون بناتى","بدلة نظافة","مريلة جلد","بابيون","سكارف","Badges"]
["المقاسات",null,null,34,36,38,40,42,44,null,null,null,null,null,null,null,null,1,1,1,1,1,1,1,1,1]
[null,null,null,null,null,null,null,null,null,50,52]
["التاريخ","نوع العملية","الاسم",{"$f":"SUM(D5:D1000)","v":24},{"$f":"SUM(E5:E1000)","v":0},0,0,0,0,0,0,0,0,0,0,0,0,0,0,0,0,0,0,0,0,0]
["2019-01-17","شراء","محل الخ.... (إضافة للرصيد)",20]
[null,"استهلاك","موظف عمرو (خصم من الرصيد)",1]
["2019-01-18","جرد","بعد الجرد وجدت عدد (اضافة للرصيد)",3]