{"text_format":"1","workbook":"xlsx","n_sheets":3,"sheets":["ورقة1","ورقة2","ورقة3"],"not_rendered":{"charts":0,"images":0,"macros":1,"external_links":0,"defined_names":1,"comments":0,"pivot_tables":0},"unopened":[],"bounds":{"document_bytes":16777216,"sheet_cells":100000,"rows_first":2000,"rows_last":500,"rows_between":2000,"halvings":0,"cell_chars":16384,"cell_head_chars":4096},"cells_cut":0,"cells_raw":0,"read":"whole","date_system":"1900"}

{"sheet":"ورقة1","index":0,"n_rows":29,"n_cols":16,"rows_kept":29,"cut":false,"hidden":false,"merged":[[2,1,2,2],[2,5,2,6],[2,8,2,9],[2,11,2,12],[2,14,2,15]]}
[]
[]
[null,"الجدول الرئيسي",null,null,null,"A",null,null,"B",null,null,"C",null,null,"D"]
[null,"B",100,null,null,{"$f":"IF(ROWS(G$4:G4)>COUNTIF($B$4:$B$29,$F$3),\"\",INDEX(B$4:B$29,SMALL(IF(($B$4:$B$29=$F$3),ROW($B$4:$B$29)-3),ROWS(F$4:F4))))","v":"A"},{"$f":"IF(ROWS(G$4:G4)>COUNTIF($B$4:$B$29,$F$3),\"\",INDEX(C$4:C$29,SMALL(IF(($B$4:$B$29=$F$3),ROW($B$4:$B$29)-3),ROWS(F$4:F4))))","v":300},null,{"$f":"IF(ROWS(J$4:J4)>COUNTIF($B$4:$B$29,$I$3),\"\",INDEX(B$4:B$29,SMALL(IF(($B$4:$B$29=$I$3),ROW($B$4:$B$29)-3),ROWS(I$4:I4))))","v":"B"},{"$f":"IF(ROWS(J$4:J4)>COUNTIF($B$4:$B$29,$I$3),\"\",INDEX(C$4:C$29,SMALL(IF(($B$4:$B$29=$I$3),ROW($B$4:$B$29)-3),ROWS(I$4:I4))))","v":100},null,{"$f":"IF(ROWS(M$4:M4)>COUNTIF($B$4:$B$29,$L$3),\"\",INDEX(B$4:B$29,SMALL(IF(($B$4:$B$29=$L$3),ROW($B$4:$B$29)-3),ROWS(L$4:L4))))","v":"C"},{"$f":"IF(ROWS(M$4:M4)>COUNTIF($B$4:$B$29,$L$3),\"\",INDEX(C$4:C$29,SMALL(IF(($B$4:$B$29=$L$3),ROW($B$4:$B$29)-3),ROWS(L$4:L4))))","v":400},null,{"$f":"IF(ROWS(P$4:P4)>COUNTIF($B$4:$B$29,$O$3),\"\",INDEX(B$4:B$29,SMALL(IF(($B$4:$B$29=$O$3),ROW($B$4:$B$29)-3),ROWS(O$4:O4))))","v":"D"},{"$f":"IF(ROWS(P$4:P4)>COUNTIF($B$4:$B$29,$O$3),\"\",INDEX(C$4:C$29,SMALL(IF(($B$4:$B$29=$O$3),ROW($B$4:$B$29)-3),ROWS(O$4:O4))))","v":600}]
[null,"D",600,null,null,{"$f":"IF(ROWS(G$4:G5)>COUNTIF($B$4:$B$29,$F$3),\"\",INDEX(B$4:B$29,SMALL(IF(($B$4:$B$29=$F$3),ROW($B$4:$B$29)-3),ROWS(F$4:F5))))","v":"A"},{"$f":"IF(ROWS(G$4:G5)>COUNTIF($B$4:$B$29,$F$3),\"\",INDEX(C$4:C$29,SMALL(IF(($B$4:$B$29=$F$3),ROW($B$4:$B$29)-3),ROWS(F$4:F5))))","v":400},null,{"$f":"IF(ROWS(J$4:J5)>COUNTIF($B$4:$B$29,$I$3),\"\",INDEX(B$4:B$29,SMALL(IF(($B$4:$B$29=$I$3),ROW($B$4:$B$29)-3),ROWS(I$4:I5))))","v":"B"},{"$f":"IF(ROWS(J$4:J5)>COUNTIF($B$4:$B$29,$I$3),\"\",INDEX(C$4:C$29,SMALL(IF(($B$4:$B$29=$I$3),ROW($B$4:$B$29)-3),ROWS(I$4:I5))))","v":300},null,{"$f":"IF(ROWS(M$4:M5)>COUNTIF($B$4:$B$29,$L$3),\"\",INDEX(B$4:B$29,SMALL(IF(($B$4:$B$29=$L$3),ROW($B$4:$B$29)-3),ROWS(L$4:L5))))","v":"C"},{"$f":"IF(ROWS(M$4:M5)>COUNTIF($B$4:$B$29,$L$3),\"\",INDEX(C$4:C$29,SMALL(IF(($B$4:$B$29=$L$3),ROW($B$4:$B$29)-3),ROWS(L$4:L5))))","v":800},null,{"$f":"IF(ROWS(P$4:P5)>COUNTIF($B$4:$B$29,$O$3),\"\",INDEX(B$4:B$29,SMALL(IF(($B$4:$B$29=$O$3),ROW($B$4:$B$29)-3),ROWS(O$4:O5))))","v":"D"},{"$f":"IF(ROWS(P$4:P5)>COUNTIF($B$4:$B$29,$O$3),\"\",INDEX(C$4:C$29,SMALL(IF(($B$4:$B$29=$O$3),ROW($B$4:$B$29)-3),ROWS(O$4:O5))))","v":700}]
[null,"C",400,null,null,{"$f":"IF(ROWS(G$4:G6)>COUNTIF($B$4:$B$29,$F$3),\"\",INDEX(B$4:B$29,SMALL(IF(($B$4:$B$29=$F$3),ROW($B$4:$B$29)-3),ROWS(F$4:F6))))","v":"A"},{"$f":"IF(ROWS(G$4:G6)>COUNTIF($B$4:$B$29,$F$3),\"\",INDEX(C$4:C$29,SMALL(IF(($B$4:$B$29=$F$3),ROW($B$4:$B$29)-3),ROWS(F$4:F6))))","v":100},null,{"$f":"IF(ROWS(J$4:J6)>COUNTIF($B$4:$B$29,$I$3),\"\",INDEX(B$4:B$29,SMALL(IF(($B$4:$B$29=$I$3),ROW($B$4:$B$29)-3),ROWS(I$4:I6))))","v":"B"},{"$f":"IF(ROWS(J$4:J6)>COUNTIF($B$4:$B$29,$I$3),\"\",INDEX(C$4:C$29,SMALL(IF(($B$4:$B$29=$I$3),ROW($B$4:$B$29)-3),ROWS(I$4:I6))))","v":100},null,{"$f":"IF(ROWS(M$4:M6)>COUNTIF($B$4:$B$29,$L$3),\"\",INDEX(B$4:B$29,SMALL(IF(($B$4:$B$29=$L$3),ROW($B$4:$B$29)-3),ROWS(L$4:L6))))","v":"C"},{"$f":"IF(ROWS(M$4:M6)>COUNTIF($B$4:$B$29,$L$3),\"\",INDEX(C$4:C$29,SMALL(IF(($B$4:$B$29=$L$3),ROW($B$4:$B$29)-3),ROWS(L$4:L6))))","v":300},null,{"$f":"IF(ROWS(P$4:P6)>COUNTIF($B$4:$B$29,$O$3),\"\",INDEX(B$4:B$29,SMALL(IF(($B$4:$B$29=$O$3),ROW($B$4:$B$29)-3),ROWS(O$4:O6))))","v":"D"},{"$f":"IF(ROWS(P$4:P6)>COUNTIF($B$4:$B$29,$O$3),\"\",INDEX(C$4:C$29,SMALL(IF(($B$4:$B$29=$O$3),ROW($B$4:$B$29)-3),ROWS(O$4:O6))))","v":600}]
[null,"A",300,null,null,{"$f":"IF(ROWS(G$4:G7)>COUNTIF($B$4:$B$29,$F$3),\"\",INDEX(B$4:B$29,SMALL(IF(($B$4:$B$29=$F$3),ROW($B$4:$B$29)-3),ROWS(F$4:F7))))","v":"A"},{"$f":"IF(ROWS(G$4:G7)>COUNTIF($B$4:$B$29,$F$3),\"\",INDEX(C$4:C$29,SMALL(IF(($B$4:$B$29=$F$3),ROW($B$4:$B$29)-3),ROWS(F$4:F7))))","v":400},null,{"$f":"IF(ROWS(J$4:J7)>COUNTIF($B$4:$B$29,$I$3),\"\",INDEX(B$4:B$29,SMALL(IF(($B$4:$B$29=$I$3),ROW($B$4:$B$29)-3),ROWS(I$4:I7))))","v":"B"},{"$f":"IF(ROWS(J$4:J7)>COUNTIF($B$4:$B$29,$I$3),\"\",INDEX(C$4:C$29,SMALL(IF(($B$4:$B$29=$I$3),ROW($B$4:$B$29)-3),ROWS(I$4:I7))))","v":600},null,{"$f":"IF(ROWS(M$4:M7)>COUNTIF($B$4:$B$29,$L$3),\"\",INDEX(B$4:B$29,SMALL(IF(($B$4:$B$29=$L$3),ROW($B$4:$B$29)-3),ROWS(L$4:L7))))","v":"C"},{"$f":"IF(ROWS(M$4:M7)>COUNTIF($B$4:$B$29,$L$3),\"\",INDEX(C$4:C$29,SMALL(IF(($B$4:$B$29=$L$3),ROW($B$4:$B$29)-3),ROWS(L$4:L7))))","v":400},null,{"$f":"IF(ROWS(P$4:P7)>COUNTIF($B$4:$B$29,$O$3),\"\",INDEX(B$4:B$29,SMALL(IF(($B$4:$B$29=$O$3),ROW($B$4:$B$29)-3),ROWS(O$4:O7))))","v":"D"},{"$f":"IF(ROWS(P$4:P7)>COUNTIF($B$4:$B$29,$O$3),\"\",INDEX(C$4:C$29,SMALL(IF(($B$4:$B$29=$O$3),ROW($B$4:$B$29)-3),ROWS(O$4:O7))))","v":700}]
[null,"A",400,null,null,{"$f":"IF(ROWS(G$4:G8)>COUNTIF($B$4:$B$29,$F$3),\"\",INDEX(B$4:B$29,SMALL(IF(($B$4:$B$29=$F$3),ROW($B$4:$B$29)-3),ROWS(F$4:F8))))","v":"A"},{"$f":"IF(ROWS(G$4:G8)>COUNTIF($B$4:$B$29,$F$3),\"\",INDEX(C$4:C$29,SMALL(IF(($B$4:$B$29=$F$3),ROW($B$4:$B$29)-3),ROWS(F$4:F8))))","v":300},null,{"$f":"IF(ROWS(J$4:J8)>COUNTIF($B$4:$B$29,$I$3),\"\",INDEX(B$4:B$29,SMALL(IF(($B$4:$B$29=$I$3),ROW($B$4:$B$29)-3),ROWS(I$4:I8))))","v":"B"},{"$f":"IF(ROWS(J$4:J8)>COUNTIF($B$4:$B$29,$I$3),\"\",INDEX(C$4:C$29,SMALL(IF(($B$4:$B$29=$I$3),ROW($B$4:$B$29)-3),ROWS(I$4:I8))))","v":400},null,{"$f":"IF(ROWS(M$4:M8)>COUNTIF($B$4:$B$29,$L$3),\"\",INDEX(B$4:B$29,SMALL(IF(($B$4:$B$29=$L$3),ROW($B$4:$B$29)-3),ROWS(L$4:L8))))","v":"C"},{"$f":"IF(ROWS(M$4:M8)>COUNTIF($B$4:$B$29,$L$3),\"\",INDEX(C$4:C$29,SMALL(IF(($B$4:$B$29=$L$3),ROW($B$4:$B$29)-3),ROWS(L$4:L8))))","v":300},null,{"$f":"IF(ROWS(P$4:P8)>COUNTIF($B$4:$B$29,$O$3),\"\",INDEX(B$4:B$29,SMALL(IF(($B$4:$B$29=$O$3),ROW($B$4:$B$29)-3),ROWS(O$4:O8))))","v":"D"},{"$f":"IF(ROWS(P$4:P8)>COUNTIF($B$4:$B$29,$O$3),\"\",INDEX(C$4:C$29,SMALL(IF(($B$4:$B$29=$O$3),ROW($B$4:$B$29)-3),ROWS(O$4:O8))))","v":800}]
[null,"D",700,null,null,{"$f":"IF(ROWS(G$4:G9)>COUNTIF($B$4:$B$29,$F$3),\"\",INDEX(B$4:B$29,SMALL(IF(($B$4:$B$29=$F$3),ROW($B$4:$B$29)-3),ROWS(F$4:F9))))","v":"A"},{"$f":"IF(ROWS(G$4:G9)>COUNTIF($B$4:$B$29,$F$3),\"\",INDEX(C$4:C$29,SMALL(IF(($B$4:$B$29=$F$3),ROW($B$4:$B$29)-3),ROWS(F$4:F9))))","v":600},null,{"$f":"IF(ROWS(J$4:J9)>COUNTIF($B$4:$B$29,$I$3),\"\",INDEX(B$4:B$29,SMALL(IF(($B$4:$B$29=$I$3),ROW($B$4:$B$29)-3),ROWS(I$4:I9))))","v":"B"},{"$f":"IF(ROWS(J$4:J9)>COUNTIF($B$4:$B$29,$I$3),\"\",INDEX(C$4:C$29,SMALL(IF(($B$4:$B$29=$I$3),ROW($B$4:$B$29)-3),ROWS(I$4:I9))))","v":100},null,{"$f":"IF(ROWS(M$4:M9)>COUNTIF($B$4:$B$29,$L$3),\"\",INDEX(B$4:B$29,SMALL(IF(($B$4:$B$29=$L$3),ROW($B$4:$B$29)-3),ROWS(L$4:L9))))","v":""},{"$f":"IF(ROWS(M$4:M9)>COUNTIF($B$4:$B$29,$L$3),\"\",INDEX(C$4:C$29,SMALL(IF(($B$4:$B$29=$L$3),ROW($B$4:$B$29)-3),ROWS(L$4:L9))))","v":""},null,{"$f":"IF(ROWS(P$4:P9)>COUNTIF($B$4:$B$29,$O$3),\"\",INDEX(B$4:B$29,SMALL(IF(($B$4:$B$29=$O$3),ROW($B$4:$B$29)-3),ROWS(O$4:O9))))","v":"D"},{"$f":"IF(ROWS(P$4:P9)>COUNTIF($B$4:$B$29,$O$3),\"\",INDEX(C$4:C$29,SMALL(IF(($B$4:$B$29=$O$3),ROW($B$4:$B$29)-3),ROWS(O$4:O9))))","v":1000}]
[null,"B",300,null,null,{"$f":"IF(ROWS(G$4:G10)>COUNTIF($B$4:$B$29,$F$3),\"\",INDEX(B$4:B$29,SMALL(IF(($B$4:$B$29=$F$3),ROW($B$4:$B$29)-3),ROWS(F$4:F10))))","v":"A"},{"$f":"IF(ROWS(G$4:G10)>COUNTIF($B$4:$B$29,$F$3),\"\",INDEX(C$4:C$29,SMALL(IF(($B$4:$B$29=$F$3),ROW($B$4:$B$29)-3),ROWS(F$4:F10))))","v":300},null,{"$f":"IF(ROWS(J$4:J10)>COUNTIF($B$4:$B$29,$I$3),\"\",INDEX(B$4:B$29,SMALL(IF(($B$4:$B$29=$I$3),ROW($B$4:$B$29)-3),ROWS(I$4:I10))))","v":"B"},{"$f":"IF(ROWS(J$4:J10)>COUNTIF($B$4:$B$29,$I$3),\"\",INDEX(C$4:C$29,SMALL(IF(($B$4:$B$29=$I$3),ROW($B$4:$B$29)-3),ROWS(I$4:I10))))","v":400},null,{"$f":"IF(ROWS(M$4:M10)>COUNTIF($B$4:$B$29,$L$3),\"\",INDEX(B$4:B$29,SMALL(IF(($B$4:$B$29=$L$3),ROW($B$4:$B$29)-3),ROWS(L$4:L10))))","v":""},{"$f":"IF(ROWS(M$4:M10)>COUNTIF($B$4:$B$29,$L$3),\"\",INDEX(C$4:C$29,SMALL(IF(($B$4:$B$29=$L$3),ROW($B$4:$B$29)-3),ROWS(L$4:L10))))","v":""},null,{"$f":"IF(ROWS(P$4:P10)>COUNTIF($B$4:$B$29,$O$3),\"\",INDEX(B$4:B$29,SMALL(IF(($B$4:$B$29=$O$3),ROW($B$4:$B$29)-3),ROWS(O$4:O10))))","v":""},{"$f":"IF(ROWS(P$4:P10)>COUNTIF($B$4:$B$29,$O$3),\"\",INDEX(C$4:C$29,SMALL(IF(($B$4:$B$29=$O$3),ROW($B$4:$B$29)-3),ROWS(O$4:O10))))","v":""}]
[null,"C",800,null,null,{"$f":"IF(ROWS(G$4:G11)>COUNTIF($B$4:$B$29,$F$3),\"\",INDEX(B$4:B$29,SMALL(IF(($B$4:$B$29=$F$3),ROW($B$4:$B$29)-3),ROWS(F$4:F11))))","v":"A"},{"$f":"IF(ROWS(G$4:G11)>COUNTIF($B$4:$B$29,$F$3),\"\",INDEX(C$4:C$29,SMALL(IF(($B$4:$B$29=$F$3),ROW($B$4:$B$29)-3),ROWS(F$4:F11))))","v":700},null,{"$f":"IF(ROWS(J$4:J11)>COUNTIF($B$4:$B$29,$I$3),\"\",INDEX(B$4:B$29,SMALL(IF(($B$4:$B$29=$I$3),ROW($B$4:$B$29)-3),ROWS(I$4:I11))))","v":""},{"$f":"IF(ROWS(J$4:J11)>COUNTIF($B$4:$B$29,$I$3),\"\",INDEX(C$4:C$29,SMALL(IF(($B$4:$B$29=$I$3),ROW($B$4:$B$29)-3),ROWS(I$4:I11))))","v":""},null,{"$f":"IF(ROWS(M$4:M11)>COUNTIF($B$4:$B$29,$L$3),\"\",INDEX(B$4:B$29,SMALL(IF(($B$4:$B$29=$L$3),ROW($B$4:$B$29)-3),ROWS(L$4:L11))))","v":""},{"$f":"IF(ROWS(M$4:M11)>COUNTIF($B$4:$B$29,$L$3),\"\",INDEX(C$4:C$29,SMALL(IF(($B$4:$B$29=$L$3),ROW($B$4:$B$29)-3),ROWS(L$4:L11))))","v":""},null,{"$f":"IF(ROWS(P$4:P11)>COUNTIF($B$4:$B$29,$O$3),\"\",INDEX(B$4:B$29,SMALL(IF(($B$4:$B$29=$O$3),ROW($B$4:$B$29)-3),ROWS(O$4:O11))))","v":""},{"$f":"IF(ROWS(P$4:P11)>COUNTIF($B$4:$B$29,$O$3),\"\",INDEX(C$4:C$29,SMALL(IF(($B$4:$B$29=$O$3),ROW($B$4:$B$29)-3),ROWS(O$4:O11))))","v":""}]
[null,"A",100,null,null,{"$f":"IF(ROWS(G$4:G12)>COUNTIF($B$4:$B$29,$F$3),\"\",INDEX(B$4:B$29,SMALL(IF(($B$4:$B$29=$F$3),ROW($B$4:$B$29)-3),ROWS(F$4:F12))))","v":""},{"$f":"IF(ROWS(G$4:G12)>COUNTIF($B$4:$B$29,$F$3),\"\",INDEX(C$4:C$29,SMALL(IF(($B$4:$B$29=$F$3),ROW($B$4:$B$29)-3),ROWS(F$4:F12))))","v":""},null,{"$f":"IF(ROWS(J$4:J12)>COUNTIF($B$4:$B$29,$I$3),\"\",INDEX(B$4:B$29,SMALL(IF(($B$4:$B$29=$I$3),ROW($B$4:$B$29)-3),ROWS(I$4:I12))))","v":""},{"$f":"IF(ROWS(J$4:J12)>COUNTIF($B$4:$B$29,$I$3),\"\",INDEX(C$4:C$29,SMALL(IF(($B$4:$B$29=$I$3),ROW($B$4:$B$29)-3),ROWS(I$4:I12))))","v":""},{"$f":"IF(ROWS(K$4:K12)>COUNTIF($B$4:$B$29,$I$3),\"\",INDEX(C$4:C$29,SMALL(IF(($B$4:$B$29=$I$3),ROW($B$4:$B$29)-3),ROWS(I$4:I12))))","v":""},{"$f":"IF(ROWS(M$4:M12)>COUNTIF($B$4:$B$29,$L$3),\"\",INDEX(B$4:B$29,SMALL(IF(($B$4:$B$29=$L$3),ROW($B$4:$B$29)-3),ROWS(L$4:L12))))","v":""},{"$f":"IF(ROWS(M$4:M12)>COUNTIF($B$4:$B$29,$L$3),\"\",INDEX(C$4:C$29,SMALL(IF(($B$4:$B$29=$L$3),ROW($B$4:$B$29)-3),ROWS(L$4:L12))))","v":""},null,{"$f":"IF(ROWS(P$4:P12)>COUNTIF($B$4:$B$29,$O$3),\"\",INDEX(B$4:B$29,SMALL(IF(($B$4:$B$29=$O$3),ROW($B$4:$B$29)-3),ROWS(O$4:O12))))","v":""},{"$f":"IF(ROWS(P$4:P12)>COUNTIF($B$4:$B$29,$O$3),\"\",INDEX(C$4:C$29,SMALL(IF(($B$4:$B$29=$O$3),ROW($B$4:$B$29)-3),ROWS(O$4:O12))))","v":""}]
[null,"D",600,null,null,{"$f":"IF(ROWS(G$4:G13)>COUNTIF($B$4:$B$29,$F$3),\"\",INDEX(B$4:B$29,SMALL(IF(($B$4:$B$29=$F$3),ROW($B$4:$B$29)-3),ROWS(F$4:F13))))","v":""},{"$f":"IF(ROWS(G$4:G13)>COUNTIF($B$4:$B$29,$F$3),\"\",INDEX(C$4:C$29,SMALL(IF(($B$4:$B$29=$F$3),ROW($B$4:$B$29)-3),ROWS(F$4:F13))))","v":""},null,{"$f":"IF(ROWS(J$4:J13)>COUNTIF($B$4:$B$29,$I$3),\"\",INDEX(B$4:B$29,SMALL(IF(($B$4:$B$29=$I$3),ROW($B$4:$B$29)-3),ROWS(I$4:I13))))","v":""},{"$f":"IF(ROWS(J$4:J13)>COUNTIF($B$4:$B$29,$I$3),\"\",INDEX(C$4:C$29,SMALL(IF(($B$4:$B$29=$I$3),ROW($B$4:$B$29)-3),ROWS(I$4:I13))))","v":""},{"$f":"IF(ROWS(K$4:K13)>COUNTIF($B$4:$B$29,$I$3),\"\",INDEX(C$4:C$29,SMALL(IF(($B$4:$B$29=$I$3),ROW($B$4:$B$29)-3),ROWS(I$4:I13))))","v":""},{"$f":"IF(ROWS(M$4:M13)>COUNTIF($B$4:$B$29,$L$3),\"\",INDEX(B$4:B$29,SMALL(IF(($B$4:$B$29=$L$3),ROW($B$4:$B$29)-3),ROWS(L$4:L13))))","v":""},{"$f":"IF(ROWS(M$4:M13)>COUNTIF($B$4:$B$29,$L$3),\"\",INDEX(C$4:C$29,SMALL(IF(($B$4:$B$29=$L$3),ROW($B$4:$B$29)-3),ROWS(L$4:L13))))","v":""},null,{"$f":"IF(ROWS(P$4:P13)>COUNTIF($B$4:$B$29,$O$3),\"\",INDEX(B$4:B$29,SMALL(IF(($B$4:$B$29=$O$3),ROW($B$4:$B$29)-3),ROWS(O$4:O13))))","v":""},{"$f":"IF(ROWS(P$4:P13)>COUNTIF($B$4:$B$29,$O$3),\"\",INDEX(C$4:C$29,SMALL(IF(($B$4:$B$29=$O$3),ROW($B$4:$B$29)-3),ROWS(O$4:O13))))","v":""}]
[null,"B",100]
[null,"B",600]
[null,"A",400]
[null,"C",300]
[null,"B",400]
[null,"D",700]
[null,"A",300]
[null,"D",800]
[null,"B",100]
[null,"A",600]
[null,"D",1000]
[null,"C",400]
[null,"A",300]
[null,"B",400]
[null,"A",700]
[null,"C",300]

{"sheet":"ورقة2","index":1,"n_rows":0,"n_cols":0,"rows_kept":0,"cut":false,"hidden":false,"merged":[]}

{"sheet":"ورقة3","index":2,"n_rows":0,"n_cols":0,"rows_kept":0,"cut":false,"hidden":false,"merged":[]}