{"text_format":"1","workbook":"xlsx","n_sheets":2,"sheets":["ورقة1","ورقة2"],"not_rendered":{"charts":0,"images":1,"macros":1,"external_links":0,"defined_names":1,"comments":0,"pivot_tables":0},"unopened":[],"bounds":{"document_bytes":16777216,"sheet_cells":100000,"rows_first":2000,"rows_last":500,"rows_between":2000,"halvings":0,"cell_chars":16384,"cell_head_chars":4096},"cells_cut":0,"cells_raw":0,"read":"whole","date_system":"1900"}

{"sheet":"ورقة1","index":0,"n_rows":304,"n_cols":30,"rows_kept":304,"cut":false,"hidden":false,"merged":[[0,27,2,29],[0,26,2,26],[0,1,2,1],[0,0,2,0],[0,23,1,23],[0,24,1,24],[0,25,1,25]]}
["تسلسل","اسم الطالب","القـرآن الكـريــــم",null,null,"التربية الإسلامية",null,null,"اللغـة العـربيــــة",null,null,"اللغة الانجليزية",null,null,"الـريـــاضـيــــات",null,null,"العلـوم الصحيــة",null,null,"الاجتمــاعـيـــات",null,null,"المجموع الكلي","نسبة مئوية","ترتيب","التقدير","تقدير الطالب"]
[null,null,"محصلة الاختبارات","الامتحان","المجموع","محصلة الاختبارات","الامتحان","المجموع","محصلة الاختبارات","الامتحان","المجموع","محصلة الاختبارات","الامتحان","المجموع","محصلة الاختبارات","الامتحان","المجموع","محصلة الاختبارات","الامتحان","المجموع","محصلة الاختبارات","الامتحان","المجموع"]
[null,null,20,30,50,20,30,50,20,30,50,20,30,50,20,30,50,20,30,50,20,30,50]
[{"$f":"IF($B4=\"\",\"\",MAX($A$3:$A3)+1)","v":1}," ابراهيم صلاح محمد احمد بن نسر",16,11,{"$f":"SUM(C4:D4)","v":27},12,20,{"$f":"SUM(F4:G4)","v":32},12,19,{"$f":"SUM(I4:J4)","v":31},12,26,{"$f":"SUM(L4:M4)","v":38},18,24,{"$f":"SUM(O4:P4)","v":42},16,18,{"$f":"SUM(R4:S4)","v":34},14,21,{"$f":"SUM(U4:V4)","v":35},{"$f":"SUM(E4,H4,K4,N4,Q4,T4,W4)","v":239},{"$f":"X4/350","v":0.68285714285714283},{"$f":"IF($X4=\"\",\"\",IF(COUNTIF($X$4:$X4,$X4)=1,Order_Salim(RANK($X4,$X$4:$X$1000)),Order_Salim(RANK($X4,$X$4:$X$1000))&\" مكرّر  \"))","v":"السّادس"},{"$f":"IF($B4=\"\",\"\",VLOOKUP(50*$Y4,$AB$4:$AD$8,3,1))","v":"جيد"},0,33,"مقبول"]
[{"$f":"IF($B5=\"\",\"\",MAX($A$3:$A4)+1)","v":2}," ابراهيم محمد عبدالله علي سنان",16,22,{"$f":"SUM(C5:D5)","v":38},14,18,{"$f":"SUM(F5:G5)","v":32},14,25,{"$f":"SUM(I5:J5)","v":39},12,17,{"$f":"SUM(L5:M5)","v":29},12,15,{"$f":"SUM(O5:P5)","v":27},12,15,{"$f":"SUM(R5:S5)","v":27},16,12,{"$f":"SUM(U5:V5)","v":28},{"$f":"SUM(E5,H5,K5,N5,Q5,T5,W5)","v":220},{"$f":"X5/350","v":0.62857142857142856},{"$f":"IF($X5=\"\",\"\",IF(COUNTIF($X$4:$X5,$X5)=1,Order_Salim(RANK($X5,$X$4:$X$1000)),Order_Salim(RANK($X5,$X$4:$X$1000))&\" مكرّر  \"))","v":"التّاسع"},{"$f":"IF($B5=\"\",\"\",VLOOKUP(50*$Y5,$AB$4:$AD$8,3,1))","v":"مقبول"},33,38,"جيد"]
[{"$f":"IF($B6=\"\",\"\",MAX($A$3:$A5)+1)","v":3}," ابوبكر احمد ابوبكر احمد بن حسن",16,10,26,14,14,28,10,21,31,12,23,35,18,15,33,12,17,29,14,24,38,220,0.62857142857142856,{"$f":"IF($X6=\"\",\"\",IF(COUNTIF($X$4:$X6,$X6)=1,Order_Salim(RANK($X6,$X$4:$X$1000)),Order_Salim(RANK($X6,$X$4:$X$1000))&\" مكرّر  \"))","v":"التّاسع مكرّر  "},"مقبول",38,48,"جيد جداً"]
[{"$f":"IF($B7=\"\",\"\",MAX($A$3:$A6)+1)","v":4}," ابوبكر احمد صالح سالم الحطيبي",14,8,22,14,15,29,8,18,26,8,15,23,18,17,35,14,8,22,14,13,27,184,0.52571428571428569,{"$f":"IF($X7=\"\",\"\",IF(COUNTIF($X$4:$X7,$X7)=1,Order_Salim(RANK($X7,$X$4:$X$1000)),Order_Salim(RANK($X7,$X$4:$X$1000))&\" مكرّر  \"))","v":"الحادي عشر"},"مقبول",48,50,"ممتاز"]
[{"$f":"IF($B8=\"\",\"\",MAX($A$3:$A7)+1)","v":5}," احمد انيس عبدالله محمد سالم عمر",20,30,50,20,29,49,20,29,49,18,27,45,20,29,49,20,24,44,18,30,48,334,0.95428571428571429,{"$f":"IF($X8=\"\",\"\",IF(COUNTIF($X$4:$X8,$X8)=1,Order_Salim(RANK($X8,$X$4:$X$1000)),Order_Salim(RANK($X8,$X$4:$X$1000))&\" مكرّر  \"))","v":"الأوّل"},"جيد جداً"]
[{"$f":"IF($B9=\"\",\"\",MAX($A$3:$A8)+1)","v":6}," احمد حسن احمد محمد زومع",14,9,23,10,18,28,6,16,22,16,7,23,16,15,31,14,9,23,12,12,24,174,0.49714285714285716,{"$f":"IF($X9=\"\",\"\",IF(COUNTIF($X$4:$X9,$X9)=1,Order_Salim(RANK($X9,$X$4:$X$1000)),Order_Salim(RANK($X9,$X$4:$X$1000))&\" مكرّر  \"))","v":"الثّاني عشر"},"مقبول"]
[{"$f":"IF($B10=\"\",\"\",MAX($A$3:$A9)+1)","v":7}," احمد محمد احمد عبدالله دينيش",14,11,25,12,7,19,10,8,18,10,8,18,12,6,18,10,16,26,14,11,25,149,0.42571428571428571,{"$f":"IF($X10=\"\",\"\",IF(COUNTIF($X$4:$X10,$X10)=1,Order_Salim(RANK($X10,$X$4:$X$1000)),Order_Salim(RANK($X10,$X$4:$X$1000))&\" مكرّر  \"))","v":"السّابع عشر"},"مقبول"]
[{"$f":"IF($B11=\"\",\"\",MAX($A$3:$A10)+1)","v":8}," احمد محمد احمد محمد زومع",20,30,50,18,27,45,16,26,42,18,28,46,20,27,47,18,19,37,18,21,39,306,0.87428571428571433,{"$f":"IF($X11=\"\",\"\",IF(COUNTIF($X$4:$X11,$X11)=1,Order_Salim(RANK($X11,$X$4:$X$1000)),Order_Salim(RANK($X11,$X$4:$X$1000))&\" مكرّر  \"))","v":"الثّاني"},"جيد جداً"]
[{"$f":"IF($B12=\"\",\"\",MAX($A$3:$A11)+1)","v":9}," امجد علي عبدالله حسن العلهي",18,30,48,16,28,44,16,25,41,12,28,40,12,25,37,12,21,33,16,28,44,287,0.82,{"$f":"IF($X12=\"\",\"\",IF(COUNTIF($X$4:$X12,$X12)=1,Order_Salim(RANK($X12,$X$4:$X$1000)),Order_Salim(RANK($X12,$X$4:$X$1000))&\" مكرّر  \"))","v":"الثّالث"},"جيد جداً"]
[{"$f":"IF($B13=\"\",\"\",MAX($A$3:$A12)+1)","v":10}," انور محمد صالح بن صالح الشرفي",10,10,20,10,11,21,8,10,18,10,8,18,10,6,16,12,15,27,16,10,26,146,0.41714285714285715,{"$f":"IF($X13=\"\",\"\",IF(COUNTIF($X$4:$X13,$X13)=1,Order_Salim(RANK($X13,$X$4:$X$1000)),Order_Salim(RANK($X13,$X$4:$X$1000))&\" مكرّر  \"))","v":"الثّامن عشر"},"مقبول"]
[{"$f":"IF($B14=\"\",\"\",MAX($A$3:$A13)+1)","v":11}," حسام صالح محمد بن محمد سنان",12,13,25,10,13,23,12,17,29,14,12,26,8,8,16,12,19,31,14,6,20,170,0.48571428571428571,{"$f":"IF($X14=\"\",\"\",IF(COUNTIF($X$4:$X14,$X14)=1,Order_Salim(RANK($X14,$X$4:$X$1000)),Order_Salim(RANK($X14,$X$4:$X$1000))&\" مكرّر  \"))","v":"الثّالث عشر"},"مقبول"]
[{"$f":"IF($B15=\"\",\"\",MAX($A$3:$A14)+1)","v":12}," خالد محمد حسين محمد العربي",14,10,24,10,15,25,10,13,23,12,14,26,12,15,27,10,20,30,1,14,15,170,0.48571428571428571,{"$f":"IF($X15=\"\",\"\",IF(COUNTIF($X$4:$X15,$X15)=1,Order_Salim(RANK($X15,$X$4:$X$1000)),Order_Salim(RANK($X15,$X$4:$X$1000))&\" مكرّر  \"))","v":"الثّالث عشر مكرّر  "},"مقبول"]
[{"$f":"IF($B16=\"\",\"\",MAX($A$3:$A15)+1)","v":13}," خالد محمد عبدالله ناصر بيبك",12,9,21,6,8,14,6,9,15,8,11,19,8,6,14,12,10,22,14,9,23,128,0.36571428571428571,{"$f":"IF($X16=\"\",\"\",IF(COUNTIF($X$4:$X16,$X16)=1,Order_Salim(RANK($X16,$X$4:$X$1000)),Order_Salim(RANK($X16,$X$4:$X$1000))&\" مكرّر  \"))","v":"التّاسع عشر"},"مقبول"]
[{"$f":"IF($B17=\"\",\"\",MAX($A$3:$A16)+1)","v":14}," راشد ماجد عبدالرب عبدالسلام",20,24,44,16,24,40,18,20,38,16,26,42,16,18,34,12,11,23,16,20,36,257,0.73428571428571432,{"$f":"IF($X17=\"\",\"\",IF(COUNTIF($X$4:$X17,$X17)=1,Order_Salim(RANK($X17,$X$4:$X$1000)),Order_Salim(RANK($X17,$X$4:$X$1000))&\" مكرّر  \"))","v":"الخامس"},"جيد"]
[{"$f":"IF($B18=\"\",\"\",MAX($A$3:$A17)+1)","v":15}," رايد محمد عبدالله بن عبدالله سواد",20,18,38,18,26,44,16,27,43,14,27,41,12,16,28,16,15,31,18,30,48,273,0.78,{"$f":"IF($X18=\"\",\"\",IF(COUNTIF($X$4:$X18,$X18)=1,Order_Salim(RANK($X18,$X$4:$X$1000)),Order_Salim(RANK($X18,$X$4:$X$1000))&\" مكرّر  \"))","v":"الرّابع"},"جيد جداً"]
[{"$f":"IF($B19=\"\",\"\",MAX($A$3:$A18)+1)","v":16}," سالم محمد ابوبكر احمد طرموم",14,5,19,12,10,22,10,11,21,12,12,24,14,10,24,14,12,26,14,14,28,164,0.46857142857142858,{"$f":"IF($X19=\"\",\"\",IF(COUNTIF($X$4:$X19,$X19)=1,Order_Salim(RANK($X19,$X$4:$X$1000)),Order_Salim(RANK($X19,$X$4:$X$1000))&\" مكرّر  \"))","v":"السّادس عشر"},"مقبول"]
[{"$f":"IF($B20=\"\",\"\",MAX($A$3:$A19)+1)","v":17}," سلطان عبدالخالق حسين ابوبكر الحقبي",16,12,28,14,21,35,12,24,36,14,13,27,16,15,31,12,22,34,16,26,42,233,0.6657142857142857,{"$f":"IF($X20=\"\",\"\",IF(COUNTIF($X$4:$X20,$X20)=1,Order_Salim(RANK($X20,$X$4:$X$1000)),Order_Salim(RANK($X20,$X$4:$X$1000))&\" مكرّر  \"))","v":"الثّامن"},"جيد"]
[{"$f":"IF($B21=\"\",\"\",MAX($A$3:$A20)+1)","v":18}," صالح ابوبكر عبدالله علي  سنان",14,8,22,10,11,21,8,7,15,10,10,20,10,2,12,8,15,23,10,3,13,126,0.36,{"$f":"IF($X21=\"\",\"\",IF(COUNTIF($X$4:$X21,$X21)=1,Order_Salim(RANK($X21,$X$4:$X$1000)),Order_Salim(RANK($X21,$X$4:$X$1000))&\" مكرّر  \"))","v":"العشرون"},"مقبول"]
[{"$f":"IF($B22=\"\",\"\",MAX($A$3:$A21)+1)","v":19}," صالح احمد حسين صالح سالم عمر",16,15,31,16,26,42,12,19,31,12,13,25,18,20,38,12,15,27,18,26,44,238,0.68,{"$f":"IF($X22=\"\",\"\",IF(COUNTIF($X$4:$X22,$X22)=1,Order_Salim(RANK($X22,$X$4:$X$1000)),Order_Salim(RANK($X22,$X$4:$X$1000))&\" مكرّر  \"))","v":"السّابع"},"جيد"]
[{"$f":"IF($B23=\"\",\"\",MAX($A$3:$A22)+1)","v":20}," صالح حسين عبدالرب عبدالله سنان",14,8,22,6,11,17,10,12,22,12,10,22,12,15,27,12,16,28,14,13,27,165,0.47142857142857142,{"$f":"IF($X23=\"\",\"\",IF(COUNTIF($X$4:$X23,$X23)=1,Order_Salim(RANK($X23,$X$4:$X$1000)),Order_Salim(RANK($X23,$X$4:$X$1000))&\" مكرّر  \"))","v":"الخامس عشر"},"مقبول"]
[{"$f":"IF($B24=\"\",\"\",MAX($A$3:$A23)+1)","v":""},null,null,null,null,null,null,null,null,null,null,null,null,null,null,null,null,null,null,null,null,null,null,null,null,{"$f":"IF($X24=\"\",\"\",IF(COUNTIF($X$4:$X24,$X24)=1,Order_Salim(RANK($X24,$X$4:$X$1000)),Order_Salim(RANK($X24,$X$4:$X$1000))&\" مكرّر  \"))","v":""},""]
[{"$f":"IF($B25=\"\",\"\",MAX($A$3:$A24)+1)","v":""},null,null,null,null,null,null,null,null,null,null,null,null,null,null,null,null,null,null,null,null,null,null,null,null,{"$f":"IF($X25=\"\",\"\",IF(COUNTIF($X$4:$X25,$X25)=1,Order_Salim(RANK($X25,$X$4:$X$1000)),Order_Salim(RANK($X25,$X$4:$X$1000))&\" مكرّر  \"))","v":""},""]
[{"$f":"IF($B26=\"\",\"\",MAX($A$3:$A25)+1)","v":""},null,null,null,null,null,null,null,null,null,null,null,null,null,null,null,null,null,null,null,null,null,null,null,null,{"$f":"IF($X26=\"\",\"\",IF(COUNTIF($X$4:$X26,$X26)=1,Order_Salim(RANK($X26,$X$4:$X$1000)),Order_Salim(RANK($X26,$X$4:$X$1000))&\" مكرّر  \"))","v":""},""]
[{"$f":"IF($B27=\"\",\"\",MAX($A$3:$A26)+1)","v":""},null,null,null,null,null,null,null,null,null,null,null,null,null,null,null,null,null,null,null,null,null,null,null,null,{"$f":"IF($X27=\"\",\"\",IF(COUNTIF($X$4:$X27,$X27)=1,Order_Salim(RANK($X27,$X$4:$X$1000)),Order_Salim(RANK($X27,$X$4:$X$1000))&\" مكرّر  \"))","v":""},""]
[{"$f":"IF($B28=\"\",\"\",MAX($A$3:$A27)+1)","v":""},null,null,null,null,null,null,null,null,null,null,null,null,null,null,null,null,null,null,null,null,null,null,null,null,{"$f":"IF($X28=\"\",\"\",IF(COUNTIF($X$4:$X28,$X28)=1,Order_Salim(RANK($X28,$X$4:$X$1000)),Order_Salim(RANK($X28,$X$4:$X$1000))&\" مكرّر  \"))","v":""},""]
[{"$f":"IF($B29=\"\",\"\",MAX($A$3:$A28)+1)","v":""},null,null,null,null,null,null,null,null,null,null,null,null,null,null,null,null,null,null,null,null,null,null,null,null,{"$f":"IF($X29=\"\",\"\",IF(COUNTIF($X$4:$X29,$X29)=1,Order_Salim(RANK($X29,$X$4:$X$1000)),Order_Salim(RANK($X29,$X$4:$X$1000))&\" مكرّر  \"))","v":""},""]
[{"$f":"IF($B30=\"\",\"\",MAX($A$3:$A29)+1)","v":""},null,null,null,null,null,null,null,null,null,null,null,null,null,null,null,null,null,null,null,null,null,null,null,null,{"$f":"IF($X30=\"\",\"\",IF(COUNTIF($X$4:$X30,$X30)=1,Order_Salim(RANK($X30,$X$4:$X$1000)),Order_Salim(RANK($X30,$X$4:$X$1000))&\" مكرّر  \"))","v":""},""]
[{"$f":"IF($B31=\"\",\"\",MAX($A$3:$A30)+1)","v":""},null,null,null,null,null,null,null,null,null,null,null,null,null,null,null,null,null,null,null,null,null,null,null,null,{"$f":"IF($X31=\"\",\"\",IF(COUNTIF($X$4:$X31,$X31)=1,Order_Salim(RANK($X31,$X$4:$X$1000)),Order_Salim(RANK($X31,$X$4:$X$1000))&\" مكرّر  \"))","v":""},""]
[{"$f":"IF($B32=\"\",\"\",MAX($A$3:$A31)+1)","v":""},null,null,null,null,null,null,null,null,null,null,null,null,null,null,null,null,null,null,null,null,null,null,null,null,{"$f":"IF($X32=\"\",\"\",IF(COUNTIF($X$4:$X32,$X32)=1,Order_Salim(RANK($X32,$X$4:$X$1000)),Order_Salim(RANK($X32,$X$4:$X$1000))&\" مكرّر  \"))","v":""},""]
[{"$f":"IF($B33=\"\",\"\",MAX($A$3:$A32)+1)","v":""},null,null,null,null,null,null,null,null,null,null,null,null,null,null,null,null,null,null,null,null,null,null,null,null,{"$f":"IF($X33=\"\",\"\",IF(COUNTIF($X$4:$X33,$X33)=1,Order_Salim(RANK($X33,$X$4:$X$1000)),Order_Salim(RANK($X33,$X$4:$X$1000))&\" مكرّر  \"))","v":""},""]
[{"$f":"IF($B34=\"\",\"\",MAX($A$3:$A33)+1)","v":""},null,null,null,null,null,null,null,null,null,null,null,null,null,null,null,null,null,null,null,null,null,null,null,null,{"$f":"IF($X34=\"\",\"\",IF(COUNTIF($X$4:$X34,$X34)=1,Order_Salim(RANK($X34,$X$4:$X$1000)),Order_Salim(RANK($X34,$X$4:$X$1000))&\" مكرّر  \"))","v":""},""]
[{"$f":"IF($B35=\"\",\"\",MAX($A$3:$A34)+1)","v":""},null,null,null,null,null,null,null,null,null,null,null,null,null,null,null,null,null,null,null,null,null,null,null,null,{"$f":"IF($X35=\"\",\"\",IF(COUNTIF($X$4:$X35,$X35)=1,Order_Salim(RANK($X35,$X$4:$X$1000)),Order_Salim(RANK($X35,$X$4:$X$1000))&\" مكرّر  \"))","v":""},""]
[{"$f":"IF($B36=\"\",\"\",MAX($A$3:$A35)+1)","v":""},null,null,null,null,null,null,null,null,null,null,null,null,null,null,null,null,null,null,null,null,null,null,null,null,{"$f":"IF($X36=\"\",\"\",IF(COUNTIF($X$4:$X36,$X36)=1,Order_Salim(RANK($X36,$X$4:$X$1000)),Order_Salim(RANK($X36,$X$4:$X$1000))&\" مكرّر  \"))","v":""},""]
[{"$f":"IF($B37=\"\",\"\",MAX($A$3:$A36)+1)","v":""},null,null,null,null,null,null,null,null,null,null,null,null,null,null,null,null,null,null,null,null,null,null,null,null,{"$f":"IF($X37=\"\",\"\",IF(COUNTIF($X$4:$X37,$X37)=1,Order_Salim(RANK($X37,$X$4:$X$1000)),Order_Salim(RANK($X37,$X$4:$X$1000))&\" مكرّر  \"))","v":""},""]
[{"$f":"IF($B38=\"\",\"\",MAX($A$3:$A37)+1)","v":""},null,null,null,null,null,null,null,null,null,null,null,null,null,null,null,null,null,null,null,null,null,null,null,null,{"$f":"IF($X38=\"\",\"\",IF(COUNTIF($X$4:$X38,$X38)=1,Order_Salim(RANK($X38,$X$4:$X$1000)),Order_Salim(RANK($X38,$X$4:$X$1000))&\" مكرّر  \"))","v":""},""]
[{"$f":"IF($B39=\"\",\"\",MAX($A$3:$A38)+1)","v":""},null,null,null,null,null,null,null,null,null,null,null,null,null,null,null,null,null,null,null,null,null,null,null,null,{"$f":"IF($X39=\"\",\"\",IF(COUNTIF($X$4:$X39,$X39)=1,Order_Salim(RANK($X39,$X$4:$X$1000)),Order_Salim(RANK($X39,$X$4:$X$1000))&\" مكرّر  \"))","v":""},""]
[{"$f":"IF($B40=\"\",\"\",MAX($A$3:$A39)+1)","v":""},null,null,null,null,null,null,null,null,null,null,null,null,null,null,null,null,null,null,null,null,null,null,null,null,{"$f":"IF($X40=\"\",\"\",IF(COUNTIF($X$4:$X40,$X40)=1,Order_Salim(RANK($X40,$X$4:$X$1000)),Order_Salim(RANK($X40,$X$4:$X$1000))&\" مكرّر  \"))","v":""},""]
{"$rows_left_out":265}
{"sheet":"ورقة2","index":1,"n_rows":21,"n_cols":12,"rows_kept":21,"cut":false,"hidden":false,"merged":[[1,11,2,11],[1,10,2,10],[17,0,17,4],[7,0,9,0],[7,1,7,2],[8,1,8,2],[7,3,7,4],[8,3,8,4],[7,5,7,6],[8,5,8,6]]}
[]
[null,null,null,null,null,null,null,null,null,null,"رقم الطالب",20]
["إخطار بنتيجة الفصل الدراسي الأول  ( مرحلة التعليم الأساسي )"]
[]
[null,"اسم الطالب : ",{"$f":"IF(OR($L$2=\"\",$L$2>MAX(ورقة1!$A:$A)),\"\",OFFSET(ورقة1!$B$1,MATCH($L$2,ورقة1!$A:$A,0)-1,0))","v":" صالح حسين عبدالرب عبدالله سنان"}]
["         "]
["الصــــــــف  :      (  الثامن  )                       شعبة (   أ  )                         العام الدراسي     2018  /   2019 م"]
["المواد الدراسية","المحصلة الأولى",null,"امتحان الفصل الأول",null,"المجمــــــــــــــوع"]
[null,0.2,null,0.3,null,0.5,null,"ملاحظة رائد الفصل : ....................................."]
[null,"رقمـا","كتــابـــة","رقمــا","كتـابـــة","رقمــا","كتــابـــة","................................................................"]
["القـرآن الكـريــــم",{"$f":"IF(OR($L$2=\"\",$L$2>MAX(ورقة1!$A:$A)),\"\",OFFSET(ورقة1!$A$1,MATCH($L$2,ورقة1!$A:$A,0)-1,MATCH($A11,ورقة1!$1:$1,0)-1))","v":14},null,{"$f":"IF(OR($L$2=\"\",$L$2>MAX(ورقة1!$A:$A)),\"\",OFFSET(ورقة1!$A$1,MATCH($L$2,ورقة1!$A:$A,0)-1,MATCH($A11,ورقة1!$1:$1,0)))","v":8},null,{"$f":"IF(OR($L$2=\"\",$L$2>MAX(ورقة1!$A:$A)),\"\",OFFSET(ورقة1!$A$1,MATCH($L$2,ورقة1!$A:$A,0)-1,MATCH($A11,ورقة1!$1:$1,0)+1))","v":22},null,"................................................................"]
["التربية الإسلامية",{"$f":"IF(OR($L$2=\"\",$L$2>MAX(ورقة1!$A:$A)),\"\",OFFSET(ورقة1!$A$1,MATCH($L$2,ورقة1!$A:$A,0)-1,MATCH($A12,ورقة1!$1:$1,0)-1))","v":6},null,{"$f":"IF(OR($L$2=\"\",$L$2>MAX(ورقة1!$A:$A)),\"\",OFFSET(ورقة1!$A$1,MATCH($L$2,ورقة1!$A:$A,0)-1,MATCH($A12,ورقة1!$1:$1,0)))","v":11},null,{"$f":"IF(OR($L$2=\"\",$L$2>MAX(ورقة1!$A:$A)),\"\",OFFSET(ورقة1!$A$1,MATCH($L$2,ورقة1!$A:$A,0)-1,MATCH($A12,ورقة1!$1:$1,0)+1))","v":17},null,"التوقيع : ...................................................."]
["اللغـة العـربيــــة",{"$f":"IF(OR($L$2=\"\",$L$2>MAX(ورقة1!$A:$A)),\"\",OFFSET(ورقة1!$A$1,MATCH($L$2,ورقة1!$A:$A,0)-1,MATCH($A13,ورقة1!$1:$1,0)-1))","v":10},null,{"$f":"IF(OR($L$2=\"\",$L$2>MAX(ورقة1!$A:$A)),\"\",OFFSET(ورقة1!$A$1,MATCH($L$2,ورقة1!$A:$A,0)-1,MATCH($A13,ورقة1!$1:$1,0)))","v":12},null,{"$f":"IF(OR($L$2=\"\",$L$2>MAX(ورقة1!$A:$A)),\"\",OFFSET(ورقة1!$A$1,MATCH($L$2,ورقة1!$A:$A,0)-1,MATCH($A13,ورقة1!$1:$1,0)+1))","v":22},null,"التاريخ : ....................................................."]
["اللغة الانجليزية",{"$f":"IF(OR($L$2=\"\",$L$2>MAX(ورقة1!$A:$A)),\"\",OFFSET(ورقة1!$A$1,MATCH($L$2,ورقة1!$A:$A,0)-1,MATCH($A14,ورقة1!$1:$1,0)-1))","v":12},null,{"$f":"IF(OR($L$2=\"\",$L$2>MAX(ورقة1!$A:$A)),\"\",OFFSET(ورقة1!$A$1,MATCH($L$2,ورقة1!$A:$A,0)-1,MATCH($A14,ورقة1!$1:$1,0)))","v":10},null,{"$f":"IF(OR($L$2=\"\",$L$2>MAX(ورقة1!$A:$A)),\"\",OFFSET(ورقة1!$A$1,MATCH($L$2,ورقة1!$A:$A,0)-1,MATCH($A14,ورقة1!$1:$1,0)+1))","v":22},null,"ملاحظات مديرالمدرسة : .................................."]
["الـريـــاضـيــــات",{"$f":"IF(OR($L$2=\"\",$L$2>MAX(ورقة1!$A:$A)),\"\",OFFSET(ورقة1!$A$1,MATCH($L$2,ورقة1!$A:$A,0)-1,MATCH($A15,ورقة1!$1:$1,0)-1))","v":12},null,{"$f":"IF(OR($L$2=\"\",$L$2>MAX(ورقة1!$A:$A)),\"\",OFFSET(ورقة1!$A$1,MATCH($L$2,ورقة1!$A:$A,0)-1,MATCH($A15,ورقة1!$1:$1,0)))","v":15},null,{"$f":"IF(OR($L$2=\"\",$L$2>MAX(ورقة1!$A:$A)),\"\",OFFSET(ورقة1!$A$1,MATCH($L$2,ورقة1!$A:$A,0)-1,MATCH($A15,ورقة1!$1:$1,0)+1))","v":27},null,"................................................................"]
["العلـوم الصحيــة",{"$f":"IF(OR($L$2=\"\",$L$2>MAX(ورقة1!$A:$A)),\"\",OFFSET(ورقة1!$A$1,MATCH($L$2,ورقة1!$A:$A,0)-1,MATCH($A16,ورقة1!$1:$1,0)-1))","v":12},null,{"$f":"IF(OR($L$2=\"\",$L$2>MAX(ورقة1!$A:$A)),\"\",OFFSET(ورقة1!$A$1,MATCH($L$2,ورقة1!$A:$A,0)-1,MATCH($A16,ورقة1!$1:$1,0)))","v":16},null,{"$f":"IF(OR($L$2=\"\",$L$2>MAX(ورقة1!$A:$A)),\"\",OFFSET(ورقة1!$A$1,MATCH($L$2,ورقة1!$A:$A,0)-1,MATCH($A16,ورقة1!$1:$1,0)+1))","v":28},null,"................................................................"]
["الاجتمــاعـيـــات",{"$f":"IF(OR($L$2=\"\",$L$2>MAX(ورقة1!$A:$A)),\"\",OFFSET(ورقة1!$A$1,MATCH($L$2,ورقة1!$A:$A,0)-1,MATCH($A17,ورقة1!$1:$1,0)-1))","v":14},null,{"$f":"IF(OR($L$2=\"\",$L$2>MAX(ورقة1!$A:$A)),\"\",OFFSET(ورقة1!$A$1,MATCH($L$2,ورقة1!$A:$A,0)-1,MATCH($A17,ورقة1!$1:$1,0)))","v":13},null,{"$f":"IF(OR($L$2=\"\",$L$2>MAX(ورقة1!$A:$A)),\"\",OFFSET(ورقة1!$A$1,MATCH($L$2,ورقة1!$A:$A,0)-1,MATCH($A17,ورقة1!$1:$1,0)+1))","v":27},null,"التوقيع : ...................................................."]
["المجـمـــــــــــــــــــــــــــــــــــــــــــــــــوع الكلـــــي",null,null,null,null,{"$f":"IF(OR($L$2=\"\",$L$2>MAX(ورقة1!$A:$A)),\"\",OFFSET(ورقة1!$X$1,MATCH($L$2,ورقة1!$A:$A,0)-1,0))","v":165},null,"التاريخ : .............................."]
[{"$f":"\"الترتيب : ( \"&IF(OR($L$2=\"\",$L$2>MAX(ورقة1!$A:$A)),\"\",OFFSET(ورقة1!$Z$1,MATCH($L$2,ورقة1!$A:$A,0)-1,0))&\" )\"","v":"الترتيب : ( الخامس عشر )"},null,null,null,null,{"$f":"\"التـقـديــر ( \"&IF(OR($L$2=\"\",$L$2>MAX(ورقة1!$A:$A)),\"\",OFFSET(ورقة1!$AA$1,MATCH($L$2,ورقة1!$A:$A,0)-1,0))&\" )\"","v":"التـقـديــر ( مقبول )"}]
[]
[null,"إدارة التربية والتعليم",null,null,null,null,"مكتب التربية والتعليم بالمديرية"]