{"text_format":"1","workbook":"xlsx","n_sheets":2,"sheets":["ورقة1","ورقة2"],"not_rendered":{"charts":0,"images":5,"macros":1,"external_links":0,"defined_names":4,"comments":0,"pivot_tables":0},"unopened":[],"bounds":{"document_bytes":16777216,"sheet_cells":100000,"rows_first":2000,"rows_last":500,"rows_between":2000,"halvings":0,"cell_chars":16384,"cell_head_chars":4096},"cells_cut":0,"cells_raw":0,"read":"whole","date_system":"1900"}

{"sheet":"ورقة1","index":0,"n_rows":41,"n_cols":256,"rows_kept":41,"cut":false,"hidden":false,"merged":[[0,0,2,0],[0,1,2,1],[0,25,2,25],[0,27,2,27],[0,24,1,24],[0,2,2,2],[0,30,2,31],[0,28,2,28],[0,21,0,23],[0,3,0,5],[0,6,0,8],[0,9,0,11],[0,12,0,14],[0,15,0,17],[0,18,0,20],[0,26,2,26]]}
["مسلسل","اسم الطالب","رقم الجلوس","القران ",null,null,"اسلامية ",null,null,"اللغة العربية ",null,null,"انجليزي",null,null,"رياضيات",null,null,"العلوم ",null,null,"اجتماعيات",null,null,"مجموع الكلي","نسبة مؤية","عمود مساعد للمجموع الكلي دون تكرارات","ترتيب","القدير",null,"تقدير الطالب"]
[null,null,null,"محصلة الاختبارات","الامتحان","المجموع","محصلة الاختبارات","الامتحان","المجموع","محصلة الاختبارات","الامتحان","المجموع","محصلة الاختبارات","الامتحان","المجموع","محصلة الاختبارات","الامتحان","المجموع","محصلة الاختبارات","الامتحان","المجموع","محصلة الاختبارات","الامتحان","المجموع"]
[null,null,null,20,30,50,20,30,50,20,30,50,20,30,50,20,30,50,20,30,50,20,30,50,{"$f":"SUM(F3,I3,L3,O3,R3,U3,X3)","v":350},null,null,null,null,null,null,null,null,null,null,null,null,null,null,null,null,null,null,null,null,null,null,null,null,null,null,null,null,null,null,null,null,null,null,null,null,null,null,null,null,null,null,null,null,null,null,null,null,null,null,null,null,null,null,null,null,null,null,null,null,null,null,null,null,null,null,null,null,null,null,null,null,null,null,null,null,null,null,null,null,null,null,null,null,null,null,null,null,null,null,null,null,null,null,null,null,null,null,null,null,null,null,null,null,null,null,null,null,null,null,null,null,null,null,null,null,null,null,null,null,null,null,null,null,null,null,null,null,null,null,null,null,null,null,null,null,null,null,null,null,null,null,null,null,null,null,null,null,null,null,null,null,null,null,null,null,null,null,null,null,null,null,null,null,null,null,null,null,null,null,null,null,null,null,null,null,null,null,null,null,null,null,null,null,null,null,null,null,null,null,null,null,null,null,null,null,null,null,null,null,null,null,null,null,null,null,null,null,null,null,null,null,null,null,null,null,null,null,null,null,null,null,null,null,null,null,null,null,null,"غ","غائب"]
[1,"طالب 1",1,14,17,31,10,15,25,14,16,30,null,null,null,16,20,36,16,25,41,14,14,28,{"$f":"SUM(F4,I4,L4,O4,R4,U4,X4)","v":191},{"$f":"Y4/$Y$3","v":0.54571428571428571},{"$f":"IF(MIN(IF(Notes<>\"\",IF(COUNTIF($AA$3:$AA3,Notes)=0,ROW(Notes))))=0,\"\",INDEX($Y:$Y,MIN(IF(Notes<>\"\",IF(COUNTIF($AA$3:$AA3,Notes)=0,ROW(Notes))))))","v":191},{"$f":"IF($A4=\"\",\"\",OrdeUP100(RANK($Y4,$AA$4:$AA$155))&IF(COUNTIF($Y$3:$Y3,$Y4)=0,\"\",\" مكرر\"))","v":"الحادي والعشرون"},{"$f":"IF($A4=\"\",\"\",VLOOKUP(100*$Z4,$AE$4:$AF$8,2,1))","v":"مقبول"},null,0,"ضعيف",null,{"$f":"IF(MIN(IF(Notes<>\"\",IF(COUNTIF($AH$3:$AH3,Notes)=0,ROW(Notes))))=0,\"\",INDEX($Y:$Y,MIN(IF(Notes<>\"\",IF(COUNTIF($AH$3:$AH3,Notes)=0,ROW(Notes))))))","v":191},null,null,null,null,null,null,null,null,null,null,null,null,null,null,null,null,null,null,null,null,null,null,null,null,null,null,null,null,null,null,null,null,null,null,null,null,null,null,null,null,null,null,null,null,null,null,null,null,null,null,null,null,null,null,null,null,null,null,null,null,null,null,null,null,null,null,null,null,null,null,null,null,null,null,null,null,null,null,null,null,null,null,null,null,null,null,null,null,null,null,null,null,null,null,null,null,null,null,null,null,null,null,null,null,null,null,null,null,null,null,null,null,null,null,null,null,null,null,null,null,null,null,null,null,null,null,null,null,null,null,null,null,null,null,null,null,null,null,null,null,null,null,null,null,null,null,null,null,null,null,null,null,null,null,null,null,null,null,null,null,null,null,null,null,null,null,null,null,null,null,null,null,null,null,null,null,null,null,null,null,null,null,null,null,null,null,null,null,null,null,null,null,null,null,null,null,null,null,null,null,null,null,null,null,null,null,null,null,null,null,null,null,null,null,null,null,null,null,null,null,0,"ضعيف"]
[2,"طالب 2",2,18,27,45,20,30,50,18,20,38,null,null,null,18,29,47,20,30,50,18,30,48,{"$f":"SUM(F5,I5,L5,O5,R5,U5,X5)","v":278},{"$f":"Y5/$Y$3","v":0.79428571428571426},{"$f":"IF(MIN(IF(Notes<>\"\",IF(COUNTIF($AA$3:$AA4,Notes)=0,ROW(Notes))))=0,\"\",INDEX($Y:$Y,MIN(IF(Notes<>\"\",IF(COUNTIF($AA$3:$AA4,Notes)=0,ROW(Notes))))))","v":278},{"$f":"IF($A5=\"\",\"\",OrdeUP100(RANK($Y5,$AA$4:$AA$155))&IF(COUNTIF($Y$3:$Y4,$Y5)=0,\"\",\" مكرر\"))","v":"الرّابع"},{"$f":"IF($A5=\"\",\"\",VLOOKUP(100*$Z5,$AE$4:$AF$8,2,1))","v":"جيد"},null,50,"مقبول",null,{"$f":"IF(MIN(IF(Notes<>\"\",IF(COUNTIF($AH$3:$AH4,Notes)=0,ROW(Notes))))=0,\"\",INDEX($Y:$Y,MIN(IF(Notes<>\"\",IF(COUNTIF($AH$3:$AH4,Notes)=0,ROW(Notes))))))","v":278},null,null,null,null,null,null,null,null,null,null,null,null,null,null,null,null,null,null,null,null,null,null,null,null,null,null,null,null,null,null,null,null,null,null,null,null,null,null,null,null,null,null,null,null,null,null,null,null,null,null,null,null,null,null,null,null,null,null,null,null,null,null,null,null,null,null,null,null,null,null,null,null,null,null,null,null,null,null,null,null,null,null,null,null,null,null,null,null,null,null,null,null,null,null,null,null,null,null,null,null,null,null,null,null,null,null,null,null,null,null,null,null,null,null,null,null,null,null,null,null,null,null,null,null,null,null,null,null,null,null,null,null,null,null,null,null,null,null,null,null,null,null,null,null,null,null,null,null,null,null,null,null,null,null,null,null,null,null,null,null,null,null,null,null,null,null,null,null,null,null,null,null,null,null,null,null,null,null,null,null,null,null,null,null,null,null,null,null,null,null,null,null,null,null,null,null,null,null,null,null,null,null,null,null,null,null,null,null,null,null,null,null,null,null,null,null,null,null,null,null,50,"مقبول"]
[3,"طالب 3",3,12,15,27,16,20,36,10,8,18,null,null,null,14,17,31,18,29,47,12,22,34,193,0.55142857142857138,{"$f":"IF(MIN(IF(Notes<>\"\",IF(COUNTIF($AA$3:$AA5,Notes)=0,ROW(Notes))))=0,\"\",INDEX($Y:$Y,MIN(IF(Notes<>\"\",IF(COUNTIF($AA$3:$AA5,Notes)=0,ROW(Notes))))))","v":193},{"$f":"IF($A6=\"\",\"\",OrdeUP100(RANK($Y6,$AA$4:$AA$155))&IF(COUNTIF($Y$3:$Y5,$Y6)=0,\"\",\" مكرر\"))","v":"العشرون"},"مقبول",null,60,"جيد",null,{"$f":"IF(MIN(IF(Notes<>\"\",IF(COUNTIF($AH$3:$AH5,Notes)=0,ROW(Notes))))=0,\"\",INDEX($Y:$Y,MIN(IF(Notes<>\"\",IF(COUNTIF($AH$3:$AH5,Notes)=0,ROW(Notes))))))","v":193},null,null,null,null,null,null,null,null,null,null,null,null,null,null,null,null,null,null,null,null,null,null,null,null,null,null,null,null,null,null,null,null,null,null,null,null,null,null,null,null,null,null,null,null,null,null,null,null,null,null,null,null,null,null,null,null,null,null,null,null,null,null,null,null,null,null,null,null,null,null,null,null,null,null,null,null,null,null,null,null,null,null,null,null,null,null,null,null,null,null,null,null,null,null,null,null,null,null,null,null,null,null,null,null,null,null,null,null,null,null,null,null,null,null,null,null,null,null,null,null,null,null,null,null,null,null,null,null,null,null,null,null,null,null,null,null,null,null,null,null,null,null,null,null,null,null,null,null,null,null,null,null,null,null,null,null,null,null,null,null,null,null,null,null,null,null,null,null,null,null,null,null,null,null,null,null,null,null,null,null,null,null,null,null,null,null,null,null,null,null,null,null,null,null,null,null,null,null,null,null,null,null,null,null,null,null,null,null,null,null,null,null,null,null,null,null,null,null,null,null,60,"جيد"]
[4,"طالب 4",4,18,30,48,20,30,50,18,30,48,null,null,null,20,30,50,20,30,50,20,30,50,296,0.84571428571428575,{"$f":"IF(MIN(IF(Notes<>\"\",IF(COUNTIF($AA$3:$AA6,Notes)=0,ROW(Notes))))=0,\"\",INDEX($Y:$Y,MIN(IF(Notes<>\"\",IF(COUNTIF($AA$3:$AA6,Notes)=0,ROW(Notes))))))","v":296},{"$f":"IF($A7=\"\",\"\",OrdeUP100(RANK($Y7,$AA$4:$AA$155))&IF(COUNTIF($Y$3:$Y6,$Y7)=0,\"\",\" مكرر\"))","v":"الثّاني"},"جيد جداً",null,80,"جيد جداً",null,{"$f":"IF(MIN(IF(Notes<>\"\",IF(COUNTIF($AH$3:$AH6,Notes)=0,ROW(Notes))))=0,\"\",INDEX($Y:$Y,MIN(IF(Notes<>\"\",IF(COUNTIF($AH$3:$AH6,Notes)=0,ROW(Notes))))))","v":296},null,null,null,null,null,null,null,null,null,null,null,null,null,null,null,null,null,null,null,null,null,null,null,null,null,null,null,null,null,null,null,null,null,null,null,null,null,null,null,null,null,null,null,null,null,null,null,null,null,null,null,null,null,null,null,null,null,null,null,null,null,null,null,null,null,null,null,null,null,null,null,null,null,null,null,null,null,null,null,null,null,null,null,null,null,null,null,null,null,null,null,null,null,null,null,null,null,null,null,null,null,null,null,null,null,null,null,null,null,null,null,null,null,null,null,null,null,null,null,null,null,null,null,null,null,null,null,null,null,null,null,null,null,null,null,null,null,null,null,null,null,null,null,null,null,null,null,null,null,null,null,null,null,null,null,null,null,null,null,null,null,null,null,null,null,null,null,null,null,null,null,null,null,null,null,null,null,null,null,null,null,null,null,null,null,null,null,null,null,null,null,null,null,null,null,null,null,null,null,null,null,null,null,null,null,null,null,null,null,null,null,null,null,null,null,null,null,null,null,null,80,"جيد جداً"]
[5,"طالب 5",5,18,30,48,20,30,50,20,30,50,null,null,null,20,30,50,20,30,50,20,30,50,298,0.85142857142857142,{"$f":"IF(MIN(IF(Notes<>\"\",IF(COUNTIF($AA$3:$AA7,Notes)=0,ROW(Notes))))=0,\"\",INDEX($Y:$Y,MIN(IF(Notes<>\"\",IF(COUNTIF($AA$3:$AA7,Notes)=0,ROW(Notes))))))","v":298},{"$f":"IF($A8=\"\",\"\",OrdeUP100(RANK($Y8,$AA$4:$AA$155))&IF(COUNTIF($Y$3:$Y7,$Y8)=0,\"\",\" مكرر\"))","v":"الأوّل"},"جيد جداً",null,95,"ممتاز",null,{"$f":"IF(MIN(IF(Notes<>\"\",IF(COUNTIF($AH$3:$AH7,Notes)=0,ROW(Notes))))=0,\"\",INDEX($Y:$Y,MIN(IF(Notes<>\"\",IF(COUNTIF($AH$3:$AH7,Notes)=0,ROW(Notes))))))","v":298},null,null,null,null,null,null,null,null,null,null,null,null,null,null,null,null,null,null,null,null,null,null,null,null,null,null,null,null,null,null,null,null,null,null,null,null,null,null,null,null,null,null,null,null,null,null,null,null,null,null,null,null,null,null,null,null,null,null,null,null,null,null,null,null,null,null,null,null,null,null,null,null,null,null,null,null,null,null,null,null,null,null,null,null,null,null,null,null,null,null,null,null,null,null,null,null,null,null,null,null,null,null,null,null,null,null,null,null,null,null,null,null,null,null,null,null,null,null,null,null,null,null,null,null,null,null,null,null,null,null,null,null,null,null,null,null,null,null,null,null,null,null,null,null,null,null,null,null,null,null,null,null,null,null,null,null,null,null,null,null,null,null,null,null,null,null,null,null,null,null,null,null,null,null,null,null,null,null,null,null,null,null,null,null,null,null,null,null,null,null,null,null,null,null,null,null,null,null,null,null,null,null,null,null,null,null,null,null,null,null,null,null,null,null,null,null,null,null,null,null,95,"ممتاز"]
[6,"طالب 6",6,16,30,46,18,30,48,16,30,46,null,null,null,20,30,50,20,30,50,18,28,46,286,0.81714285714285717,{"$f":"IF(MIN(IF(Notes<>\"\",IF(COUNTIF($AA$3:$AA8,Notes)=0,ROW(Notes))))=0,\"\",INDEX($Y:$Y,MIN(IF(Notes<>\"\",IF(COUNTIF($AA$3:$AA8,Notes)=0,ROW(Notes))))))","v":286},{"$f":"IF($A9=\"\",\"\",OrdeUP100(RANK($Y9,$AA$4:$AA$155))&IF(COUNTIF($Y$3:$Y8,$Y9)=0,\"\",\" مكرر\"))","v":"الثّالث"},"جيد جداً",null,null,null,null,{"$f":"IF(MIN(IF(Notes<>\"\",IF(COUNTIF($AH$3:$AH8,Notes)=0,ROW(Notes))))=0,\"\",INDEX($Y:$Y,MIN(IF(Notes<>\"\",IF(COUNTIF($AH$3:$AH8,Notes)=0,ROW(Notes))))))","v":286}]
[7,"طالب 7",7,18,28,46,14,26,40,18,28,46,null,null,null,18,24,42,20,27,47,18,30,48,269,0.76857142857142857,{"$f":"IF(MIN(IF(Notes<>\"\",IF(COUNTIF($AA$3:$AA9,Notes)=0,ROW(Notes))))=0,\"\",INDEX($Y:$Y,MIN(IF(Notes<>\"\",IF(COUNTIF($AA$3:$AA9,Notes)=0,ROW(Notes))))))","v":269},{"$f":"IF($A10=\"\",\"\",OrdeUP100(RANK($Y10,$AA$4:$AA$155))&IF(COUNTIF($Y$3:$Y9,$Y10)=0,\"\",\" مكرر\"))","v":"السّادس"},"جيد",null,null,null,null,{"$f":"IF(MIN(IF(Notes<>\"\",IF(COUNTIF($AH$3:$AH9,Notes)=0,ROW(Notes))))=0,\"\",INDEX($Y:$Y,MIN(IF(Notes<>\"\",IF(COUNTIF($AH$3:$AH9,Notes)=0,ROW(Notes))))))","v":269}]
[8,"طالب 8",8,14,13,27,8,13,21,14,12,26,null,null,null,14,21,35,18,15,33,12,14,26,168,0.48,{"$f":"IF(MIN(IF(Notes<>\"\",IF(COUNTIF($AA$3:$AA10,Notes)=0,ROW(Notes))))=0,\"\",INDEX($Y:$Y,MIN(IF(Notes<>\"\",IF(COUNTIF($AA$3:$AA10,Notes)=0,ROW(Notes))))))","v":168},{"$f":"IF($A11=\"\",\"\",OrdeUP100(RANK($Y11,$AA$4:$AA$155))&IF(COUNTIF($Y$3:$Y10,$Y11)=0,\"\",\" مكرر\"))","v":"السّابع والعشرون"},"ضعيف",null,null,null,null,{"$f":"IF(MIN(IF(Notes<>\"\",IF(COUNTIF($AH$3:$AH10,Notes)=0,ROW(Notes))))=0,\"\",INDEX($Y:$Y,MIN(IF(Notes<>\"\",IF(COUNTIF($AH$3:$AH10,Notes)=0,ROW(Notes))))))","v":168}]
[9,"طالب 9",9,14,14,28,14,20,34,12,18,30,null,null,null,16,18,34,16,26,42,14,18,32,200,0.5714285714285714,{"$f":"IF(MIN(IF(Notes<>\"\",IF(COUNTIF($AA$3:$AA11,Notes)=0,ROW(Notes))))=0,\"\",INDEX($Y:$Y,MIN(IF(Notes<>\"\",IF(COUNTIF($AA$3:$AA11,Notes)=0,ROW(Notes))))))","v":200},{"$f":"IF($A12=\"\",\"\",OrdeUP100(RANK($Y12,$AA$4:$AA$155))&IF(COUNTIF($Y$3:$Y11,$Y12)=0,\"\",\" مكرر\"))","v":"الثّامن عشر"},"مقبول",null,null,null,null,{"$f":"IF(MIN(IF(Notes<>\"\",IF(COUNTIF($AH$3:$AH11,Notes)=0,ROW(Notes))))=0,\"\",INDEX($Y:$Y,MIN(IF(Notes<>\"\",IF(COUNTIF($AH$3:$AH11,Notes)=0,ROW(Notes))))))","v":200}]
[10,"طالب 10",10,14,14,28,10,18,28,14,5,19,null,null,null,18,30,48,14,24,38,14,8,22,183,0.52285714285714291,{"$f":"IF(MIN(IF(Notes<>\"\",IF(COUNTIF($AA$3:$AA12,Notes)=0,ROW(Notes))))=0,\"\",INDEX($Y:$Y,MIN(IF(Notes<>\"\",IF(COUNTIF($AA$3:$AA12,Notes)=0,ROW(Notes))))))","v":183},{"$f":"IF($A13=\"\",\"\",OrdeUP100(RANK($Y13,$AA$4:$AA$155))&IF(COUNTIF($Y$3:$Y12,$Y13)=0,\"\",\" مكرر\"))","v":"الرّابع والعشرون"},"مقبول",null,null,null,null,{"$f":"IF(MIN(IF(Notes<>\"\",IF(COUNTIF($AH$3:$AH12,Notes)=0,ROW(Notes))))=0,\"\",INDEX($Y:$Y,MIN(IF(Notes<>\"\",IF(COUNTIF($AH$3:$AH12,Notes)=0,ROW(Notes))))))","v":183}]
[11,"طالب 11",11,8,14,22,12,12,24,14,7,21,null,null,null,14,17,31,16,10,26,14,12,26,150,0.42857142857142855,{"$f":"IF(MIN(IF(Notes<>\"\",IF(COUNTIF($AA$3:$AA13,Notes)=0,ROW(Notes))))=0,\"\",INDEX($Y:$Y,MIN(IF(Notes<>\"\",IF(COUNTIF($AA$3:$AA13,Notes)=0,ROW(Notes))))))","v":150},{"$f":"IF($A14=\"\",\"\",OrdeUP100(RANK($Y14,$AA$4:$AA$155))&IF(COUNTIF($Y$3:$Y13,$Y14)=0,\"\",\" مكرر\"))","v":"الثّلاثون"},"ضعيف",null,null,null,null,{"$f":"IF(MIN(IF(Notes<>\"\",IF(COUNTIF($AH$3:$AH13,Notes)=0,ROW(Notes))))=0,\"\",INDEX($Y:$Y,MIN(IF(Notes<>\"\",IF(COUNTIF($AH$3:$AH13,Notes)=0,ROW(Notes))))))","v":150}]
[12,"طالب 12",12,12,17,29,10,14,24,12,4,16,null,null,null,14,22,36,16,18,34,14,10,24,163,0.46571428571428569,{"$f":"IF(MIN(IF(Notes<>\"\",IF(COUNTIF($AA$3:$AA14,Notes)=0,ROW(Notes))))=0,\"\",INDEX($Y:$Y,MIN(IF(Notes<>\"\",IF(COUNTIF($AA$3:$AA14,Notes)=0,ROW(Notes))))))","v":163},{"$f":"IF($A15=\"\",\"\",OrdeUP100(RANK($Y15,$AA$4:$AA$155))&IF(COUNTIF($Y$3:$Y14,$Y15)=0,\"\",\" مكرر\"))","v":"الثّامن والعشرون"},"ضعيف",null,null,null,null,{"$f":"IF(MIN(IF(Notes<>\"\",IF(COUNTIF($AH$3:$AH14,Notes)=0,ROW(Notes))))=0,\"\",INDEX($Y:$Y,MIN(IF(Notes<>\"\",IF(COUNTIF($AH$3:$AH14,Notes)=0,ROW(Notes))))))","v":163}]
[13,"طالب 13",13,20,30,50,20,30,50,20,30,50,null,null,null,20,30,50,20,30,50,20,28,48,298,0.85142857142857142,{"$f":"IF(MIN(IF(Notes<>\"\",IF(COUNTIF($AA$3:$AA15,Notes)=0,ROW(Notes))))=0,\"\",INDEX($Y:$Y,MIN(IF(Notes<>\"\",IF(COUNTIF($AA$3:$AA15,Notes)=0,ROW(Notes))))))","v":178},{"$f":"IF($A16=\"\",\"\",OrdeUP100(RANK($Y16,$AA$4:$AA$155))&IF(COUNTIF($Y$3:$Y15,$Y16)=0,\"\",\" مكرر\"))","v":"الأوّل مكرر"},"جيد جداً",null,null,null,null,{"$f":"IF(MIN(IF(Notes<>\"\",IF(COUNTIF($AH$3:$AH15,Notes)=0,ROW(Notes))))=0,\"\",INDEX($Y:$Y,MIN(IF(Notes<>\"\",IF(COUNTIF($AH$3:$AH15,Notes)=0,ROW(Notes))))))","v":178}]
[14,"طالب 14",14,16,15,31,12,11,23,12,13,25,null,null,null,14,15,29,16,22,38,16,16,32,178,0.50857142857142856,{"$f":"IF(MIN(IF(Notes<>\"\",IF(COUNTIF($AA$3:$AA16,Notes)=0,ROW(Notes))))=0,\"\",INDEX($Y:$Y,MIN(IF(Notes<>\"\",IF(COUNTIF($AA$3:$AA16,Notes)=0,ROW(Notes))))))","v":195},{"$f":"IF($A17=\"\",\"\",OrdeUP100(RANK($Y17,$AA$4:$AA$155))&IF(COUNTIF($Y$3:$Y16,$Y17)=0,\"\",\" مكرر\"))","v":"السّادس والعشرون"},"مقبول",null,null,null,null,{"$f":"IF(MIN(IF(Notes<>\"\",IF(COUNTIF($AH$3:$AH16,Notes)=0,ROW(Notes))))=0,\"\",INDEX($Y:$Y,MIN(IF(Notes<>\"\",IF(COUNTIF($AH$3:$AH16,Notes)=0,ROW(Notes))))))","v":195}]
[15,"طالب 15",15,18,16,34,16,16,32,12,12,24,null,null,null,18,28,46,18,21,39,14,6,20,195,0.55714285714285716,{"$f":"IF(MIN(IF(Notes<>\"\",IF(COUNTIF($AA$3:$AA17,Notes)=0,ROW(Notes))))=0,\"\",INDEX($Y:$Y,MIN(IF(Notes<>\"\",IF(COUNTIF($AA$3:$AA17,Notes)=0,ROW(Notes))))))","v":184},{"$f":"IF($A18=\"\",\"\",OrdeUP100(RANK($Y18,$AA$4:$AA$155))&IF(COUNTIF($Y$3:$Y17,$Y18)=0,\"\",\" مكرر\"))","v":"التّاسع عشر"},"مقبول",null,null,null,null,{"$f":"IF(MIN(IF(Notes<>\"\",IF(COUNTIF($AH$3:$AH17,Notes)=0,ROW(Notes))))=0,\"\",INDEX($Y:$Y,MIN(IF(Notes<>\"\",IF(COUNTIF($AH$3:$AH17,Notes)=0,ROW(Notes))))))","v":184}]
[16,"طالب 16",16,16,19,35,10,20,30,14,20,34,null,null,null,16,17,33,18,14,32,16,4,20,184,0.52571428571428569,{"$f":"IF(MIN(IF(Notes<>\"\",IF(COUNTIF($AA$3:$AA18,Notes)=0,ROW(Notes))))=0,\"\",INDEX($Y:$Y,MIN(IF(Notes<>\"\",IF(COUNTIF($AA$3:$AA18,Notes)=0,ROW(Notes))))))","v":54},{"$f":"IF($A19=\"\",\"\",OrdeUP100(RANK($Y19,$AA$4:$AA$155))&IF(COUNTIF($Y$3:$Y18,$Y19)=0,\"\",\" مكرر\"))","v":"الثّالث والعشرون"},"مقبول",null,null,null,null,{"$f":"IF(MIN(IF(Notes<>\"\",IF(COUNTIF($AH$3:$AH18,Notes)=0,ROW(Notes))))=0,\"\",INDEX($Y:$Y,MIN(IF(Notes<>\"\",IF(COUNTIF($AH$3:$AH18,Notes)=0,ROW(Notes))))))","v":54}]
[17,"طالب 17",17,8,null,8,6,null,6,8,null,8,null,null,null,10,null,10,12,null,12,10,null,10,54,0.15428571428571428,{"$f":"IF(MIN(IF(Notes<>\"\",IF(COUNTIF($AA$3:$AA19,Notes)=0,ROW(Notes))))=0,\"\",INDEX($Y:$Y,MIN(IF(Notes<>\"\",IF(COUNTIF($AA$3:$AA19,Notes)=0,ROW(Notes))))))","v":257},{"$f":"IF($A20=\"\",\"\",OrdeUP100(RANK($Y20,$AA$4:$AA$155))&IF(COUNTIF($Y$3:$Y19,$Y20)=0,\"\",\" مكرر\"))","v":"الثّالث والثّلاثون"},"ضعيف",null,null,null,null,{"$f":"IF(MIN(IF(Notes<>\"\",IF(COUNTIF($AH$3:$AH19,Notes)=0,ROW(Notes))))=0,\"\",INDEX($Y:$Y,MIN(IF(Notes<>\"\",IF(COUNTIF($AH$3:$AH19,Notes)=0,ROW(Notes))))))","v":257}]
{"$rows_left_out":22}
{"sheet":"ورقة2","index":1,"n_rows":36,"n_cols":15,"rows_kept":36,"cut":false,"hidden":false,"merged":[[25,3,25,4],[25,5,25,6],[14,0,14,4],[14,8,14,11],[36,7,36,10],[37,7,37,10],[17,7,17,10],[16,7,16,10],[35,1,35,3],[35,5,35,6],[21,0,21,11],[22,2,22,7],[23,0,23,11],[22,0,22,1],[34,0,34,4],[24,0,26,0],[24,5,24,6],[25,1,25,2],[24,1,24,2],[24,3,24,4],[34,8,34,11],[2,2,2,7],[1,0,1,11],[15,5,15,6],[15,1,15,3],[3,0,3,11],[4,1,4,2],[5,1,5,2],[4,3,4,4],[5,3,5,4],[4,5,4,6],[5,5,5,6],[2,0,2,1],[4,0,6,0]]}
[null,null,null,null,null,null,null,null,null,null,null,null,1,"من","إلى"]
["إخطار بنتيجة الفصل الدراسي الأول  ( مرحلة التعليم الأساسي  )",null,null,null,null,null,null,null,null,null,null,null,null,{"$f":"MIN(ورقة1!A:A)","v":1},{"$f":"MAX(ورقة1!A:A)","v":38}]
["          اسم الطالب :  ",null,{"$f":"VLOOKUP($M$1,ورقة1!$A$4:$AC$148,2,1)","v":"طالب 1"}]
["الصــــــــف  :      (  الخامس  )       شعبة (    )          العام الدراسي     2018  /   2019 م"]
["المواد الدراسية","المحصلة الأولى",null,"امتحان الفصل الأول",null,"المجمــــــــــــــوع",null,"ملاحظة رائد الفصل :........................",null,null,null,null,null,"أصغر رقم",{"$f":"MIN(ورقة1!C:C)","v":1}]
[null,0.2,null,0.3,null,0.5,null,null,null,null,null,".............................................................",null,"أكبر رقم",{"$f":"MAX(ورقة1!C:C)","v":38}]
[null,"رقما","كتــابـــة","رقما","كتـابـــة","رقما","كتــابـــة",null,null,null,null,"...................................................",{"$f":"NN(B8)","v":""}]
["القـران الكـريــــم",{"$f":"VLOOKUP($M$1,ورقة1!$A$4:$AC$148,4,1)","v":14},{"$f":"IFERROR(IF(B8=\"\",\"\",IF(B8=0,\"صفر\",n2t(B8))),\"\")","v":"أربع عشرة درجةً"},{"$f":"VLOOKUP($M$1,ورقة1!$A$4:$AC$148,5,1)","v":17},{"$f":"IFERROR(IF(D8=\"\",\"\",IF(D8=0,\"صفر\",n2t(D8))),\"\")","v":"سبع عشرة درجةً"},{"$f":"VLOOKUP($M$1,ورقة1!$A$4:$AC$148,6,1)","v":31},{"$f":"IFERROR(IF(F8=\"\",\"\",IF(F8=0,\"صفر\",n2t(F8))),\"\")","v":"إحدى و ثلاثونَ درجةً"},"التوقيع  :........................................"]
["التربية الإسلامية",{"$f":"VLOOKUP($M$1,ورقة1!$A$4:$AC$148,7,1)","v":10},{"$f":"IFERROR(IF(B9=\"\",\"\",IF(B9=0,\"صفر\",n2t(B9))),\"\")","v":"عشر درجاتٍ"},{"$f":"VLOOKUP($M$1,ورقة1!$A$4:$AC$148,8,1)","v":15},{"$f":"IFERROR(IF(D9=\"\",\"\",IF(D9=0,\"صفر\",n2t(D9))),\"\")","v":"خمس عشرة درجةً"},{"$f":"VLOOKUP($M$1,ورقة1!$A$4:$AC$148,9,1)","v":25},{"$f":"IFERROR(IF(F9=\"\",\"\",IF(F9=0,\"صفر\",n2t(F9))),\"\")","v":"خمس و عشرونَ درجةً"},"التاريخ : ........................................"]
["اللغـة العـربيــــة",{"$f":"VLOOKUP($M$1,ورقة1!$A$4:$AC$148,10,1)","v":14},{"$f":"IFERROR(IF(B10=\"\",\"\",IF(B10=0,\"صفر\",n2t(B10))),\"\")","v":"أربع عشرة درجةً"},{"$f":"VLOOKUP($M$1,ورقة1!$A$4:$AC$148,11,1)","v":16},{"$f":"IFERROR(IF(D10=\"\",\"\",IF(D10=0,\"صفر\",n2t(D10))),\"\")","v":"ست عشرة درجةً"},{"$f":"VLOOKUP($M$1,ورقة1!$A$4:$AC$148,12,1)","v":30},{"$f":"IFERROR(IF(F10=\"\",\"\",IF(F10=0,\"صفر\",n2t(F10))),\"\")","v":" ثلاثونَ درجةً"},"ملاحظات مدير المدرسة : .................",null,null,null,null,"اضغط زر أمر طباعة "]
["اللغة الإنجليزية",{"$f":"VLOOKUP($M$1,ورقة1!$A$4:$AC$148,13,1)","v":0},{"$f":"IFERROR(IF(B11=\"\",\"\",IF(B11=0,\"صفر\",n2t(B11))),\"\")","v":"صفر"},{"$f":"VLOOKUP($M$1,ورقة1!$A$4:$AC$148,14,1)","v":0},{"$f":"IFERROR(IF(D11=\"\",\"\",IF(D11=0,\"صفر\",n2t(D11))),\"\")","v":"صفر"},{"$f":"VLOOKUP($M$1,ورقة1!$A$4:$AC$148,15,1)","v":0},{"$f":"IFERROR(IF(F11=\"\",\"\",IF(F11=0,\"صفر\",n2t(F11))),\"\")","v":"صفر"},null,null,null,null,"...................................................."]
["الـريـــاضـيــــات",{"$f":"VLOOKUP($M$1,ورقة1!$A$4:$AC$148,16,1)","v":16},{"$f":"IFERROR(IF(B12=\"\",\"\",IF(B12=0,\"صفر\",n2t(B12))),\"\")","v":"ست عشرة درجةً"},{"$f":"VLOOKUP($M$1,ورقة1!$A$4:$AC$148,17,1)","v":20},{"$f":"IFERROR(IF(D12=\"\",\"\",IF(D12=0,\"صفر\",n2t(D12))),\"\")","v":" عشرونَ درجةً"},{"$f":"VLOOKUP($M$1,ورقة1!$A$4:$AC$148,18,1)","v":36},{"$f":"IFERROR(IF(F12=\"\",\"\",IF(F12=0,\"صفر\",n2t(F12))),\"\")","v":"ست و ثلاثونَ درجةً"},"التوقيع : ........................................"]
["العلـوم الصحيــة",{"$f":"VLOOKUP($M$1,ورقة1!$A$4:$AC$148,19,1)","v":16},{"$f":"IFERROR(IF(B13=\"\",\"\",IF(B13=0,\"صفر\",n2t(B13))),\"\")","v":"ست عشرة درجةً"},{"$f":"VLOOKUP($M$1,ورقة1!$A$4:$AC$148,20,1)","v":25},{"$f":"IFERROR(IF(D13=\"\",\"\",IF(D13=0,\"صفر\",n2t(D13))),\"\")","v":"خمس و عشرونَ درجةً"},{"$f":"VLOOKUP($M$1,ورقة1!$A$4:$AC$148,21,1)","v":41},{"$f":"IFERROR(IF(F13=\"\",\"\",IF(F13=0,\"صفر\",n2t(F13))),\"\")","v":"إحدى و أربعونَ درجةً"}]
["الاجتمــاعـيـــات",{"$f":"VLOOKUP($M$1,ورقة1!$A$4:$AC$148,22,1)","v":14},{"$f":"IFERROR(IF(B14=\"\",\"\",IF(B14=0,\"صفر\",n2t(B14))),\"\")","v":"أربع عشرة درجةً"},{"$f":"VLOOKUP($M$1,ورقة1!$A$4:$AC$148,23,1)","v":14},{"$f":"IFERROR(IF(D14=\"\",\"\",IF(D14=0,\"صفر\",n2t(D14))),\"\")","v":"أربع عشرة درجةً"},{"$f":"VLOOKUP($M$1,ورقة1!$A$4:$AC$148,24,1)","v":28},{"$f":"IFERROR(IF(F14=\"\",\"\",IF(F14=0,\"صفر\",n2t(F14))),\"\")","v":"ثمان و عشرونَ درجةً"}]
["المجـمـــــــــــــــــــــــــــــــــــــــــــــــــوع الكلـــــي",null,null,null,null,{"$f":"VLOOKUP($M$1,ورقة1!$A$4:$AC$148,25,1)","v":191},{"$f":"IFERROR(IF(F15=\"\",\"\",IF(F15=0,\"صفر\",n2t(F15))),\"\")","v":"مائة و إحدى و تسعونَ درجةً"},"التاريخ:",{"$f":"TODAY()","v":"2019-02-01"}]
["الترتيب:",{"$f":"VLOOKUP($M$1,ورقة1!$A$4:$AC$148,28,1)","v":"الحادي والعشرون"},null,null,"التقدير",{"$f":"VLOOKUP($M$1,ورقة1!$A$4:$AC$148,29,1)","v":"مقبول"}]
[]
[]
[]
[]
{"$rows_left_out":16}