{"text_format":"1","workbook":"xlsx","n_sheets":7,"sheets":["index","Templete","حمد صالح ","كريم ","salim","Templete (3)","Templete (2)"],"not_rendered":{"charts":0,"images":0,"macros":1,"external_links":0,"defined_names":13,"comments":0,"pivot_tables":0},"unopened":[],"bounds":{"document_bytes":16777216,"sheet_cells":100000,"rows_first":2000,"rows_last":500,"rows_between":2000,"halvings":0,"cell_chars":16384,"cell_head_chars":4096},"cells_cut":0,"cells_raw":0,"read":"whole","date_system":"1900"}

{"sheet":"index","index":0,"n_rows":501,"n_cols":4,"rows_kept":501,"cut":false,"hidden":false,"merged":[]}
["2019-02-07T21:49:17","الارتباط ","اسم العميل ","رقم الهاتف "]
["2019-02-07T22:21:13","go to it","حمد صالح "]
["2019-02-07T22:21:14","go to it","كريم "]
["2019-02-07T22:32:25","go to it","جاسم "]
["2019-02-07T22:34:01","go to it","salim"]
["2019-02-07T22:32:53"]
["2019-02-07T22:33:21"]
["2019-02-07T22:32:32"]
["2019-02-07T22:18:47"]
["2019-02-07T22:20:22"]
["2019-02-07T16:53:12"]
["2019-02-07T22:21:15"]
["2019-02-07T16:45:08"]
["2019-02-07T16:45:08"]
["2019-02-07T16:43:44"]
[]
[]
[]
[]
[]
[]
[]
[]
[]
[]
[]
[]
[]
[]
[]
[]
[]
[]
[]
[]
[]
[]
[]
[]
[]
[]
[]
[]
[]
[]
[]
[]
[]
[]
[]
[]
[]
[]
[]
[]
[]
[]
[]
[]
[]
[]
[]
[]
[]
[]
[]
[]
[]
[]
[]
[]
[]
[]
[]
[]
[]
[]
[]
[]
[]
[]
[]
[]
[]
[]
[]
[]
[]
[]
[]
[]
[]
[]
[]
[]
[]
[]
[]
[]
[]
[]
[]
[]
[]
[]
[]
[]
[]
[]
[]
[]
[]
[]
[]
[]
[]
[]
[]
[]
[]
{"$rows_left_out":382}
{"sheet":"Templete","index":1,"n_rows":502,"n_cols":5,"rows_kept":502,"cut":false,"hidden":true,"merged":[]}
[null,null,"رقم الموبايل ",{"$f":"IFERROR(INDEX(index!$E:$E,MATCH($B$2,index!$C:$C,0)),\"\")","v":""}]
["الاسم :",null,"العنوان "]
["التارخ والوقت ","المشتريات ","التسديد ","المجموع ","الملاحظات "]
[{"$f":"IF(B4&C4<>\"\",IF(A4=\"\",NOW(),A4),\"\")","v":""},null,null,{"$f":"IF(AND(B4=\"\",C4=\"\"),\"\",B4-C4)","v":""}]
[{"$f":"IF(B5&C5<>\"\",IF(A5=\"\",NOW(),A5),\"\")","v":""},null,null,{"$f":"IF(AND(B5=\"\",C5=\"\"),\"\",(B5-C5)+D4)","v":""}]
["",null,null,{"$f":"IF(AND(B6=\"\",C6=\"\"),\"\",(B6-C6)+D5)","v":""}]
["",null,null,""]
["",null,null,""]
["",null,null,""]
["",null,null,""]
["",null,null,""]
["",null,null,""]
["",null,null,""]
["",null,null,""]
["",null,null,""]
["",null,null,""]
["",null,null,""]
["",null,null,""]
["",null,null,""]
["",null,null,""]
["",null,null,""]
["",null,null,""]
["",null,null,""]
["",null,null,""]
["",null,null,""]
["",null,null,""]
["",null,null,""]
["",null,null,""]
["",null,null,""]
["",null,null,""]
["",null,null,""]
["",null,null,""]
["",null,null,""]
["",null,null,""]
["",null,null,""]
["",null,null,""]
["",null,null,""]
["",null,null,""]
["",null,null,""]
["",null,null,""]
["",null,null,""]
["",null,null,""]
["",null,null,""]
["",null,null,""]
["",null,null,""]
["",null,null,""]
["",null,null,""]
["",null,null,""]
["",null,null,""]
["",null,null,""]
["",null,null,""]
["",null,null,""]
["",null,null,""]
["",null,null,""]
["",null,null,""]
["",null,null,""]
["",null,null,""]
["",null,null,""]
["",null,null,""]
["",null,null,""]
["",null,null,""]
["",null,null,""]
["",null,null,""]
["",null,null,""]
["",null,null,""]
["",null,null,""]
["",null,null,""]
["",null,null,""]
[{"$f":"IF(B69&C69<>\"\",IF(A69=\"\",NOW(),A69),\"\")","v":""},null,null,""]
["",null,null,{"$f":"IF(AND(B70=\"\",C70=\"\"),\"\",(B70-C70)+D69)","v":""}]
["",null,null,""]
["",null,null,""]
["",null,null,""]
["",null,null,""]
["",null,null,""]
["",null,null,""]
["",null,null,""]
["",null,null,""]
["",null,null,""]
["",null,null,""]
["",null,null,""]
["",null,null,""]
["",null,null,""]
["",null,null,""]
["",null,null,""]
["",null,null,""]
["",null,null,""]
["",null,null,""]
["",null,null,""]
["",null,null,""]
["",null,null,""]
["",null,null,""]
["",null,null,""]
["",null,null,""]
["",null,null,""]
["",null,null,""]
["",null,null,""]
["",null,null,""]
["",null,null,""]
["",null,null,""]
["",null,null,""]
["",null,null,""]
["",null,null,""]
["",null,null,""]
["",null,null,""]
["",null,null,""]
["",null,null,""]
["",null,null,""]
["",null,null,""]
["",null,null,""]
["",null,null,""]
["",null,null,""]
["",null,null,""]
["",null,null,""]
["",null,null,""]
["",null,null,""]
["",null,null,""]
["",null,null,""]
["",null,null,""]
["",null,null,""]
{"$rows_left_out":383}
{"sheet":"حمد صالح ","index":2,"n_rows":502,"n_cols":5,"rows_kept":502,"cut":false,"hidden":false,"merged":[]}
[null,null,"رقم الموبايل ",{"$f":"IFERROR(INDEX(index!$E:$E,MATCH($B$2,index!$C:$C,0)),\"\")","v":0}]
["الاسم :","حمد صالح ","العنوان "]
["التارخ والوقت ","المشتريات ","التسديد ","المجموع ","الملاحظات "]
[{"$f":"IF(B4&C4<>\"\",IF(A4=\"\",NOW(),A4),\"\")","v":""},null,null,{"$f":"IF(AND(B4=\"\",C4=\"\"),\"\",B4-C4)","v":""}]
[{"$f":"IF(B5&C5<>\"\",IF(A5=\"\",NOW(),A5),\"\")","v":""},null,null,{"$f":"IF(AND(B5=\"\",C5=\"\"),\"\",(B5-C5)+D4)","v":""}]
["",null,null,{"$f":"IF(AND(B6=\"\",C6=\"\"),\"\",(B6-C6)+D5)","v":""}]
["",null,null,""]
["",null,null,""]
["",null,null,""]
["",null,null,""]
["",null,null,""]
["",null,null,""]
["",null,null,""]
["",null,null,""]
["",null,null,""]
["",null,null,""]
["",null,null,""]
["",null,null,""]
["",null,null,""]
["",null,null,""]
["",null,null,""]
["",null,null,""]
["",null,null,""]
["",null,null,""]
["",null,null,""]
["",null,null,""]
["",null,null,""]
["",null,null,""]
["",null,null,""]
["",null,null,""]
["",null,null,""]
["",null,null,""]
["",null,null,""]
["",null,null,""]
["",null,null,""]
["",null,null,""]
["",null,null,""]
["",null,null,""]
["",null,null,""]
["",null,null,""]
["",null,null,""]
["",null,null,""]
["",null,null,""]
["",null,null,""]
["",null,null,""]
["",null,null,""]
["",null,null,""]
["",null,null,""]
["",null,null,""]
["",null,null,""]
["",null,null,""]
["",null,null,""]
["",null,null,""]
["",null,null,""]
["",null,null,""]
["",null,null,""]
["",null,null,""]
["",null,null,""]
["",null,null,""]
["",null,null,""]
["",null,null,""]
["",null,null,""]
["",null,null,""]
["",null,null,""]
["",null,null,""]
["",null,null,""]
["",null,null,""]
["",null,null,""]
[{"$f":"IF(B69&C69<>\"\",IF(A69=\"\",NOW(),A69),\"\")","v":""},null,null,""]
["",null,null,{"$f":"IF(AND(B70=\"\",C70=\"\"),\"\",(B70-C70)+D69)","v":""}]
["",null,null,""]
["",null,null,""]
["",null,null,""]
["",null,null,""]
["",null,null,""]
["",null,null,""]
["",null,null,""]
["",null,null,""]
["",null,null,""]
["",null,null,""]
["",null,null,""]
["",null,null,""]
["",null,null,""]
["",null,null,""]
["",null,null,""]
["",null,null,""]
["",null,null,""]
["",null,null,""]
["",null,null,""]
["",null,null,""]
["",null,null,""]
["",null,null,""]
["",null,null,""]
["",null,null,""]
["",null,null,""]
["",null,null,""]
["",null,null,""]
["",null,null,""]
["",null,null,""]
["",null,null,""]
["",null,null,""]
["",null,null,""]
["",null,null,""]
["",null,null,""]
["",null,null,""]
["",null,null,""]
["",null,null,""]
["",null,null,""]
["",null,null,""]
["",null,null,""]
["",null,null,""]
["",null,null,""]
["",null,null,""]
["",null,null,""]
["",null,null,""]
["",null,null,""]
["",null,null,""]
["",null,null,""]
["",null,null,""]
["",null,null,""]
{"$rows_left_out":383}
{"sheet":"كريم ","index":3,"n_rows":502,"n_cols":5,"rows_kept":502,"cut":false,"hidden":false,"merged":[]}
[null,null,"رقم الموبايل ",{"$f":"IFERROR(INDEX(index!$E:$E,MATCH($B$2,index!$C:$C,0)),\"\")","v":0}]
["الاسم :","كريم ","العنوان "]
["التارخ والوقت ","المشتريات ","التسديد ","المجموع ","الملاحظات "]
[{"$f":"IF(B4&C4<>\"\",IF(A4=\"\",NOW(),A4),\"\")","v":""},null,null,{"$f":"IF(AND(B4=\"\",C4=\"\"),\"\",B4-C4)","v":""}]
[{"$f":"IF(B5&C5<>\"\",IF(A5=\"\",NOW(),A5),\"\")","v":""},null,null,{"$f":"IF(AND(B5=\"\",C5=\"\"),\"\",(B5-C5)+D4)","v":""}]
["",null,null,{"$f":"IF(AND(B6=\"\",C6=\"\"),\"\",(B6-C6)+D5)","v":""}]
["",null,null,""]
["",null,null,""]
["",null,null,""]
["",null,null,""]
["",null,null,""]
["",null,null,""]
["",null,null,""]
["",null,null,""]
["",null,null,""]
["",null,null,""]
["",null,null,""]
["",null,null,""]
["",null,null,""]
["",null,null,""]
["",null,null,""]
["",null,null,""]
["",null,null,""]
["",null,null,""]
["",null,null,""]
["",null,null,""]
["",null,null,""]
["",null,null,""]
["",null,null,""]
["",null,null,""]
["",null,null,""]
["",null,null,""]
["",null,null,""]
["",null,null,""]
["",null,null,""]
["",null,null,""]
["",null,null,""]
["",null,null,""]
["",null,null,""]
["",null,null,""]
["",null,null,""]
["",null,null,""]
["",null,null,""]
["",null,null,""]
["",null,null,""]
["",null,null,""]
["",null,null,""]
["",null,null,""]
["",null,null,""]
["",null,null,""]
["",null,null,""]
["",null,null,""]
["",null,null,""]
["",null,null,""]
["",null,null,""]
["",null,null,""]
["",null,null,""]
["",null,null,""]
["",null,null,""]
["",null,null,""]
["",null,null,""]
["",null,null,""]
["",null,null,""]
["",null,null,""]
["",null,null,""]
["",null,null,""]
["",null,null,""]
["",null,null,""]
[{"$f":"IF(B69&C69<>\"\",IF(A69=\"\",NOW(),A69),\"\")","v":""},null,null,""]
["",null,null,{"$f":"IF(AND(B70=\"\",C70=\"\"),\"\",(B70-C70)+D69)","v":""}]
["",null,null,""]
["",null,null,""]
["",null,null,""]
["",null,null,""]
["",null,null,""]
["",null,null,""]
["",null,null,""]
["",null,null,""]
["",null,null,""]
["",null,null,""]
["",null,null,""]
["",null,null,""]
["",null,null,""]
["",null,null,""]
["",null,null,""]
["",null,null,""]
["",null,null,""]
["",null,null,""]
["",null,null,""]
["",null,null,""]
["",null,null,""]
["",null,null,""]
["",null,null,""]
["",null,null,""]
["",null,null,""]
["",null,null,""]
["",null,null,""]
["",null,null,""]
["",null,null,""]
["",null,null,""]
["",null,null,""]
["",null,null,""]
["",null,null,""]
["",null,null,""]
["",null,null,""]
["",null,null,""]
["",null,null,""]
["",null,null,""]
["",null,null,""]
["",null,null,""]
["",null,null,""]
["",null,null,""]
["",null,null,""]
["",null,null,""]
["",null,null,""]
["",null,null,""]
["",null,null,""]
["",null,null,""]
["",null,null,""]
["",null,null,""]
{"$rows_left_out":383}
{"sheet":"salim","index":4,"n_rows":502,"n_cols":5,"rows_kept":502,"cut":false,"hidden":false,"merged":[]}
[null,null,"رقم الموبايل ",{"$f":"IFERROR(INDEX(index!$E:$E,MATCH($B$2,index!$C:$C,0)),\"\")","v":0}]
["الاسم :","salim","العنوان "]
["التارخ والوقت ","المشتريات ","التسديد ","المجموع ","الملاحظات "]
[{"$f":"IF(B4&C4<>\"\",IF(A4=\"\",NOW(),A4),\"\")","v":""},null,null,{"$f":"IF(AND(B4=\"\",C4=\"\"),\"\",B4-C4)","v":""}]
[{"$f":"IF(B5&C5<>\"\",IF(A5=\"\",NOW(),A5),\"\")","v":""},null,null,{"$f":"IF(AND(B5=\"\",C5=\"\"),\"\",(B5-C5)+D4)","v":""}]
["",null,null,{"$f":"IF(AND(B6=\"\",C6=\"\"),\"\",(B6-C6)+D5)","v":""}]
["",null,null,""]
["",null,null,""]
["",null,null,""]
["",null,null,""]
["",null,null,""]
["",null,null,""]
["",null,null,""]
["",null,null,""]
["",null,null,""]
["",null,null,""]
["",null,null,""]
["",null,null,""]
["",null,null,""]
["",null,null,""]
["",null,null,""]
["",null,null,""]
["",null,null,""]
["",null,null,""]
["",null,null,""]
["",null,null,""]
["",null,null,""]
["",null,null,""]
["",null,null,""]
["",null,null,""]
["",null,null,""]
["",null,null,""]
["",null,null,""]
["",null,null,""]
["",null,null,""]
["",null,null,""]
["",null,null,""]
["",null,null,""]
["",null,null,""]
["",null,null,""]
["",null,null,""]
["",null,null,""]
["",null,null,""]
["",null,null,""]
["",null,null,""]
["",null,null,""]
["",null,null,""]
["",null,null,""]
["",null,null,""]
["",null,null,""]
["",null,null,""]
["",null,null,""]
["",null,null,""]
["",null,null,""]
["",null,null,""]
["",null,null,""]
["",null,null,""]
["",null,null,""]
["",null,null,""]
["",null,null,""]
["",null,null,""]
["",null,null,""]
["",null,null,""]
["",null,null,""]
["",null,null,""]
["",null,null,""]
["",null,null,""]
["",null,null,""]
[{"$f":"IF(B69&C69<>\"\",IF(A69=\"\",NOW(),A69),\"\")","v":""},null,null,""]
["",null,null,{"$f":"IF(AND(B70=\"\",C70=\"\"),\"\",(B70-C70)+D69)","v":""}]
["",null,null,""]
["",null,null,""]
["",null,null,""]
["",null,null,""]
["",null,null,""]
["",null,null,""]
["",null,null,""]
["",null,null,""]
["",null,null,""]
["",null,null,""]
["",null,null,""]
["",null,null,""]
["",null,null,""]
["",null,null,""]
["",null,null,""]
["",null,null,""]
["",null,null,""]
["",null,null,""]
["",null,null,""]
["",null,null,""]
["",null,null,""]
["",null,null,""]
["",null,null,""]
["",null,null,""]
["",null,null,""]
["",null,null,""]
["",null,null,""]
["",null,null,""]
["",null,null,""]
["",null,null,""]
["",null,null,""]
["",null,null,""]
["",null,null,""]
["",null,null,""]
["",null,null,""]
["",null,null,""]
["",null,null,""]
["",null,null,""]
["",null,null,""]
["",null,null,""]
["",null,null,""]
["",null,null,""]
["",null,null,""]
["",null,null,""]
["",null,null,""]
["",null,null,""]
["",null,null,""]
["",null,null,""]
["",null,null,""]
["",null,null,""]
{"$rows_left_out":383}
{"sheet":"Templete (3)","index":5,"n_rows":502,"n_cols":5,"rows_kept":502,"cut":false,"hidden":true,"merged":[]}
[null,null,"رقم الموبايل ",{"$f":"IFERROR(INDEX(index!$E:$E,MATCH($B$2,index!$C:$C,0)),\"\")","v":""}]
["الاسم :",null,"العنوان "]
["التارخ والوقت ","المشتريات ","التسديد ","المجموع ","الملاحظات "]
[{"$f":"IF(B4&C4<>\"\",IF(A4=\"\",NOW(),A4),\"\")","v":""},null,null,{"$f":"IF(AND(B4=\"\",C4=\"\"),\"\",B4-C4)","v":""}]
[{"$f":"IF(B5&C5<>\"\",IF(A5=\"\",NOW(),A5),\"\")","v":""},null,null,{"$f":"IF(AND(B5=\"\",C5=\"\"),\"\",(B5-C5)+D4)","v":""}]
["",null,null,{"$f":"IF(AND(B6=\"\",C6=\"\"),\"\",(B6-C6)+D5)","v":""}]
["",null,null,""]
["",null,null,""]
["",null,null,""]
["",null,null,""]
["",null,null,""]
["",null,null,""]
["",null,null,""]
["",null,null,""]
["",null,null,""]
["",null,null,""]
["",null,null,""]
["",null,null,""]
["",null,null,""]
["",null,null,""]
["",null,null,""]
["",null,null,""]
["",null,null,""]
["",null,null,""]
["",null,null,""]
["",null,null,""]
["",null,null,""]
["",null,null,""]
["",null,null,""]
["",null,null,""]
["",null,null,""]
["",null,null,""]
["",null,null,""]
["",null,null,""]
["",null,null,""]
["",null,null,""]
["",null,null,""]
["",null,null,""]
["",null,null,""]
["",null,null,""]
["",null,null,""]
["",null,null,""]
["",null,null,""]
["",null,null,""]
["",null,null,""]
["",null,null,""]
["",null,null,""]
["",null,null,""]
["",null,null,""]
["",null,null,""]
["",null,null,""]
["",null,null,""]
["",null,null,""]
["",null,null,""]
["",null,null,""]
["",null,null,""]
["",null,null,""]
["",null,null,""]
["",null,null,""]
["",null,null,""]
["",null,null,""]
["",null,null,""]
["",null,null,""]
["",null,null,""]
["",null,null,""]
["",null,null,""]
["",null,null,""]
["",null,null,""]
[{"$f":"IF(B69&C69<>\"\",IF(A69=\"\",NOW(),A69),\"\")","v":""},null,null,""]
["",null,null,{"$f":"IF(AND(B70=\"\",C70=\"\"),\"\",(B70-C70)+D69)","v":""}]
["",null,null,""]
["",null,null,""]
["",null,null,""]
["",null,null,""]
["",null,null,""]
["",null,null,""]
["",null,null,""]
["",null,null,""]
["",null,null,""]
["",null,null,""]
["",null,null,""]
["",null,null,""]
["",null,null,""]
["",null,null,""]
["",null,null,""]
["",null,null,""]
["",null,null,""]
["",null,null,""]
["",null,null,""]
["",null,null,""]
["",null,null,""]
["",null,null,""]
["",null,null,""]
["",null,null,""]
["",null,null,""]
["",null,null,""]
["",null,null,""]
["",null,null,""]
["",null,null,""]
["",null,null,""]
["",null,null,""]
["",null,null,""]
["",null,null,""]
["",null,null,""]
["",null,null,""]
["",null,null,""]
["",null,null,""]
["",null,null,""]
["",null,null,""]
["",null,null,""]
["",null,null,""]
["",null,null,""]
["",null,null,""]
["",null,null,""]
["",null,null,""]
["",null,null,""]
["",null,null,""]
["",null,null,""]
["",null,null,""]
["",null,null,""]
{"$rows_left_out":383}
{"sheet":"Templete (2)","index":6,"n_rows":502,"n_cols":5,"rows_kept":502,"cut":false,"hidden":true,"merged":[]}
[null,null,"رقم الموبايل ",{"$f":"IFERROR(INDEX(index!$E:$E,MATCH($B$2,index!$C:$C,0)),\"\")","v":""}]
["الاسم :",null,"العنوان "]
["التارخ والوقت ","المشتريات ","التسديد ","المجموع ","الملاحظات "]
[{"$f":"IF(B4&C4<>\"\",IF(A4=\"\",NOW(),A4),\"\")","v":""},null,null,{"$f":"IF(AND(B4=\"\",C4=\"\"),\"\",B4-C4)","v":""}]
[{"$f":"IF(B5&C5<>\"\",IF(A5=\"\",NOW(),A5),\"\")","v":""},null,null,{"$f":"IF(AND(B5=\"\",C5=\"\"),\"\",(B5-C5)+D4)","v":""}]
["",null,null,{"$f":"IF(AND(B6=\"\",C6=\"\"),\"\",(B6-C6)+D5)","v":""}]
["",null,null,""]
["",null,null,""]
["",null,null,""]
["",null,null,""]
["",null,null,""]
["",null,null,""]
["",null,null,""]
["",null,null,""]
["",null,null,""]
["",null,null,""]
["",null,null,""]
["",null,null,""]
["",null,null,""]
["",null,null,""]
["",null,null,""]
["",null,null,""]
["",null,null,""]
["",null,null,""]
["",null,null,""]
["",null,null,""]
["",null,null,""]
["",null,null,""]
["",null,null,""]
["",null,null,""]
["",null,null,""]
["",null,null,""]
["",null,null,""]
["",null,null,""]
["",null,null,""]
["",null,null,""]
["",null,null,""]
["",null,null,""]
["",null,null,""]
["",null,null,""]
["",null,null,""]
["",null,null,""]
["",null,null,""]
["",null,null,""]
["",null,null,""]
["",null,null,""]
["",null,null,""]
["",null,null,""]
["",null,null,""]
["",null,null,""]
["",null,null,""]
["",null,null,""]
["",null,null,""]
["",null,null,""]
["",null,null,""]
["",null,null,""]
["",null,null,""]
["",null,null,""]
["",null,null,""]
["",null,null,""]
["",null,null,""]
["",null,null,""]
["",null,null,""]
["",null,null,""]
["",null,null,""]
["",null,null,""]
["",null,null,""]
["",null,null,""]
[{"$f":"IF(B69&C69<>\"\",IF(A69=\"\",NOW(),A69),\"\")","v":""},null,null,""]
["",null,null,{"$f":"IF(AND(B70=\"\",C70=\"\"),\"\",(B70-C70)+D69)","v":""}]
["",null,null,""]
["",null,null,""]
["",null,null,""]
["",null,null,""]
["",null,null,""]
["",null,null,""]
["",null,null,""]
["",null,null,""]
["",null,null,""]
["",null,null,""]
["",null,null,""]
["",null,null,""]
["",null,null,""]
["",null,null,""]
["",null,null,""]
["",null,null,""]
["",null,null,""]
["",null,null,""]
["",null,null,""]
["",null,null,""]
["",null,null,""]
["",null,null,""]
["",null,null,""]
["",null,null,""]
["",null,null,""]
["",null,null,""]
["",null,null,""]
["",null,null,""]
["",null,null,""]
["",null,null,""]
["",null,null,""]
["",null,null,""]
["",null,null,""]
["",null,null,""]
["",null,null,""]
["",null,null,""]
["",null,null,""]
["",null,null,""]
["",null,null,""]
["",null,null,""]
["",null,null,""]
["",null,null,""]
["",null,null,""]
["",null,null,""]
["",null,null,""]
["",null,null,""]
["",null,null,""]
["",null,null,""]
["",null,null,""]
["",null,null,""]
{"$rows_left_out":382}