{"text_format":"1","workbook":"xlsx","n_sheets":2,"sheets":["Sheet1","Setting"],"not_rendered":{"charts":0,"images":0,"macros":1,"external_links":0,"defined_names":6,"comments":0,"pivot_tables":0},"unopened":[],"bounds":{"document_bytes":16777216,"sheet_cells":100000,"rows_first":2000,"rows_last":500,"rows_between":2000,"halvings":0,"cell_chars":16384,"cell_head_chars":4096},"cells_cut":0,"cells_raw":0,"read":"whole","date_system":"1900"}

{"sheet":"Sheet1","index":0,"n_rows":58,"n_cols":21,"rows_kept":58,"cut":false,"hidden":false,"merged":[[0,13,0,17]]}
["الدولة","المدينة","المنشأة","العميل","رقم",null,null,null,null,null,null,null,null,"شروط الفلتر",null,null,null,null,null,null,{"$f":"IFERROR(INDEX($A:$A,SMALL(IF($A:$A=$N$3,IF($B:$B=$P$3,IF($C:$C=$R$3,ROW($A$2:$A$1000)-ROW($A$2)+1))),ROWS($N$6:N6))),\"\")","v":"السعودية"}]
["السعودية","الرياض","المنشأة 1","العميل 1",1,null,null,null,null,null,null,null,null,"الدولة",null,"المدينة",null,"المنشأة"]
["مصر","القاهرة","المنشأة 3","العميل 2",2,null,null,null,null,null,null,null,null,"السعودية",null,"جدة",null,"المنشأة 3"]
["المغرب","الرباط","المنشأة 2","العميل 3",3]
["السعودية","جدة","المنشأة 5","العميل 4",4,null,null,null,null,null,null,null,null,"الدولة","المدينة","المنشأة","العميل","رقم"]
["مصر","الاسكندرية","المنشأة 4","العميل 5",5,null,null,null,null,null,null,null,null,"السعودية","جدة","المنشأة 3","العميل 57",57]
["المغرب","الدار البيضاء","المنشأة 2","العميل 6",6]
["المغرب","الرباط","المنشأة 5","العميل 7",7]
["مصر","القاهرة","المنشأة 1","العميل 8",8]
["البحرين","المنامة","المنشأة 1","العميل 9",9]
["البحرين","المحرق","المنشأة 2","العميل 10",10]
["السعودية","جدة","المنشأة 5","العميل 11",11]
["البحرين","المحرق","المنشأة 4","العميل 12",12]
["السعودية","القاهرة","المنشأة 5","العميل 13",13]
["السعودية","الاسكندرية","المنشأة 2","العميل 14",14]
["المغرب","الاسكندرية","المنشأة 5","العميل 15",15]
["السعودية","القاهرة","المنشأة 3","العميل 16",16]
["المغرب","جدة","المنشأة 5","العميل 17",17]
["البحرين","جدة","المنشأة 3","العميل 18",18]
["المغرب","القاهرة","المنشأة 2","العميل 19",19]
["البحرين","الرياض","المنشأة 4","العميل 20",20]
["البحرين","المنامة","المنشأة 4","العميل 21",21]
["المغرب","جدة","المنشأة 3","العميل 22",22]
["المغرب","جدة","المنشأة 3","العميل 23",23]
["المغرب","القاهرة","المنشأة 1","العميل 24",24]
["البحرين","المنامة","المنشأة 5","العميل 25",25]
["السعودية","الاسكندرية","المنشأة 5","العميل 26",26]
["السعودية","جدة","المنشأة 2","العميل 27",27]
["المغرب","القاهرة","المنشأة 3","العميل 28",28]
["مصر","القاهرة","المنشأة 4","العميل 29",29]
{"$rows_left_out":29}
{"sheet":"Setting","index":1,"n_rows":256,"n_cols":7,"rows_kept":256,"cut":false,"hidden":true,"merged":[]}
[null,null,"الدولة","المدينة","المنشأة","العميل","رقم"]
[null,null,{"$f":"IFERROR(INDEX(Sheet1!$A$2:$A$600, MATCH(0,IF(ISBLANK(Sheet1!$A$2:$A$600),1,COUNTIF($C$1:C1, Sheet1!$A$2:$A$600)), 0)),\"\")","v":"السعودية"},{"$f":"IFERROR(INDEX(Sheet1!$B$2:$B$600, MATCH(0,IF(ISBLANK(Sheet1!$B$2:$B$600),1,COUNTIF($D$1:D1, Sheet1!$B$2:$B$600)), 0)),\"\")","v":"الرياض"},{"$f":"IFERROR(INDEX(Sheet1!$C$2:$C$600, MATCH(0,IF(ISBLANK(Sheet1!$C$2:$C$600),1,COUNTIF($E$1:E1, Sheet1!$C$2:$C$600)), 0)),\"\")","v":"المنشأة 1"},{"$f":"IFERROR(INDEX(Sheet1!$D$2:$D$600, MATCH(0,IF(ISBLANK(Sheet1!$D$2:$D$600),1,COUNTIF($F$1:F1, Sheet1!$D$2:$D$600)), 0)),\"\")","v":"العميل 1"},{"$f":"IFERROR(INDEX(Sheet1!$E$2:$E$600, MATCH(0,IF(ISBLANK(Sheet1!$E$2:$E$600),1,COUNTIF($G$1:G1, Sheet1!$E$2:$E$600)), 0)),\"\")","v":1}]
[null,null,{"$f":"IFERROR(INDEX(Sheet1!$A$2:$A$600, MATCH(0,IF(ISBLANK(Sheet1!$A$2:$A$600),1,COUNTIF($C$1:C2, Sheet1!$A$2:$A$600)), 0)),\"\")","v":"مصر"},{"$f":"IFERROR(INDEX(Sheet1!$B$2:$B$600, MATCH(0,IF(ISBLANK(Sheet1!$B$2:$B$600),1,COUNTIF($D$1:D2, Sheet1!$B$2:$B$600)), 0)),\"\")","v":"القاهرة"},{"$f":"IFERROR(INDEX(Sheet1!$C$2:$C$600, MATCH(0,IF(ISBLANK(Sheet1!$C$2:$C$600),1,COUNTIF($E$1:E2, Sheet1!$C$2:$C$600)), 0)),\"\")","v":"المنشأة 3"},{"$f":"IFERROR(INDEX(Sheet1!$D$2:$D$600, MATCH(0,IF(ISBLANK(Sheet1!$D$2:$D$600),1,COUNTIF($F$1:F2, Sheet1!$D$2:$D$600)), 0)),\"\")","v":"العميل 2"},{"$f":"IFERROR(INDEX(Sheet1!$E$2:$E$600, MATCH(0,IF(ISBLANK(Sheet1!$E$2:$E$600),1,COUNTIF($G$1:G2, Sheet1!$E$2:$E$600)), 0)),\"\")","v":2}]
[null,null,{"$f":"IFERROR(INDEX(Sheet1!$A$2:$A$600, MATCH(0,IF(ISBLANK(Sheet1!$A$2:$A$600),1,COUNTIF($C$1:C3, Sheet1!$A$2:$A$600)), 0)),\"\")","v":"المغرب"},{"$f":"IFERROR(INDEX(Sheet1!$B$2:$B$600, MATCH(0,IF(ISBLANK(Sheet1!$B$2:$B$600),1,COUNTIF($D$1:D3, Sheet1!$B$2:$B$600)), 0)),\"\")","v":"الرباط"},{"$f":"IFERROR(INDEX(Sheet1!$C$2:$C$600, MATCH(0,IF(ISBLANK(Sheet1!$C$2:$C$600),1,COUNTIF($E$1:E3, Sheet1!$C$2:$C$600)), 0)),\"\")","v":"المنشأة 2"},{"$f":"IFERROR(INDEX(Sheet1!$D$2:$D$600, MATCH(0,IF(ISBLANK(Sheet1!$D$2:$D$600),1,COUNTIF($F$1:F3, Sheet1!$D$2:$D$600)), 0)),\"\")","v":"العميل 3"},{"$f":"IFERROR(INDEX(Sheet1!$E$2:$E$600, MATCH(0,IF(ISBLANK(Sheet1!$E$2:$E$600),1,COUNTIF($G$1:G3, Sheet1!$E$2:$E$600)), 0)),\"\")","v":3}]
[null,null,{"$f":"IFERROR(INDEX(Sheet1!$A$2:$A$600, MATCH(0,IF(ISBLANK(Sheet1!$A$2:$A$600),1,COUNTIF($C$1:C4, Sheet1!$A$2:$A$600)), 0)),\"\")","v":"البحرين"},{"$f":"IFERROR(INDEX(Sheet1!$B$2:$B$600, MATCH(0,IF(ISBLANK(Sheet1!$B$2:$B$600),1,COUNTIF($D$1:D4, Sheet1!$B$2:$B$600)), 0)),\"\")","v":"جدة"},{"$f":"IFERROR(INDEX(Sheet1!$C$2:$C$600, MATCH(0,IF(ISBLANK(Sheet1!$C$2:$C$600),1,COUNTIF($E$1:E4, Sheet1!$C$2:$C$600)), 0)),\"\")","v":"المنشأة 5"},{"$f":"IFERROR(INDEX(Sheet1!$D$2:$D$600, MATCH(0,IF(ISBLANK(Sheet1!$D$2:$D$600),1,COUNTIF($F$1:F4, Sheet1!$D$2:$D$600)), 0)),\"\")","v":"العميل 4"},{"$f":"IFERROR(INDEX(Sheet1!$E$2:$E$600, MATCH(0,IF(ISBLANK(Sheet1!$E$2:$E$600),1,COUNTIF($G$1:G4, Sheet1!$E$2:$E$600)), 0)),\"\")","v":4}]
[null,null,{"$f":"IFERROR(INDEX(Sheet1!$A$2:$A$600, MATCH(0,IF(ISBLANK(Sheet1!$A$2:$A$600),1,COUNTIF($C$1:C5, Sheet1!$A$2:$A$600)), 0)),\"\")","v":""},{"$f":"IFERROR(INDEX(Sheet1!$B$2:$B$600, MATCH(0,IF(ISBLANK(Sheet1!$B$2:$B$600),1,COUNTIF($D$1:D5, Sheet1!$B$2:$B$600)), 0)),\"\")","v":"الاسكندرية"},{"$f":"IFERROR(INDEX(Sheet1!$C$2:$C$600, MATCH(0,IF(ISBLANK(Sheet1!$C$2:$C$600),1,COUNTIF($E$1:E5, Sheet1!$C$2:$C$600)), 0)),\"\")","v":"المنشأة 4"},{"$f":"IFERROR(INDEX(Sheet1!$D$2:$D$600, MATCH(0,IF(ISBLANK(Sheet1!$D$2:$D$600),1,COUNTIF($F$1:F5, Sheet1!$D$2:$D$600)), 0)),\"\")","v":"العميل 5"},{"$f":"IFERROR(INDEX(Sheet1!$E$2:$E$600, MATCH(0,IF(ISBLANK(Sheet1!$E$2:$E$600),1,COUNTIF($G$1:G5, Sheet1!$E$2:$E$600)), 0)),\"\")","v":5}]
[null,null,{"$f":"IFERROR(INDEX(Sheet1!$A$2:$A$600, MATCH(0,IF(ISBLANK(Sheet1!$A$2:$A$600),1,COUNTIF($C$1:C6, Sheet1!$A$2:$A$600)), 0)),\"\")","v":""},{"$f":"IFERROR(INDEX(Sheet1!$B$2:$B$600, MATCH(0,IF(ISBLANK(Sheet1!$B$2:$B$600),1,COUNTIF($D$1:D6, Sheet1!$B$2:$B$600)), 0)),\"\")","v":"الدار البيضاء"},{"$f":"IFERROR(INDEX(Sheet1!$C$2:$C$600, MATCH(0,IF(ISBLANK(Sheet1!$C$2:$C$600),1,COUNTIF($E$1:E6, Sheet1!$C$2:$C$600)), 0)),\"\")","v":""},{"$f":"IFERROR(INDEX(Sheet1!$D$2:$D$600, MATCH(0,IF(ISBLANK(Sheet1!$D$2:$D$600),1,COUNTIF($F$1:F6, Sheet1!$D$2:$D$600)), 0)),\"\")","v":"العميل 6"},{"$f":"IFERROR(INDEX(Sheet1!$E$2:$E$600, MATCH(0,IF(ISBLANK(Sheet1!$E$2:$E$600),1,COUNTIF($G$1:G6, Sheet1!$E$2:$E$600)), 0)),\"\")","v":6}]
[null,null,{"$f":"IFERROR(INDEX(Sheet1!$A$2:$A$600, MATCH(0,IF(ISBLANK(Sheet1!$A$2:$A$600),1,COUNTIF($C$1:C7, Sheet1!$A$2:$A$600)), 0)),\"\")","v":""},{"$f":"IFERROR(INDEX(Sheet1!$B$2:$B$600, MATCH(0,IF(ISBLANK(Sheet1!$B$2:$B$600),1,COUNTIF($D$1:D7, Sheet1!$B$2:$B$600)), 0)),\"\")","v":"المنامة"},{"$f":"IFERROR(INDEX(Sheet1!$C$2:$C$600, MATCH(0,IF(ISBLANK(Sheet1!$C$2:$C$600),1,COUNTIF($E$1:E7, Sheet1!$C$2:$C$600)), 0)),\"\")","v":""},{"$f":"IFERROR(INDEX(Sheet1!$D$2:$D$600, MATCH(0,IF(ISBLANK(Sheet1!$D$2:$D$600),1,COUNTIF($F$1:F7, Sheet1!$D$2:$D$600)), 0)),\"\")","v":"العميل 7"},{"$f":"IFERROR(INDEX(Sheet1!$E$2:$E$600, MATCH(0,IF(ISBLANK(Sheet1!$E$2:$E$600),1,COUNTIF($G$1:G7, Sheet1!$E$2:$E$600)), 0)),\"\")","v":7}]
[null,null,{"$f":"IFERROR(INDEX(Sheet1!$A$2:$A$600, MATCH(0,IF(ISBLANK(Sheet1!$A$2:$A$600),1,COUNTIF($C$1:C8, Sheet1!$A$2:$A$600)), 0)),\"\")","v":""},{"$f":"IFERROR(INDEX(Sheet1!$B$2:$B$600, MATCH(0,IF(ISBLANK(Sheet1!$B$2:$B$600),1,COUNTIF($D$1:D8, Sheet1!$B$2:$B$600)), 0)),\"\")","v":"المحرق"},{"$f":"IFERROR(INDEX(Sheet1!$C$2:$C$600, MATCH(0,IF(ISBLANK(Sheet1!$C$2:$C$600),1,COUNTIF($E$1:E8, Sheet1!$C$2:$C$600)), 0)),\"\")","v":""},{"$f":"IFERROR(INDEX(Sheet1!$D$2:$D$600, MATCH(0,IF(ISBLANK(Sheet1!$D$2:$D$600),1,COUNTIF($F$1:F8, Sheet1!$D$2:$D$600)), 0)),\"\")","v":"العميل 8"},{"$f":"IFERROR(INDEX(Sheet1!$E$2:$E$600, MATCH(0,IF(ISBLANK(Sheet1!$E$2:$E$600),1,COUNTIF($G$1:G8, Sheet1!$E$2:$E$600)), 0)),\"\")","v":8}]
[null,null,{"$f":"IFERROR(INDEX(Sheet1!$A$2:$A$600, MATCH(0,IF(ISBLANK(Sheet1!$A$2:$A$600),1,COUNTIF($C$1:C9, Sheet1!$A$2:$A$600)), 0)),\"\")","v":""},{"$f":"IFERROR(INDEX(Sheet1!$B$2:$B$600, MATCH(0,IF(ISBLANK(Sheet1!$B$2:$B$600),1,COUNTIF($D$1:D9, Sheet1!$B$2:$B$600)), 0)),\"\")","v":""},{"$f":"IFERROR(INDEX(Sheet1!$C$2:$C$600, MATCH(0,IF(ISBLANK(Sheet1!$C$2:$C$600),1,COUNTIF($E$1:E9, Sheet1!$C$2:$C$600)), 0)),\"\")","v":""},{"$f":"IFERROR(INDEX(Sheet1!$D$2:$D$600, MATCH(0,IF(ISBLANK(Sheet1!$D$2:$D$600),1,COUNTIF($F$1:F9, Sheet1!$D$2:$D$600)), 0)),\"\")","v":"العميل 9"},{"$f":"IFERROR(INDEX(Sheet1!$E$2:$E$600, MATCH(0,IF(ISBLANK(Sheet1!$E$2:$E$600),1,COUNTIF($G$1:G9, Sheet1!$E$2:$E$600)), 0)),\"\")","v":9}]
[null,null,{"$f":"IFERROR(INDEX(Sheet1!$A$2:$A$600, MATCH(0,IF(ISBLANK(Sheet1!$A$2:$A$600),1,COUNTIF($C$1:C10, Sheet1!$A$2:$A$600)), 0)),\"\")","v":""},{"$f":"IFERROR(INDEX(Sheet1!$B$2:$B$600, MATCH(0,IF(ISBLANK(Sheet1!$B$2:$B$600),1,COUNTIF($D$1:D10, Sheet1!$B$2:$B$600)), 0)),\"\")","v":""},{"$f":"IFERROR(INDEX(Sheet1!$C$2:$C$600, MATCH(0,IF(ISBLANK(Sheet1!$C$2:$C$600),1,COUNTIF($E$1:E10, Sheet1!$C$2:$C$600)), 0)),\"\")","v":""},{"$f":"IFERROR(INDEX(Sheet1!$D$2:$D$600, MATCH(0,IF(ISBLANK(Sheet1!$D$2:$D$600),1,COUNTIF($F$1:F10, Sheet1!$D$2:$D$600)), 0)),\"\")","v":"العميل 10"},{"$f":"IFERROR(INDEX(Sheet1!$E$2:$E$600, MATCH(0,IF(ISBLANK(Sheet1!$E$2:$E$600),1,COUNTIF($G$1:G10, Sheet1!$E$2:$E$600)), 0)),\"\")","v":10}]
[null,null,{"$f":"IFERROR(INDEX(Sheet1!$A$2:$A$600, MATCH(0,IF(ISBLANK(Sheet1!$A$2:$A$600),1,COUNTIF($C$1:C11, Sheet1!$A$2:$A$600)), 0)),\"\")","v":""},{"$f":"IFERROR(INDEX(Sheet1!$B$2:$B$600, MATCH(0,IF(ISBLANK(Sheet1!$B$2:$B$600),1,COUNTIF($D$1:D11, Sheet1!$B$2:$B$600)), 0)),\"\")","v":""},{"$f":"IFERROR(INDEX(Sheet1!$C$2:$C$600, MATCH(0,IF(ISBLANK(Sheet1!$C$2:$C$600),1,COUNTIF($E$1:E11, Sheet1!$C$2:$C$600)), 0)),\"\")","v":""},{"$f":"IFERROR(INDEX(Sheet1!$D$2:$D$600, MATCH(0,IF(ISBLANK(Sheet1!$D$2:$D$600),1,COUNTIF($F$1:F11, Sheet1!$D$2:$D$600)), 0)),\"\")","v":"العميل 11"},{"$f":"IFERROR(INDEX(Sheet1!$E$2:$E$600, MATCH(0,IF(ISBLANK(Sheet1!$E$2:$E$600),1,COUNTIF($G$1:G11, Sheet1!$E$2:$E$600)), 0)),\"\")","v":11}]
[null,null,{"$f":"IFERROR(INDEX(Sheet1!$A$2:$A$600, MATCH(0,IF(ISBLANK(Sheet1!$A$2:$A$600),1,COUNTIF($C$1:C12, Sheet1!$A$2:$A$600)), 0)),\"\")","v":""},{"$f":"IFERROR(INDEX(Sheet1!$B$2:$B$600, MATCH(0,IF(ISBLANK(Sheet1!$B$2:$B$600),1,COUNTIF($D$1:D12, Sheet1!$B$2:$B$600)), 0)),\"\")","v":""},{"$f":"IFERROR(INDEX(Sheet1!$C$2:$C$600, MATCH(0,IF(ISBLANK(Sheet1!$C$2:$C$600),1,COUNTIF($E$1:E12, Sheet1!$C$2:$C$600)), 0)),\"\")","v":""},{"$f":"IFERROR(INDEX(Sheet1!$D$2:$D$600, MATCH(0,IF(ISBLANK(Sheet1!$D$2:$D$600),1,COUNTIF($F$1:F12, Sheet1!$D$2:$D$600)), 0)),\"\")","v":"العميل 12"},{"$f":"IFERROR(INDEX(Sheet1!$E$2:$E$600, MATCH(0,IF(ISBLANK(Sheet1!$E$2:$E$600),1,COUNTIF($G$1:G12, Sheet1!$E$2:$E$600)), 0)),\"\")","v":12}]
[null,null,{"$f":"IFERROR(INDEX(Sheet1!$A$2:$A$600, MATCH(0,IF(ISBLANK(Sheet1!$A$2:$A$600),1,COUNTIF($C$1:C13, Sheet1!$A$2:$A$600)), 0)),\"\")","v":""},{"$f":"IFERROR(INDEX(Sheet1!$B$2:$B$600, MATCH(0,IF(ISBLANK(Sheet1!$B$2:$B$600),1,COUNTIF($D$1:D13, Sheet1!$B$2:$B$600)), 0)),\"\")","v":""},{"$f":"IFERROR(INDEX(Sheet1!$C$2:$C$600, MATCH(0,IF(ISBLANK(Sheet1!$C$2:$C$600),1,COUNTIF($E$1:E13, Sheet1!$C$2:$C$600)), 0)),\"\")","v":""},{"$f":"IFERROR(INDEX(Sheet1!$D$2:$D$600, MATCH(0,IF(ISBLANK(Sheet1!$D$2:$D$600),1,COUNTIF($F$1:F13, Sheet1!$D$2:$D$600)), 0)),\"\")","v":"العميل 13"},{"$f":"IFERROR(INDEX(Sheet1!$E$2:$E$600, MATCH(0,IF(ISBLANK(Sheet1!$E$2:$E$600),1,COUNTIF($G$1:G13, Sheet1!$E$2:$E$600)), 0)),\"\")","v":13}]
[null,null,{"$f":"IFERROR(INDEX(Sheet1!$A$2:$A$600, MATCH(0,IF(ISBLANK(Sheet1!$A$2:$A$600),1,COUNTIF($C$1:C14, Sheet1!$A$2:$A$600)), 0)),\"\")","v":""},{"$f":"IFERROR(INDEX(Sheet1!$B$2:$B$600, MATCH(0,IF(ISBLANK(Sheet1!$B$2:$B$600),1,COUNTIF($D$1:D14, Sheet1!$B$2:$B$600)), 0)),\"\")","v":""},{"$f":"IFERROR(INDEX(Sheet1!$C$2:$C$600, MATCH(0,IF(ISBLANK(Sheet1!$C$2:$C$600),1,COUNTIF($E$1:E14, Sheet1!$C$2:$C$600)), 0)),\"\")","v":""},{"$f":"IFERROR(INDEX(Sheet1!$D$2:$D$600, MATCH(0,IF(ISBLANK(Sheet1!$D$2:$D$600),1,COUNTIF($F$1:F14, Sheet1!$D$2:$D$600)), 0)),\"\")","v":"العميل 14"},{"$f":"IFERROR(INDEX(Sheet1!$E$2:$E$600, MATCH(0,IF(ISBLANK(Sheet1!$E$2:$E$600),1,COUNTIF($G$1:G14, Sheet1!$E$2:$E$600)), 0)),\"\")","v":14}]
[null,null,{"$f":"IFERROR(INDEX(Sheet1!$A$2:$A$600, MATCH(0,IF(ISBLANK(Sheet1!$A$2:$A$600),1,COUNTIF($C$1:C15, Sheet1!$A$2:$A$600)), 0)),\"\")","v":""},{"$f":"IFERROR(INDEX(Sheet1!$B$2:$B$600, MATCH(0,IF(ISBLANK(Sheet1!$B$2:$B$600),1,COUNTIF($D$1:D15, Sheet1!$B$2:$B$600)), 0)),\"\")","v":""},{"$f":"IFERROR(INDEX(Sheet1!$C$2:$C$600, MATCH(0,IF(ISBLANK(Sheet1!$C$2:$C$600),1,COUNTIF($E$1:E15, Sheet1!$C$2:$C$600)), 0)),\"\")","v":""},{"$f":"IFERROR(INDEX(Sheet1!$D$2:$D$600, MATCH(0,IF(ISBLANK(Sheet1!$D$2:$D$600),1,COUNTIF($F$1:F15, Sheet1!$D$2:$D$600)), 0)),\"\")","v":"العميل 15"},{"$f":"IFERROR(INDEX(Sheet1!$E$2:$E$600, MATCH(0,IF(ISBLANK(Sheet1!$E$2:$E$600),1,COUNTIF($G$1:G15, Sheet1!$E$2:$E$600)), 0)),\"\")","v":15}]
[null,null,{"$f":"IFERROR(INDEX(Sheet1!$A$2:$A$600, MATCH(0,IF(ISBLANK(Sheet1!$A$2:$A$600),1,COUNTIF($C$1:C16, Sheet1!$A$2:$A$600)), 0)),\"\")","v":""},{"$f":"IFERROR(INDEX(Sheet1!$B$2:$B$600, MATCH(0,IF(ISBLANK(Sheet1!$B$2:$B$600),1,COUNTIF($D$1:D16, Sheet1!$B$2:$B$600)), 0)),\"\")","v":""},{"$f":"IFERROR(INDEX(Sheet1!$C$2:$C$600, MATCH(0,IF(ISBLANK(Sheet1!$C$2:$C$600),1,COUNTIF($E$1:E16, Sheet1!$C$2:$C$600)), 0)),\"\")","v":""},{"$f":"IFERROR(INDEX(Sheet1!$D$2:$D$600, MATCH(0,IF(ISBLANK(Sheet1!$D$2:$D$600),1,COUNTIF($F$1:F16, Sheet1!$D$2:$D$600)), 0)),\"\")","v":"العميل 16"},{"$f":"IFERROR(INDEX(Sheet1!$E$2:$E$600, MATCH(0,IF(ISBLANK(Sheet1!$E$2:$E$600),1,COUNTIF($G$1:G16, Sheet1!$E$2:$E$600)), 0)),\"\")","v":16}]
[null,null,{"$f":"IFERROR(INDEX(Sheet1!$A$2:$A$600, MATCH(0,IF(ISBLANK(Sheet1!$A$2:$A$600),1,COUNTIF($C$1:C17, Sheet1!$A$2:$A$600)), 0)),\"\")","v":""},{"$f":"IFERROR(INDEX(Sheet1!$B$2:$B$600, MATCH(0,IF(ISBLANK(Sheet1!$B$2:$B$600),1,COUNTIF($D$1:D17, Sheet1!$B$2:$B$600)), 0)),\"\")","v":""},{"$f":"IFERROR(INDEX(Sheet1!$C$2:$C$600, MATCH(0,IF(ISBLANK(Sheet1!$C$2:$C$600),1,COUNTIF($E$1:E17, Sheet1!$C$2:$C$600)), 0)),\"\")","v":""},{"$f":"IFERROR(INDEX(Sheet1!$D$2:$D$600, MATCH(0,IF(ISBLANK(Sheet1!$D$2:$D$600),1,COUNTIF($F$1:F17, Sheet1!$D$2:$D$600)), 0)),\"\")","v":"العميل 17"},{"$f":"IFERROR(INDEX(Sheet1!$E$2:$E$600, MATCH(0,IF(ISBLANK(Sheet1!$E$2:$E$600),1,COUNTIF($G$1:G17, Sheet1!$E$2:$E$600)), 0)),\"\")","v":17}]
[null,null,{"$f":"IFERROR(INDEX(Sheet1!$A$2:$A$600, MATCH(0,IF(ISBLANK(Sheet1!$A$2:$A$600),1,COUNTIF($C$1:C18, Sheet1!$A$2:$A$600)), 0)),\"\")","v":""},{"$f":"IFERROR(INDEX(Sheet1!$B$2:$B$600, MATCH(0,IF(ISBLANK(Sheet1!$B$2:$B$600),1,COUNTIF($D$1:D18, Sheet1!$B$2:$B$600)), 0)),\"\")","v":""},{"$f":"IFERROR(INDEX(Sheet1!$C$2:$C$600, MATCH(0,IF(ISBLANK(Sheet1!$C$2:$C$600),1,COUNTIF($E$1:E18, Sheet1!$C$2:$C$600)), 0)),\"\")","v":""},{"$f":"IFERROR(INDEX(Sheet1!$D$2:$D$600, MATCH(0,IF(ISBLANK(Sheet1!$D$2:$D$600),1,COUNTIF($F$1:F18, Sheet1!$D$2:$D$600)), 0)),\"\")","v":"العميل 18"},{"$f":"IFERROR(INDEX(Sheet1!$E$2:$E$600, MATCH(0,IF(ISBLANK(Sheet1!$E$2:$E$600),1,COUNTIF($G$1:G18, Sheet1!$E$2:$E$600)), 0)),\"\")","v":18}]
[null,null,{"$f":"IFERROR(INDEX(Sheet1!$A$2:$A$600, MATCH(0,IF(ISBLANK(Sheet1!$A$2:$A$600),1,COUNTIF($C$1:C19, Sheet1!$A$2:$A$600)), 0)),\"\")","v":""},{"$f":"IFERROR(INDEX(Sheet1!$B$2:$B$600, MATCH(0,IF(ISBLANK(Sheet1!$B$2:$B$600),1,COUNTIF($D$1:D19, Sheet1!$B$2:$B$600)), 0)),\"\")","v":""},{"$f":"IFERROR(INDEX(Sheet1!$C$2:$C$600, MATCH(0,IF(ISBLANK(Sheet1!$C$2:$C$600),1,COUNTIF($E$1:E19, Sheet1!$C$2:$C$600)), 0)),\"\")","v":""},{"$f":"IFERROR(INDEX(Sheet1!$D$2:$D$600, MATCH(0,IF(ISBLANK(Sheet1!$D$2:$D$600),1,COUNTIF($F$1:F19, Sheet1!$D$2:$D$600)), 0)),\"\")","v":"العميل 19"},{"$f":"IFERROR(INDEX(Sheet1!$E$2:$E$600, MATCH(0,IF(ISBLANK(Sheet1!$E$2:$E$600),1,COUNTIF($G$1:G19, Sheet1!$E$2:$E$600)), 0)),\"\")","v":19}]
[null,null,{"$f":"IFERROR(INDEX(Sheet1!$A$2:$A$600, MATCH(0,IF(ISBLANK(Sheet1!$A$2:$A$600),1,COUNTIF($C$1:C20, Sheet1!$A$2:$A$600)), 0)),\"\")","v":""},{"$f":"IFERROR(INDEX(Sheet1!$B$2:$B$600, MATCH(0,IF(ISBLANK(Sheet1!$B$2:$B$600),1,COUNTIF($D$1:D20, Sheet1!$B$2:$B$600)), 0)),\"\")","v":""},{"$f":"IFERROR(INDEX(Sheet1!$C$2:$C$600, MATCH(0,IF(ISBLANK(Sheet1!$C$2:$C$600),1,COUNTIF($E$1:E20, Sheet1!$C$2:$C$600)), 0)),\"\")","v":""},{"$f":"IFERROR(INDEX(Sheet1!$D$2:$D$600, MATCH(0,IF(ISBLANK(Sheet1!$D$2:$D$600),1,COUNTIF($F$1:F20, Sheet1!$D$2:$D$600)), 0)),\"\")","v":"العميل 20"},{"$f":"IFERROR(INDEX(Sheet1!$E$2:$E$600, MATCH(0,IF(ISBLANK(Sheet1!$E$2:$E$600),1,COUNTIF($G$1:G20, Sheet1!$E$2:$E$600)), 0)),\"\")","v":20}]
[null,null,{"$f":"IFERROR(INDEX(Sheet1!$A$2:$A$600, MATCH(0,IF(ISBLANK(Sheet1!$A$2:$A$600),1,COUNTIF($C$1:C21, Sheet1!$A$2:$A$600)), 0)),\"\")","v":""},{"$f":"IFERROR(INDEX(Sheet1!$B$2:$B$600, MATCH(0,IF(ISBLANK(Sheet1!$B$2:$B$600),1,COUNTIF($D$1:D21, Sheet1!$B$2:$B$600)), 0)),\"\")","v":""},{"$f":"IFERROR(INDEX(Sheet1!$C$2:$C$600, MATCH(0,IF(ISBLANK(Sheet1!$C$2:$C$600),1,COUNTIF($E$1:E21, Sheet1!$C$2:$C$600)), 0)),\"\")","v":""},{"$f":"IFERROR(INDEX(Sheet1!$D$2:$D$600, MATCH(0,IF(ISBLANK(Sheet1!$D$2:$D$600),1,COUNTIF($F$1:F21, Sheet1!$D$2:$D$600)), 0)),\"\")","v":"العميل 21"},{"$f":"IFERROR(INDEX(Sheet1!$E$2:$E$600, MATCH(0,IF(ISBLANK(Sheet1!$E$2:$E$600),1,COUNTIF($G$1:G21, Sheet1!$E$2:$E$600)), 0)),\"\")","v":21}]
[null,null,{"$f":"IFERROR(INDEX(Sheet1!$A$2:$A$600, MATCH(0,IF(ISBLANK(Sheet1!$A$2:$A$600),1,COUNTIF($C$1:C22, Sheet1!$A$2:$A$600)), 0)),\"\")","v":""},{"$f":"IFERROR(INDEX(Sheet1!$B$2:$B$600, MATCH(0,IF(ISBLANK(Sheet1!$B$2:$B$600),1,COUNTIF($D$1:D22, Sheet1!$B$2:$B$600)), 0)),\"\")","v":""},{"$f":"IFERROR(INDEX(Sheet1!$C$2:$C$600, MATCH(0,IF(ISBLANK(Sheet1!$C$2:$C$600),1,COUNTIF($E$1:E22, Sheet1!$C$2:$C$600)), 0)),\"\")","v":""},{"$f":"IFERROR(INDEX(Sheet1!$D$2:$D$600, MATCH(0,IF(ISBLANK(Sheet1!$D$2:$D$600),1,COUNTIF($F$1:F22, Sheet1!$D$2:$D$600)), 0)),\"\")","v":"العميل 22"},{"$f":"IFERROR(INDEX(Sheet1!$E$2:$E$600, MATCH(0,IF(ISBLANK(Sheet1!$E$2:$E$600),1,COUNTIF($G$1:G22, Sheet1!$E$2:$E$600)), 0)),\"\")","v":22}]
[null,null,{"$f":"IFERROR(INDEX(Sheet1!$A$2:$A$600, MATCH(0,IF(ISBLANK(Sheet1!$A$2:$A$600),1,COUNTIF($C$1:C23, Sheet1!$A$2:$A$600)), 0)),\"\")","v":""},{"$f":"IFERROR(INDEX(Sheet1!$B$2:$B$600, MATCH(0,IF(ISBLANK(Sheet1!$B$2:$B$600),1,COUNTIF($D$1:D23, Sheet1!$B$2:$B$600)), 0)),\"\")","v":""},{"$f":"IFERROR(INDEX(Sheet1!$C$2:$C$600, MATCH(0,IF(ISBLANK(Sheet1!$C$2:$C$600),1,COUNTIF($E$1:E23, Sheet1!$C$2:$C$600)), 0)),\"\")","v":""},{"$f":"IFERROR(INDEX(Sheet1!$D$2:$D$600, MATCH(0,IF(ISBLANK(Sheet1!$D$2:$D$600),1,COUNTIF($F$1:F23, Sheet1!$D$2:$D$600)), 0)),\"\")","v":"العميل 23"},{"$f":"IFERROR(INDEX(Sheet1!$E$2:$E$600, MATCH(0,IF(ISBLANK(Sheet1!$E$2:$E$600),1,COUNTIF($G$1:G23, Sheet1!$E$2:$E$600)), 0)),\"\")","v":23}]
[null,null,{"$f":"IFERROR(INDEX(Sheet1!$A$2:$A$600, MATCH(0,IF(ISBLANK(Sheet1!$A$2:$A$600),1,COUNTIF($C$1:C24, Sheet1!$A$2:$A$600)), 0)),\"\")","v":""},{"$f":"IFERROR(INDEX(Sheet1!$B$2:$B$600, MATCH(0,IF(ISBLANK(Sheet1!$B$2:$B$600),1,COUNTIF($D$1:D24, Sheet1!$B$2:$B$600)), 0)),\"\")","v":""},{"$f":"IFERROR(INDEX(Sheet1!$C$2:$C$600, MATCH(0,IF(ISBLANK(Sheet1!$C$2:$C$600),1,COUNTIF($E$1:E24, Sheet1!$C$2:$C$600)), 0)),\"\")","v":""},{"$f":"IFERROR(INDEX(Sheet1!$D$2:$D$600, MATCH(0,IF(ISBLANK(Sheet1!$D$2:$D$600),1,COUNTIF($F$1:F24, Sheet1!$D$2:$D$600)), 0)),\"\")","v":"العميل 24"},{"$f":"IFERROR(INDEX(Sheet1!$E$2:$E$600, MATCH(0,IF(ISBLANK(Sheet1!$E$2:$E$600),1,COUNTIF($G$1:G24, Sheet1!$E$2:$E$600)), 0)),\"\")","v":24}]
[null,null,{"$f":"IFERROR(INDEX(Sheet1!$A$2:$A$600, MATCH(0,IF(ISBLANK(Sheet1!$A$2:$A$600),1,COUNTIF($C$1:C25, Sheet1!$A$2:$A$600)), 0)),\"\")","v":""},{"$f":"IFERROR(INDEX(Sheet1!$B$2:$B$600, MATCH(0,IF(ISBLANK(Sheet1!$B$2:$B$600),1,COUNTIF($D$1:D25, Sheet1!$B$2:$B$600)), 0)),\"\")","v":""},{"$f":"IFERROR(INDEX(Sheet1!$C$2:$C$600, MATCH(0,IF(ISBLANK(Sheet1!$C$2:$C$600),1,COUNTIF($E$1:E25, Sheet1!$C$2:$C$600)), 0)),\"\")","v":""},{"$f":"IFERROR(INDEX(Sheet1!$D$2:$D$600, MATCH(0,IF(ISBLANK(Sheet1!$D$2:$D$600),1,COUNTIF($F$1:F25, Sheet1!$D$2:$D$600)), 0)),\"\")","v":"العميل 25"},{"$f":"IFERROR(INDEX(Sheet1!$E$2:$E$600, MATCH(0,IF(ISBLANK(Sheet1!$E$2:$E$600),1,COUNTIF($G$1:G25, Sheet1!$E$2:$E$600)), 0)),\"\")","v":25}]
[null,null,{"$f":"IFERROR(INDEX(Sheet1!$A$2:$A$600, MATCH(0,IF(ISBLANK(Sheet1!$A$2:$A$600),1,COUNTIF($C$1:C26, Sheet1!$A$2:$A$600)), 0)),\"\")","v":""},{"$f":"IFERROR(INDEX(Sheet1!$B$2:$B$600, MATCH(0,IF(ISBLANK(Sheet1!$B$2:$B$600),1,COUNTIF($D$1:D26, Sheet1!$B$2:$B$600)), 0)),\"\")","v":""},{"$f":"IFERROR(INDEX(Sheet1!$C$2:$C$600, MATCH(0,IF(ISBLANK(Sheet1!$C$2:$C$600),1,COUNTIF($E$1:E26, Sheet1!$C$2:$C$600)), 0)),\"\")","v":""},{"$f":"IFERROR(INDEX(Sheet1!$D$2:$D$600, MATCH(0,IF(ISBLANK(Sheet1!$D$2:$D$600),1,COUNTIF($F$1:F26, Sheet1!$D$2:$D$600)), 0)),\"\")","v":"العميل 26"},{"$f":"IFERROR(INDEX(Sheet1!$E$2:$E$600, MATCH(0,IF(ISBLANK(Sheet1!$E$2:$E$600),1,COUNTIF($G$1:G26, Sheet1!$E$2:$E$600)), 0)),\"\")","v":26}]
[null,null,{"$f":"IFERROR(INDEX(Sheet1!$A$2:$A$600, MATCH(0,IF(ISBLANK(Sheet1!$A$2:$A$600),1,COUNTIF($C$1:C27, Sheet1!$A$2:$A$600)), 0)),\"\")","v":""},{"$f":"IFERROR(INDEX(Sheet1!$B$2:$B$600, MATCH(0,IF(ISBLANK(Sheet1!$B$2:$B$600),1,COUNTIF($D$1:D27, Sheet1!$B$2:$B$600)), 0)),\"\")","v":""},{"$f":"IFERROR(INDEX(Sheet1!$C$2:$C$600, MATCH(0,IF(ISBLANK(Sheet1!$C$2:$C$600),1,COUNTIF($E$1:E27, Sheet1!$C$2:$C$600)), 0)),\"\")","v":""},{"$f":"IFERROR(INDEX(Sheet1!$D$2:$D$600, MATCH(0,IF(ISBLANK(Sheet1!$D$2:$D$600),1,COUNTIF($F$1:F27, Sheet1!$D$2:$D$600)), 0)),\"\")","v":"العميل 27"},{"$f":"IFERROR(INDEX(Sheet1!$E$2:$E$600, MATCH(0,IF(ISBLANK(Sheet1!$E$2:$E$600),1,COUNTIF($G$1:G27, Sheet1!$E$2:$E$600)), 0)),\"\")","v":27}]
[null,null,{"$f":"IFERROR(INDEX(Sheet1!$A$2:$A$600, MATCH(0,IF(ISBLANK(Sheet1!$A$2:$A$600),1,COUNTIF($C$1:C28, Sheet1!$A$2:$A$600)), 0)),\"\")","v":""},{"$f":"IFERROR(INDEX(Sheet1!$B$2:$B$600, MATCH(0,IF(ISBLANK(Sheet1!$B$2:$B$600),1,COUNTIF($D$1:D28, Sheet1!$B$2:$B$600)), 0)),\"\")","v":""},{"$f":"IFERROR(INDEX(Sheet1!$C$2:$C$600, MATCH(0,IF(ISBLANK(Sheet1!$C$2:$C$600),1,COUNTIF($E$1:E28, Sheet1!$C$2:$C$600)), 0)),\"\")","v":""},{"$f":"IFERROR(INDEX(Sheet1!$D$2:$D$600, MATCH(0,IF(ISBLANK(Sheet1!$D$2:$D$600),1,COUNTIF($F$1:F28, Sheet1!$D$2:$D$600)), 0)),\"\")","v":"العميل 28"},{"$f":"IFERROR(INDEX(Sheet1!$E$2:$E$600, MATCH(0,IF(ISBLANK(Sheet1!$E$2:$E$600),1,COUNTIF($G$1:G28, Sheet1!$E$2:$E$600)), 0)),\"\")","v":28}]
[null,null,{"$f":"IFERROR(INDEX(Sheet1!$A$2:$A$600, MATCH(0,IF(ISBLANK(Sheet1!$A$2:$A$600),1,COUNTIF($C$1:C29, Sheet1!$A$2:$A$600)), 0)),\"\")","v":""},{"$f":"IFERROR(INDEX(Sheet1!$B$2:$B$600, MATCH(0,IF(ISBLANK(Sheet1!$B$2:$B$600),1,COUNTIF($D$1:D29, Sheet1!$B$2:$B$600)), 0)),\"\")","v":""},{"$f":"IFERROR(INDEX(Sheet1!$C$2:$C$600, MATCH(0,IF(ISBLANK(Sheet1!$C$2:$C$600),1,COUNTIF($E$1:E29, Sheet1!$C$2:$C$600)), 0)),\"\")","v":""},{"$f":"IFERROR(INDEX(Sheet1!$D$2:$D$600, MATCH(0,IF(ISBLANK(Sheet1!$D$2:$D$600),1,COUNTIF($F$1:F29, Sheet1!$D$2:$D$600)), 0)),\"\")","v":"العميل 29"},{"$f":"IFERROR(INDEX(Sheet1!$E$2:$E$600, MATCH(0,IF(ISBLANK(Sheet1!$E$2:$E$600),1,COUNTIF($G$1:G29, Sheet1!$E$2:$E$600)), 0)),\"\")","v":29}]
{"$rows_left_out":226}