{"text_format":"1","workbook":"xlsx","n_sheets":6,"sheets":["Shift_1","Shift_2","Shift_3","Total Prodaction By shift","Sheet1","Sheet2"],"not_rendered":{"charts":0,"images":0,"macros":1,"external_links":0,"defined_names":14,"comments":0,"pivot_tables":0},"unopened":[],"bounds":{"document_bytes":16777216,"sheet_cells":100000,"rows_first":2000,"rows_last":500,"rows_between":2000,"halvings":0,"cell_chars":16384,"cell_head_chars":4096},"cells_cut":0,"cells_raw":0,"read":"whole","date_system":"1900"}

{"sheet":"Shift_1","index":0,"n_rows":597,"n_cols":38,"rows_kept":597,"cut":false,"hidden":false,"merged":[[6,1,6,3],[6,5,6,7],[6,9,6,12]]}
[]
["Date","Start Time","End Time","Total","Machine No.","Machine Name","Maximum power  ( HOUR / KG)","        Average hourly output","Acual Production rate        ( HOUR / KG)","     Production rate per Shift   ","      Average hourly output","Gm/ML","Size MM"," Drawing  ","ML X KG."," ML.\\ day","Color","Shift","       Name of the Employee","       Name of Supervisor","OR No.","Comment",null,null,null,null,null,null,null,null,null,0.05,"Black ","منصور محمد منصور","محمد","Machine number","Machine Name","Machine Type"]
[{"$f":"IF(E3=\"\",\"\",IF(A3=\"\",TODAY(),A3))","v":"2019-02-18"},"08:00:00","09:00:00",{"$f":"C3-B3+IF(B3>C3,1)","v":"01:00:00"},1,{"$f":"IFERROR(VLOOKUP(E3,$AJ$3:$AL$317,2,FALSE),\"\")","v":"Crosha COMEZ 2017"},{"$f":"IFERROR(VLOOKUP(E3,$AJ$3:$AL$317,3,FALSE),\"\")","v":17.5},{"$f":"IFERROR(SUM(G3/7),\"\")","v":2.5},null,15,{"$f":"IFERROR(SUM(J3/C3),\"\")","v":40},20,0.06,"eeee",{"$f":"IFERROR(ROUND(SUM(1000/L3),2),\"\")","v":50},{"$f":"IFERROR(ROUND(SUM(J3*O3),2),\"\")","v":750},"Black ",1,"منصور محمد منصور","محمود",2211,"hhh",null,null,null,null,null,null,null,null,null,0.06,"White","علي مراد حسن","محمود",1,"Crosha COMEZ 2017",17.5]
[{"$f":"IF(E4=\"\",\"\",IF(A4=\"\",TODAY(),A4))","v":"2019-02-18"},"10:30:00","15:00:00",{"$f":"C4-B4+IF(B4>C4,1)","v":"04:30:00"},2,{"$f":"IFERROR(VLOOKUP(E4,$AJ$3:$AL$317,2,FALSE),\"\")","v":"Crosha COMEZ 2017"},{"$f":"IFERROR(VLOOKUP(E4,$AJ$3:$AL$317,3,FALSE),\"\")","v":13.5},{"$f":"IFERROR(SUM(G4/7),\"\")","v":1.9285714285714286},null,10,{"$f":"IFERROR(SUM(#REF!/C4),\"\")","v":""},10,7.0000000000000007E-2,"hhh",{"$f":"IFERROR(ROUND(SUM(1000/L4),2),\"\")","v":100},{"$f":"IFERROR(ROUND(SUM(#REF!*O4),2),\"\")","v":""},"Black&White",1,"ابراهيم محمود ابراهيم","محمود",1111,null,null,null,null,null,null,null,null,null,null,7.0000000000000007E-2,"Black&White","ابراهيم محمود ابراهيم","اسامة",2,"Crosha COMEZ 2017",13.5]
["2019-02-18","09:30:00","16:30:00","07:00:00",5,"","","",null,8,{"$f":"IFERROR(SUM(#REF!/C5),\"\")","v":""},8,0.06,"o",125,{"$f":"IFERROR(ROUND(SUM(#REF!*O5),2),\"\")","v":""},"White",1,"دينا مجدي ابراهيم","محمود",999,null,null,null,null,null,null,null,null,null,null,0.08,"A prominent Black","مسعد رمزي مسعد",null,3,"Crosha F.COLLIC 1996",10.5]
[null,null,"↓",null,null,null,null,"↓",null,0.09,"↓","عادل عزمي شنودة",null,4,"Crosha F.COLLIC 1997",9.4499999999999993]
[null,"محتاج الوقت الاخير يكون 4.30 ولايكتب 16:30",null,null,null,"محتاج اقسم عدد الكيلوات على عدد الساعات والناتج رقم صحيح",null,null,null,"محتاج اقسم عدد الكيلوات على عدد الساعات والناتج رقم صحيح",null,null,null,5,"Crosha F.COLLIC 1996",9.1]
[null,null,null,null,null,null,null,null,null,0.11,null,"السيد محمد عبد العال",null,6,"Crosha"]
[null,null,null,null,null,null,null,null,null,0.12,null,"عادل سيف الله السيد",null,7,"Crosha"]
[null,null,null,null,null,null,null,null,null,0.13,null,"خالد السيد عبد القادر",null,8,"Crosha"]
[null,null,null,null,null,null,null,null,null,0.14000000000000001,null,"عادل صادق بشير",null,9,"Crosha"]
[null,null,null,null,null,null,null,null,null,0.15,null,"روماني عطية حبشي",null,10,"Crosha"]
[null,null,null,null,null,null,null,null,null,0.16,null,"احمد صادق توفيق",null,11,"Crosha"]
[null,null,null,null,null,null,null,null,null,0.17,null,"دينا مجدي ابراهيم",null,12,"Crosha"]
[null,null,null,null,null,null,null,null,null,0.18,null,"علي فرج على محمد",null,13,"Crosha"]
[null,null,null,null,null,null,null,null,null,0.19,null,"بوسي السيد عبد المنعم",null,14,"Crosha"]
[null,null,null,null,null,null,null,null,null,0.2,null,"محمد محمد عبد الوهاب",null,15,"Crosha"]
[null,null,null,null,null,null,null,null,null,0.21,null,"سعيد الليثي جاب الله",null,16,"Crosha"]
[null,null,null,null,null,null,null,null,null,0.22,null,"احمد عبد الظاهر",null,17,"Crosha"]
[null,null,null,null,null,null,null,null,null,0.23,null,"مصطفى عبد النبي مصطفى",null,18,"Crosha"]
[null,null,null,null,null,null,null,null,null,0.24,null,"ابراهيم صبحي محمد السيد",null,19,"Crosha"]
[null,null,null,null,null,null,null,null,null,0.25,null,"خميس حسن حسنين",null,20,"Crosha"]
[null,null,null,null,null,null,null,null,null,0.26,null,"محمد حسني حسن",null,21,"Crosha"]
[null,null,null,null,null,null,null,null,null,0.27,null,"محمد عادل محمد محمد",null,22,"Crosha"]
[null,null,null,null,null,null,null,null,null,0.28000000000000003,null,"السيد عبد الحميد اسماعيل",null,23,"Crosha"]
[null,null,null,null,null,null,null,null,null,0.28999999999999998,null,"ابراهيم محمد فتوح",null,24,"Crosha"]
[null,null,null,null,null,null,null,null,null,0.3,null,"عمرو محمد عبد الجليل",null,25,"Crosha"]
[null,null,null,null,null,null,null,null,null,0.31,null,"خالد مصطفى العوضي",null,26,"Crosha"]
[null,null,null,null,null,null,null,null,null,0.32,null,"حمادة احمد على النجار",null,27,"Crosha"]
[null,null,null,null,null,null,null,null,null,0.33,null,"عاطف وليم لبيب",null,28,"Crosha"]
[null,null,null,null,null,null,null,null,null,0.34,null,"عادل وليم نبيل",null,29,"Crosha"]
[null,null,null,null,null,null,null,null,null,0.35,null,"بيشوي عزت شفيق",null,30,"Crosha"]
[null,null,null,null,null,null,null,null,null,0.36,null,"محمد يحيى محمود",null,31,"Crosha"]
[null,null,null,null,null,null,null,null,null,0.37,null,"احمد رمضان احمد",null,32,"Crosha"]
[null,null,null,null,null,null,null,null,null,0.38,null,null,null,33,"Crosha"]
[null,null,null,null,null,null,null,null,null,0.39,null,null,null,34,"Crosha"]
[null,null,null,null,null,null,null,null,null,0.4,null,null,null,35,"Crosha"]
[null,null,null,null,null,null,null,null,null,0.41,null,null,null,36,"Crosha"]
[null,null,null,null,null,null,null,null,null,0.42,null,null,null,37,"Crosha"]
[null,null,null,null,null,null,null,null,null,0.43,null,null,null,38,"Crosha"]
[null,null,null,null,null,null,null,null,null,0.44,null,null,null,39,"Crosha"]
[null,null,null,null,null,null,null,null,null,0.45,null,null,null,40,"Crosha"]
[null,null,null,null,null,null,null,null,null,0.46,null,null,null,41,"Crosha"]
[null,null,null,null,null,null,null,null,null,0.47,null,null,null,42,"Crosha"]
[null,null,null,null,null,null,null,null,null,0.48,null,null,null,43,"Crosha"]
[null,null,null,null,null,null,null,null,null,0.49,null,null,null,44,"Crosha"]
[null,null,null,null,null,null,null,null,null,0.5,null,null,null,45,"Crosha"]
[null,null,null,null,null,null,null,null,null,0.51,null,null,null,46,"Crosha"]
[null,null,null,null,null,null,null,null,null,0.52,null,null,null,47,"Crosha"]
[null,null,null,null,null,null,null,null,null,0.53,null,null,null,48,"Crosha"]
[null,null,null,null,null,null,null,null,null,0.54,null,null,null,49,"Crosha"]
[null,null,null,null,null,null,null,null,null,0.55000000000000004,null,null,null,50,"Crosha"]
[null,null,null,null,null,null,null,null,null,0.56000000000000005,null,null,null,51,"Crosha"]
[null,null,null,null,null,null,null,null,null,0.56999999999999995,null,null,null,52,"Crosha"]
[null,null,null,null,null,null,null,null,null,0.57999999999999996,null,null,null,53,"Crosha"]
[null,null,null,null,null,null,null,null,null,0.59,null,null,null,54,"Crosha"]
[null,null,null,null,null,null,null,null,null,0.6,null,null,null,55,"Crosha"]
[null,null,null,null,null,null,null,null,null,0.61,null,null,null,56,"Crosha"]
[null,null,null,null,null,null,null,null,null,0.62,null,null,null,57,"Crosha"]
[null,null,null,null,null,null,null,null,null,0.63,null,null,null,58,"Crosha"]
[null,null,null,null,null,null,null,null,null,0.64,null,null,null,59,"Crosha"]
[null,null,null,null,null,null,null,null,null,0.65,null,null,null,60,"Crosha"]
[null,null,null,null,null,null,null,null,null,0.66,null,null,null,61,"Crosha"]
[null,null,null,null,null,null,null,null,null,0.67,null,null,null,62,"Crosha"]
[null,null,null,null,null,null,null,null,null,0.68,null,null,null,63,"Crosha"]
[null,null,null,null,null,null,null,null,null,0.69,null,null,null,64,"Crosha"]
[null,null,null,null,null,null,null,null,null,0.7,null,null,null,65,"Crosha"]
[null,null,null,null,null,null,null,null,null,0.71,null,null,null,66,"Crosha"]
[null,null,null,null,null,null,null,null,null,0.72,null,null,null,67,"Crosha"]
[null,null,null,null,null,null,null,null,null,0.73,null,null,null,68,"Crosha"]
[null,null,null,null,null,null,null,null,null,0.74,null,null,null,69,"Crosha"]
[null,null,null,null,null,null,null,null,null,0.75,null,null,null,70,"Crosha"]
[null,null,null,null,null,null,null,null,null,0.76,null,null,null,71,"Crosha"]
[null,null,null,null,null,null,null,null,null,0.77,null,null,null,72,"Crosha"]
[null,null,null,null,null,null,null,null,null,0.78,null,null,null,73,"Crosha"]
[null,null,null,null,null,null,null,null,null,0.79,null,null,null,74,"Crosha"]
[null,null,null,null,null,null,null,null,null,0.8,null,null,null,75,"Crosha"]
[null,null,null,null,null,null,null,null,null,0.81,null,null,null,76,"Crosha"]
[null,null,null,null,null,null,null,null,null,0.82,null,null,null,77,"Crosha"]
[null,null,null,null,null,null,null,null,null,0.83,null,null,null,78,"Crosha"]
[null,null,null,null,null,null,null,null,null,0.84,null,null,null,79,"Crosha"]
[null,null,null,null,null,null,null,null,null,0.85,null,null,null,80,"Crosha"]
[null,null,null,null,null,null,null,null,null,0.86,null,null,null,81,"Crosha"]
[null,null,null,null,null,null,null,null,null,0.87,null,null,null,82,"Crosha"]
[null,null,null,null,null,null,null,null,null,0.88,null,null,null,83,"Crosha"]
[null,null,null,null,null,null,null,null,null,0.89,null,null,null,84,"Crosha"]
[null,null,null,null,null,null,null,null,null,0.9,null,null,null,85,"Crosha"]
[null,null,null,null,null,null,null,null,null,0.91,null,null,null,86,"Crosha"]
[null,null,null,null,null,null,null,null,null,0.92,null,null,null,87,"Crosha"]
[null,null,null,null,null,null,null,null,null,0.93,null,null,null,88,"Crosha"]
[null,null,null,null,null,null,null,null,null,0.94,null,null,null,89,"Crosha"]
[null,null,null,null,null,null,null,null,null,0.95,null,null,null,90,"Crosha"]
[null,null,null,null,null,null,null,null,null,0.96,null,null,null,91,"Crosha"]
[null,null,null,null,null,null,null,null,null,0.97,null,null,null,92,"Crosha"]
[null,null,null,null,null,null,null,null,null,0.98,null,null,null,93,"Crosha"]
[null,null,null,null,null,null,null,null,null,0.99,null,null,null,94,"Crosha"]
[null,null,null,null,null,null,null,null,null,1,null,null,null,95,"Crosha"]
[null,null,null,null,null,null,null,null,null,1.01,null,null,null,96,"Crosha"]
[null,null,null,null,null,null,null,null,null,1.02,null,null,null,97,"Crosha"]
[null,null,null,null,null,null,null,null,null,1.03,null,null,null,98,"Crosha"]
[null,null,null,null,null,null,null,null,null,1.04,null,null,null,99,"Crosha"]
[null,null,null,null,null,null,null,null,null,1.05,null,null,null,100,"Crosha"]
[null,null,null,null,null,null,null,null,null,1.06,null,null,null,101,"Jakar - MULLER 2017",3.91]
[null,null,null,null,null,null,null,null,null,1.07,null,null,null,102,"Jakar - MULLER 2017",5.94]
[null,null,null,null,null,null,null,null,null,1.08,null,null,null,103,"Jakar"]
[null,null,null,null,null,null,null,null,null,1.0900000000000001,null,null,null,104,"Jakar"]
[null,null,null,null,null,null,null,null,null,1.1000000000000001,null,null,null,105,"Jakar"]
[null,null,null,null,null,null,null,null,null,1.1100000000000001,null,null,null,106,"Jakar"]
[null,null,null,null,null,null,null,null,null,1.1200000000000001,null,null,null,107,"Jakar"]
[null,null,null,null,null,null,null,null,null,1.1299999999999999,null,null,null,108,"Jakar"]
[null,null,null,null,null,null,null,null,null,1.1399999999999999,null,null,null,109,"Jakar"]
[null,null,null,null,null,null,null,null,null,1.1499999999999999,null,null,null,110,"Jakar"]
[null,null,null,null,null,null,null,null,null,1.1599999999999999,null,null,null,111,"Jakar"]
[null,null,null,null,null,null,null,null,null,1.17,null,null,null,112,"Jakar"]
[null,null,null,null,null,null,null,null,null,1.18,null,null,null,113,"Jakar"]
[null,null,null,null,null,null,null,null,null,1.19,null,null,null,114,"Jakar"]
[null,null,null,null,null,null,null,null,null,1.2,null,null,null,115,"Jakar"]
[null,null,null,null,null,null,null,null,null,1.21,null,null,null,116,"Jakar"]
[null,null,null,null,null,null,null,null,null,1.22,null,null,null,117,"Jakar"]
[null,null,null,null,null,null,null,null,null,1.23,null,null,null,118,"Jakar"]
[null,null,null,null,null,null,null,null,null,1.24,null,null,null,119,"Jakar"]
[null,null,null,null,null,null,null,null,null,1.25,null,null,null,120,"Jakar"]
[null,null,null,null,null,null,null,null,null,1.26,null,null,null,121,"Jakar"]
[null,null,null,null,null,null,null,null,null,1.27,null,null,null,122,"Jakar"]
[null,null,null,null,null,null,null,null,null,1.28,null,null,null,123,"Jakar"]
[null,null,null,null,null,null,null,null,null,1.29,null,null,null,124,"Jakar"]
[null,null,null,null,null,null,null,null,null,1.3,null,null,null,125,"Jakar"]
[null,null,null,null,null,null,null,null,null,1.31,null,null,null,126,"Jakar"]
[null,null,null,null,null,null,null,null,null,1.32,null,null,null,127,"Jakar"]
[null,null,null,null,null,null,null,null,null,1.33,null,null,null,128,"Jakar"]
[null,null,null,null,null,null,null,null,null,1.34,null,null,null,129,"Jakar"]
[null,null,null,null,null,null,null,null,null,1.35,null,null,null,130,"Jakar"]
[null,null,null,null,null,null,null,null,null,1.36,null,null,null,131,"Jakar"]
[null,null,null,null,null,null,null,null,null,1.37,null,null,null,132,"Jakar"]
[null,null,null,null,null,null,null,null,null,1.38,null,null,null,133,"Jakar"]
[null,null,null,null,null,null,null,null,null,1.39,null,null,null,134,"Jakar"]
[null,null,null,null,null,null,null,null,null,1.4,null,null,null,135,"Jakar"]
[null,null,null,null,null,null,null,null,null,1.41,null,null,null,136,"Jakar"]
[null,null,null,null,null,null,null,null,null,1.42,null,null,null,137,"Jakar"]
[null,null,null,null,null,null,null,null,null,1.43,null,null,null,138,"Jakar"]
[null,null,null,null,null,null,null,null,null,1.44,null,null,null,139,"Jakar"]
[null,null,null,null,null,null,null,null,null,1.45,null,null,null,140,"Jakar"]
[null,null,null,null,null,null,null,null,null,1.46,null,null,null,141,"Jakar"]
[null,null,null,null,null,null,null,null,null,1.47,null,null,null,142,"Jakar"]
[null,null,null,null,null,null,null,null,null,1.48,null,null,null,143,"Jakar"]
[null,null,null,null,null,null,null,null,null,1.49,null,null,null,144,"Jakar"]
[null,null,null,null,null,null,null,null,null,1.5,null,null,null,145,"Jakar"]
[null,null,null,null,null,null,null,null,null,1.51,null,null,null,146,"Jakar"]
[null,null,null,null,null,null,null,null,null,1.52,null,null,null,147,"Jakar"]
[null,null,null,null,null,null,null,null,null,1.53,null,null,null,148,"Jakar"]
[null,null,null,null,null,null,null,null,null,1.54,null,null,null,149,"Jakar"]
[null,null,null,null,null,null,null,null,null,1.55,null,null,null,150,"Jakar"]
[null,null,null,null,null,null,null,null,null,1.56,null,null,null,151,"Jakar"]
[null,null,null,null,null,null,null,null,null,1.57,null,null,null,152,"Jakar"]
[null,null,null,null,null,null,null,null,null,1.58,null,null,null,153,"Jakar"]
[null,null,null,null,null,null,null,null,null,1.59,null,null,null,154,"Jakar"]
[null,null,null,null,null,null,null,null,null,1.6,null,null,null,155,"Jakar"]
[null,null,null,null,null,null,null,null,null,1.61,null,null,null,156,"Jakar"]
[null,null,null,null,null,null,null,null,null,1.62,null,null,null,157,"Jakar"]
[null,null,null,null,null,null,null,null,null,1.63,null,null,null,158,"Jakar"]
[null,null,null,null,null,null,null,null,null,1.64,null,null,null,159,"Jakar"]
[null,null,null,null,null,null,null,null,null,1.65,null,null,null,160,"Jakar"]
[null,null,null,null,null,null,null,null,null,1.66,null,null,null,161,"Jakar"]
[null,null,null,null,null,null,null,null,null,1.67,null,null,null,162,"Jakar"]
[null,null,null,null,null,null,null,null,null,1.68,null,null,null,163,"Jakar"]
[null,null,null,null,null,null,null,null,null,1.69,null,null,null,164,"Jakar"]
[null,null,null,null,null,null,null,null,null,1.7,null,null,null,165,"Jakar"]
[null,null,null,null,null,null,null,null,null,1.71,null,null,null,166,"Jakar"]
[null,null,null,null,null,null,null,null,null,1.72,null,null,null,167,"Jakar"]
[null,null,null,null,null,null,null,null,null,1.73,null,null,null,168,"Jakar"]
[null,null,null,null,null,null,null,null,null,1.74,null,null,null,169,"Jakar"]
[null,null,null,null,null,null,null,null,null,1.75,null,null,null,170,"Jakar"]
[null,null,null,null,null,null,null,null,null,1.76,null,null,null,171,"Jakar"]
[null,null,null,null,null,null,null,null,null,1.77,null,null,null,172,"Jakar"]
[null,null,null,null,null,null,null,null,null,1.78,null,null,null,173,"Jakar"]
[null,null,null,null,null,null,null,null,null,1.79,null,null,null,174,"Jakar"]
[null,null,null,null,null,null,null,null,null,1.8,null,null,null,175,"Jakar"]
[null,null,null,null,null,null,null,null,null,1.81,null,null,null,176,"Jakar"]
[null,null,null,null,null,null,null,null,null,1.82,null,null,null,177,"Jakar"]
[null,null,null,null,null,null,null,null,null,1.83,null,null,null,178,"Jakar"]
[null,null,null,null,null,null,null,null,null,1.84,null,null,null,179,"Jakar"]
[null,null,null,null,null,null,null,null,null,1.85,null,null,null,180,"Jakar"]
[null,null,null,null,null,null,null,null,null,1.86,null,null,null,181,"Jakar"]
[null,null,null,null,null,null,null,null,null,1.87,null,null,null,182,"Jakar"]
[null,null,null,null,null,null,null,null,null,1.88,null,null,null,183,"Jakar"]
[null,null,null,null,null,null,null,null,null,1.89,null,null,null,184,"Jakar"]
[null,null,null,null,null,null,null,null,null,1.9,null,null,null,185,"Jakar"]
[null,null,null,null,null,null,null,null,null,1.91,null,null,null,186,"Jakar"]
[null,null,null,null,null,null,null,null,null,1.92,null,null,null,187,"Jakar"]
[null,null,null,null,null,null,null,null,null,1.93,null,null,null,188,"Jakar"]
[null,null,null,null,null,null,null,null,null,1.94,null,null,null,189,"Jakar"]
[null,null,null,null,null,null,null,null,null,1.95,null,null,null,190,"Jakar"]
[null,null,null,null,null,null,null,null,null,1.96,null,null,null,191,"Jakar"]
[null,null,null,null,null,null,null,null,null,1.97,null,null,null,192,"Jakar"]
[null,null,null,null,null,null,null,null,null,1.98,null,null,null,193,"Jakar"]
[null,null,null,null,null,null,null,null,null,1.99,null,null,null,194,"Jakar"]
[null,null,null,null,null,null,null,null,null,2,null,null,null,195,"Jakar"]
[null,null,null,null,null,null,null,null,null,2.0099999999999998,null,null,null,196,"Jakar"]
[null,null,null,null,null,null,null,null,null,2.02,null,null,null,197,"Jakar"]
[null,null,null,null,null,null,null,null,null,2.0299999999999998,null,null,null,198,"Jakar"]
[null,null,null,null,null,null,null,null,null,2.04,null,null,null,199,"Jakar"]
[null,null,null,null,null,null,null,null,null,2.0499999999999998,null,null,null,200,"Jakar"]
[null,null,null,null,null,null,null,null,null,2.06,null,null,null,201,"Jakar"]
[null,null,null,null,null,null,null,null,null,2.0699999999999998,null,null,null,202,"Jakar"]
[null,null,null,null,null,null,null,null,null,2.08,null,null,null,203,"Jakar"]
[null,null,null,null,null,null,null,null,null,2.09,null,null,null,204,"Jakar"]
[null,null,null,null,null,null,null,null,null,2.1,null,null,null,205,"Jakar"]
[null,null,null,null,null,null,null,null,null,2.11,null,null,null,206,"Jakar"]
[null,null,null,null,null,null,null,null,null,2.12,null,null,null,207,"Jakar"]
[null,null,null,null,null,null,null,null,null,2.13,null,null,null,208,"Jakar"]
[null,null,null,null,null,null,null,null,null,2.14,null,null,null,209,"Jakar"]
[null,null,null,null,null,null,null,null,null,2.15,null,null,null,210,"Jakar"]
[null,null,null,null,null,null,null,null,null,2.16,null,null,null,211,"Jakar"]
[null,null,null,null,null,null,null,null,null,2.17,null,null,null,212,"Jakar"]
[null,null,null,null,null,null,null,null,null,2.1800000000000002,null,null,null,213,"Jakar"]
[null,null,null,null,null,null,null,null,null,2.19,null,null,null,214,"Jakar"]
[null,null,null,null,null,null,null,null,null,2.2000000000000002,null,null,null,215,"Jakar"]
[null,null,null,null,null,null,null,null,null,2.21,null,null,null,216,"Jakar"]
[null,null,null,null,null,null,null,null,null,2.2200000000000002,null,null,null,217,"Jakar"]
[null,null,null,null,null,null,null,null,null,2.23,null,null,null,218,"Jakar"]
[null,null,null,null,null,null,null,null,null,2.2400000000000002,null,null,null,219,"Jakar"]
[null,null,null,null,null,null,null,null,null,2.25,null,null,null,220,"Jakar"]
[null,null,null,null,null,null,null,null,null,2.2599999999999998,null,null,null,221,"Jakar"]
[null,null,null,null,null,null,null,null,null,2.27,null,null,null,222,"Jakar"]
[null,null,null,null,null,null,null,null,null,2.2799999999999998,null,null,null,223,"Jakar"]
[null,null,null,null,null,null,null,null,null,2.29,null,null,null,224,"Jakar"]
[null,null,null,null,null,null,null,null,null,2.2999999999999998,null,null,null,225,"Jakar"]
[null,null,null,null,null,null,null,null,null,2.31,null,null,null,226,"Jakar"]
[null,null,null,null,null,null,null,null,null,2.3199999999999998,null,null,null,227,"Jakar"]
[null,null,null,null,null,null,null,null,null,2.33,null,null,null,228,"Jakar"]
[null,null,null,null,null,null,null,null,null,2.34,null,null,null,229,"Jakar"]
[null,null,null,null,null,null,null,null,null,2.35,null,null,null,230,"Jakar"]
[null,null,null,null,null,null,null,null,null,2.36,null,null,null,231,"Jakar"]
[null,null,null,null,null,null,null,null,null,2.37,null,null,null,232,"Jakar"]
[null,null,null,null,null,null,null,null,null,2.38,null,null,null,233,"Jakar"]
[null,null,null,null,null,null,null,null,null,2.39,null,null,null,234,"Jakar"]
[null,null,null,null,null,null,null,null,null,2.4,null,null,null,235,"Jakar"]
[null,null,null,null,null,null,null,null,null,2.41,null,null,null,236,"Jakar"]
[null,null,null,null,null,null,null,null,null,2.42,null,null,null,237,"Jakar"]
[null,null,null,null,null,null,null,null,null,2.4300000000000002,null,null,null,238,"Jakar"]
[null,null,null,null,null,null,null,null,null,2.44,null,null,null,239,"Jakar"]
[null,null,null,null,null,null,null,null,null,2.4500000000000002,null,null,null,240,"Jakar"]
[null,null,null,null,null,null,null,null,null,2.46,null,null,null,241,"Jakar"]
[null,null,null,null,null,null,null,null,null,2.4700000000000002,null,null,null,242,"Jakar"]
[null,null,null,null,null,null,null,null,null,2.48,null,null,null,243,"Jakar"]
[null,null,null,null,null,null,null,null,null,2.4900000000000002,null,null,null,244,"Jakar"]
[null,null,null,null,null,null,null,null,null,2.5,null,null,null,245,"Jakar"]
[null,null,null,null,null,null,null,null,null,2.5099999999999998,null,null,null,246,"Jakar"]
[null,null,null,null,null,null,null,null,null,2.52,null,null,null,247,"Jakar"]
[null,null,null,null,null,null,null,null,null,2.5299999999999998,null,null,null,248,"Jakar"]
[null,null,null,null,null,null,null,null,null,2.54,null,null,null,249,"Jakar"]
[null,null,null,null,null,null,null,null,null,2.5499999999999998,null,null,null,250,"Jakar"]
[null,null,null,null,null,null,null,null,null,2.56,null,null,null,251,"Jakar"]
[null,null,null,null,null,null,null,null,null,2.57,null,null,null,252,"Jakar"]
[null,null,null,null,null,null,null,null,null,2.58,null,null,null,253,"Jakar"]
[null,null,null,null,null,null,null,null,null,2.59,null,null,null,254,"Jakar"]
[null,null,null,null,null,null,null,null,null,2.6,null,null,null,255,"Jakar"]
[null,null,null,null,null,null,null,null,null,2.61,null,null,null,256,"Jakar"]
[null,null,null,null,null,null,null,null,null,2.62,null,null,null,257,"Jakar"]
[null,null,null,null,null,null,null,null,null,2.63,null,null,null,258,"Jakar"]
[null,null,null,null,null,null,null,null,null,2.64,null,null,null,259,"Jakar"]
[null,null,null,null,null,null,null,null,null,2.65,null,null,null,260,"Jakar"]
[null,null,null,null,null,null,null,null,null,2.66,null,null,null,261,"Jakar"]
[null,null,null,null,null,null,null,null,null,2.67,null,null,null,262,"Jakar"]
[null,null,null,null,null,null,null,null,null,2.68,null,null,null,263,"Jakar"]
[null,null,null,null,null,null,null,null,null,2.69,null,null,null,264,"Jakar"]
[null,null,null,null,null,null,null,null,null,2.7,null,null,null,265,"Jakar"]
[null,null,null,null,null,null,null,null,null,2.71,null,null,null,266,"Jakar"]
[null,null,null,null,null,null,null,null,null,2.72,null,null,null,267,"Jakar"]
[null,null,null,null,null,null,null,null,null,2.73,null,null,null,268,"Jakar"]
[null,null,null,null,null,null,null,null,null,2.74,null,null,null,269,"Jakar"]
[null,null,null,null,null,null,null,null,null,2.75,null,null,null,270,"Jakar"]
[null,null,null,null,null,null,null,null,null,2.76,null,null,null,271,"Jakar"]
[null,null,null,null,null,null,null,null,null,2.77,null,null,null,272,"Jakar"]
[null,null,null,null,null,null,null,null,null,2.78,null,null,null,273,"Jakar"]
[null,null,null,null,null,null,null,null,null,2.79,null,null,null,274,"Jakar"]
[null,null,null,null,null,null,null,null,null,2.8,null,null,null,275,"Jakar"]
[null,null,null,null,null,null,null,null,null,2.81,null,null,null,276,"Jakar"]
[null,null,null,null,null,null,null,null,null,2.82,null,null,null,277,"Jakar"]
[null,null,null,null,null,null,null,null,null,2.83,null,null,null,278,"Jakar"]
[null,null,null,null,null,null,null,null,null,2.84,null,null,null,279,"Jakar"]
[null,null,null,null,null,null,null,null,null,2.85,null,null,null,280,"Jakar"]
[null,null,null,null,null,null,null,null,null,2.86,null,null,null,281,"Jakar"]
[null,null,null,null,null,null,null,null,null,2.87,null,null,null,282,"Jakar"]
[null,null,null,null,null,null,null,null,null,2.88,null,null,null,283,"Jakar"]
[null,null,null,null,null,null,null,null,null,2.89,null,null,null,284,"Jakar"]
[null,null,null,null,null,null,null,null,null,2.9,null,null,null,285,"Jakar"]
[null,null,null,null,null,null,null,null,null,2.91,null,null,null,286,"Jakar"]
[null,null,null,null,null,null,null,null,null,2.92,null,null,null,287,"Jakar"]
[null,null,null,null,null,null,null,null,null,2.93,null,null,null,288,"Jakar"]
[null,null,null,null,null,null,null,null,null,2.94,null,null,null,289,"Jakar"]
[null,null,null,null,null,null,null,null,null,2.95,null,null,null,290,"Jakar"]
[null,null,null,null,null,null,null,null,null,2.96,null,null,null,291,"Jakar"]
[null,null,null,null,null,null,null,null,null,2.97,null,null,null,292,"Jakar"]
[null,null,null,null,null,null,null,null,null,2.98,null,null,null,293,"Jakar"]
[null,null,null,null,null,null,null,null,null,2.99,null,null,null,294,"Jakar"]
[null,null,null,null,null,null,null,null,null,3,null,null,null,295,"Jakar"]
[null,null,null,null,null,null,null,null,null,3.01,null,null,null,296,"Jakar"]
[null,null,null,null,null,null,null,null,null,3.02,null,null,null,297,"Jakar"]
[null,null,null,null,null,null,null,null,null,3.03,null,null,null,298,"Jakar"]
[null,null,null,null,null,null,null,null,null,3.04,null,null,null,299,"Jakar"]
[null,null,null,null,null,null,null,null,null,3.05,null,null,null,300,"Jakar"]
[null,null,null,null,null,null,null,null,null,3.06,null,null,null,301,"Electric iron"]
[null,null,null,null,null,null,null,null,null,3.07,null,null,null,302,"Electric iron"]
[null,null,null,null,null,null,null,null,null,3.08,null,null,null,303,"Electric iron"]
[null,null,null,null,null,null,null,null,null,3.09,null,null,null,304,"Electric iron"]
[null,null,null,null,null,null,null,null,null,3.1,null,null,null,305,"Electric iron"]
[null,null,null,null,null,null,null,null,null,3.11,null,null,null,306,"Electric iron"]
[null,null,null,null,null,null,null,null,null,3.12,null,null,null,307,"Electric iron"]
[null,null,null,null,null,null,null,null,null,3.13,null,null,null,308,"Electric iron"]
[null,null,null,null,null,null,null,null,null,3.14,null,null,null,309,"Electric iron"]
[null,null,null,null,null,null,null,null,null,3.15,null,null,null,310,"Electric iron"]
[null,null,null,null,null,null,null,null,null,3.16,null,null,null,311,"Electric iron"]
[null,null,null,null,null,null,null,null,null,3.17,null,null,null,312,"Electric iron"]
[null,null,null,null,null,null,null,null,null,3.18,null,null,null,313,"Electric iron"]
[null,null,null,null,null,null,null,null,null,3.19,null,null,null,314,"Electric iron"]
[null,null,null,null,null,null,null,null,null,3.2,null,null,null,315,"Electric iron"]
[null,null,null,null,null,null,null,null,null,3.21]
[null,null,null,null,null,null,null,null,null,3.22]
[null,null,null,null,null,null,null,null,null,3.23]
[null,null,null,null,null,null,null,null,null,3.24]
[null,null,null,null,null,null,null,null,null,3.25]
[null,null,null,null,null,null,null,null,null,3.26]
[null,null,null,null,null,null,null,null,null,3.27]
[null,null,null,null,null,null,null,null,null,3.28]
[null,null,null,null,null,null,null,null,null,3.29]
[null,null,null,null,null,null,null,null,null,3.3]
[null,null,null,null,null,null,null,null,null,3.31]
[null,null,null,null,null,null,null,null,null,3.32]
[null,null,null,null,null,null,null,null,null,3.33]
[null,null,null,null,null,null,null,null,null,3.34]
[null,null,null,null,null,null,null,null,null,3.35]
[null,null,null,null,null,null,null,null,null,3.36]
[null,null,null,null,null,null,null,null,null,3.37]
[null,null,null,null,null,null,null,null,null,3.38]
[null,null,null,null,null,null,null,null,null,3.39]
[null,null,null,null,null,null,null,null,null,3.4]
[null,null,null,null,null,null,null,null,null,3.41]
[null,null,null,null,null,null,null,null,null,3.42]
[null,null,null,null,null,null,null,null,null,3.43]
[null,null,null,null,null,null,null,null,null,3.44]
[null,null,null,null,null,null,null,null,null,3.45]
[null,null,null,null,null,null,null,null,null,3.46]
[null,null,null,null,null,null,null,null,null,3.47]
[null,null,null,null,null,null,null,null,null,3.48]
[null,null,null,null,null,null,null,null,null,3.49]
[null,null,null,null,null,null,null,null,null,3.5]
[null,null,null,null,null,null,null,null,null,3.51]
[null,null,null,null,null,null,null,null,null,3.52]
[null,null,null,null,null,null,null,null,null,3.53]
[null,null,null,null,null,null,null,null,null,3.54]
[null,null,null,null,null,null,null,null,null,3.55]
[null,null,null,null,null,null,null,null,null,3.56]
[null,null,null,null,null,null,null,null,null,3.57]
[null,null,null,null,null,null,null,null,null,3.58]
[null,null,null,null,null,null,null,null,null,3.59]
[null,null,null,null,null,null,null,null,null,3.6]
[null,null,null,null,null,null,null,null,null,3.61]
[null,null,null,null,null,null,null,null,null,3.62]
[null,null,null,null,null,null,null,null,null,3.63]
[null,null,null,null,null,null,null,null,null,3.64]
[null,null,null,null,null,null,null,null,null,3.65]
[null,null,null,null,null,null,null,null,null,3.66]
[null,null,null,null,null,null,null,null,null,3.67]
[null,null,null,null,null,null,null,null,null,3.68]
[null,null,null,null,null,null,null,null,null,3.69]
[null,null,null,null,null,null,null,null,null,3.7]
[null,null,null,null,null,null,null,null,null,3.71]
[null,null,null,null,null,null,null,null,null,3.72]
[null,null,null,null,null,null,null,null,null,3.73]
[null,null,null,null,null,null,null,null,null,3.74]
[null,null,null,null,null,null,null,null,null,3.75]
[null,null,null,null,null,null,null,null,null,3.76]
[null,null,null,null,null,null,null,null,null,3.77]
[null,null,null,null,null,null,null,null,null,3.78]
[null,null,null,null,null,null,null,null,null,3.79]
[null,null,null,null,null,null,null,null,null,3.8]
[null,null,null,null,null,null,null,null,null,3.81]
[null,null,null,null,null,null,null,null,null,3.82]
[null,null,null,null,null,null,null,null,null,3.83]
[null,null,null,null,null,null,null,null,null,3.84]
[null,null,null,null,null,null,null,null,null,3.85]
[null,null,null,null,null,null,null,null,null,3.86]
[null,null,null,null,null,null,null,null,null,3.87]
[null,null,null,null,null,null,null,null,null,3.88]
[null,null,null,null,null,null,null,null,null,3.89]
[null,null,null,null,null,null,null,null,null,3.9]
[null,null,null,null,null,null,null,null,null,3.91]
[null,null,null,null,null,null,null,null,null,3.92]
[null,null,null,null,null,null,null,null,null,3.93]
[null,null,null,null,null,null,null,null,null,3.94]
[null,null,null,null,null,null,null,null,null,3.95]
[null,null,null,null,null,null,null,null,null,3.96]
[null,null,null,null,null,null,null,null,null,3.97]
[null,null,null,null,null,null,null,null,null,3.98]
[null,null,null,null,null,null,null,null,null,3.99]
[null,null,null,null,null,null,null,null,null,4]
[null,null,null,null,null,null,null,null,null,4.01]
[null,null,null,null,null,null,null,null,null,4.0199999999999996]
[null,null,null,null,null,null,null,null,null,4.03]
[null,null,null,null,null,null,null,null,null,4.04]
[null,null,null,null,null,null,null,null,null,4.05]
[null,null,null,null,null,null,null,null,null,4.0599999999999996]
[null,null,null,null,null,null,null,null,null,4.07]
[null,null,null,null,null,null,null,null,null,4.08]
[null,null,null,null,null,null,null,null,null,4.09]
[null,null,null,null,null,null,null,null,null,4.0999999999999996]
[null,null,null,null,null,null,null,null,null,4.1100000000000003]
[null,null,null,null,null,null,null,null,null,4.12]
[null,null,null,null,null,null,null,null,null,4.13]
[null,null,null,null,null,null,null,null,null,4.1399999999999997]
[null,null,null,null,null,null,null,null,null,4.1500000000000004]
[null,null,null,null,null,null,null,null,null,4.16]
[null,null,null,null,null,null,null,null,null,4.17]
[null,null,null,null,null,null,null,null,null,4.18]
[null,null,null,null,null,null,null,null,null,4.1900000000000004]
[null,null,null,null,null,null,null,null,null,4.2]
[null,null,null,null,null,null,null,null,null,4.21]
[null,null,null,null,null,null,null,null,null,4.22]
[null,null,null,null,null,null,null,null,null,4.2300000000000004]
[null,null,null,null,null,null,null,null,null,4.24]
[null,null,null,null,null,null,null,null,null,4.25]
[null,null,null,null,null,null,null,null,null,4.26]
[null,null,null,null,null,null,null,null,null,4.2699999999999996]
[null,null,null,null,null,null,null,null,null,4.28]
[null,null,null,null,null,null,null,null,null,4.29]
[null,null,null,null,null,null,null,null,null,4.3]
[null,null,null,null,null,null,null,null,null,4.3099999999999996]
[null,null,null,null,null,null,null,null,null,4.32]
[null,null,null,null,null,null,null,null,null,4.33]
[null,null,null,null,null,null,null,null,null,4.34]
[null,null,null,null,null,null,null,null,null,4.3499999999999996]
[null,null,null,null,null,null,null,null,null,4.3600000000000003]
[null,null,null,null,null,null,null,null,null,4.37]
[null,null,null,null,null,null,null,null,null,4.38]
[null,null,null,null,null,null,null,null,null,4.3899999999999997]
[null,null,null,null,null,null,null,null,null,4.4000000000000004]
[null,null,null,null,null,null,null,null,null,4.41]
[null,null,null,null,null,null,null,null,null,4.42]
[null,null,null,null,null,null,null,null,null,4.43]
[null,null,null,null,null,null,null,null,null,4.4400000000000004]
[null,null,null,null,null,null,null,null,null,4.45]
[null,null,null,null,null,null,null,null,null,4.46]
[null,null,null,null,null,null,null,null,null,4.47]
[null,null,null,null,null,null,null,null,null,4.4800000000000004]
[null,null,null,null,null,null,null,null,null,4.49]
[null,null,null,null,null,null,null,null,null,4.5]
[null,null,null,null,null,null,null,null,null,4.51]
[null,null,null,null,null,null,null,null,null,4.5199999999999996]
[null,null,null,null,null,null,null,null,null,4.53]
[null,null,null,null,null,null,null,null,null,4.54]
[null,null,null,null,null,null,null,null,null,4.55]
[null,null,null,null,null,null,null,null,null,4.5599999999999996]
[null,null,null,null,null,null,null,null,null,4.57]
[null,null,null,null,null,null,null,null,null,4.58]
[null,null,null,null,null,null,null,null,null,4.59]
[null,null,null,null,null,null,null,null,null,4.5999999999999996]
[null,null,null,null,null,null,null,null,null,4.6100000000000003]
[null,null,null,null,null,null,null,null,null,4.62]
[null,null,null,null,null,null,null,null,null,4.63]
[null,null,null,null,null,null,null,null,null,4.6399999999999997]
[null,null,null,null,null,null,null,null,null,4.6500000000000004]
[null,null,null,null,null,null,null,null,null,4.66]
[null,null,null,null,null,null,null,null,null,4.67]
[null,null,null,null,null,null,null,null,null,4.68]
[null,null,null,null,null,null,null,null,null,4.6900000000000004]
[null,null,null,null,null,null,null,null,null,4.7]
[null,null,null,null,null,null,null,null,null,4.71]
[null,null,null,null,null,null,null,null,null,4.72]
[null,null,null,null,null,null,null,null,null,4.7300000000000004]
[null,null,null,null,null,null,null,null,null,4.74]
[null,null,null,null,null,null,null,null,null,4.75]
[null,null,null,null,null,null,null,null,null,4.76]
[null,null,null,null,null,null,null,null,null,4.7699999999999996]
[null,null,null,null,null,null,null,null,null,4.78]
[null,null,null,null,null,null,null,null,null,4.79]
[null,null,null,null,null,null,null,null,null,4.8]
[null,null,null,null,null,null,null,null,null,4.8099999999999996]
[null,null,null,null,null,null,null,null,null,4.82]
[null,null,null,null,null,null,null,null,null,4.83]
[null,null,null,null,null,null,null,null,null,4.84]
[null,null,null,null,null,null,null,null,null,4.8499999999999996]
[null,null,null,null,null,null,null,null,null,4.8600000000000003]
[null,null,null,null,null,null,null,null,null,4.87]
[null,null,null,null,null,null,null,null,null,4.88]
[null,null,null,null,null,null,null,null,null,4.8899999999999997]
[null,null,null,null,null,null,null,null,null,4.9000000000000004]
[null,null,null,null,null,null,null,null,null,4.91]
[null,null,null,null,null,null,null,null,null,4.92]
[null,null,null,null,null,null,null,null,null,4.93]
[null,null,null,null,null,null,null,null,null,4.9400000000000004]
[null,null,null,null,null,null,null,null,null,4.95]
[null,null,null,null,null,null,null,null,null,4.96]
[null,null,null,null,null,null,null,null,null,4.97]
[null,null,null,null,null,null,null,null,null,4.9800000000000004]
[null,null,null,null,null,null,null,null,null,4.99]
[null,null,null,null,null,null,null,null,null,5]
[null,null,null,null,null,null,null,null,null,5.01]
[null,null,null,null,null,null,null,null,null,5.0199999999999996]
[null,null,null,null,null,null,null,null,null,5.03]
[null,null,null,null,null,null,null,null,null,5.04]
[null,null,null,null,null,null,null,null,null,5.05]
[null,null,null,null,null,null,null,null,null,5.0599999999999996]
[null,null,null,null,null,null,null,null,null,5.07]
[null,null,null,null,null,null,null,null,null,5.08]
[null,null,null,null,null,null,null,null,null,5.09]
[null,null,null,null,null,null,null,null,null,5.0999999999999996]
[null,null,null,null,null,null,null,null,null,5.1100000000000003]
[null,null,null,null,null,null,null,null,null,5.12]
[null,null,null,null,null,null,null,null,null,5.13]
[null,null,null,null,null,null,null,null,null,5.14]
[null,null,null,null,null,null,null,null,null,5.15]
[null,null,null,null,null,null,null,null,null,5.16]
[null,null,null,null,null,null,null,null,null,5.17]
[null,null,null,null,null,null,null,null,null,5.18]
[null,null,null,null,null,null,null,null,null,5.19]
[null,null,null,null,null,null,null,null,null,5.2]
[null,null,null,null,null,null,null,null,null,5.21]
[null,null,null,null,null,null,null,null,null,5.22]
[null,null,null,null,null,null,null,null,null,5.23]
[null,null,null,null,null,null,null,null,null,5.24]
[null,null,null,null,null,null,null,null,null,5.25]
[null,null,null,null,null,null,null,null,null,5.26]
[null,null,null,null,null,null,null,null,null,5.27]
[null,null,null,null,null,null,null,null,null,5.28]
[null,null,null,null,null,null,null,null,null,5.29]
[null,null,null,null,null,null,null,null,null,5.3]
[null,null,null,null,null,null,null,null,null,5.31]
[null,null,null,null,null,null,null,null,null,5.32]
[null,null,null,null,null,null,null,null,null,5.33]
[null,null,null,null,null,null,null,null,null,5.34]
[null,null,null,null,null,null,null,null,null,5.35]
[null,null,null,null,null,null,null,null,null,5.36]
[null,null,null,null,null,null,null,null,null,5.37]
[null,null,null,null,null,null,null,null,null,5.38]
[null,null,null,null,null,null,null,null,null,5.39]
[null,null,null,null,null,null,null,null,null,5.4]
[null,null,null,null,null,null,null,null,null,5.41]
[null,null,null,null,null,null,null,null,null,5.42]
[null,null,null,null,null,null,null,null,null,5.43]
[null,null,null,null,null,null,null,null,null,5.44]
[null,null,null,null,null,null,null,null,null,5.45]
[null,null,null,null,null,null,null,null,null,5.46]
[null,null,null,null,null,null,null,null,null,5.47]
[null,null,null,null,null,null,null,null,null,5.48]
[null,null,null,null,null,null,null,null,null,5.49]
[null,null,null,null,null,null,null,null,null,5.5]
[null,null,null,null,null,null,null,null,null,5.51]
[null,null,null,null,null,null,null,null,null,5.52]
[null,null,null,null,null,null,null,null,null,5.53]
[null,null,null,null,null,null,null,null,null,5.54]
[null,null,null,null,null,null,null,null,null,5.55]
[null,null,null,null,null,null,null,null,null,5.56]
[null,null,null,null,null,null,null,null,null,5.57]
[null,null,null,null,null,null,null,null,null,5.58]
[null,null,null,null,null,null,null,null,null,5.59]
[null,null,null,null,null,null,null,null,null,5.6]
[null,null,null,null,null,null,null,null,null,5.61]
[null,null,null,null,null,null,null,null,null,5.62]
[null,null,null,null,null,null,null,null,null,5.63]
[null,null,null,null,null,null,null,null,null,5.64]
[null,null,null,null,null,null,null,null,null,5.65]
[null,null,null,null,null,null,null,null,null,5.66]
[null,null,null,null,null,null,null,null,null,5.67]
[null,null,null,null,null,null,null,null,null,5.68]
[null,null,null,null,null,null,null,null,null,5.69]
[null,null,null,null,null,null,null,null,null,5.7]
[null,null,null,null,null,null,null,null,null,5.71]
[null,null,null,null,null,null,null,null,null,5.72]
[null,null,null,null,null,null,null,null,null,5.73]
[null,null,null,null,null,null,null,null,null,5.74]
[null,null,null,null,null,null,null,null,null,5.75]
[null,null,null,null,null,null,null,null,null,5.76]
[null,null,null,null,null,null,null,null,null,5.77]
[null,null,null,null,null,null,null,null,null,5.78]
[null,null,null,null,null,null,null,null,null,5.79]
[null,null,null,null,null,null,null,null,null,5.8]
[null,null,null,null,null,null,null,null,null,5.81]
[null,null,null,null,null,null,null,null,null,5.82]
[null,null,null,null,null,null,null,null,null,5.83]
[null,null,null,null,null,null,null,null,null,5.84]
[null,null,null,null,null,null,null,null,null,5.85]
[null,null,null,null,null,null,null,null,null,5.86]
[null,null,null,null,null,null,null,null,null,5.87]
[null,null,null,null,null,null,null,null,null,5.88]
[null,null,null,null,null,null,null,null,null,5.89]
[null,null,null,null,null,null,null,null,null,5.9]
[null,null,null,null,null,null,null,null,null,5.91]
[null,null,null,null,null,null,null,null,null,5.92]
[null,null,null,null,null,null,null,null,null,5.93]
[null,null,null,null,null,null,null,null,null,5.94]
[null,null,null,null,null,null,null,null,null,5.95]
[null,null,null,null,null,null,null,null,null,5.96]
[null,null,null,null,null,null,null,null,null,5.97]
[null,null,null,null,null,null,null,null,null,5.98]
[null,null,null,null,null,null,null,null,null,5.99]
[null,null,null,null,null,null,null,null,null,6]

{"sheet":"Shift_2","index":1,"n_rows":2001,"n_cols":42,"rows_kept":2001,"cut":false,"hidden":false,"merged":[]}
[]
["Date","Start Time","End Time","Total","Machine No.","Machine Name","Maximum power","Production rate per Shift","Average hourly output","Average hourly output","Gm/ML","Size MM"," Drawing  "," KG.\\ day","ML X KG."," ML.\\ day","Color","Shift","Name of the employee","Name of Supervisor","OR No.","Comment",null,null,null,null,null,null,null,null,null,null,null,null,null,1,"Crosha COMEZ 2017",15,0.05,"Black ","منصور محمد منصور","محمد"]
[{"$f":"IF(E3=\"\",\"\",IF(A3=\"\",TODAY(),A3))","v":"2019-02-18"},"08:30:00","16:30:00",{"$f":"C3-B3+IF(B3>C3,1)","v":"08:00:00"},5,{"$f":"IFERROR(VLOOKUP(E3,$AJ$2:$AL$3155,2,FALSE),\"\")","v":"Crosha F.COLLIC 1996"},{"$f":"IFERROR(VLOOKUP(E3,$AJ$2:$AL$3155,3,FALSE),\"\")","v":7.8},5,{"$f":"IFERROR(SUM(G3/7),\"\")","v":1.1142857142857143},{"$f":"IFERROR(SUM(N3/C3),\"\")","v":7.2727272727272725},20,7.0000000000000007E-2,"uuu",5,{"$f":"IFERROR(ROUND(SUM(1000/K3),2),\"\")","v":50},{"$f":"IFERROR(ROUND(SUM(N3*O3),2),\"\")","v":250},"A prominent White",2,"علي مراد حسن","اسامة",6666,null,null,null,null,null,null,null,null,null,null,null,null,null,null,2,"Crosha COMEZ 2017",11.5,0.06,"White","علي مراد حسن","محمود"]
[{"$f":"IF(E4=\"\",\"\",IF(A4=\"\",TODAY(),A4))","v":"2019-02-18"},"11:00:00","14:30:00",{"$f":"C4-B4+IF(B4>C4,1)","v":"03:30:00"},1,{"$f":"IFERROR(VLOOKUP(E4,$AJ$2:$AL$3155,2,FALSE),\"\")","v":"Crosha COMEZ 2017"},{"$f":"IFERROR(VLOOKUP(E4,$AJ$2:$AL$3155,3,FALSE),\"\")","v":15},18,{"$f":"IFERROR(SUM(G4/7),\"\")","v":2.1428571428571428},{"$f":"IFERROR(SUM(N4/C4),\"\")","v":29.793103448275865},22,0.09,"tt",18,{"$f":"IFERROR(ROUND(SUM(1000/K4),2),\"\")","v":45.45},{"$f":"IFERROR(ROUND(SUM(N4*O4),2),\"\")","v":818.1},"Black ",2,"عادل عزمي شنودة","اسامة",5454,null,null,null,null,null,null,null,null,null,null,null,null,null,null,3,"Crosha F.COLLIC 1996",9,7.0000000000000007E-2,"Black&White","ابراهيم محمود ابراهيم","اسامة"]
["",null,null,"00:00:00",null,"","",null,"","",null,null,null,null,"","",null,2,null,null,null,null,null,null,null,null,null,null,null,null,null,null,null,null,null,4,"Crosha F.COLLIC 1997",8.1,0.08,"A prominent Black","مسعد رمزي مسعد"]
["",null,null,"00:00:00",null,"","",null,"","",null,null,null,null,"","",null,2,null,null,null,null,null,null,null,null,null,null,null,null,null,null,null,null,null,5,"Crosha F.COLLIC 1996",7.8,0.09,"A prominent White","عادل عزمي شنودة"]
["",null,null,"00:00:00",null,"","",null,"","",null,null,null,null,"","",null,2,null,null,null,null,null,null,null,null,null,null,null,null,null,null,null,null,null,6,"Crosha",null,0.1,null,"صبحي محمد محمود"]
["",null,null,"00:00:00",null,"","",null,"","",null,null,null,null,"","",null,2,null,null,null,null,null,null,null,null,null,null,null,null,null,null,null,null,null,7,"Crosha",null,0.11,null,"السيد محمد عبد العال"]
["",null,null,"00:00:00",null,"","",null,"","",null,null,null,null,"","",null,2,null,null,null,null,null,null,null,null,null,null,null,null,null,null,null,null,null,8,"Crosha",null,0.12,null,"عادل سيف الله السيد"]
["",null,null,"00:00:00",null,"","",null,"","",null,null,null,null,"","",null,2,null,null,null,null,null,null,null,null,null,null,null,null,null,null,null,null,null,9,"Crosha",null,0.13,null,"خالد السيد عبد القادر"]
["",null,null,"00:00:00",null,"","",null,"","",null,null,null,null,"","",null,2,null,null,null,null,null,null,null,null,null,null,null,null,null,null,null,null,null,10,"Crosha",null,0.14000000000000001,null,"عادل صادق بشير"]
["",null,null,"00:00:00",null,"","",null,"","",null,null,null,null,"","",null,2,null,null,null,null,null,null,null,null,null,null,null,null,null,null,null,null,null,11,"Crosha",null,0.15,null,"روماني عطية حبشي"]
["",null,null,"00:00:00",null,"","",null,"","",null,null,null,null,"","",null,2,null,null,null,null,null,null,null,null,null,null,null,null,null,null,null,null,null,12,"Crosha",null,0.16,null,"احمد صادق توفيق"]
["",null,null,"00:00:00",null,"","",null,"","",null,null,null,null,"","",null,2,null,null,null,null,null,null,null,null,null,null,null,null,null,null,null,null,null,13,"Crosha",null,0.17,null,"دينا مجدي ابراهيم"]
["",null,null,"00:00:00",null,"","",null,"","",null,null,null,null,"","",null,2,null,null,null,null,null,null,null,null,null,null,null,null,null,null,null,null,null,14,"Crosha",null,0.18,null,"علي فرج على محمد"]
["",null,null,"00:00:00",null,"","",null,"","",null,null,null,null,"","",null,2,null,null,null,null,null,null,null,null,null,null,null,null,null,null,null,null,null,15,"Crosha",null,0.19,null,"بوسي السيد عبد المنعم"]
["",null,null,"00:00:00",null,"","",null,"","",null,null,null,null,"","",null,2,null,null,null,null,null,null,null,null,null,null,null,null,null,null,null,null,null,16,"Crosha",null,0.2,null,"محمد محمد عبد الوهاب"]
["",null,null,"00:00:00",null,"","",null,"","",null,null,null,null,"","",null,2,null,null,null,null,null,null,null,null,null,null,null,null,null,null,null,null,null,17,"Crosha",null,0.21,null,"سعيد الليثي جاب الله"]
["",null,null,"00:00:00",null,"","",null,"","",null,null,null,null,"","",null,2,null,null,null,null,null,null,null,null,null,null,null,null,null,null,null,null,null,18,"Crosha",null,0.22,null,"احمد عبد الظاهر"]
["",null,null,"00:00:00",null,"","",null,"","",null,null,null,null,"","",null,2,null,null,null,null,null,null,null,null,null,null,null,null,null,null,null,null,null,19,"Crosha",null,0.23,null,"مصطفى عبد النبي مصطفى"]
["",null,null,"00:00:00",null,"","",null,"","",null,null,null,null,"","",null,2,null,null,null,null,null,null,null,null,null,null,null,null,null,null,null,null,null,20,"Crosha",null,0.24,null,"ابراهيم صبحي محمد السيد"]
["",null,null,"00:00:00",null,"","",null,"","",null,null,null,null,"","",null,2,null,null,null,null,null,null,null,null,null,null,null,null,null,null,null,null,null,21,"Crosha",null,0.25,null,"خميس حسن حسنين"]
["",null,null,"00:00:00",null,"","",null,"","",null,null,null,null,"","",null,2,null,null,null,null,null,null,null,null,null,null,null,null,null,null,null,null,null,22,"Crosha",null,0.26,null,"محمد حسني حسن"]
["",null,null,"00:00:00",null,"","",null,"","",null,null,null,null,"","",null,2,null,null,null,null,null,null,null,null,null,null,null,null,null,null,null,null,null,23,"Crosha",null,0.27,null,"محمد عادل محمد محمد"]
["",null,null,"00:00:00",null,"","",null,"","",null,null,null,null,"","",null,2,null,null,null,null,null,null,null,null,null,null,null,null,null,null,null,null,null,24,"Crosha",null,0.28000000000000003,null,"السيد عبد الحميد اسماعيل"]
["",null,null,"00:00:00",null,"","",null,"","",null,null,null,null,"","",null,2,null,null,null,null,null,null,null,null,null,null,null,null,null,null,null,null,null,25,"Crosha",null,0.28999999999999998,null,"ابراهيم محمد فتوح"]
["",null,null,"00:00:00",null,"","",null,"","",null,null,null,null,"","",null,2,null,null,null,null,null,null,null,null,null,null,null,null,null,null,null,null,null,26,"Crosha",null,0.3,null,"عمرو محمد عبد الجليل"]
["",null,null,"00:00:00",null,"","",null,"","",null,null,null,null,"","",null,2,null,null,null,null,null,null,null,null,null,null,null,null,null,null,null,null,null,27,"Crosha",null,0.31,null,"خالد مصطفى العوضي"]
["",null,null,"00:00:00",null,"","",null,"","",null,null,null,null,"","",null,2,null,null,null,null,null,null,null,null,null,null,null,null,null,null,null,null,null,28,"Crosha",null,0.32,null,"حمادة احمد على النجار"]
["",null,null,"00:00:00",null,"","",null,"","",null,null,null,null,"","",null,2,null,null,null,null,null,null,null,null,null,null,null,null,null,null,null,null,null,29,"Crosha",null,0.33,null,"عاطف وليم لبيب"]
["",null,null,"00:00:00",null,"","",null,"","",null,null,null,null,"","",null,2,null,null,null,null,null,null,null,null,null,null,null,null,null,null,null,null,null,30,"Crosha",null,0.34,null,"عادل وليم نبيل"]
["",null,null,"00:00:00",null,"","",null,"","",null,null,null,null,"","",null,2,null,null,null,null,null,null,null,null,null,null,null,null,null,null,null,null,null,31,"Crosha",null,0.35,null,"بيشوي عزت شفيق"]
["",null,null,"00:00:00",null,"","",null,"","",null,null,null,null,"","",null,2,null,null,null,null,null,null,null,null,null,null,null,null,null,null,null,null,null,32,"Crosha",null,0.36,null,"محمد يحيى محمود"]
["",null,null,"00:00:00",null,"","",null,"","",null,null,null,null,"","",null,2,null,null,null,null,null,null,null,null,null,null,null,null,null,null,null,null,null,33,"Crosha",null,0.37,null,"احمد رمضان احمد"]
["",null,null,"00:00:00",null,"","",null,"","",null,null,null,null,"","",null,2,null,null,null,null,null,null,null,null,null,null,null,null,null,null,null,null,null,34,"Crosha",null,0.38]
["",null,null,"00:00:00",null,"","",null,"","",null,null,null,null,"","",null,2,null,null,null,null,null,null,null,null,null,null,null,null,null,null,null,null,null,35,"Crosha",null,0.39]
["",null,null,"00:00:00",null,"","",null,"","",null,null,null,null,"","",null,2,null,null,null,null,null,null,null,null,null,null,null,null,null,null,null,null,null,36,"Crosha",null,0.4]
["",null,null,"00:00:00",null,"","",null,"","",null,null,null,null,"","",null,2,null,null,null,null,null,null,null,null,null,null,null,null,null,null,null,null,null,37,"Crosha",null,0.41]
["",null,null,"00:00:00",null,"","",null,"","",null,null,null,null,"","",null,2,null,null,null,null,null,null,null,null,null,null,null,null,null,null,null,null,null,38,"Crosha",null,0.42]
["",null,null,"00:00:00",null,"","",null,"","",null,null,null,null,"","",null,2,null,null,null,null,null,null,null,null,null,null,null,null,null,null,null,null,null,39,"Crosha",null,0.43]
["",null,null,"00:00:00",null,"","",null,"","",null,null,null,null,"","",null,2,null,null,null,null,null,null,null,null,null,null,null,null,null,null,null,null,null,40,"Crosha",null,0.44]
["",null,null,"00:00:00",null,"","",null,"","",null,null,null,null,"","",null,2,null,null,null,null,null,null,null,null,null,null,null,null,null,null,null,null,null,41,"Crosha",null,0.45]
["",null,null,"00:00:00",null,"","",null,"","",null,null,null,null,"","",null,2,null,null,null,null,null,null,null,null,null,null,null,null,null,null,null,null,null,42,"Crosha",null,0.46]
["",null,null,"00:00:00",null,"","",null,"","",null,null,null,null,"","",null,2,null,null,null,null,null,null,null,null,null,null,null,null,null,null,null,null,null,43,"Crosha",null,0.47]
["",null,null,"00:00:00",null,"","",null,"","",null,null,null,null,"","",null,2,null,null,null,null,null,null,null,null,null,null,null,null,null,null,null,null,null,44,"Crosha",null,0.48]
["",null,null,"00:00:00",null,"","",null,"","",null,null,null,null,"","",null,2,null,null,null,null,null,null,null,null,null,null,null,null,null,null,null,null,null,45,"Crosha",null,0.49]
["",null,null,"00:00:00",null,"","",null,"","",null,null,null,null,"","",null,2,null,null,null,null,null,null,null,null,null,null,null,null,null,null,null,null,null,46,"Crosha",null,0.5]
["",null,null,"00:00:00",null,"","",null,"","",null,null,null,null,"","",null,2,null,null,null,null,null,null,null,null,null,null,null,null,null,null,null,null,null,47,"Crosha",null,0.51]
["",null,null,"00:00:00",null,"","",null,"","",null,null,null,null,"","",null,2,null,null,null,null,null,null,null,null,null,null,null,null,null,null,null,null,null,48,"Crosha",null,0.52]
["",null,null,"00:00:00",null,"","",null,"","",null,null,null,null,"","",null,2,null,null,null,null,null,null,null,null,null,null,null,null,null,null,null,null,null,49,"Crosha",null,0.53]
["",null,null,"00:00:00",null,"","",null,"","",null,null,null,null,"","",null,2,null,null,null,null,null,null,null,null,null,null,null,null,null,null,null,null,null,50,"Crosha",null,0.54]
["",null,null,"00:00:00",null,"","",null,"","",null,null,null,null,"","",null,2,null,null,null,null,null,null,null,null,null,null,null,null,null,null,null,null,null,51,"Crosha",null,0.55000000000000004]
["",null,null,"00:00:00",null,"","",null,"","",null,null,null,null,"","",null,2,null,null,null,null,null,null,null,null,null,null,null,null,null,null,null,null,null,52,"Crosha",null,0.56000000000000005]
["",null,null,"00:00:00",null,"","",null,"","",null,null,null,null,"","",null,2,null,null,null,null,null,null,null,null,null,null,null,null,null,null,null,null,null,53,"Crosha",null,0.56999999999999995]
["",null,null,"00:00:00",null,"","",null,"","",null,null,null,null,"","",null,2,null,null,null,null,null,null,null,null,null,null,null,null,null,null,null,null,null,54,"Crosha",null,0.57999999999999996]
["",null,null,"00:00:00",null,"","",null,"","",null,null,null,null,"","",null,2,null,null,null,null,null,null,null,null,null,null,null,null,null,null,null,null,null,55,"Crosha",null,0.59]
["",null,null,"00:00:00",null,"","",null,"","",null,null,null,null,"","",null,2,null,null,null,null,null,null,null,null,null,null,null,null,null,null,null,null,null,56,"Crosha",null,0.6]
["",null,null,"00:00:00",null,"","",null,"","",null,null,null,null,"","",null,2,null,null,null,null,null,null,null,null,null,null,null,null,null,null,null,null,null,57,"Crosha",null,0.61]
["",null,null,"00:00:00",null,"","",null,"","",null,null,null,null,"","",null,2,null,null,null,null,null,null,null,null,null,null,null,null,null,null,null,null,null,58,"Crosha",null,0.62]
["",null,null,"00:00:00",null,"","",null,"","",null,null,null,null,"","",null,2,null,null,null,null,null,null,null,null,null,null,null,null,null,null,null,null,null,59,"Crosha",null,0.63]
["",null,null,"00:00:00",null,"","",null,"","",null,null,null,null,"","",null,2,null,null,null,null,null,null,null,null,null,null,null,null,null,null,null,null,null,60,"Crosha",null,0.64]
["",null,null,"00:00:00",null,"","",null,"","",null,null,null,null,"","",null,2,null,null,null,null,null,null,null,null,null,null,null,null,null,null,null,null,null,61,"Crosha",null,0.65]
["",null,null,"00:00:00",null,"","",null,"","",null,null,null,null,"","",null,2,null,null,null,null,null,null,null,null,null,null,null,null,null,null,null,null,null,62,"Crosha",null,0.66]
["",null,null,"00:00:00",null,"","",null,"","",null,null,null,null,"","",null,2,null,null,null,null,null,null,null,null,null,null,null,null,null,null,null,null,null,63,"Crosha",null,0.67]
["",null,null,"00:00:00",null,"","",null,"","",null,null,null,null,"","",null,2,null,null,null,null,null,null,null,null,null,null,null,null,null,null,null,null,null,64,"Crosha",null,0.68]
["",null,null,"00:00:00",null,"","",null,"","",null,null,null,null,"","",null,2,null,null,null,null,null,null,null,null,null,null,null,null,null,null,null,null,null,65,"Crosha",null,0.69]
["",null,null,"00:00:00",null,"","",null,"","",null,null,null,null,"","",null,2,null,null,null,null,null,null,null,null,null,null,null,null,null,null,null,null,null,66,"Crosha",null,0.7]
[{"$f":"IF(E68=\"\",\"\",IF(A68=\"\",TODAY(),A68))","v":""},null,null,{"$f":"C68-B68+IF(B68>C68,1)","v":"00:00:00"},null,{"$f":"IFERROR(VLOOKUP(E68,$AJ$2:$AL$3155,2,FALSE),\"\")","v":""},{"$f":"IFERROR(VLOOKUP(E68,$AJ$2:$AL$3155,3,FALSE),\"\")","v":""},null,{"$f":"IFERROR(SUM(G68/7),\"\")","v":""},{"$f":"IFERROR(SUM(N68/C68),\"\")","v":""},null,null,null,null,{"$f":"IFERROR(ROUND(SUM(1000/K68),2),\"\")","v":""},{"$f":"IFERROR(ROUND(SUM(N68*O68),2),\"\")","v":""},null,2,null,null,null,null,null,null,null,null,null,null,null,null,null,null,null,null,null,67,"Crosha",null,0.71]
["",null,null,"00:00:00",null,"","",null,"","",null,null,null,null,"","",null,2,null,null,null,null,null,null,null,null,null,null,null,null,null,null,null,null,null,68,"Crosha",null,0.72]
["",null,null,"00:00:00",null,"","",null,"","",null,null,null,null,"","",null,2,null,null,null,null,null,null,null,null,null,null,null,null,null,null,null,null,null,69,"Crosha",null,0.73]
["",null,null,"00:00:00",null,"","",null,"","",null,null,null,null,"","",null,2,null,null,null,null,null,null,null,null,null,null,null,null,null,null,null,null,null,70,"Crosha",null,0.74]
["",null,null,"00:00:00",null,"","",null,"","",null,null,null,null,"","",null,2,null,null,null,null,null,null,null,null,null,null,null,null,null,null,null,null,null,71,"Crosha",null,0.75]
["",null,null,"00:00:00",null,"","",null,"","",null,null,null,null,"","",null,2,null,null,null,null,null,null,null,null,null,null,null,null,null,null,null,null,null,72,"Crosha",null,0.76]
["",null,null,"00:00:00",null,"","",null,"","",null,null,null,null,"","",null,2,null,null,null,null,null,null,null,null,null,null,null,null,null,null,null,null,null,73,"Crosha",null,0.77]
["",null,null,"00:00:00",null,"","",null,"","",null,null,null,null,"","",null,2,null,null,null,null,null,null,null,null,null,null,null,null,null,null,null,null,null,74,"Crosha",null,0.78]
["",null,null,"00:00:00",null,"","",null,"","",null,null,null,null,"","",null,2,null,null,null,null,null,null,null,null,null,null,null,null,null,null,null,null,null,75,"Crosha",null,0.79]
["",null,null,"00:00:00",null,"","",null,"","",null,null,null,null,"","",null,2,null,null,null,null,null,null,null,null,null,null,null,null,null,null,null,null,null,76,"Crosha",null,0.8]
["",null,null,"00:00:00",null,"","",null,"","",null,null,null,null,"","",null,2,null,null,null,null,null,null,null,null,null,null,null,null,null,null,null,null,null,77,"Crosha",null,0.81]
["",null,null,"00:00:00",null,"","",null,"","",null,null,null,null,"","",null,2,null,null,null,null,null,null,null,null,null,null,null,null,null,null,null,null,null,78,"Crosha",null,0.82]
["",null,null,"00:00:00",null,"","",null,"","",null,null,null,null,"","",null,2,null,null,null,null,null,null,null,null,null,null,null,null,null,null,null,null,null,79,"Crosha",null,0.83]
["",null,null,"00:00:00",null,"","",null,"","",null,null,null,null,"","",null,2,null,null,null,null,null,null,null,null,null,null,null,null,null,null,null,null,null,80,"Crosha",null,0.84]
["",null,null,"00:00:00",null,"","",null,"","",null,null,null,null,"","",null,2,null,null,null,null,null,null,null,null,null,null,null,null,null,null,null,null,null,81,"Crosha",null,0.85]
["",null,null,"00:00:00",null,"","",null,"","",null,null,null,null,"","",null,2,null,null,null,null,null,null,null,null,null,null,null,null,null,null,null,null,null,82,"Crosha",null,0.86]
["",null,null,"00:00:00",null,"","",null,"","",null,null,null,null,"","",null,2,null,null,null,null,null,null,null,null,null,null,null,null,null,null,null,null,null,83,"Crosha",null,0.87]
["",null,null,"00:00:00",null,"","",null,"","",null,null,null,null,"","",null,2,null,null,null,null,null,null,null,null,null,null,null,null,null,null,null,null,null,84,"Crosha",null,0.88]
["",null,null,"00:00:00",null,"","",null,"","",null,null,null,null,"","",null,2,null,null,null,null,null,null,null,null,null,null,null,null,null,null,null,null,null,85,"Crosha",null,0.89]
["",null,null,"00:00:00",null,"","",null,"","",null,null,null,null,"","",null,2,null,null,null,null,null,null,null,null,null,null,null,null,null,null,null,null,null,86,"Crosha",null,0.9]
["",null,null,"00:00:00",null,"","",null,"","",null,null,null,null,"","",null,2,null,null,null,null,null,null,null,null,null,null,null,null,null,null,null,null,null,87,"Crosha",null,0.91]
["",null,null,"00:00:00",null,"","",null,"","",null,null,null,null,"","",null,2,null,null,null,null,null,null,null,null,null,null,null,null,null,null,null,null,null,88,"Crosha",null,0.92]
["",null,null,"00:00:00",null,"","",null,"","",null,null,null,null,"","",null,2,null,null,null,null,null,null,null,null,null,null,null,null,null,null,null,null,null,89,"Crosha",null,0.93]
["",null,null,"00:00:00",null,"","",null,"","",null,null,null,null,"","",null,2,null,null,null,null,null,null,null,null,null,null,null,null,null,null,null,null,null,90,"Crosha",null,0.94]
["",null,null,"00:00:00",null,"","",null,"","",null,null,null,null,"","",null,2,null,null,null,null,null,null,null,null,null,null,null,null,null,null,null,null,null,91,"Crosha",null,0.95]
["",null,null,"00:00:00",null,"","",null,"","",null,null,null,null,"","",null,2,null,null,null,null,null,null,null,null,null,null,null,null,null,null,null,null,null,92,"Crosha",null,0.96]
["",null,null,"00:00:00",null,"","",null,"","",null,null,null,null,"","",null,2,null,null,null,null,null,null,null,null,null,null,null,null,null,null,null,null,null,93,"Crosha",null,0.97]
["",null,null,"00:00:00",null,"","",null,"","",null,null,null,null,"","",null,2,null,null,null,null,null,null,null,null,null,null,null,null,null,null,null,null,null,94,"Crosha",null,0.98]
["",null,null,"00:00:00",null,"","",null,"","",null,null,null,null,"","",null,2,null,null,null,null,null,null,null,null,null,null,null,null,null,null,null,null,null,95,"Crosha",null,0.99]
["",null,null,"00:00:00",null,"","",null,"","",null,null,null,null,"","",null,2,null,null,null,null,null,null,null,null,null,null,null,null,null,null,null,null,null,96,"Crosha",null,1]
["",null,null,"00:00:00",null,"","",null,"","",null,null,null,null,"","",null,2,null,null,null,null,null,null,null,null,null,null,null,null,null,null,null,null,null,97,"Crosha",null,1.01]
["",null,null,"00:00:00",null,"","",null,"","",null,null,null,null,"","",null,2,null,null,null,null,null,null,null,null,null,null,null,null,null,null,null,null,null,98,"Crosha",null,1.02]
["",null,null,"00:00:00",null,"","",null,"","",null,null,null,null,"","",null,2,null,null,null,null,null,null,null,null,null,null,null,null,null,null,null,null,null,99,"Crosha",null,1.03]
["",null,null,"00:00:00",null,"","",null,"","",null,null,null,null,"","",null,2,null,null,null,null,null,null,null,null,null,null,null,null,null,null,null,null,null,100,"Crosha",null,1.04]
["",null,null,"00:00:00",null,"","",null,"","",null,null,null,null,"","",null,2,null,null,null,null,null,null,null,null,null,null,null,null,null,null,null,null,null,101,"Jakar - MULLER 2017",3.35,1.05]
["",null,null,"00:00:00",null,"","",null,"","",null,null,null,null,"","",null,2,null,null,null,null,null,null,null,null,null,null,null,null,null,null,null,null,null,102,"Jakar - MULLER 2017",5.01,1.06]
["",null,null,"00:00:00",null,"","",null,"","",null,null,null,null,"","",null,2,null,null,null,null,null,null,null,null,null,null,null,null,null,null,null,null,null,103,"Jakar",null,1.07]
["",null,null,"00:00:00",null,"","",null,"","",null,null,null,null,"","",null,2,null,null,null,null,null,null,null,null,null,null,null,null,null,null,null,null,null,104,"Jakar",null,1.08]
["",null,null,"00:00:00",null,"","",null,"","",null,null,null,null,"","",null,2,null,null,null,null,null,null,null,null,null,null,null,null,null,null,null,null,null,105,"Jakar",null,1.0900000000000001]
["",null,null,"00:00:00",null,"","",null,"","",null,null,null,null,"","",null,2,null,null,null,null,null,null,null,null,null,null,null,null,null,null,null,null,null,106,"Jakar",null,1.1000000000000001]
["",null,null,"00:00:00",null,"","",null,"","",null,null,null,null,"","",null,2,null,null,null,null,null,null,null,null,null,null,null,null,null,null,null,null,null,107,"Jakar",null,1.1100000000000001]
["",null,null,"00:00:00",null,"","",null,"","",null,null,null,null,"","",null,2,null,null,null,null,null,null,null,null,null,null,null,null,null,null,null,null,null,108,"Jakar",null,1.1200000000000001]
["",null,null,"00:00:00",null,"","",null,"","",null,null,null,null,"","",null,2,null,null,null,null,null,null,null,null,null,null,null,null,null,null,null,null,null,109,"Jakar",null,1.1299999999999999]
["",null,null,"00:00:00",null,"","",null,"","",null,null,null,null,"","",null,2,null,null,null,null,null,null,null,null,null,null,null,null,null,null,null,null,null,110,"Jakar",null,1.1399999999999999]
["",null,null,"00:00:00",null,"","",null,"","",null,null,null,null,"","",null,2,null,null,null,null,null,null,null,null,null,null,null,null,null,null,null,null,null,111,"Jakar",null,1.1499999999999999]
["",null,null,"00:00:00",null,"","",null,"","",null,null,null,null,"","",null,2,null,null,null,null,null,null,null,null,null,null,null,null,null,null,null,null,null,112,"Jakar",null,1.1599999999999999]
["",null,null,"00:00:00",null,"","",null,"","",null,null,null,null,"","",null,2,null,null,null,null,null,null,null,null,null,null,null,null,null,null,null,null,null,113,"Jakar",null,1.17]
["",null,null,"00:00:00",null,"","",null,"","",null,null,null,null,"","",null,2,null,null,null,null,null,null,null,null,null,null,null,null,null,null,null,null,null,114,"Jakar",null,1.18]
["",null,null,"00:00:00",null,"","",null,"","",null,null,null,null,"","",null,2,null,null,null,null,null,null,null,null,null,null,null,null,null,null,null,null,null,115,"Jakar",null,1.19]
["",null,null,"00:00:00",null,"","",null,"","",null,null,null,null,"","",null,2,null,null,null,null,null,null,null,null,null,null,null,null,null,null,null,null,null,116,"Jakar",null,1.2]
["",null,null,"00:00:00",null,"","",null,"","",null,null,null,null,"","",null,2,null,null,null,null,null,null,null,null,null,null,null,null,null,null,null,null,null,117,"Jakar",null,1.21]
["",null,null,"00:00:00",null,"","",null,"","",null,null,null,null,"","",null,2,null,null,null,null,null,null,null,null,null,null,null,null,null,null,null,null,null,118,"Jakar",null,1.22]
["",null,null,"00:00:00",null,"","",null,"","",null,null,null,null,"","",null,2,null,null,null,null,null,null,null,null,null,null,null,null,null,null,null,null,null,119,"Jakar",null,1.23]
["",null,null,"00:00:00",null,"","",null,"","",null,null,null,null,"","",null,2,null,null,null,null,null,null,null,null,null,null,null,null,null,null,null,null,null,120,"Jakar",null,1.24]
["",null,null,"00:00:00",null,"","",null,"","",null,null,null,null,"","",null,2,null,null,null,null,null,null,null,null,null,null,null,null,null,null,null,null,null,121,"Jakar",null,1.25]
["",null,null,"00:00:00",null,"","",null,"","",null,null,null,null,"","",null,2,null,null,null,null,null,null,null,null,null,null,null,null,null,null,null,null,null,122,"Jakar",null,1.26]
["",null,null,"00:00:00",null,"","",null,"","",null,null,null,null,"","",null,2,null,null,null,null,null,null,null,null,null,null,null,null,null,null,null,null,null,123,"Jakar",null,1.27]
["",null,null,"00:00:00",null,"","",null,"","",null,null,null,null,"","",null,2,null,null,null,null,null,null,null,null,null,null,null,null,null,null,null,null,null,124,"Jakar",null,1.28]
["",null,null,"00:00:00",null,"","",null,"","",null,null,null,null,"","",null,2,null,null,null,null,null,null,null,null,null,null,null,null,null,null,null,null,null,125,"Jakar",null,1.29]
["",null,null,"00:00:00",null,"","",null,"","",null,null,null,null,"","",null,2,null,null,null,null,null,null,null,null,null,null,null,null,null,null,null,null,null,126,"Jakar",null,1.3]
["",null,null,"00:00:00",null,"","",null,"","",null,null,null,null,"","",null,2,null,null,null,null,null,null,null,null,null,null,null,null,null,null,null,null,null,127,"Jakar",null,1.31]
["",null,null,"00:00:00",null,"","",null,"","",null,null,null,null,"","",null,2,null,null,null,null,null,null,null,null,null,null,null,null,null,null,null,null,null,128,"Jakar",null,1.32]
["",null,null,"00:00:00",null,"","",null,"","",null,null,null,null,"","",null,2,null,null,null,null,null,null,null,null,null,null,null,null,null,null,null,null,null,129,"Jakar",null,1.33]
["",null,null,"00:00:00",null,"","",null,"","",null,null,null,null,"","",null,2,null,null,null,null,null,null,null,null,null,null,null,null,null,null,null,null,null,130,"Jakar",null,1.34]
[{"$f":"IF(E132=\"\",\"\",IF(A132=\"\",TODAY(),A132))","v":""},null,null,{"$f":"C132-B132+IF(B132>C132,1)","v":"00:00:00"},null,{"$f":"IFERROR(VLOOKUP(E132,$AJ$2:$AL$3155,2,FALSE),\"\")","v":""},{"$f":"IFERROR(VLOOKUP(E132,$AJ$2:$AL$3155,3,FALSE),\"\")","v":""},null,{"$f":"IFERROR(SUM(G132/7),\"\")","v":""},{"$f":"IFERROR(SUM(N132/C132),\"\")","v":""},null,null,null,null,{"$f":"IFERROR(ROUND(SUM(1000/K132),2),\"\")","v":""},{"$f":"IFERROR(ROUND(SUM(N132*O132),2),\"\")","v":""},null,2,null,null,null,null,null,null,null,null,null,null,null,null,null,null,null,null,null,131,"Jakar",null,1.35]
["",null,null,"00:00:00",null,"","",null,"","",null,null,null,null,"","",null,2,null,null,null,null,null,null,null,null,null,null,null,null,null,null,null,null,null,132,"Jakar",null,1.36]
["",null,null,"00:00:00",null,"","",null,"","",null,null,null,null,"","",null,2,null,null,null,null,null,null,null,null,null,null,null,null,null,null,null,null,null,133,"Jakar",null,1.37]
["",null,null,"00:00:00",null,"","",null,"","",null,null,null,null,"","",null,2,null,null,null,null,null,null,null,null,null,null,null,null,null,null,null,null,null,134,"Jakar",null,1.38]
["",null,null,"00:00:00",null,"","",null,"","",null,null,null,null,"","",null,2,null,null,null,null,null,null,null,null,null,null,null,null,null,null,null,null,null,135,"Jakar",null,1.39]
["",null,null,"00:00:00",null,"","",null,"","",null,null,null,null,"","",null,2,null,null,null,null,null,null,null,null,null,null,null,null,null,null,null,null,null,136,"Jakar",null,1.4]
["",null,null,"00:00:00",null,"","",null,"","",null,null,null,null,"","",null,2,null,null,null,null,null,null,null,null,null,null,null,null,null,null,null,null,null,137,"Jakar",null,1.41]
["",null,null,"00:00:00",null,"","",null,"","",null,null,null,null,"","",null,2,null,null,null,null,null,null,null,null,null,null,null,null,null,null,null,null,null,138,"Jakar",null,1.42]
["",null,null,"00:00:00",null,"","",null,"","",null,null,null,null,"","",null,2,null,null,null,null,null,null,null,null,null,null,null,null,null,null,null,null,null,139,"Jakar",null,1.43]
["",null,null,"00:00:00",null,"","",null,"","",null,null,null,null,"","",null,2,null,null,null,null,null,null,null,null,null,null,null,null,null,null,null,null,null,140,"Jakar",null,1.44]
["",null,null,"00:00:00",null,"","",null,"","",null,null,null,null,"","",null,2,null,null,null,null,null,null,null,null,null,null,null,null,null,null,null,null,null,141,"Jakar",null,1.45]
["",null,null,"00:00:00",null,"","",null,"","",null,null,null,null,"","",null,2,null,null,null,null,null,null,null,null,null,null,null,null,null,null,null,null,null,142,"Jakar",null,1.46]
["",null,null,"00:00:00",null,"","",null,"","",null,null,null,null,"","",null,2,null,null,null,null,null,null,null,null,null,null,null,null,null,null,null,null,null,143,"Jakar",null,1.47]
["",null,null,"00:00:00",null,"","",null,"","",null,null,null,null,"","",null,2,null,null,null,null,null,null,null,null,null,null,null,null,null,null,null,null,null,144,"Jakar",null,1.48]
["",null,null,"00:00:00",null,"","",null,"","",null,null,null,null,"","",null,2,null,null,null,null,null,null,null,null,null,null,null,null,null,null,null,null,null,145,"Jakar",null,1.49]
["",null,null,"00:00:00",null,"","",null,"","",null,null,null,null,"","",null,2,null,null,null,null,null,null,null,null,null,null,null,null,null,null,null,null,null,146,"Jakar",null,1.5]
["",null,null,"00:00:00",null,"","",null,"","",null,null,null,null,"","",null,2,null,null,null,null,null,null,null,null,null,null,null,null,null,null,null,null,null,147,"Jakar",null,1.51]
["",null,null,"00:00:00",null,"","",null,"","",null,null,null,null,"","",null,2,null,null,null,null,null,null,null,null,null,null,null,null,null,null,null,null,null,148,"Jakar",null,1.52]
["",null,null,"00:00:00",null,"","",null,"","",null,null,null,null,"","",null,2,null,null,null,null,null,null,null,null,null,null,null,null,null,null,null,null,null,149,"Jakar",null,1.53]
["",null,null,"00:00:00",null,"","",null,"","",null,null,null,null,"","",null,2,null,null,null,null,null,null,null,null,null,null,null,null,null,null,null,null,null,150,"Jakar",null,1.54]
["",null,null,"00:00:00",null,"","",null,"","",null,null,null,null,"","",null,2,null,null,null,null,null,null,null,null,null,null,null,null,null,null,null,null,null,151,"Jakar",null,1.55]
["",null,null,"00:00:00",null,"","",null,"","",null,null,null,null,"","",null,2,null,null,null,null,null,null,null,null,null,null,null,null,null,null,null,null,null,152,"Jakar",null,1.56]
["",null,null,"00:00:00",null,"","",null,"","",null,null,null,null,"","",null,2,null,null,null,null,null,null,null,null,null,null,null,null,null,null,null,null,null,153,"Jakar",null,1.57]
["",null,null,"00:00:00",null,"","",null,"","",null,null,null,null,"","",null,2,null,null,null,null,null,null,null,null,null,null,null,null,null,null,null,null,null,154,"Jakar",null,1.58]
["",null,null,"00:00:00",null,"","",null,"","",null,null,null,null,"","",null,2,null,null,null,null,null,null,null,null,null,null,null,null,null,null,null,null,null,155,"Jakar",null,1.59]
["",null,null,"00:00:00",null,"","",null,"","",null,null,null,null,"","",null,2,null,null,null,null,null,null,null,null,null,null,null,null,null,null,null,null,null,156,"Jakar",null,1.6]
["",null,null,"00:00:00",null,"","",null,"","",null,null,null,null,"","",null,2,null,null,null,null,null,null,null,null,null,null,null,null,null,null,null,null,null,157,"Jakar",null,1.61]
["",null,null,"00:00:00",null,"","",null,"","",null,null,null,null,"","",null,2,null,null,null,null,null,null,null,null,null,null,null,null,null,null,null,null,null,158,"Jakar",null,1.62]
["",null,null,"00:00:00",null,"","",null,"","",null,null,null,null,"","",null,2,null,null,null,null,null,null,null,null,null,null,null,null,null,null,null,null,null,159,"Jakar",null,1.63]
["",null,null,"00:00:00",null,"","",null,"","",null,null,null,null,"","",null,2,null,null,null,null,null,null,null,null,null,null,null,null,null,null,null,null,null,160,"Jakar",null,1.64]
["",null,null,"00:00:00",null,"","",null,"","",null,null,null,null,"","",null,2,null,null,null,null,null,null,null,null,null,null,null,null,null,null,null,null,null,161,"Jakar",null,1.65]
["",null,null,"00:00:00",null,"","",null,"","",null,null,null,null,"","",null,2,null,null,null,null,null,null,null,null,null,null,null,null,null,null,null,null,null,162,"Jakar",null,1.66]
["",null,null,"00:00:00",null,"","",null,"","",null,null,null,null,"","",null,2,null,null,null,null,null,null,null,null,null,null,null,null,null,null,null,null,null,163,"Jakar",null,1.67]
["",null,null,"00:00:00",null,"","",null,"","",null,null,null,null,"","",null,2,null,null,null,null,null,null,null,null,null,null,null,null,null,null,null,null,null,164,"Jakar",null,1.68]
["",null,null,"00:00:00",null,"","",null,"","",null,null,null,null,"","",null,2,null,null,null,null,null,null,null,null,null,null,null,null,null,null,null,null,null,165,"Jakar",null,1.69]
["",null,null,"00:00:00",null,"","",null,"","",null,null,null,null,"","",null,2,null,null,null,null,null,null,null,null,null,null,null,null,null,null,null,null,null,166,"Jakar",null,1.7]
["",null,null,"00:00:00",null,"","",null,"","",null,null,null,null,"","",null,2,null,null,null,null,null,null,null,null,null,null,null,null,null,null,null,null,null,167,"Jakar",null,1.71]
["",null,null,"00:00:00",null,"","",null,"","",null,null,null,null,"","",null,2,null,null,null,null,null,null,null,null,null,null,null,null,null,null,null,null,null,168,"Jakar",null,1.72]
["",null,null,"00:00:00",null,"","",null,"","",null,null,null,null,"","",null,2,null,null,null,null,null,null,null,null,null,null,null,null,null,null,null,null,null,169,"Jakar",null,1.73]
["",null,null,"00:00:00",null,"","",null,"","",null,null,null,null,"","",null,2,null,null,null,null,null,null,null,null,null,null,null,null,null,null,null,null,null,170,"Jakar",null,1.74]
["",null,null,"00:00:00",null,"","",null,"","",null,null,null,null,"","",null,2,null,null,null,null,null,null,null,null,null,null,null,null,null,null,null,null,null,171,"Jakar",null,1.75]
["",null,null,"00:00:00",null,"","",null,"","",null,null,null,null,"","",null,2,null,null,null,null,null,null,null,null,null,null,null,null,null,null,null,null,null,172,"Jakar",null,1.76]
["",null,null,"00:00:00",null,"","",null,"","",null,null,null,null,"","",null,2,null,null,null,null,null,null,null,null,null,null,null,null,null,null,null,null,null,173,"Jakar",null,1.77]
["",null,null,"00:00:00",null,"","",null,"","",null,null,null,null,"","",null,2,null,null,null,null,null,null,null,null,null,null,null,null,null,null,null,null,null,174,"Jakar",null,1.78]
["",null,null,"00:00:00",null,"","",null,"","",null,null,null,null,"","",null,2,null,null,null,null,null,null,null,null,null,null,null,null,null,null,null,null,null,175,"Jakar",null,1.79]
["",null,null,"00:00:00",null,"","",null,"","",null,null,null,null,"","",null,2,null,null,null,null,null,null,null,null,null,null,null,null,null,null,null,null,null,176,"Jakar",null,1.8]
["",null,null,"00:00:00",null,"","",null,"","",null,null,null,null,"","",null,2,null,null,null,null,null,null,null,null,null,null,null,null,null,null,null,null,null,177,"Jakar",null,1.81]
["",null,null,"00:00:00",null,"","",null,"","",null,null,null,null,"","",null,2,null,null,null,null,null,null,null,null,null,null,null,null,null,null,null,null,null,178,"Jakar",null,1.82]
["",null,null,"00:00:00",null,"","",null,"","",null,null,null,null,"","",null,2,null,null,null,null,null,null,null,null,null,null,null,null,null,null,null,null,null,179,"Jakar",null,1.83]
["",null,null,"00:00:00",null,"","",null,"","",null,null,null,null,"","",null,2,null,null,null,null,null,null,null,null,null,null,null,null,null,null,null,null,null,180,"Jakar",null,1.84]
["",null,null,"00:00:00",null,"","",null,"","",null,null,null,null,"","",null,2,null,null,null,null,null,null,null,null,null,null,null,null,null,null,null,null,null,181,"Jakar",null,1.85]
["",null,null,"00:00:00",null,"","",null,"","",null,null,null,null,"","",null,2,null,null,null,null,null,null,null,null,null,null,null,null,null,null,null,null,null,182,"Jakar",null,1.86]
["",null,null,"00:00:00",null,"","",null,"","",null,null,null,null,"","",null,2,null,null,null,null,null,null,null,null,null,null,null,null,null,null,null,null,null,183,"Jakar",null,1.87]
["",null,null,"00:00:00",null,"","",null,"","",null,null,null,null,"","",null,2,null,null,null,null,null,null,null,null,null,null,null,null,null,null,null,null,null,184,"Jakar",null,1.88]
["",null,null,"00:00:00",null,"","",null,"","",null,null,null,null,"","",null,2,null,null,null,null,null,null,null,null,null,null,null,null,null,null,null,null,null,185,"Jakar",null,1.89]
["",null,null,"00:00:00",null,"","",null,"","",null,null,null,null,"","",null,2,null,null,null,null,null,null,null,null,null,null,null,null,null,null,null,null,null,186,"Jakar",null,1.9]
["",null,null,"00:00:00",null,"","",null,"","",null,null,null,null,"","",null,2,null,null,null,null,null,null,null,null,null,null,null,null,null,null,null,null,null,187,"Jakar",null,1.91]
["",null,null,"00:00:00",null,"","",null,"","",null,null,null,null,"","",null,2,null,null,null,null,null,null,null,null,null,null,null,null,null,null,null,null,null,188,"Jakar",null,1.92]
["",null,null,"00:00:00",null,"","",null,"","",null,null,null,null,"","",null,2,null,null,null,null,null,null,null,null,null,null,null,null,null,null,null,null,null,189,"Jakar",null,1.93]
["",null,null,"00:00:00",null,"","",null,"","",null,null,null,null,"","",null,2,null,null,null,null,null,null,null,null,null,null,null,null,null,null,null,null,null,190,"Jakar",null,1.94]
["",null,null,"00:00:00",null,"","",null,"","",null,null,null,null,"","",null,2,null,null,null,null,null,null,null,null,null,null,null,null,null,null,null,null,null,191,"Jakar",null,1.95]
["",null,null,"00:00:00",null,"","",null,"","",null,null,null,null,"","",null,2,null,null,null,null,null,null,null,null,null,null,null,null,null,null,null,null,null,192,"Jakar",null,1.96]
["",null,null,"00:00:00",null,"","",null,"","",null,null,null,null,"","",null,2,null,null,null,null,null,null,null,null,null,null,null,null,null,null,null,null,null,193,"Jakar",null,1.97]
["",null,null,"00:00:00",null,"","",null,"","",null,null,null,null,"","",null,2,null,null,null,null,null,null,null,null,null,null,null,null,null,null,null,null,null,194,"Jakar",null,1.98]
[{"$f":"IF(E196=\"\",\"\",IF(A196=\"\",TODAY(),A196))","v":""},null,null,{"$f":"C196-B196+IF(B196>C196,1)","v":"00:00:00"},null,{"$f":"IFERROR(VLOOKUP(E196,$AJ$2:$AL$3155,2,FALSE),\"\")","v":""},{"$f":"IFERROR(VLOOKUP(E196,$AJ$2:$AL$3155,3,FALSE),\"\")","v":""},null,{"$f":"IFERROR(SUM(G196/7),\"\")","v":""},{"$f":"IFERROR(SUM(N196/C196),\"\")","v":""},null,null,null,null,{"$f":"IFERROR(ROUND(SUM(1000/K196),2),\"\")","v":""},{"$f":"IFERROR(ROUND(SUM(N196*O196),2),\"\")","v":""},null,2,null,null,null,null,null,null,null,null,null,null,null,null,null,null,null,null,null,195,"Jakar",null,1.99]
["",null,null,"00:00:00",null,"","",null,"","",null,null,null,null,"","",null,2,null,null,null,null,null,null,null,null,null,null,null,null,null,null,null,null,null,196,"Jakar",null,2]
["",null,null,"00:00:00",null,"","",null,"","",null,null,null,null,"","",null,2,null,null,null,null,null,null,null,null,null,null,null,null,null,null,null,null,null,197,"Jakar",null,2.0099999999999998]
["",null,null,"00:00:00",null,"","",null,"","",null,null,null,null,"","",null,2,null,null,null,null,null,null,null,null,null,null,null,null,null,null,null,null,null,198,"Jakar",null,2.02]
["",null,null,"00:00:00",null,"","",null,"","",null,null,null,null,"","",null,2,null,null,null,null,null,null,null,null,null,null,null,null,null,null,null,null,null,199,"Jakar",null,2.0299999999999998]
["",null,null,"00:00:00",null,"","",null,"","",null,null,null,null,"","",null,2,null,null,null,null,null,null,null,null,null,null,null,null,null,null,null,null,null,200,"Jakar",null,2.04]
["",null,null,"00:00:00",null,"","",null,"","",null,null,null,null,"","",null,2,null,null,null,null,null,null,null,null,null,null,null,null,null,null,null,null,null,201,"Jakar",null,2.0499999999999998]
["",null,null,"00:00:00",null,"","",null,"","",null,null,null,null,"","",null,2,null,null,null,null,null,null,null,null,null,null,null,null,null,null,null,null,null,202,"Jakar",null,2.06]
["",null,null,"00:00:00",null,"","",null,"","",null,null,null,null,"","",null,2,null,null,null,null,null,null,null,null,null,null,null,null,null,null,null,null,null,203,"Jakar",null,2.0699999999999998]
["",null,null,"00:00:00",null,"","",null,"","",null,null,null,null,"","",null,2,null,null,null,null,null,null,null,null,null,null,null,null,null,null,null,null,null,204,"Jakar",null,2.08]
["",null,null,"00:00:00",null,"","",null,"","",null,null,null,null,"","",null,2,null,null,null,null,null,null,null,null,null,null,null,null,null,null,null,null,null,205,"Jakar",null,2.09]
["",null,null,"00:00:00",null,"","",null,"","",null,null,null,null,"","",null,2,null,null,null,null,null,null,null,null,null,null,null,null,null,null,null,null,null,206,"Jakar",null,2.1]
["",null,null,"00:00:00",null,"","",null,"","",null,null,null,null,"","",null,2,null,null,null,null,null,null,null,null,null,null,null,null,null,null,null,null,null,207,"Jakar",null,2.11]
["",null,null,"00:00:00",null,"","",null,"","",null,null,null,null,"","",null,2,null,null,null,null,null,null,null,null,null,null,null,null,null,null,null,null,null,208,"Jakar",null,2.12]
["",null,null,"00:00:00",null,"","",null,"","",null,null,null,null,"","",null,2,null,null,null,null,null,null,null,null,null,null,null,null,null,null,null,null,null,209,"Jakar",null,2.13]
["",null,null,"00:00:00",null,"","",null,"","",null,null,null,null,"","",null,2,null,null,null,null,null,null,null,null,null,null,null,null,null,null,null,null,null,210,"Jakar",null,2.14]
["",null,null,"00:00:00",null,"","",null,"","",null,null,null,null,"","",null,2,null,null,null,null,null,null,null,null,null,null,null,null,null,null,null,null,null,211,"Jakar",null,2.15]
["",null,null,"00:00:00",null,"","",null,"","",null,null,null,null,"","",null,2,null,null,null,null,null,null,null,null,null,null,null,null,null,null,null,null,null,212,"Jakar",null,2.16]
["",null,null,"00:00:00",null,"","",null,"","",null,null,null,null,"","",null,2,null,null,null,null,null,null,null,null,null,null,null,null,null,null,null,null,null,213,"Jakar",null,2.17]
["",null,null,"00:00:00",null,"","",null,"","",null,null,null,null,"","",null,2,null,null,null,null,null,null,null,null,null,null,null,null,null,null,null,null,null,214,"Jakar",null,2.1800000000000002]
["",null,null,"00:00:00",null,"","",null,"","",null,null,null,null,"","",null,2,null,null,null,null,null,null,null,null,null,null,null,null,null,null,null,null,null,215,"Jakar",null,2.19]
["",null,null,"00:00:00",null,"","",null,"","",null,null,null,null,"","",null,2,null,null,null,null,null,null,null,null,null,null,null,null,null,null,null,null,null,216,"Jakar",null,2.2000000000000002]
["",null,null,"00:00:00",null,"","",null,"","",null,null,null,null,"","",null,2,null,null,null,null,null,null,null,null,null,null,null,null,null,null,null,null,null,217,"Jakar",null,2.21]
["",null,null,"00:00:00",null,"","",null,"","",null,null,null,null,"","",null,2,null,null,null,null,null,null,null,null,null,null,null,null,null,null,null,null,null,218,"Jakar",null,2.2200000000000002]
["",null,null,"00:00:00",null,"","",null,"","",null,null,null,null,"","",null,2,null,null,null,null,null,null,null,null,null,null,null,null,null,null,null,null,null,219,"Jakar",null,2.23]
["",null,null,"00:00:00",null,"","",null,"","",null,null,null,null,"","",null,2,null,null,null,null,null,null,null,null,null,null,null,null,null,null,null,null,null,220,"Jakar",null,2.2400000000000002]
["",null,null,"00:00:00",null,"","",null,"","",null,null,null,null,"","",null,2,null,null,null,null,null,null,null,null,null,null,null,null,null,null,null,null,null,221,"Jakar",null,2.25]
["",null,null,"00:00:00",null,"","",null,"","",null,null,null,null,"","",null,2,null,null,null,null,null,null,null,null,null,null,null,null,null,null,null,null,null,222,"Jakar",null,2.2599999999999998]
["",null,null,"00:00:00",null,"","",null,"","",null,null,null,null,"","",null,2,null,null,null,null,null,null,null,null,null,null,null,null,null,null,null,null,null,223,"Jakar",null,2.27]
["",null,null,"00:00:00",null,"","",null,"","",null,null,null,null,"","",null,2,null,null,null,null,null,null,null,null,null,null,null,null,null,null,null,null,null,224,"Jakar",null,2.2799999999999998]
["",null,null,"00:00:00",null,"","",null,"","",null,null,null,null,"","",null,2,null,null,null,null,null,null,null,null,null,null,null,null,null,null,null,null,null,225,"Jakar",null,2.29]
["",null,null,"00:00:00",null,"","",null,"","",null,null,null,null,"","",null,2,null,null,null,null,null,null,null,null,null,null,null,null,null,null,null,null,null,226,"Jakar",null,2.2999999999999998]
["",null,null,"00:00:00",null,"","",null,"","",null,null,null,null,"","",null,2,null,null,null,null,null,null,null,null,null,null,null,null,null,null,null,null,null,227,"Jakar",null,2.31]
["",null,null,"00:00:00",null,"","",null,"","",null,null,null,null,"","",null,2,null,null,null,null,null,null,null,null,null,null,null,null,null,null,null,null,null,228,"Jakar",null,2.3199999999999998]
["",null,null,"00:00:00",null,"","",null,"","",null,null,null,null,"","",null,2,null,null,null,null,null,null,null,null,null,null,null,null,null,null,null,null,null,229,"Jakar",null,2.33]
["",null,null,"00:00:00",null,"","",null,"","",null,null,null,null,"","",null,2,null,null,null,null,null,null,null,null,null,null,null,null,null,null,null,null,null,230,"Jakar",null,2.34]
["",null,null,"00:00:00",null,"","",null,"","",null,null,null,null,"","",null,2,null,null,null,null,null,null,null,null,null,null,null,null,null,null,null,null,null,231,"Jakar",null,2.35]
["",null,null,"00:00:00",null,"","",null,"","",null,null,null,null,"","",null,2,null,null,null,null,null,null,null,null,null,null,null,null,null,null,null,null,null,232,"Jakar",null,2.36]
["",null,null,"00:00:00",null,"","",null,"","",null,null,null,null,"","",null,2,null,null,null,null,null,null,null,null,null,null,null,null,null,null,null,null,null,233,"Jakar",null,2.37]
["",null,null,"00:00:00",null,"","",null,"","",null,null,null,null,"","",null,2,null,null,null,null,null,null,null,null,null,null,null,null,null,null,null,null,null,234,"Jakar",null,2.38]
["",null,null,"00:00:00",null,"","",null,"","",null,null,null,null,"","",null,2,null,null,null,null,null,null,null,null,null,null,null,null,null,null,null,null,null,235,"Jakar",null,2.39]
["",null,null,"00:00:00",null,"","",null,"","",null,null,null,null,"","",null,2,null,null,null,null,null,null,null,null,null,null,null,null,null,null,null,null,null,236,"Jakar",null,2.4]
["",null,null,"00:00:00",null,"","",null,"","",null,null,null,null,"","",null,2,null,null,null,null,null,null,null,null,null,null,null,null,null,null,null,null,null,237,"Jakar",null,2.41]
["",null,null,"00:00:00",null,"","",null,"","",null,null,null,null,"","",null,2,null,null,null,null,null,null,null,null,null,null,null,null,null,null,null,null,null,238,"Jakar",null,2.42]
["",null,null,"00:00:00",null,"","",null,"","",null,null,null,null,"","",null,2,null,null,null,null,null,null,null,null,null,null,null,null,null,null,null,null,null,239,"Jakar",null,2.4300000000000002]
["",null,null,"00:00:00",null,"","",null,"","",null,null,null,null,"","",null,2,null,null,null,null,null,null,null,null,null,null,null,null,null,null,null,null,null,240,"Jakar",null,2.44]
["",null,null,"00:00:00",null,"","",null,"","",null,null,null,null,"","",null,2,null,null,null,null,null,null,null,null,null,null,null,null,null,null,null,null,null,241,"Jakar",null,2.4500000000000002]
["",null,null,"00:00:00",null,"","",null,"","",null,null,null,null,"","",null,2,null,null,null,null,null,null,null,null,null,null,null,null,null,null,null,null,null,242,"Jakar",null,2.46]
["",null,null,"00:00:00",null,"","",null,"","",null,null,null,null,"","",null,2,null,null,null,null,null,null,null,null,null,null,null,null,null,null,null,null,null,243,"Jakar",null,2.4700000000000002]
["",null,null,"00:00:00",null,"","",null,"","",null,null,null,null,"","",null,2,null,null,null,null,null,null,null,null,null,null,null,null,null,null,null,null,null,244,"Jakar",null,2.48]
["",null,null,"00:00:00",null,"","",null,"","",null,null,null,null,"","",null,2,null,null,null,null,null,null,null,null,null,null,null,null,null,null,null,null,null,245,"Jakar",null,2.4900000000000002]
["",null,null,"00:00:00",null,"","",null,"","",null,null,null,null,"","",null,2,null,null,null,null,null,null,null,null,null,null,null,null,null,null,null,null,null,246,"Jakar",null,2.5]
["",null,null,"00:00:00",null,"","",null,"","",null,null,null,null,"","",null,2,null,null,null,null,null,null,null,null,null,null,null,null,null,null,null,null,null,247,"Jakar",null,2.5099999999999998]
["",null,null,"00:00:00",null,"","",null,"","",null,null,null,null,"","",null,2,null,null,null,null,null,null,null,null,null,null,null,null,null,null,null,null,null,248,"Jakar",null,2.52]
["",null,null,"00:00:00",null,"","",null,"","",null,null,null,null,"","",null,2,null,null,null,null,null,null,null,null,null,null,null,null,null,null,null,null,null,249,"Jakar",null,2.5299999999999998]
["",null,null,"00:00:00",null,"","",null,"","",null,null,null,null,"","",null,2,null,null,null,null,null,null,null,null,null,null,null,null,null,null,null,null,null,250,"Jakar",null,2.54]
["",null,null,"00:00:00",null,"","",null,"","",null,null,null,null,"","",null,2,null,null,null,null,null,null,null,null,null,null,null,null,null,null,null,null,null,251,"Jakar",null,2.5499999999999998]
["",null,null,"00:00:00",null,"","",null,"","",null,null,null,null,"","",null,2,null,null,null,null,null,null,null,null,null,null,null,null,null,null,null,null,null,252,"Jakar",null,2.56]
["",null,null,"00:00:00",null,"","",null,"","",null,null,null,null,"","",null,2,null,null,null,null,null,null,null,null,null,null,null,null,null,null,null,null,null,253,"Jakar",null,2.57]
["",null,null,"00:00:00",null,"","",null,"","",null,null,null,null,"","",null,2,null,null,null,null,null,null,null,null,null,null,null,null,null,null,null,null,null,254,"Jakar",null,2.58]
["",null,null,"00:00:00",null,"","",null,"","",null,null,null,null,"","",null,2,null,null,null,null,null,null,null,null,null,null,null,null,null,null,null,null,null,255,"Jakar",null,2.59]
["",null,null,"00:00:00",null,"","",null,"","",null,null,null,null,"","",null,2,null,null,null,null,null,null,null,null,null,null,null,null,null,null,null,null,null,256,"Jakar",null,2.6]
["",null,null,"00:00:00",null,"","",null,"","",null,null,null,null,"","",null,2,null,null,null,null,null,null,null,null,null,null,null,null,null,null,null,null,null,257,"Jakar",null,2.61]
["",null,null,"00:00:00",null,"","",null,"","",null,null,null,null,"","",null,2,null,null,null,null,null,null,null,null,null,null,null,null,null,null,null,null,null,258,"Jakar",null,2.62]
[{"$f":"IF(E260=\"\",\"\",IF(A260=\"\",TODAY(),A260))","v":""},null,null,{"$f":"C260-B260+IF(B260>C260,1)","v":"00:00:00"},null,{"$f":"IFERROR(VLOOKUP(E260,$AJ$2:$AL$3155,2,FALSE),\"\")","v":""},{"$f":"IFERROR(VLOOKUP(E260,$AJ$2:$AL$3155,3,FALSE),\"\")","v":""},null,{"$f":"IFERROR(SUM(G260/7),\"\")","v":""},{"$f":"IFERROR(SUM(N260/C260),\"\")","v":""},null,null,null,null,{"$f":"IFERROR(ROUND(SUM(1000/K260),2),\"\")","v":""},{"$f":"IFERROR(ROUND(SUM(N260*O260),2),\"\")","v":""},null,2,null,null,null,null,null,null,null,null,null,null,null,null,null,null,null,null,null,259,"Jakar",null,2.63]
["",null,null,"00:00:00",null,"","",null,"","",null,null,null,null,"","",null,2,null,null,null,null,null,null,null,null,null,null,null,null,null,null,null,null,null,260,"Jakar",null,2.64]
["",null,null,"00:00:00",null,"","",null,"","",null,null,null,null,"","",null,2,null,null,null,null,null,null,null,null,null,null,null,null,null,null,null,null,null,261,"Jakar",null,2.65]
["",null,null,"00:00:00",null,"","",null,"","",null,null,null,null,"","",null,2,null,null,null,null,null,null,null,null,null,null,null,null,null,null,null,null,null,262,"Jakar",null,2.66]
["",null,null,"00:00:00",null,"","",null,"","",null,null,null,null,"","",null,2,null,null,null,null,null,null,null,null,null,null,null,null,null,null,null,null,null,263,"Jakar",null,2.67]
["",null,null,"00:00:00",null,"","",null,"","",null,null,null,null,"","",null,2,null,null,null,null,null,null,null,null,null,null,null,null,null,null,null,null,null,264,"Jakar",null,2.68]
["",null,null,"00:00:00",null,"","",null,"","",null,null,null,null,"","",null,2,null,null,null,null,null,null,null,null,null,null,null,null,null,null,null,null,null,265,"Jakar",null,2.69]
["",null,null,"00:00:00",null,"","",null,"","",null,null,null,null,"","",null,2,null,null,null,null,null,null,null,null,null,null,null,null,null,null,null,null,null,266,"Jakar",null,2.7]
["",null,null,"00:00:00",null,"","",null,"","",null,null,null,null,"","",null,2,null,null,null,null,null,null,null,null,null,null,null,null,null,null,null,null,null,267,"Jakar",null,2.71]
["",null,null,"00:00:00",null,"","",null,"","",null,null,null,null,"","",null,2,null,null,null,null,null,null,null,null,null,null,null,null,null,null,null,null,null,268,"Jakar",null,2.72]
["",null,null,"00:00:00",null,"","",null,"","",null,null,null,null,"","",null,2,null,null,null,null,null,null,null,null,null,null,null,null,null,null,null,null,null,269,"Jakar",null,2.73]
["",null,null,"00:00:00",null,"","",null,"","",null,null,null,null,"","",null,2,null,null,null,null,null,null,null,null,null,null,null,null,null,null,null,null,null,270,"Jakar",null,2.74]
["",null,null,"00:00:00",null,"","",null,"","",null,null,null,null,"","",null,2,null,null,null,null,null,null,null,null,null,null,null,null,null,null,null,null,null,271,"Jakar",null,2.75]
["",null,null,"00:00:00",null,"","",null,"","",null,null,null,null,"","",null,2,null,null,null,null,null,null,null,null,null,null,null,null,null,null,null,null,null,272,"Jakar",null,2.76]
["",null,null,"00:00:00",null,"","",null,"","",null,null,null,null,"","",null,2,null,null,null,null,null,null,null,null,null,null,null,null,null,null,null,null,null,273,"Jakar",null,2.77]
["",null,null,"00:00:00",null,"","",null,"","",null,null,null,null,"","",null,2,null,null,null,null,null,null,null,null,null,null,null,null,null,null,null,null,null,274,"Jakar",null,2.78]
["",null,null,"00:00:00",null,"","",null,"","",null,null,null,null,"","",null,2,null,null,null,null,null,null,null,null,null,null,null,null,null,null,null,null,null,275,"Jakar",null,2.79]
["",null,null,"00:00:00",null,"","",null,"","",null,null,null,null,"","",null,2,null,null,null,null,null,null,null,null,null,null,null,null,null,null,null,null,null,276,"Jakar",null,2.8]
["",null,null,"00:00:00",null,"","",null,"","",null,null,null,null,"","",null,2,null,null,null,null,null,null,null,null,null,null,null,null,null,null,null,null,null,277,"Jakar",null,2.81]
["",null,null,"00:00:00",null,"","",null,"","",null,null,null,null,"","",null,2,null,null,null,null,null,null,null,null,null,null,null,null,null,null,null,null,null,278,"Jakar",null,2.82]
["",null,null,"00:00:00",null,"","",null,"","",null,null,null,null,"","",null,2,null,null,null,null,null,null,null,null,null,null,null,null,null,null,null,null,null,279,"Jakar",null,2.83]
["",null,null,"00:00:00",null,"","",null,"","",null,null,null,null,"","",null,2,null,null,null,null,null,null,null,null,null,null,null,null,null,null,null,null,null,280,"Jakar",null,2.84]
["",null,null,"00:00:00",null,"","",null,"","",null,null,null,null,"","",null,2,null,null,null,null,null,null,null,null,null,null,null,null,null,null,null,null,null,281,"Jakar",null,2.85]
["",null,null,"00:00:00",null,"","",null,"","",null,null,null,null,"","",null,2,null,null,null,null,null,null,null,null,null,null,null,null,null,null,null,null,null,282,"Jakar",null,2.86]
["",null,null,"00:00:00",null,"","",null,"","",null,null,null,null,"","",null,2,null,null,null,null,null,null,null,null,null,null,null,null,null,null,null,null,null,283,"Jakar",null,2.87]
["",null,null,"00:00:00",null,"","",null,"","",null,null,null,null,"","",null,2,null,null,null,null,null,null,null,null,null,null,null,null,null,null,null,null,null,284,"Jakar",null,2.88]
["",null,null,"00:00:00",null,"","",null,"","",null,null,null,null,"","",null,2,null,null,null,null,null,null,null,null,null,null,null,null,null,null,null,null,null,285,"Jakar",null,2.89]
["",null,null,"00:00:00",null,"","",null,"","",null,null,null,null,"","",null,2,null,null,null,null,null,null,null,null,null,null,null,null,null,null,null,null,null,286,"Jakar",null,2.9]
["",null,null,"00:00:00",null,"","",null,"","",null,null,null,null,"","",null,2,null,null,null,null,null,null,null,null,null,null,null,null,null,null,null,null,null,287,"Jakar",null,2.91]
["",null,null,"00:00:00",null,"","",null,"","",null,null,null,null,"","",null,2,null,null,null,null,null,null,null,null,null,null,null,null,null,null,null,null,null,288,"Jakar",null,2.92]
["",null,null,"00:00:00",null,"","",null,"","",null,null,null,null,"","",null,2,null,null,null,null,null,null,null,null,null,null,null,null,null,null,null,null,null,289,"Jakar",null,2.93]
["",null,null,"00:00:00",null,"","",null,"","",null,null,null,null,"","",null,2,null,null,null,null,null,null,null,null,null,null,null,null,null,null,null,null,null,290,"Jakar",null,2.94]
["",null,null,"00:00:00",null,"","",null,"","",null,null,null,null,"","",null,2,null,null,null,null,null,null,null,null,null,null,null,null,null,null,null,null,null,291,"Jakar",null,2.95]
["",null,null,"00:00:00",null,"","",null,"","",null,null,null,null,"","",null,2,null,null,null,null,null,null,null,null,null,null,null,null,null,null,null,null,null,292,"Jakar",null,2.96]
["",null,null,"00:00:00",null,"","",null,"","",null,null,null,null,"","",null,2,null,null,null,null,null,null,null,null,null,null,null,null,null,null,null,null,null,293,"Jakar",null,2.97]
["",null,null,"00:00:00",null,"","",null,"","",null,null,null,null,"","",null,2,null,null,null,null,null,null,null,null,null,null,null,null,null,null,null,null,null,294,"Jakar",null,2.98]
["",null,null,"00:00:00",null,"","",null,"","",null,null,null,null,"","",null,2,null,null,null,null,null,null,null,null,null,null,null,null,null,null,null,null,null,295,"Jakar",null,2.99]
["",null,null,"00:00:00",null,"","",null,"","",null,null,null,null,"","",null,2,null,null,null,null,null,null,null,null,null,null,null,null,null,null,null,null,null,296,"Jakar",null,3]
["",null,null,"00:00:00",null,"","",null,"","",null,null,null,null,"","",null,2,null,null,null,null,null,null,null,null,null,null,null,null,null,null,null,null,null,297,"Jakar",null,3.01]
["",null,null,"00:00:00",null,"","",null,"","",null,null,null,null,"","",null,2,null,null,null,null,null,null,null,null,null,null,null,null,null,null,null,null,null,298,"Jakar",null,3.02]
["",null,null,"00:00:00",null,"","",null,"","",null,null,null,null,"","",null,2,null,null,null,null,null,null,null,null,null,null,null,null,null,null,null,null,null,299,"Jakar",null,3.03]
["",null,null,"00:00:00",null,"","",null,"","",null,null,null,null,"","",null,2,null,null,null,null,null,null,null,null,null,null,null,null,null,null,null,null,null,300,"Jakar",null,3.04]
["",null,null,"00:00:00",null,"","",null,"","",null,null,null,null,"","",null,2,null,null,null,null,null,null,null,null,null,null,null,null,null,null,null,null,null,301,"Electric iron",null,3.05]
["",null,null,"00:00:00",null,"","",null,"","",null,null,null,null,"","",null,2,null,null,null,null,null,null,null,null,null,null,null,null,null,null,null,null,null,302,"Electric iron",null,3.06]
["",null,null,"00:00:00",null,"","",null,"","",null,null,null,null,"","",null,2,null,null,null,null,null,null,null,null,null,null,null,null,null,null,null,null,null,303,"Electric iron",null,3.07]
["",null,null,"00:00:00",null,"","",null,"","",null,null,null,null,"","",null,2,null,null,null,null,null,null,null,null,null,null,null,null,null,null,null,null,null,304,"Electric iron",null,3.08]
["",null,null,"00:00:00",null,"","",null,"","",null,null,null,null,"","",null,2,null,null,null,null,null,null,null,null,null,null,null,null,null,null,null,null,null,305,"Electric iron",null,3.09]
["",null,null,"00:00:00",null,"","",null,"","",null,null,null,null,"","",null,2,null,null,null,null,null,null,null,null,null,null,null,null,null,null,null,null,null,306,"Electric iron",null,3.1]
["",null,null,"00:00:00",null,"","",null,"","",null,null,null,null,"","",null,2,null,null,null,null,null,null,null,null,null,null,null,null,null,null,null,null,null,307,"Electric iron",null,3.11]
["",null,null,"00:00:00",null,"","",null,"","",null,null,null,null,"","",null,2,null,null,null,null,null,null,null,null,null,null,null,null,null,null,null,null,null,308,"Electric iron",null,3.12]
["",null,null,"00:00:00",null,"","",null,"","",null,null,null,null,"","",null,2,null,null,null,null,null,null,null,null,null,null,null,null,null,null,null,null,null,309,"Electric iron",null,3.13]
["",null,null,"00:00:00",null,"","",null,"","",null,null,null,null,"","",null,2,null,null,null,null,null,null,null,null,null,null,null,null,null,null,null,null,null,310,"Electric iron",null,3.14]
["",null,null,"00:00:00",null,"","",null,"","",null,null,null,null,"","",null,2,null,null,null,null,null,null,null,null,null,null,null,null,null,null,null,null,null,311,"Electric iron",null,3.15]
["",null,null,"00:00:00",null,"","",null,"","",null,null,null,null,"","",null,2,null,null,null,null,null,null,null,null,null,null,null,null,null,null,null,null,null,312,"Electric iron",null,3.16]
["",null,null,"00:00:00",null,"","",null,"","",null,null,null,null,"","",null,2,null,null,null,null,null,null,null,null,null,null,null,null,null,null,null,null,null,313,"Electric iron",null,3.17]
["",null,null,"00:00:00",null,"","",null,"","",null,null,null,null,"","",null,2,null,null,null,null,null,null,null,null,null,null,null,null,null,null,null,null,null,314,"Electric iron",null,3.18]
["",null,null,"00:00:00",null,"","",null,"","",null,null,null,null,"","",null,2,null,null,null,null,null,null,null,null,null,null,null,null,null,null,null,null,null,315,"Electric iron",null,3.19]
["",null,null,"00:00:00",null,"","",null,"","",null,null,null,null,"","",null,2,null,null,null,null,null,null,null,null,null,null,null,null,null,null,null,null,null,null,null,null,3.2]
["",null,null,"00:00:00",null,"","",null,"","",null,null,null,null,"","",null,2,null,null,null,null,null,null,null,null,null,null,null,null,null,null,null,null,null,null,null,null,3.21]
["",null,null,"00:00:00",null,"","",null,"","",null,null,null,null,"","",null,2,null,null,null,null,null,null,null,null,null,null,null,null,null,null,null,null,null,null,null,null,3.22]
["",null,null,"00:00:00",null,"","",null,"","",null,null,null,null,"","",null,2,null,null,null,null,null,null,null,null,null,null,null,null,null,null,null,null,null,null,null,null,3.23]
["",null,null,"00:00:00",null,"","",null,"","",null,null,null,null,"","",null,2,null,null,null,null,null,null,null,null,null,null,null,null,null,null,null,null,null,null,null,null,3.24]
["",null,null,"00:00:00",null,"","",null,"","",null,null,null,null,"","",null,2,null,null,null,null,null,null,null,null,null,null,null,null,null,null,null,null,null,null,null,null,3.25]
["",null,null,"00:00:00",null,"","",null,"","",null,null,null,null,"","",null,2,null,null,null,null,null,null,null,null,null,null,null,null,null,null,null,null,null,null,null,null,3.26]
[{"$f":"IF(E324=\"\",\"\",IF(A324=\"\",TODAY(),A324))","v":""},null,null,{"$f":"C324-B324+IF(B324>C324,1)","v":"00:00:00"},null,{"$f":"IFERROR(VLOOKUP(E324,$AJ$2:$AL$3155,2,FALSE),\"\")","v":""},{"$f":"IFERROR(VLOOKUP(E324,$AJ$2:$AL$3155,3,FALSE),\"\")","v":""},null,{"$f":"IFERROR(SUM(G324/7),\"\")","v":""},{"$f":"IFERROR(SUM(N324/C324),\"\")","v":""},null,null,null,null,{"$f":"IFERROR(ROUND(SUM(1000/K324),2),\"\")","v":""},{"$f":"IFERROR(ROUND(SUM(N324*O324),2),\"\")","v":""},null,2,null,null,null,null,null,null,null,null,null,null,null,null,null,null,null,null,null,null,null,null,3.27]
["",null,null,"00:00:00",null,"","",null,"","",null,null,null,null,"","",null,2,null,null,null,null,null,null,null,null,null,null,null,null,null,null,null,null,null,null,null,null,3.28]
["",null,null,"00:00:00",null,"","",null,"","",null,null,null,null,"","",null,2,null,null,null,null,null,null,null,null,null,null,null,null,null,null,null,null,null,null,null,null,3.29]
["",null,null,"00:00:00",null,"","",null,"","",null,null,null,null,"","",null,2,null,null,null,null,null,null,null,null,null,null,null,null,null,null,null,null,null,null,null,null,3.3]
["",null,null,"00:00:00",null,"","",null,"","",null,null,null,null,"","",null,2,null,null,null,null,null,null,null,null,null,null,null,null,null,null,null,null,null,null,null,null,3.31]
["",null,null,"00:00:00",null,"","",null,"","",null,null,null,null,"","",null,2,null,null,null,null,null,null,null,null,null,null,null,null,null,null,null,null,null,null,null,null,3.32]
["",null,null,"00:00:00",null,"","",null,"","",null,null,null,null,"","",null,2,null,null,null,null,null,null,null,null,null,null,null,null,null,null,null,null,null,null,null,null,3.33]
["",null,null,"00:00:00",null,"","",null,"","",null,null,null,null,"","",null,2,null,null,null,null,null,null,null,null,null,null,null,null,null,null,null,null,null,null,null,null,3.34]
["",null,null,"00:00:00",null,"","",null,"","",null,null,null,null,"","",null,2,null,null,null,null,null,null,null,null,null,null,null,null,null,null,null,null,null,null,null,null,3.35]
["",null,null,"00:00:00",null,"","",null,"","",null,null,null,null,"","",null,2,null,null,null,null,null,null,null,null,null,null,null,null,null,null,null,null,null,null,null,null,3.36]
["",null,null,"00:00:00",null,"","",null,"","",null,null,null,null,"","",null,2,null,null,null,null,null,null,null,null,null,null,null,null,null,null,null,null,null,null,null,null,3.37]
["",null,null,"00:00:00",null,"","",null,"","",null,null,null,null,"","",null,2,null,null,null,null,null,null,null,null,null,null,null,null,null,null,null,null,null,null,null,null,3.38]
["",null,null,"00:00:00",null,"","",null,"","",null,null,null,null,"","",null,2,null,null,null,null,null,null,null,null,null,null,null,null,null,null,null,null,null,null,null,null,3.39]
["",null,null,"00:00:00",null,"","",null,"","",null,null,null,null,"","",null,2,null,null,null,null,null,null,null,null,null,null,null,null,null,null,null,null,null,null,null,null,3.4]
["",null,null,"00:00:00",null,"","",null,"","",null,null,null,null,"","",null,2,null,null,null,null,null,null,null,null,null,null,null,null,null,null,null,null,null,null,null,null,3.41]
["",null,null,"00:00:00",null,"","",null,"","",null,null,null,null,"","",null,2,null,null,null,null,null,null,null,null,null,null,null,null,null,null,null,null,null,null,null,null,3.42]
["",null,null,"00:00:00",null,"","",null,"","",null,null,null,null,"","",null,2,null,null,null,null,null,null,null,null,null,null,null,null,null,null,null,null,null,null,null,null,3.43]
["",null,null,"00:00:00",null,"","",null,"","",null,null,null,null,"","",null,2,null,null,null,null,null,null,null,null,null,null,null,null,null,null,null,null,null,null,null,null,3.44]
["",null,null,"00:00:00",null,"","",null,"","",null,null,null,null,"","",null,2,null,null,null,null,null,null,null,null,null,null,null,null,null,null,null,null,null,null,null,null,3.45]
["",null,null,"00:00:00",null,"","",null,"","",null,null,null,null,"","",null,2,null,null,null,null,null,null,null,null,null,null,null,null,null,null,null,null,null,null,null,null,3.46]
["",null,null,"00:00:00",null,"","",null,"","",null,null,null,null,"","",null,2,null,null,null,null,null,null,null,null,null,null,null,null,null,null,null,null,null,null,null,null,3.47]
["",null,null,"00:00:00",null,"","",null,"","",null,null,null,null,"","",null,2,null,null,null,null,null,null,null,null,null,null,null,null,null,null,null,null,null,null,null,null,3.48]
["",null,null,"00:00:00",null,"","",null,"","",null,null,null,null,"","",null,2,null,null,null,null,null,null,null,null,null,null,null,null,null,null,null,null,null,null,null,null,3.49]
["",null,null,"00:00:00",null,"","",null,"","",null,null,null,null,"","",null,2,null,null,null,null,null,null,null,null,null,null,null,null,null,null,null,null,null,null,null,null,3.5]
["",null,null,"00:00:00",null,"","",null,"","",null,null,null,null,"","",null,2,null,null,null,null,null,null,null,null,null,null,null,null,null,null,null,null,null,null,null,null,3.51]
["",null,null,"00:00:00",null,"","",null,"","",null,null,null,null,"","",null,2,null,null,null,null,null,null,null,null,null,null,null,null,null,null,null,null,null,null,null,null,3.52]
["",null,null,"00:00:00",null,"","",null,"","",null,null,null,null,"","",null,2,null,null,null,null,null,null,null,null,null,null,null,null,null,null,null,null,null,null,null,null,3.53]
["",null,null,"00:00:00",null,"","",null,"","",null,null,null,null,"","",null,2,null,null,null,null,null,null,null,null,null,null,null,null,null,null,null,null,null,null,null,null,3.54]
["",null,null,"00:00:00",null,"","",null,"","",null,null,null,null,"","",null,2,null,null,null,null,null,null,null,null,null,null,null,null,null,null,null,null,null,null,null,null,3.55]
["",null,null,"00:00:00",null,"","",null,"","",null,null,null,null,"","",null,2,null,null,null,null,null,null,null,null,null,null,null,null,null,null,null,null,null,null,null,null,3.56]
["",null,null,"00:00:00",null,"","",null,"","",null,null,null,null,"","",null,2,null,null,null,null,null,null,null,null,null,null,null,null,null,null,null,null,null,null,null,null,3.57]
["",null,null,"00:00:00",null,"","",null,"","",null,null,null,null,"","",null,2,null,null,null,null,null,null,null,null,null,null,null,null,null,null,null,null,null,null,null,null,3.58]
["",null,null,"00:00:00",null,"","",null,"","",null,null,null,null,"","",null,2,null,null,null,null,null,null,null,null,null,null,null,null,null,null,null,null,null,null,null,null,3.59]
["",null,null,"00:00:00",null,"","",null,"","",null,null,null,null,"","",null,2,null,null,null,null,null,null,null,null,null,null,null,null,null,null,null,null,null,null,null,null,3.6]
["",null,null,"00:00:00",null,"","",null,"","",null,null,null,null,"","",null,2,null,null,null,null,null,null,null,null,null,null,null,null,null,null,null,null,null,null,null,null,3.61]
["",null,null,"00:00:00",null,"","",null,"","",null,null,null,null,"","",null,2,null,null,null,null,null,null,null,null,null,null,null,null,null,null,null,null,null,null,null,null,3.62]
["",null,null,"00:00:00",null,"","",null,"","",null,null,null,null,"","",null,2,null,null,null,null,null,null,null,null,null,null,null,null,null,null,null,null,null,null,null,null,3.63]
["",null,null,"00:00:00",null,"","",null,"","",null,null,null,null,"","",null,2,null,null,null,null,null,null,null,null,null,null,null,null,null,null,null,null,null,null,null,null,3.64]
["",null,null,"00:00:00",null,"","",null,"","",null,null,null,null,"","",null,2,null,null,null,null,null,null,null,null,null,null,null,null,null,null,null,null,null,null,null,null,3.65]
["",null,null,"00:00:00",null,"","",null,"","",null,null,null,null,"","",null,2,null,null,null,null,null,null,null,null,null,null,null,null,null,null,null,null,null,null,null,null,3.66]
["",null,null,"00:00:00",null,"","",null,"","",null,null,null,null,"","",null,2,null,null,null,null,null,null,null,null,null,null,null,null,null,null,null,null,null,null,null,null,3.67]
["",null,null,"00:00:00",null,"","",null,"","",null,null,null,null,"","",null,2,null,null,null,null,null,null,null,null,null,null,null,null,null,null,null,null,null,null,null,null,3.68]
["",null,null,"00:00:00",null,"","",null,"","",null,null,null,null,"","",null,2,null,null,null,null,null,null,null,null,null,null,null,null,null,null,null,null,null,null,null,null,3.69]
["",null,null,"00:00:00",null,"","",null,"","",null,null,null,null,"","",null,2,null,null,null,null,null,null,null,null,null,null,null,null,null,null,null,null,null,null,null,null,3.7]
["",null,null,"00:00:00",null,"","",null,"","",null,null,null,null,"","",null,2,null,null,null,null,null,null,null,null,null,null,null,null,null,null,null,null,null,null,null,null,3.71]
["",null,null,"00:00:00",null,"","",null,"","",null,null,null,null,"","",null,2,null,null,null,null,null,null,null,null,null,null,null,null,null,null,null,null,null,null,null,null,3.72]
["",null,null,"00:00:00",null,"","",null,"","",null,null,null,null,"","",null,2,null,null,null,null,null,null,null,null,null,null,null,null,null,null,null,null,null,null,null,null,3.73]
["",null,null,"00:00:00",null,"","",null,"","",null,null,null,null,"","",null,2,null,null,null,null,null,null,null,null,null,null,null,null,null,null,null,null,null,null,null,null,3.74]
["",null,null,"00:00:00",null,"","",null,"","",null,null,null,null,"","",null,2,null,null,null,null,null,null,null,null,null,null,null,null,null,null,null,null,null,null,null,null,3.75]
["",null,null,"00:00:00",null,"","",null,"","",null,null,null,null,"","",null,2,null,null,null,null,null,null,null,null,null,null,null,null,null,null,null,null,null,null,null,null,3.76]
["",null,null,"00:00:00",null,"","",null,"","",null,null,null,null,"","",null,2,null,null,null,null,null,null,null,null,null,null,null,null,null,null,null,null,null,null,null,null,3.77]
["",null,null,"00:00:00",null,"","",null,"","",null,null,null,null,"","",null,2,null,null,null,null,null,null,null,null,null,null,null,null,null,null,null,null,null,null,null,null,3.78]
["",null,null,"00:00:00",null,"","",null,"","",null,null,null,null,"","",null,2,null,null,null,null,null,null,null,null,null,null,null,null,null,null,null,null,null,null,null,null,3.79]
["",null,null,"00:00:00",null,"","",null,"","",null,null,null,null,"","",null,2,null,null,null,null,null,null,null,null,null,null,null,null,null,null,null,null,null,null,null,null,3.8]
["",null,null,"00:00:00",null,"","",null,"","",null,null,null,null,"","",null,2,null,null,null,null,null,null,null,null,null,null,null,null,null,null,null,null,null,null,null,null,3.81]
["",null,null,"00:00:00",null,"","",null,"","",null,null,null,null,"","",null,2,null,null,null,null,null,null,null,null,null,null,null,null,null,null,null,null,null,null,null,null,3.82]
["",null,null,"00:00:00",null,"","",null,"","",null,null,null,null,"","",null,2,null,null,null,null,null,null,null,null,null,null,null,null,null,null,null,null,null,null,null,null,3.83]
["",null,null,"00:00:00",null,"","",null,"","",null,null,null,null,"","",null,2,null,null,null,null,null,null,null,null,null,null,null,null,null,null,null,null,null,null,null,null,3.84]
["",null,null,"00:00:00",null,"","",null,"","",null,null,null,null,"","",null,2,null,null,null,null,null,null,null,null,null,null,null,null,null,null,null,null,null,null,null,null,3.85]
["",null,null,"00:00:00",null,"","",null,"","",null,null,null,null,"","",null,2,null,null,null,null,null,null,null,null,null,null,null,null,null,null,null,null,null,null,null,null,3.86]
["",null,null,"00:00:00",null,"","",null,"","",null,null,null,null,"","",null,2,null,null,null,null,null,null,null,null,null,null,null,null,null,null,null,null,null,null,null,null,3.87]
["",null,null,"00:00:00",null,"","",null,"","",null,null,null,null,"","",null,2,null,null,null,null,null,null,null,null,null,null,null,null,null,null,null,null,null,null,null,null,3.88]
["",null,null,"00:00:00",null,"","",null,"","",null,null,null,null,"","",null,2,null,null,null,null,null,null,null,null,null,null,null,null,null,null,null,null,null,null,null,null,3.89]
["",null,null,"00:00:00",null,"","",null,"","",null,null,null,null,"","",null,2,null,null,null,null,null,null,null,null,null,null,null,null,null,null,null,null,null,null,null,null,3.9]
[{"$f":"IF(E388=\"\",\"\",IF(A388=\"\",TODAY(),A388))","v":""},null,null,{"$f":"C388-B388+IF(B388>C388,1)","v":"00:00:00"},null,{"$f":"IFERROR(VLOOKUP(E388,$AJ$2:$AL$3155,2,FALSE),\"\")","v":""},{"$f":"IFERROR(VLOOKUP(E388,$AJ$2:$AL$3155,3,FALSE),\"\")","v":""},null,{"$f":"IFERROR(SUM(G388/7),\"\")","v":""},{"$f":"IFERROR(SUM(N388/C388),\"\")","v":""},null,null,null,null,{"$f":"IFERROR(ROUND(SUM(1000/K388),2),\"\")","v":""},{"$f":"IFERROR(ROUND(SUM(N388*O388),2),\"\")","v":""},null,2,null,null,null,null,null,null,null,null,null,null,null,null,null,null,null,null,null,null,null,null,3.91]
["",null,null,"00:00:00",null,"","",null,"","",null,null,null,null,"","",null,2,null,null,null,null,null,null,null,null,null,null,null,null,null,null,null,null,null,null,null,null,3.92]
["",null,null,"00:00:00",null,"","",null,"","",null,null,null,null,"","",null,2,null,null,null,null,null,null,null,null,null,null,null,null,null,null,null,null,null,null,null,null,3.93]
["",null,null,"00:00:00",null,"","",null,"","",null,null,null,null,"","",null,2,null,null,null,null,null,null,null,null,null,null,null,null,null,null,null,null,null,null,null,null,3.94]
["",null,null,"00:00:00",null,"","",null,"","",null,null,null,null,"","",null,2,null,null,null,null,null,null,null,null,null,null,null,null,null,null,null,null,null,null,null,null,3.95]
["",null,null,"00:00:00",null,"","",null,"","",null,null,null,null,"","",null,2,null,null,null,null,null,null,null,null,null,null,null,null,null,null,null,null,null,null,null,null,3.96]
["",null,null,"00:00:00",null,"","",null,"","",null,null,null,null,"","",null,2,null,null,null,null,null,null,null,null,null,null,null,null,null,null,null,null,null,null,null,null,3.97]
["",null,null,"00:00:00",null,"","",null,"","",null,null,null,null,"","",null,2,null,null,null,null,null,null,null,null,null,null,null,null,null,null,null,null,null,null,null,null,3.98]
["",null,null,"00:00:00",null,"","",null,"","",null,null,null,null,"","",null,2,null,null,null,null,null,null,null,null,null,null,null,null,null,null,null,null,null,null,null,null,3.99]
["",null,null,"00:00:00",null,"","",null,"","",null,null,null,null,"","",null,2,null,null,null,null,null,null,null,null,null,null,null,null,null,null,null,null,null,null,null,null,4]
["",null,null,"00:00:00",null,"","",null,"","",null,null,null,null,"","",null,2,null,null,null,null,null,null,null,null,null,null,null,null,null,null,null,null,null,null,null,null,4.01]
["",null,null,"00:00:00",null,"","",null,"","",null,null,null,null,"","",null,2,null,null,null,null,null,null,null,null,null,null,null,null,null,null,null,null,null,null,null,null,4.0199999999999996]
["",null,null,"00:00:00",null,"","",null,"","",null,null,null,null,"","",null,2,null,null,null,null,null,null,null,null,null,null,null,null,null,null,null,null,null,null,null,null,4.03]
["",null,null,"00:00:00",null,"","",null,"","",null,null,null,null,"","",null,2,null,null,null,null,null,null,null,null,null,null,null,null,null,null,null,null,null,null,null,null,4.04]
["",null,null,"00:00:00",null,"","",null,"","",null,null,null,null,"","",null,2,null,null,null,null,null,null,null,null,null,null,null,null,null,null,null,null,null,null,null,null,4.05]
["",null,null,"00:00:00",null,"","",null,"","",null,null,null,null,"","",null,2,null,null,null,null,null,null,null,null,null,null,null,null,null,null,null,null,null,null,null,null,4.0599999999999996]
["",null,null,"00:00:00",null,"","",null,"","",null,null,null,null,"","",null,2,null,null,null,null,null,null,null,null,null,null,null,null,null,null,null,null,null,null,null,null,4.07]
["",null,null,"00:00:00",null,"","",null,"","",null,null,null,null,"","",null,2,null,null,null,null,null,null,null,null,null,null,null,null,null,null,null,null,null,null,null,null,4.08]
["",null,null,"00:00:00",null,"","",null,"","",null,null,null,null,"","",null,2,null,null,null,null,null,null,null,null,null,null,null,null,null,null,null,null,null,null,null,null,4.09]
["",null,null,"00:00:00",null,"","",null,"","",null,null,null,null,"","",null,2,null,null,null,null,null,null,null,null,null,null,null,null,null,null,null,null,null,null,null,null,4.0999999999999996]
["",null,null,"00:00:00",null,"","",null,"","",null,null,null,null,"","",null,2,null,null,null,null,null,null,null,null,null,null,null,null,null,null,null,null,null,null,null,null,4.1100000000000003]
["",null,null,"00:00:00",null,"","",null,"","",null,null,null,null,"","",null,2,null,null,null,null,null,null,null,null,null,null,null,null,null,null,null,null,null,null,null,null,4.12]
["",null,null,"00:00:00",null,"","",null,"","",null,null,null,null,"","",null,2,null,null,null,null,null,null,null,null,null,null,null,null,null,null,null,null,null,null,null,null,4.13]
["",null,null,"00:00:00",null,"","",null,"","",null,null,null,null,"","",null,2,null,null,null,null,null,null,null,null,null,null,null,null,null,null,null,null,null,null,null,null,4.1399999999999997]
["",null,null,"00:00:00",null,"","",null,"","",null,null,null,null,"","",null,2,null,null,null,null,null,null,null,null,null,null,null,null,null,null,null,null,null,null,null,null,4.1500000000000004]
["",null,null,"00:00:00",null,"","",null,"","",null,null,null,null,"","",null,2,null,null,null,null,null,null,null,null,null,null,null,null,null,null,null,null,null,null,null,null,4.16]
["",null,null,"00:00:00",null,"","",null,"","",null,null,null,null,"","",null,2,null,null,null,null,null,null,null,null,null,null,null,null,null,null,null,null,null,null,null,null,4.17]
["",null,null,"00:00:00",null,"","",null,"","",null,null,null,null,"","",null,2,null,null,null,null,null,null,null,null,null,null,null,null,null,null,null,null,null,null,null,null,4.18]
["",null,null,"00:00:00",null,"","",null,"","",null,null,null,null,"","",null,2,null,null,null,null,null,null,null,null,null,null,null,null,null,null,null,null,null,null,null,null,4.1900000000000004]
["",null,null,"00:00:00",null,"","",null,"","",null,null,null,null,"","",null,2,null,null,null,null,null,null,null,null,null,null,null,null,null,null,null,null,null,null,null,null,4.2]
["",null,null,"00:00:00",null,"","",null,"","",null,null,null,null,"","",null,2,null,null,null,null,null,null,null,null,null,null,null,null,null,null,null,null,null,null,null,null,4.21]
["",null,null,"00:00:00",null,"","",null,"","",null,null,null,null,"","",null,2,null,null,null,null,null,null,null,null,null,null,null,null,null,null,null,null,null,null,null,null,4.22]
["",null,null,"00:00:00",null,"","",null,"","",null,null,null,null,"","",null,2,null,null,null,null,null,null,null,null,null,null,null,null,null,null,null,null,null,null,null,null,4.2300000000000004]
["",null,null,"00:00:00",null,"","",null,"","",null,null,null,null,"","",null,2,null,null,null,null,null,null,null,null,null,null,null,null,null,null,null,null,null,null,null,null,4.24]
["",null,null,"00:00:00",null,"","",null,"","",null,null,null,null,"","",null,2,null,null,null,null,null,null,null,null,null,null,null,null,null,null,null,null,null,null,null,null,4.25]
["",null,null,"00:00:00",null,"","",null,"","",null,null,null,null,"","",null,2,null,null,null,null,null,null,null,null,null,null,null,null,null,null,null,null,null,null,null,null,4.26]
["",null,null,"00:00:00",null,"","",null,"","",null,null,null,null,"","",null,2,null,null,null,null,null,null,null,null,null,null,null,null,null,null,null,null,null,null,null,null,4.2699999999999996]
["",null,null,"00:00:00",null,"","",null,"","",null,null,null,null,"","",null,2,null,null,null,null,null,null,null,null,null,null,null,null,null,null,null,null,null,null,null,null,4.28]
["",null,null,"00:00:00",null,"","",null,"","",null,null,null,null,"","",null,2,null,null,null,null,null,null,null,null,null,null,null,null,null,null,null,null,null,null,null,null,4.29]
["",null,null,"00:00:00",null,"","",null,"","",null,null,null,null,"","",null,2,null,null,null,null,null,null,null,null,null,null,null,null,null,null,null,null,null,null,null,null,4.3]
["",null,null,"00:00:00",null,"","",null,"","",null,null,null,null,"","",null,2,null,null,null,null,null,null,null,null,null,null,null,null,null,null,null,null,null,null,null,null,4.3099999999999996]
["",null,null,"00:00:00",null,"","",null,"","",null,null,null,null,"","",null,2,null,null,null,null,null,null,null,null,null,null,null,null,null,null,null,null,null,null,null,null,4.32]
["",null,null,"00:00:00",null,"","",null,"","",null,null,null,null,"","",null,2,null,null,null,null,null,null,null,null,null,null,null,null,null,null,null,null,null,null,null,null,4.33]
["",null,null,"00:00:00",null,"","",null,"","",null,null,null,null,"","",null,2,null,null,null,null,null,null,null,null,null,null,null,null,null,null,null,null,null,null,null,null,4.34]
["",null,null,"00:00:00",null,"","",null,"","",null,null,null,null,"","",null,2,null,null,null,null,null,null,null,null,null,null,null,null,null,null,null,null,null,null,null,null,4.3499999999999996]
["",null,null,"00:00:00",null,"","",null,"","",null,null,null,null,"","",null,2,null,null,null,null,null,null,null,null,null,null,null,null,null,null,null,null,null,null,null,null,4.3600000000000003]
["",null,null,"00:00:00",null,"","",null,"","",null,null,null,null,"","",null,2,null,null,null,null,null,null,null,null,null,null,null,null,null,null,null,null,null,null,null,null,4.37]
["",null,null,"00:00:00",null,"","",null,"","",null,null,null,null,"","",null,2,null,null,null,null,null,null,null,null,null,null,null,null,null,null,null,null,null,null,null,null,4.38]
["",null,null,"00:00:00",null,"","",null,"","",null,null,null,null,"","",null,2,null,null,null,null,null,null,null,null,null,null,null,null,null,null,null,null,null,null,null,null,4.3899999999999997]
["",null,null,"00:00:00",null,"","",null,"","",null,null,null,null,"","",null,2,null,null,null,null,null,null,null,null,null,null,null,null,null,null,null,null,null,null,null,null,4.4000000000000004]
["",null,null,"00:00:00",null,"","",null,"","",null,null,null,null,"","",null,2,null,null,null,null,null,null,null,null,null,null,null,null,null,null,null,null,null,null,null,null,4.41]
["",null,null,"00:00:00",null,"","",null,"","",null,null,null,null,"","",null,2,null,null,null,null,null,null,null,null,null,null,null,null,null,null,null,null,null,null,null,null,4.42]
["",null,null,"00:00:00",null,"","",null,"","",null,null,null,null,"","",null,2,null,null,null,null,null,null,null,null,null,null,null,null,null,null,null,null,null,null,null,null,4.43]
["",null,null,"00:00:00",null,"","",null,"","",null,null,null,null,"","",null,2,null,null,null,null,null,null,null,null,null,null,null,null,null,null,null,null,null,null,null,null,4.4400000000000004]
["",null,null,"00:00:00",null,"","",null,"","",null,null,null,null,"","",null,2,null,null,null,null,null,null,null,null,null,null,null,null,null,null,null,null,null,null,null,null,4.45]
["",null,null,"00:00:00",null,"","",null,"","",null,null,null,null,"","",null,2,null,null,null,null,null,null,null,null,null,null,null,null,null,null,null,null,null,null,null,null,4.46]
["",null,null,"00:00:00",null,"","",null,"","",null,null,null,null,"","",null,2,null,null,null,null,null,null,null,null,null,null,null,null,null,null,null,null,null,null,null,null,4.47]
["",null,null,"00:00:00",null,"","",null,"","",null,null,null,null,"","",null,2,null,null,null,null,null,null,null,null,null,null,null,null,null,null,null,null,null,null,null,null,4.4800000000000004]
["",null,null,"00:00:00",null,"","",null,"","",null,null,null,null,"","",null,2,null,null,null,null,null,null,null,null,null,null,null,null,null,null,null,null,null,null,null,null,4.49]
["",null,null,"00:00:00",null,"","",null,"","",null,null,null,null,"","",null,2,null,null,null,null,null,null,null,null,null,null,null,null,null,null,null,null,null,null,null,null,4.5]
["",null,null,"00:00:00",null,"","",null,"","",null,null,null,null,"","",null,2,null,null,null,null,null,null,null,null,null,null,null,null,null,null,null,null,null,null,null,null,4.51]
["",null,null,"00:00:00",null,"","",null,"","",null,null,null,null,"","",null,2,null,null,null,null,null,null,null,null,null,null,null,null,null,null,null,null,null,null,null,null,4.5199999999999996]
["",null,null,"00:00:00",null,"","",null,"","",null,null,null,null,"","",null,2,null,null,null,null,null,null,null,null,null,null,null,null,null,null,null,null,null,null,null,null,4.53]
["",null,null,"00:00:00",null,"","",null,"","",null,null,null,null,"","",null,2,null,null,null,null,null,null,null,null,null,null,null,null,null,null,null,null,null,null,null,null,4.54]
[{"$f":"IF(E452=\"\",\"\",IF(A452=\"\",TODAY(),A452))","v":""},null,null,{"$f":"C452-B452+IF(B452>C452,1)","v":"00:00:00"},null,{"$f":"IFERROR(VLOOKUP(E452,$AJ$2:$AL$3155,2,FALSE),\"\")","v":""},{"$f":"IFERROR(VLOOKUP(E452,$AJ$2:$AL$3155,3,FALSE),\"\")","v":""},null,{"$f":"IFERROR(SUM(G452/7),\"\")","v":""},{"$f":"IFERROR(SUM(N452/C452),\"\")","v":""},null,null,null,null,{"$f":"IFERROR(ROUND(SUM(1000/K452),2),\"\")","v":""},{"$f":"IFERROR(ROUND(SUM(N452*O452),2),\"\")","v":""},null,2,null,null,null,null,null,null,null,null,null,null,null,null,null,null,null,null,null,null,null,null,4.55]
["",null,null,"00:00:00",null,"","",null,"","",null,null,null,null,"","",null,2,null,null,null,null,null,null,null,null,null,null,null,null,null,null,null,null,null,null,null,null,4.5599999999999996]
["",null,null,"00:00:00",null,"","",null,"","",null,null,null,null,"","",null,2,null,null,null,null,null,null,null,null,null,null,null,null,null,null,null,null,null,null,null,null,4.57]
["",null,null,"00:00:00",null,"","",null,"","",null,null,null,null,"","",null,2,null,null,null,null,null,null,null,null,null,null,null,null,null,null,null,null,null,null,null,null,4.58]
["",null,null,"00:00:00",null,"","",null,"","",null,null,null,null,"","",null,2,null,null,null,null,null,null,null,null,null,null,null,null,null,null,null,null,null,null,null,null,4.59]
["",null,null,"00:00:00",null,"","",null,"","",null,null,null,null,"","",null,2,null,null,null,null,null,null,null,null,null,null,null,null,null,null,null,null,null,null,null,null,4.5999999999999996]
["",null,null,"00:00:00",null,"","",null,"","",null,null,null,null,"","",null,2,null,null,null,null,null,null,null,null,null,null,null,null,null,null,null,null,null,null,null,null,4.6100000000000003]
["",null,null,"00:00:00",null,"","",null,"","",null,null,null,null,"","",null,2,null,null,null,null,null,null,null,null,null,null,null,null,null,null,null,null,null,null,null,null,4.62]
["",null,null,"00:00:00",null,"","",null,"","",null,null,null,null,"","",null,2,null,null,null,null,null,null,null,null,null,null,null,null,null,null,null,null,null,null,null,null,4.63]
["",null,null,"00:00:00",null,"","",null,"","",null,null,null,null,"","",null,2,null,null,null,null,null,null,null,null,null,null,null,null,null,null,null,null,null,null,null,null,4.6399999999999997]
["",null,null,"00:00:00",null,"","",null,"","",null,null,null,null,"","",null,2,null,null,null,null,null,null,null,null,null,null,null,null,null,null,null,null,null,null,null,null,4.6500000000000004]
["",null,null,"00:00:00",null,"","",null,"","",null,null,null,null,"","",null,2,null,null,null,null,null,null,null,null,null,null,null,null,null,null,null,null,null,null,null,null,4.66]
["",null,null,"00:00:00",null,"","",null,"","",null,null,null,null,"","",null,2,null,null,null,null,null,null,null,null,null,null,null,null,null,null,null,null,null,null,null,null,4.67]
["",null,null,"00:00:00",null,"","",null,"","",null,null,null,null,"","",null,2,null,null,null,null,null,null,null,null,null,null,null,null,null,null,null,null,null,null,null,null,4.68]
["",null,null,"00:00:00",null,"","",null,"","",null,null,null,null,"","",null,2,null,null,null,null,null,null,null,null,null,null,null,null,null,null,null,null,null,null,null,null,4.6900000000000004]
["",null,null,"00:00:00",null,"","",null,"","",null,null,null,null,"","",null,2,null,null,null,null,null,null,null,null,null,null,null,null,null,null,null,null,null,null,null,null,4.7]
["",null,null,"00:00:00",null,"","",null,"","",null,null,null,null,"","",null,2,null,null,null,null,null,null,null,null,null,null,null,null,null,null,null,null,null,null,null,null,4.71]
["",null,null,"00:00:00",null,"","",null,"","",null,null,null,null,"","",null,2,null,null,null,null,null,null,null,null,null,null,null,null,null,null,null,null,null,null,null,null,4.72]
["",null,null,"00:00:00",null,"","",null,"","",null,null,null,null,"","",null,2,null,null,null,null,null,null,null,null,null,null,null,null,null,null,null,null,null,null,null,null,4.7300000000000004]
["",null,null,"00:00:00",null,"","",null,"","",null,null,null,null,"","",null,2,null,null,null,null,null,null,null,null,null,null,null,null,null,null,null,null,null,null,null,null,4.74]
["",null,null,"00:00:00",null,"","",null,"","",null,null,null,null,"","",null,2,null,null,null,null,null,null,null,null,null,null,null,null,null,null,null,null,null,null,null,null,4.75]
["",null,null,"00:00:00",null,"","",null,"","",null,null,null,null,"","",null,2,null,null,null,null,null,null,null,null,null,null,null,null,null,null,null,null,null,null,null,null,4.76]
["",null,null,"00:00:00",null,"","",null,"","",null,null,null,null,"","",null,2,null,null,null,null,null,null,null,null,null,null,null,null,null,null,null,null,null,null,null,null,4.7699999999999996]
["",null,null,"00:00:00",null,"","",null,"","",null,null,null,null,"","",null,2,null,null,null,null,null,null,null,null,null,null,null,null,null,null,null,null,null,null,null,null,4.78]
["",null,null,"00:00:00",null,"","",null,"","",null,null,null,null,"","",null,2,null,null,null,null,null,null,null,null,null,null,null,null,null,null,null,null,null,null,null,null,4.79]
["",null,null,"00:00:00",null,"","",null,"","",null,null,null,null,"","",null,2,null,null,null,null,null,null,null,null,null,null,null,null,null,null,null,null,null,null,null,null,4.8]
["",null,null,"00:00:00",null,"","",null,"","",null,null,null,null,"","",null,2,null,null,null,null,null,null,null,null,null,null,null,null,null,null,null,null,null,null,null,null,4.8099999999999996]
["",null,null,"00:00:00",null,"","",null,"","",null,null,null,null,"","",null,2,null,null,null,null,null,null,null,null,null,null,null,null,null,null,null,null,null,null,null,null,4.82]
["",null,null,"00:00:00",null,"","",null,"","",null,null,null,null,"","",null,2,null,null,null,null,null,null,null,null,null,null,null,null,null,null,null,null,null,null,null,null,4.83]
["",null,null,"00:00:00",null,"","",null,"","",null,null,null,null,"","",null,2,null,null,null,null,null,null,null,null,null,null,null,null,null,null,null,null,null,null,null,null,4.84]
["",null,null,"00:00:00",null,"","",null,"","",null,null,null,null,"","",null,2,null,null,null,null,null,null,null,null,null,null,null,null,null,null,null,null,null,null,null,null,4.8499999999999996]
["",null,null,"00:00:00",null,"","",null,"","",null,null,null,null,"","",null,2,null,null,null,null,null,null,null,null,null,null,null,null,null,null,null,null,null,null,null,null,4.8600000000000003]
["",null,null,"00:00:00",null,"","",null,"","",null,null,null,null,"","",null,2,null,null,null,null,null,null,null,null,null,null,null,null,null,null,null,null,null,null,null,null,4.87]
["",null,null,"00:00:00",null,"","",null,"","",null,null,null,null,"","",null,2,null,null,null,null,null,null,null,null,null,null,null,null,null,null,null,null,null,null,null,null,4.88]
["",null,null,"00:00:00",null,"","",null,"","",null,null,null,null,"","",null,2,null,null,null,null,null,null,null,null,null,null,null,null,null,null,null,null,null,null,null,null,4.8899999999999997]
["",null,null,"00:00:00",null,"","",null,"","",null,null,null,null,"","",null,2,null,null,null,null,null,null,null,null,null,null,null,null,null,null,null,null,null,null,null,null,4.9000000000000004]
["",null,null,"00:00:00",null,"","",null,"","",null,null,null,null,"","",null,2,null,null,null,null,null,null,null,null,null,null,null,null,null,null,null,null,null,null,null,null,4.91]
["",null,null,"00:00:00",null,"","",null,"","",null,null,null,null,"","",null,2,null,null,null,null,null,null,null,null,null,null,null,null,null,null,null,null,null,null,null,null,4.92]
["",null,null,"00:00:00",null,"","",null,"","",null,null,null,null,"","",null,2,null,null,null,null,null,null,null,null,null,null,null,null,null,null,null,null,null,null,null,null,4.93]
["",null,null,"00:00:00",null,"","",null,"","",null,null,null,null,"","",null,2,null,null,null,null,null,null,null,null,null,null,null,null,null,null,null,null,null,null,null,null,4.9400000000000004]
["",null,null,"00:00:00",null,"","",null,"","",null,null,null,null,"","",null,2,null,null,null,null,null,null,null,null,null,null,null,null,null,null,null,null,null,null,null,null,4.95]
["",null,null,"00:00:00",null,"","",null,"","",null,null,null,null,"","",null,2,null,null,null,null,null,null,null,null,null,null,null,null,null,null,null,null,null,null,null,null,4.96]
["",null,null,"00:00:00",null,"","",null,"","",null,null,null,null,"","",null,2,null,null,null,null,null,null,null,null,null,null,null,null,null,null,null,null,null,null,null,null,4.97]
["",null,null,"00:00:00",null,"","",null,"","",null,null,null,null,"","",null,2,null,null,null,null,null,null,null,null,null,null,null,null,null,null,null,null,null,null,null,null,4.9800000000000004]
["",null,null,"00:00:00",null,"","",null,"","",null,null,null,null,"","",null,2,null,null,null,null,null,null,null,null,null,null,null,null,null,null,null,null,null,null,null,null,4.99]
["",null,null,"00:00:00",null,"","",null,"","",null,null,null,null,"","",null,2,null,null,null,null,null,null,null,null,null,null,null,null,null,null,null,null,null,null,null,null,5]
["",null,null,"00:00:00",null,"","",null,"","",null,null,null,null,"","",null,2,null,null,null,null,null,null,null,null,null,null,null,null,null,null,null,null,null,null,null,null,5.01]
["",null,null,"00:00:00",null,"","",null,"","",null,null,null,null,"","",null,2,null,null,null,null,null,null,null,null,null,null,null,null,null,null,null,null,null,null,null,null,5.0199999999999996]
["",null,null,"00:00:00",null,"","",null,"","",null,null,null,null,"","",null,2,null,null,null,null,null,null,null,null,null,null,null,null,null,null,null,null,null,null,null,null,5.03]
["",null,null,"00:00:00",null,"","",null,"","",null,null,null,null,"","",null,2,null,null,null,null,null,null,null,null,null,null,null,null,null,null,null,null,null,null,null,null,5.04]
["",null,null,"00:00:00",null,"","",null,"","",null,null,null,null,"","",null,2,null,null,null,null,null,null,null,null,null,null,null,null,null,null,null,null,null,null,null,null,5.05]
["",null,null,"00:00:00",null,"","",null,"","",null,null,null,null,"","",null,2,null,null,null,null,null,null,null,null,null,null,null,null,null,null,null,null,null,null,null,null,5.0599999999999996]
["",null,null,"00:00:00",null,"","",null,"","",null,null,null,null,"","",null,2,null,null,null,null,null,null,null,null,null,null,null,null,null,null,null,null,null,null,null,null,5.07]
["",null,null,"00:00:00",null,"","",null,"","",null,null,null,null,"","",null,2,null,null,null,null,null,null,null,null,null,null,null,null,null,null,null,null,null,null,null,null,5.08]
["",null,null,"00:00:00",null,"","",null,"","",null,null,null,null,"","",null,2,null,null,null,null,null,null,null,null,null,null,null,null,null,null,null,null,null,null,null,null,5.09]
["",null,null,"00:00:00",null,"","",null,"","",null,null,null,null,"","",null,2,null,null,null,null,null,null,null,null,null,null,null,null,null,null,null,null,null,null,null,null,5.0999999999999996]
["",null,null,"00:00:00",null,"","",null,"","",null,null,null,null,"","",null,2,null,null,null,null,null,null,null,null,null,null,null,null,null,null,null,null,null,null,null,null,5.1100000000000003]
["",null,null,"00:00:00",null,"","",null,"","",null,null,null,null,"","",null,2,null,null,null,null,null,null,null,null,null,null,null,null,null,null,null,null,null,null,null,null,5.12]
["",null,null,"00:00:00",null,"","",null,"","",null,null,null,null,"","",null,2,null,null,null,null,null,null,null,null,null,null,null,null,null,null,null,null,null,null,null,null,5.13]
["",null,null,"00:00:00",null,"","",null,"","",null,null,null,null,"","",null,2,null,null,null,null,null,null,null,null,null,null,null,null,null,null,null,null,null,null,null,null,5.14]
["",null,null,"00:00:00",null,"","",null,"","",null,null,null,null,"","",null,2,null,null,null,null,null,null,null,null,null,null,null,null,null,null,null,null,null,null,null,null,5.15]
["",null,null,"00:00:00",null,"","",null,"","",null,null,null,null,"","",null,2,null,null,null,null,null,null,null,null,null,null,null,null,null,null,null,null,null,null,null,null,5.16]
["",null,null,"00:00:00",null,"","",null,"","",null,null,null,null,"","",null,2,null,null,null,null,null,null,null,null,null,null,null,null,null,null,null,null,null,null,null,null,5.17]
["",null,null,"00:00:00",null,"","",null,"","",null,null,null,null,"","",null,2,null,null,null,null,null,null,null,null,null,null,null,null,null,null,null,null,null,null,null,null,5.18]
[{"$f":"IF(E516=\"\",\"\",IF(A516=\"\",TODAY(),A516))","v":""},null,null,{"$f":"C516-B516+IF(B516>C516,1)","v":"00:00:00"},null,{"$f":"IFERROR(VLOOKUP(E516,$AJ$2:$AL$3155,2,FALSE),\"\")","v":""},{"$f":"IFERROR(VLOOKUP(E516,$AJ$2:$AL$3155,3,FALSE),\"\")","v":""},null,{"$f":"IFERROR(SUM(G516/7),\"\")","v":""},{"$f":"IFERROR(SUM(N516/C516),\"\")","v":""},null,null,null,null,{"$f":"IFERROR(ROUND(SUM(1000/K516),2),\"\")","v":""},{"$f":"IFERROR(ROUND(SUM(N516*O516),2),\"\")","v":""},null,2,null,null,null,null,null,null,null,null,null,null,null,null,null,null,null,null,null,null,null,null,5.19]
["",null,null,"00:00:00",null,"","",null,"","",null,null,null,null,"","",null,2,null,null,null,null,null,null,null,null,null,null,null,null,null,null,null,null,null,null,null,null,5.2]
["",null,null,"00:00:00",null,"","",null,"","",null,null,null,null,"","",null,2,null,null,null,null,null,null,null,null,null,null,null,null,null,null,null,null,null,null,null,null,5.21]
["",null,null,"00:00:00",null,"","",null,"","",null,null,null,null,"","",null,2,null,null,null,null,null,null,null,null,null,null,null,null,null,null,null,null,null,null,null,null,5.22]
["",null,null,"00:00:00",null,"","",null,"","",null,null,null,null,"","",null,2,null,null,null,null,null,null,null,null,null,null,null,null,null,null,null,null,null,null,null,null,5.23]
["",null,null,"00:00:00",null,"","",null,"","",null,null,null,null,"","",null,2,null,null,null,null,null,null,null,null,null,null,null,null,null,null,null,null,null,null,null,null,5.24]
["",null,null,"00:00:00",null,"","",null,"","",null,null,null,null,"","",null,2,null,null,null,null,null,null,null,null,null,null,null,null,null,null,null,null,null,null,null,null,5.25]
["",null,null,"00:00:00",null,"","",null,"","",null,null,null,null,"","",null,2,null,null,null,null,null,null,null,null,null,null,null,null,null,null,null,null,null,null,null,null,5.26]
["",null,null,"00:00:00",null,"","",null,"","",null,null,null,null,"","",null,2,null,null,null,null,null,null,null,null,null,null,null,null,null,null,null,null,null,null,null,null,5.27]
["",null,null,"00:00:00",null,"","",null,"","",null,null,null,null,"","",null,2,null,null,null,null,null,null,null,null,null,null,null,null,null,null,null,null,null,null,null,null,5.28]
["",null,null,"00:00:00",null,"","",null,"","",null,null,null,null,"","",null,2,null,null,null,null,null,null,null,null,null,null,null,null,null,null,null,null,null,null,null,null,5.29]
["",null,null,"00:00:00",null,"","",null,"","",null,null,null,null,"","",null,2,null,null,null,null,null,null,null,null,null,null,null,null,null,null,null,null,null,null,null,null,5.3]
["",null,null,"00:00:00",null,"","",null,"","",null,null,null,null,"","",null,2,null,null,null,null,null,null,null,null,null,null,null,null,null,null,null,null,null,null,null,null,5.31]
["",null,null,"00:00:00",null,"","",null,"","",null,null,null,null,"","",null,2,null,null,null,null,null,null,null,null,null,null,null,null,null,null,null,null,null,null,null,null,5.32]
["",null,null,"00:00:00",null,"","",null,"","",null,null,null,null,"","",null,2,null,null,null,null,null,null,null,null,null,null,null,null,null,null,null,null,null,null,null,null,5.33]
["",null,null,"00:00:00",null,"","",null,"","",null,null,null,null,"","",null,2,null,null,null,null,null,null,null,null,null,null,null,null,null,null,null,null,null,null,null,null,5.34]
["",null,null,"00:00:00",null,"","",null,"","",null,null,null,null,"","",null,2,null,null,null,null,null,null,null,null,null,null,null,null,null,null,null,null,null,null,null,null,5.35]
["",null,null,"00:00:00",null,"","",null,"","",null,null,null,null,"","",null,2,null,null,null,null,null,null,null,null,null,null,null,null,null,null,null,null,null,null,null,null,5.36]
["",null,null,"00:00:00",null,"","",null,"","",null,null,null,null,"","",null,2,null,null,null,null,null,null,null,null,null,null,null,null,null,null,null,null,null,null,null,null,5.37]
["",null,null,"00:00:00",null,"","",null,"","",null,null,null,null,"","",null,2,null,null,null,null,null,null,null,null,null,null,null,null,null,null,null,null,null,null,null,null,5.38]
["",null,null,"00:00:00",null,"","",null,"","",null,null,null,null,"","",null,2,null,null,null,null,null,null,null,null,null,null,null,null,null,null,null,null,null,null,null,null,5.39]
["",null,null,"00:00:00",null,"","",null,"","",null,null,null,null,"","",null,2,null,null,null,null,null,null,null,null,null,null,null,null,null,null,null,null,null,null,null,null,5.4]
["",null,null,"00:00:00",null,"","",null,"","",null,null,null,null,"","",null,2,null,null,null,null,null,null,null,null,null,null,null,null,null,null,null,null,null,null,null,null,5.41]
["",null,null,"00:00:00",null,"","",null,"","",null,null,null,null,"","",null,2,null,null,null,null,null,null,null,null,null,null,null,null,null,null,null,null,null,null,null,null,5.42]
["",null,null,"00:00:00",null,"","",null,"","",null,null,null,null,"","",null,2,null,null,null,null,null,null,null,null,null,null,null,null,null,null,null,null,null,null,null,null,5.43]
["",null,null,"00:00:00",null,"","",null,"","",null,null,null,null,"","",null,2,null,null,null,null,null,null,null,null,null,null,null,null,null,null,null,null,null,null,null,null,5.44]
["",null,null,"00:00:00",null,"","",null,"","",null,null,null,null,"","",null,2,null,null,null,null,null,null,null,null,null,null,null,null,null,null,null,null,null,null,null,null,5.45]
["",null,null,"00:00:00",null,"","",null,"","",null,null,null,null,"","",null,2,null,null,null,null,null,null,null,null,null,null,null,null,null,null,null,null,null,null,null,null,5.46]
["",null,null,"00:00:00",null,"","",null,"","",null,null,null,null,"","",null,2,null,null,null,null,null,null,null,null,null,null,null,null,null,null,null,null,null,null,null,null,5.47]
["",null,null,"00:00:00",null,"","",null,"","",null,null,null,null,"","",null,2,null,null,null,null,null,null,null,null,null,null,null,null,null,null,null,null,null,null,null,null,5.48]
["",null,null,"00:00:00",null,"","",null,"","",null,null,null,null,"","",null,2,null,null,null,null,null,null,null,null,null,null,null,null,null,null,null,null,null,null,null,null,5.49]
["",null,null,"00:00:00",null,"","",null,"","",null,null,null,null,"","",null,2,null,null,null,null,null,null,null,null,null,null,null,null,null,null,null,null,null,null,null,null,5.5]
["",null,null,"00:00:00",null,"","",null,"","",null,null,null,null,"","",null,2,null,null,null,null,null,null,null,null,null,null,null,null,null,null,null,null,null,null,null,null,5.51]
["",null,null,"00:00:00",null,"","",null,"","",null,null,null,null,"","",null,2,null,null,null,null,null,null,null,null,null,null,null,null,null,null,null,null,null,null,null,null,5.52]
["",null,null,"00:00:00",null,"","",null,"","",null,null,null,null,"","",null,2,null,null,null,null,null,null,null,null,null,null,null,null,null,null,null,null,null,null,null,null,5.53]
["",null,null,"00:00:00",null,"","",null,"","",null,null,null,null,"","",null,2,null,null,null,null,null,null,null,null,null,null,null,null,null,null,null,null,null,null,null,null,5.54]
["",null,null,"00:00:00",null,"","",null,"","",null,null,null,null,"","",null,2,null,null,null,null,null,null,null,null,null,null,null,null,null,null,null,null,null,null,null,null,5.55]
["",null,null,"00:00:00",null,"","",null,"","",null,null,null,null,"","",null,2,null,null,null,null,null,null,null,null,null,null,null,null,null,null,null,null,null,null,null,null,5.56]
["",null,null,"00:00:00",null,"","",null,"","",null,null,null,null,"","",null,2,null,null,null,null,null,null,null,null,null,null,null,null,null,null,null,null,null,null,null,null,5.57]
["",null,null,"00:00:00",null,"","",null,"","",null,null,null,null,"","",null,2,null,null,null,null,null,null,null,null,null,null,null,null,null,null,null,null,null,null,null,null,5.58]
["",null,null,"00:00:00",null,"","",null,"","",null,null,null,null,"","",null,2,null,null,null,null,null,null,null,null,null,null,null,null,null,null,null,null,null,null,null,null,5.59]
["",null,null,"00:00:00",null,"","",null,"","",null,null,null,null,"","",null,2,null,null,null,null,null,null,null,null,null,null,null,null,null,null,null,null,null,null,null,null,5.6]
["",null,null,"00:00:00",null,"","",null,"","",null,null,null,null,"","",null,2,null,null,null,null,null,null,null,null,null,null,null,null,null,null,null,null,null,null,null,null,5.61]
["",null,null,"00:00:00",null,"","",null,"","",null,null,null,null,"","",null,2,null,null,null,null,null,null,null,null,null,null,null,null,null,null,null,null,null,null,null,null,5.62]
["",null,null,"00:00:00",null,"","",null,"","",null,null,null,null,"","",null,2,null,null,null,null,null,null,null,null,null,null,null,null,null,null,null,null,null,null,null,null,5.63]
["",null,null,"00:00:00",null,"","",null,"","",null,null,null,null,"","",null,2,null,null,null,null,null,null,null,null,null,null,null,null,null,null,null,null,null,null,null,null,5.64]
["",null,null,"00:00:00",null,"","",null,"","",null,null,null,null,"","",null,2,null,null,null,null,null,null,null,null,null,null,null,null,null,null,null,null,null,null,null,null,5.65]
["",null,null,"00:00:00",null,"","",null,"","",null,null,null,null,"","",null,2,null,null,null,null,null,null,null,null,null,null,null,null,null,null,null,null,null,null,null,null,5.66]
["",null,null,"00:00:00",null,"","",null,"","",null,null,null,null,"","",null,2,null,null,null,null,null,null,null,null,null,null,null,null,null,null,null,null,null,null,null,null,5.67]
["",null,null,"00:00:00",null,"","",null,"","",null,null,null,null,"","",null,2,null,null,null,null,null,null,null,null,null,null,null,null,null,null,null,null,null,null,null,null,5.68]
["",null,null,"00:00:00",null,"","",null,"","",null,null,null,null,"","",null,2,null,null,null,null,null,null,null,null,null,null,null,null,null,null,null,null,null,null,null,null,5.69]
["",null,null,"00:00:00",null,"","",null,"","",null,null,null,null,"","",null,2,null,null,null,null,null,null,null,null,null,null,null,null,null,null,null,null,null,null,null,null,5.7]
["",null,null,"00:00:00",null,"","",null,"","",null,null,null,null,"","",null,2,null,null,null,null,null,null,null,null,null,null,null,null,null,null,null,null,null,null,null,null,5.71]
["",null,null,"00:00:00",null,"","",null,"","",null,null,null,null,"","",null,2,null,null,null,null,null,null,null,null,null,null,null,null,null,null,null,null,null,null,null,null,5.72]
["",null,null,"00:00:00",null,"","",null,"","",null,null,null,null,"","",null,2,null,null,null,null,null,null,null,null,null,null,null,null,null,null,null,null,null,null,null,null,5.73]
["",null,null,"00:00:00",null,"","",null,"","",null,null,null,null,"","",null,2,null,null,null,null,null,null,null,null,null,null,null,null,null,null,null,null,null,null,null,null,5.74]
["",null,null,"00:00:00",null,"","",null,"","",null,null,null,null,"","",null,2,null,null,null,null,null,null,null,null,null,null,null,null,null,null,null,null,null,null,null,null,5.75]
["",null,null,"00:00:00",null,"","",null,"","",null,null,null,null,"","",null,2,null,null,null,null,null,null,null,null,null,null,null,null,null,null,null,null,null,null,null,null,5.76]
["",null,null,"00:00:00",null,"","",null,"","",null,null,null,null,"","",null,2,null,null,null,null,null,null,null,null,null,null,null,null,null,null,null,null,null,null,null,null,5.77]
["",null,null,"00:00:00",null,"","",null,"","",null,null,null,null,"","",null,2,null,null,null,null,null,null,null,null,null,null,null,null,null,null,null,null,null,null,null,null,5.78]
["",null,null,"00:00:00",null,"","",null,"","",null,null,null,null,"","",null,2,null,null,null,null,null,null,null,null,null,null,null,null,null,null,null,null,null,null,null,null,5.79]
["",null,null,"00:00:00",null,"","",null,"","",null,null,null,null,"","",null,2,null,null,null,null,null,null,null,null,null,null,null,null,null,null,null,null,null,null,null,null,5.8]
["",null,null,"00:00:00",null,"","",null,"","",null,null,null,null,"","",null,2,null,null,null,null,null,null,null,null,null,null,null,null,null,null,null,null,null,null,null,null,5.81]
["",null,null,"00:00:00",null,"","",null,"","",null,null,null,null,"","",null,2,null,null,null,null,null,null,null,null,null,null,null,null,null,null,null,null,null,null,null,null,5.82]
[{"$f":"IF(E580=\"\",\"\",IF(A580=\"\",TODAY(),A580))","v":""},null,null,{"$f":"C580-B580+IF(B580>C580,1)","v":"00:00:00"},null,{"$f":"IFERROR(VLOOKUP(E580,$AJ$2:$AL$3155,2,FALSE),\"\")","v":""},{"$f":"IFERROR(VLOOKUP(E580,$AJ$2:$AL$3155,3,FALSE),\"\")","v":""},null,{"$f":"IFERROR(SUM(G580/7),\"\")","v":""},{"$f":"IFERROR(SUM(N580/C580),\"\")","v":""},null,null,null,null,{"$f":"IFERROR(ROUND(SUM(1000/K580),2),\"\")","v":""},{"$f":"IFERROR(ROUND(SUM(N580*O580),2),\"\")","v":""},null,2,null,null,null,null,null,null,null,null,null,null,null,null,null,null,null,null,null,null,null,null,5.83]
["",null,null,"00:00:00",null,"","",null,"","",null,null,null,null,"","",null,2,null,null,null,null,null,null,null,null,null,null,null,null,null,null,null,null,null,null,null,null,5.84]
["",null,null,"00:00:00",null,"","",null,"","",null,null,null,null,"","",null,2,null,null,null,null,null,null,null,null,null,null,null,null,null,null,null,null,null,null,null,null,5.85]
["",null,null,"00:00:00",null,"","",null,"","",null,null,null,null,"","",null,2,null,null,null,null,null,null,null,null,null,null,null,null,null,null,null,null,null,null,null,null,5.86]
["",null,null,"00:00:00",null,"","",null,"","",null,null,null,null,"","",null,2,null,null,null,null,null,null,null,null,null,null,null,null,null,null,null,null,null,null,null,null,5.87]
["",null,null,"00:00:00",null,"","",null,"","",null,null,null,null,"","",null,2,null,null,null,null,null,null,null,null,null,null,null,null,null,null,null,null,null,null,null,null,5.88]
["",null,null,"00:00:00",null,"","",null,"","",null,null,null,null,"","",null,2,null,null,null,null,null,null,null,null,null,null,null,null,null,null,null,null,null,null,null,null,5.89]
["",null,null,"00:00:00",null,"","",null,"","",null,null,null,null,"","",null,2,null,null,null,null,null,null,null,null,null,null,null,null,null,null,null,null,null,null,null,null,5.9]
["",null,null,"00:00:00",null,"","",null,"","",null,null,null,null,"","",null,2,null,null,null,null,null,null,null,null,null,null,null,null,null,null,null,null,null,null,null,null,5.91]
["",null,null,"00:00:00",null,"","",null,"","",null,null,null,null,"","",null,2,null,null,null,null,null,null,null,null,null,null,null,null,null,null,null,null,null,null,null,null,5.92]
["",null,null,"00:00:00",null,"","",null,"","",null,null,null,null,"","",null,2,null,null,null,null,null,null,null,null,null,null,null,null,null,null,null,null,null,null,null,null,5.93]
["",null,null,"00:00:00",null,"","",null,"","",null,null,null,null,"","",null,2,null,null,null,null,null,null,null,null,null,null,null,null,null,null,null,null,null,null,null,null,5.94]
["",null,null,"00:00:00",null,"","",null,"","",null,null,null,null,"","",null,2,null,null,null,null,null,null,null,null,null,null,null,null,null,null,null,null,null,null,null,null,5.95]
["",null,null,"00:00:00",null,"","",null,"","",null,null,null,null,"","",null,2,null,null,null,null,null,null,null,null,null,null,null,null,null,null,null,null,null,null,null,null,5.96]
["",null,null,"00:00:00",null,"","",null,"","",null,null,null,null,"","",null,2,null,null,null,null,null,null,null,null,null,null,null,null,null,null,null,null,null,null,null,null,5.97]
["",null,null,"00:00:00",null,"","",null,"","",null,null,null,null,"","",null,2,null,null,null,null,null,null,null,null,null,null,null,null,null,null,null,null,null,null,null,null,5.98]
["",null,null,"00:00:00",null,"","",null,"","",null,null,null,null,"","",null,2,null,null,null,null,null,null,null,null,null,null,null,null,null,null,null,null,null,null,null,null,5.99]
["",null,null,"00:00:00",null,"","",null,"","",null,null,null,null,"","",null,2,null,null,null,null,null,null,null,null,null,null,null,null,null,null,null,null,null,null,null,null,6]
["",null,null,"00:00:00",null,"","",null,"","",null,null,null,null,"","",null,2]
["",null,null,"00:00:00",null,"","",null,"","",null,null,null,null,"","",null,2]
["",null,null,"00:00:00",null,"","",null,"","",null,null,null,null,"","",null,2]
["",null,null,"00:00:00",null,"","",null,"","",null,null,null,null,"","",null,2]
["",null,null,"00:00:00",null,"","",null,"","",null,null,null,null,"","",null,2]
["",null,null,"00:00:00",null,"","",null,"","",null,null,null,null,"","",null,2]
["",null,null,"00:00:00",null,"","",null,"","",null,null,null,null,"","",null,2]
["",null,null,"00:00:00",null,"","",null,"","",null,null,null,null,"","",null,2]
["",null,null,"00:00:00",null,"","",null,"","",null,null,null,null,"","",null,2]
["",null,null,"00:00:00",null,"","",null,"","",null,null,null,null,"","",null,2]
["",null,null,"00:00:00",null,"","",null,"","",null,null,null,null,"","",null,2]
["",null,null,"00:00:00",null,"","",null,"","",null,null,null,null,"","",null,2]
["",null,null,"00:00:00",null,"","",null,"","",null,null,null,null,"","",null,2]
["",null,null,"00:00:00",null,"","",null,"","",null,null,null,null,"","",null,2]
["",null,null,"00:00:00",null,"","",null,"","",null,null,null,null,"","",null,2]
["",null,null,"00:00:00",null,"","",null,"","",null,null,null,null,"","",null,2]
["",null,null,"00:00:00",null,"","",null,"","",null,null,null,null,"","",null,2]
["",null,null,"00:00:00",null,"","",null,"","",null,null,null,null,"","",null,2]
["",null,null,"00:00:00",null,"","",null,"","",null,null,null,null,"","",null,2]
["",null,null,"00:00:00",null,"","",null,"","",null,null,null,null,"","",null,2]
["",null,null,"00:00:00",null,"","",null,"","",null,null,null,null,"","",null,2]
["",null,null,"00:00:00",null,"","",null,"","",null,null,null,null,"","",null,2]
["",null,null,"00:00:00",null,"","",null,"","",null,null,null,null,"","",null,2]
["",null,null,"00:00:00",null,"","",null,"","",null,null,null,null,"","",null,2]
["",null,null,"00:00:00",null,"","",null,"","",null,null,null,null,"","",null,2]
["",null,null,"00:00:00",null,"","",null,"","",null,null,null,null,"","",null,2]
["",null,null,"00:00:00",null,"","",null,"","",null,null,null,null,"","",null,2]
["",null,null,"00:00:00",null,"","",null,"","",null,null,null,null,"","",null,2]
["",null,null,"00:00:00",null,"","",null,"","",null,null,null,null,"","",null,2]
["",null,null,"00:00:00",null,"","",null,"","",null,null,null,null,"","",null,2]
["",null,null,"00:00:00",null,"","",null,"","",null,null,null,null,"","",null,2]
["",null,null,"00:00:00",null,"","",null,"","",null,null,null,null,"","",null,2]
["",null,null,"00:00:00",null,"","",null,"","",null,null,null,null,"","",null,2]
["",null,null,"00:00:00",null,"","",null,"","",null,null,null,null,"","",null,2]
["",null,null,"00:00:00",null,"","",null,"","",null,null,null,null,"","",null,2]
["",null,null,"00:00:00",null,"","",null,"","",null,null,null,null,"","",null,2]
["",null,null,"00:00:00",null,"","",null,"","",null,null,null,null,"","",null,2]
["",null,null,"00:00:00",null,"","",null,"","",null,null,null,null,"","",null,2]
["",null,null,"00:00:00",null,"","",null,"","",null,null,null,null,"","",null,2]
["",null,null,"00:00:00",null,"","",null,"","",null,null,null,null,"","",null,2]
["",null,null,"00:00:00",null,"","",null,"","",null,null,null,null,"","",null,2]
["",null,null,"00:00:00",null,"","",null,"","",null,null,null,null,"","",null,2]
["",null,null,"00:00:00",null,"","",null,"","",null,null,null,null,"","",null,2]
["",null,null,"00:00:00",null,"","",null,"","",null,null,null,null,"","",null,2]
["",null,null,"00:00:00",null,"","",null,"","",null,null,null,null,"","",null,2]
["",null,null,"00:00:00",null,"","",null,"","",null,null,null,null,"","",null,2]
[{"$f":"IF(E644=\"\",\"\",IF(A644=\"\",TODAY(),A644))","v":""},null,null,{"$f":"C644-B644+IF(B644>C644,1)","v":"00:00:00"},null,{"$f":"IFERROR(VLOOKUP(E644,$AJ$2:$AL$3155,2,FALSE),\"\")","v":""},{"$f":"IFERROR(VLOOKUP(E644,$AJ$2:$AL$3155,3,FALSE),\"\")","v":""},null,{"$f":"IFERROR(SUM(G644/7),\"\")","v":""},{"$f":"IFERROR(SUM(N644/C644),\"\")","v":""},null,null,null,null,{"$f":"IFERROR(ROUND(SUM(1000/K644),2),\"\")","v":""},{"$f":"IFERROR(ROUND(SUM(N644*O644),2),\"\")","v":""},null,2]
["",null,null,"00:00:00",null,"","",null,"","",null,null,null,null,"","",null,2]
["",null,null,"00:00:00",null,"","",null,"","",null,null,null,null,"","",null,2]
["",null,null,"00:00:00",null,"","",null,"","",null,null,null,null,"","",null,2]
["",null,null,"00:00:00",null,"","",null,"","",null,null,null,null,"","",null,2]
["",null,null,"00:00:00",null,"","",null,"","",null,null,null,null,"","",null,2]
["",null,null,"00:00:00",null,"","",null,"","",null,null,null,null,"","",null,2]
["",null,null,"00:00:00",null,"","",null,"","",null,null,null,null,"","",null,2]
["",null,null,"00:00:00",null,"","",null,"","",null,null,null,null,"","",null,2]
["",null,null,"00:00:00",null,"","",null,"","",null,null,null,null,"","",null,2]
["",null,null,"00:00:00",null,"","",null,"","",null,null,null,null,"","",null,2]
["",null,null,"00:00:00",null,"","",null,"","",null,null,null,null,"","",null,2]
["",null,null,"00:00:00",null,"","",null,"","",null,null,null,null,"","",null,2]
["",null,null,"00:00:00",null,"","",null,"","",null,null,null,null,"","",null,2]
["",null,null,"00:00:00",null,"","",null,"","",null,null,null,null,"","",null,2]
["",null,null,"00:00:00",null,"","",null,"","",null,null,null,null,"","",null,2]
["",null,null,"00:00:00",null,"","",null,"","",null,null,null,null,"","",null,2]
["",null,null,"00:00:00",null,"","",null,"","",null,null,null,null,"","",null,2]
["",null,null,"00:00:00",null,"","",null,"","",null,null,null,null,"","",null,2]
["",null,null,"00:00:00",null,"","",null,"","",null,null,null,null,"","",null,2]
["",null,null,"00:00:00",null,"","",null,"","",null,null,null,null,"","",null,2]
["",null,null,"00:00:00",null,"","",null,"","",null,null,null,null,"","",null,2]
["",null,null,"00:00:00",null,"","",null,"","",null,null,null,null,"","",null,2]
["",null,null,"00:00:00",null,"","",null,"","",null,null,null,null,"","",null,2]
["",null,null,"00:00:00",null,"","",null,"","",null,null,null,null,"","",null,2]
["",null,null,"00:00:00",null,"","",null,"","",null,null,null,null,"","",null,2]
["",null,null,"00:00:00",null,"","",null,"","",null,null,null,null,"","",null,2]
["",null,null,"00:00:00",null,"","",null,"","",null,null,null,null,"","",null,2]
["",null,null,"00:00:00",null,"","",null,"","",null,null,null,null,"","",null,2]
["",null,null,"00:00:00",null,"","",null,"","",null,null,null,null,"","",null,2]
["",null,null,"00:00:00",null,"","",null,"","",null,null,null,null,"","",null,2]
["",null,null,"00:00:00",null,"","",null,"","",null,null,null,null,"","",null,2]
["",null,null,"00:00:00",null,"","",null,"","",null,null,null,null,"","",null,2]
["",null,null,"00:00:00",null,"","",null,"","",null,null,null,null,"","",null,2]
["",null,null,"00:00:00",null,"","",null,"","",null,null,null,null,"","",null,2]
["",null,null,"00:00:00",null,"","",null,"","",null,null,null,null,"","",null,2]
["",null,null,"00:00:00",null,"","",null,"","",null,null,null,null,"","",null,2]
["",null,null,"00:00:00",null,"","",null,"","",null,null,null,null,"","",null,2]
["",null,null,"00:00:00",null,"","",null,"","",null,null,null,null,"","",null,2]
["",null,null,"00:00:00",null,"","",null,"","",null,null,null,null,"","",null,2]
["",null,null,"00:00:00",null,"","",null,"","",null,null,null,null,"","",null,2]
["",null,null,"00:00:00",null,"","",null,"","",null,null,null,null,"","",null,2]
["",null,null,"00:00:00",null,"","",null,"","",null,null,null,null,"","",null,2]
["",null,null,"00:00:00",null,"","",null,"","",null,null,null,null,"","",null,2]
["",null,null,"00:00:00",null,"","",null,"","",null,null,null,null,"","",null,2]
["",null,null,"00:00:00",null,"","",null,"","",null,null,null,null,"","",null,2]
["",null,null,"00:00:00",null,"","",null,"","",null,null,null,null,"","",null,2]
["",null,null,"00:00:00",null,"","",null,"","",null,null,null,null,"","",null,2]
["",null,null,"00:00:00",null,"","",null,"","",null,null,null,null,"","",null,2]
["",null,null,"00:00:00",null,"","",null,"","",null,null,null,null,"","",null,2]
["",null,null,"00:00:00",null,"","",null,"","",null,null,null,null,"","",null,2]
["",null,null,"00:00:00",null,"","",null,"","",null,null,null,null,"","",null,2]
["",null,null,"00:00:00",null,"","",null,"","",null,null,null,null,"","",null,2]
["",null,null,"00:00:00",null,"","",null,"","",null,null,null,null,"","",null,2]
["",null,null,"00:00:00",null,"","",null,"","",null,null,null,null,"","",null,2]
["",null,null,"00:00:00",null,"","",null,"","",null,null,null,null,"","",null,2]
["",null,null,"00:00:00",null,"","",null,"","",null,null,null,null,"","",null,2]
["",null,null,"00:00:00",null,"","",null,"","",null,null,null,null,"","",null,2]
["",null,null,"00:00:00",null,"","",null,"","",null,null,null,null,"","",null,2]
["",null,null,"00:00:00",null,"","",null,"","",null,null,null,null,"","",null,2]
["",null,null,"00:00:00",null,"","",null,"","",null,null,null,null,"","",null,2]
["",null,null,"00:00:00",null,"","",null,"","",null,null,null,null,"","",null,2]
["",null,null,"00:00:00",null,"","",null,"","",null,null,null,null,"","",null,2]
["",null,null,"00:00:00",null,"","",null,"","",null,null,null,null,"","",null,2]
[{"$f":"IF(E708=\"\",\"\",IF(A708=\"\",TODAY(),A708))","v":""},null,null,{"$f":"C708-B708+IF(B708>C708,1)","v":"00:00:00"},null,{"$f":"IFERROR(VLOOKUP(E708,$AJ$2:$AL$3155,2,FALSE),\"\")","v":""},{"$f":"IFERROR(VLOOKUP(E708,$AJ$2:$AL$3155,3,FALSE),\"\")","v":""},null,{"$f":"IFERROR(SUM(G708/7),\"\")","v":""},{"$f":"IFERROR(SUM(N708/C708),\"\")","v":""},null,null,null,null,{"$f":"IFERROR(ROUND(SUM(1000/K708),2),\"\")","v":""},{"$f":"IFERROR(ROUND(SUM(N708*O708),2),\"\")","v":""},null,2]
["",null,null,"00:00:00",null,"","",null,"","",null,null,null,null,"","",null,2]
["",null,null,"00:00:00",null,"","",null,"","",null,null,null,null,"","",null,2]
["",null,null,"00:00:00",null,"","",null,"","",null,null,null,null,"","",null,2]
["",null,null,"00:00:00",null,"","",null,"","",null,null,null,null,"","",null,2]
["",null,null,"00:00:00",null,"","",null,"","",null,null,null,null,"","",null,2]
["",null,null,"00:00:00",null,"","",null,"","",null,null,null,null,"","",null,2]
["",null,null,"00:00:00",null,"","",null,"","",null,null,null,null,"","",null,2]
["",null,null,"00:00:00",null,"","",null,"","",null,null,null,null,"","",null,2]
["",null,null,"00:00:00",null,"","",null,"","",null,null,null,null,"","",null,2]
["",null,null,"00:00:00",null,"","",null,"","",null,null,null,null,"","",null,2]
["",null,null,"00:00:00",null,"","",null,"","",null,null,null,null,"","",null,2]
["",null,null,"00:00:00",null,"","",null,"","",null,null,null,null,"","",null,2]
["",null,null,"00:00:00",null,"","",null,"","",null,null,null,null,"","",null,2]
["",null,null,"00:00:00",null,"","",null,"","",null,null,null,null,"","",null,2]
["",null,null,"00:00:00",null,"","",null,"","",null,null,null,null,"","",null,2]
["",null,null,"00:00:00",null,"","",null,"","",null,null,null,null,"","",null,2]
["",null,null,"00:00:00",null,"","",null,"","",null,null,null,null,"","",null,2]
["",null,null,"00:00:00",null,"","",null,"","",null,null,null,null,"","",null,2]
["",null,null,"00:00:00",null,"","",null,"","",null,null,null,null,"","",null,2]
["",null,null,"00:00:00",null,"","",null,"","",null,null,null,null,"","",null,2]
["",null,null,"00:00:00",null,"","",null,"","",null,null,null,null,"","",null,2]
["",null,null,"00:00:00",null,"","",null,"","",null,null,null,null,"","",null,2]
["",null,null,"00:00:00",null,"","",null,"","",null,null,null,null,"","",null,2]
["",null,null,"00:00:00",null,"","",null,"","",null,null,null,null,"","",null,2]
["",null,null,"00:00:00",null,"","",null,"","",null,null,null,null,"","",null,2]
["",null,null,"00:00:00",null,"","",null,"","",null,null,null,null,"","",null,2]
["",null,null,"00:00:00",null,"","",null,"","",null,null,null,null,"","",null,2]
["",null,null,"00:00:00",null,"","",null,"","",null,null,null,null,"","",null,2]
["",null,null,"00:00:00",null,"","",null,"","",null,null,null,null,"","",null,2]
["",null,null,"00:00:00",null,"","",null,"","",null,null,null,null,"","",null,2]
["",null,null,"00:00:00",null,"","",null,"","",null,null,null,null,"","",null,2]
["",null,null,"00:00:00",null,"","",null,"","",null,null,null,null,"","",null,2]
["",null,null,"00:00:00",null,"","",null,"","",null,null,null,null,"","",null,2]
["",null,null,"00:00:00",null,"","",null,"","",null,null,null,null,"","",null,2]
["",null,null,"00:00:00",null,"","",null,"","",null,null,null,null,"","",null,2]
["",null,null,"00:00:00",null,"","",null,"","",null,null,null,null,"","",null,2]
["",null,null,"00:00:00",null,"","",null,"","",null,null,null,null,"","",null,2]
["",null,null,"00:00:00",null,"","",null,"","",null,null,null,null,"","",null,2]
["",null,null,"00:00:00",null,"","",null,"","",null,null,null,null,"","",null,2]
["",null,null,"00:00:00",null,"","",null,"","",null,null,null,null,"","",null,2]
["",null,null,"00:00:00",null,"","",null,"","",null,null,null,null,"","",null,2]
["",null,null,"00:00:00",null,"","",null,"","",null,null,null,null,"","",null,2]
["",null,null,"00:00:00",null,"","",null,"","",null,null,null,null,"","",null,2]
["",null,null,"00:00:00",null,"","",null,"","",null,null,null,null,"","",null,2]
["",null,null,"00:00:00",null,"","",null,"","",null,null,null,null,"","",null,2]
["",null,null,"00:00:00",null,"","",null,"","",null,null,null,null,"","",null,2]
["",null,null,"00:00:00",null,"","",null,"","",null,null,null,null,"","",null,2]
["",null,null,"00:00:00",null,"","",null,"","",null,null,null,null,"","",null,2]
["",null,null,"00:00:00",null,"","",null,"","",null,null,null,null,"","",null,2]
["",null,null,"00:00:00",null,"","",null,"","",null,null,null,null,"","",null,2]
["",null,null,"00:00:00",null,"","",null,"","",null,null,null,null,"","",null,2]
["",null,null,"00:00:00",null,"","",null,"","",null,null,null,null,"","",null,2]
["",null,null,"00:00:00",null,"","",null,"","",null,null,null,null,"","",null,2]
["",null,null,"00:00:00",null,"","",null,"","",null,null,null,null,"","",null,2]
["",null,null,"00:00:00",null,"","",null,"","",null,null,null,null,"","",null,2]
["",null,null,"00:00:00",null,"","",null,"","",null,null,null,null,"","",null,2]
["",null,null,"00:00:00",null,"","",null,"","",null,null,null,null,"","",null,2]
["",null,null,"00:00:00",null,"","",null,"","",null,null,null,null,"","",null,2]
["",null,null,"00:00:00",null,"","",null,"","",null,null,null,null,"","",null,2]
["",null,null,"00:00:00",null,"","",null,"","",null,null,null,null,"","",null,2]
["",null,null,"00:00:00",null,"","",null,"","",null,null,null,null,"","",null,2]
["",null,null,"00:00:00",null,"","",null,"","",null,null,null,null,"","",null,2]
["",null,null,"00:00:00",null,"","",null,"","",null,null,null,null,"","",null,2]
[{"$f":"IF(E772=\"\",\"\",IF(A772=\"\",TODAY(),A772))","v":""},null,null,{"$f":"C772-B772+IF(B772>C772,1)","v":"00:00:00"},null,{"$f":"IFERROR(VLOOKUP(E772,$AJ$2:$AL$3155,2,FALSE),\"\")","v":""},{"$f":"IFERROR(VLOOKUP(E772,$AJ$2:$AL$3155,3,FALSE),\"\")","v":""},null,{"$f":"IFERROR(SUM(G772/7),\"\")","v":""},{"$f":"IFERROR(SUM(N772/C772),\"\")","v":""},null,null,null,null,{"$f":"IFERROR(ROUND(SUM(1000/K772),2),\"\")","v":""},{"$f":"IFERROR(ROUND(SUM(N772*O772),2),\"\")","v":""},null,2]
["",null,null,"00:00:00",null,"","",null,"","",null,null,null,null,"","",null,2]
["",null,null,"00:00:00",null,"","",null,"","",null,null,null,null,"","",null,2]
["",null,null,"00:00:00",null,"","",null,"","",null,null,null,null,"","",null,2]
["",null,null,"00:00:00",null,"","",null,"","",null,null,null,null,"","",null,2]
["",null,null,"00:00:00",null,"","",null,"","",null,null,null,null,"","",null,2]
["",null,null,"00:00:00",null,"","",null,"","",null,null,null,null,"","",null,2]
["",null,null,"00:00:00",null,"","",null,"","",null,null,null,null,"","",null,2]
["",null,null,"00:00:00",null,"","",null,"","",null,null,null,null,"","",null,2]
["",null,null,"00:00:00",null,"","",null,"","",null,null,null,null,"","",null,2]
["",null,null,"00:00:00",null,"","",null,"","",null,null,null,null,"","",null,2]
["",null,null,"00:00:00",null,"","",null,"","",null,null,null,null,"","",null,2]
["",null,null,"00:00:00",null,"","",null,"","",null,null,null,null,"","",null,2]
["",null,null,"00:00:00",null,"","",null,"","",null,null,null,null,"","",null,2]
["",null,null,"00:00:00",null,"","",null,"","",null,null,null,null,"","",null,2]
["",null,null,"00:00:00",null,"","",null,"","",null,null,null,null,"","",null,2]
["",null,null,"00:00:00",null,"","",null,"","",null,null,null,null,"","",null,2]
["",null,null,"00:00:00",null,"","",null,"","",null,null,null,null,"","",null,2]
["",null,null,"00:00:00",null,"","",null,"","",null,null,null,null,"","",null,2]
["",null,null,"00:00:00",null,"","",null,"","",null,null,null,null,"","",null,2]
["",null,null,"00:00:00",null,"","",null,"","",null,null,null,null,"","",null,2]
["",null,null,"00:00:00",null,"","",null,"","",null,null,null,null,"","",null,2]
["",null,null,"00:00:00",null,"","",null,"","",null,null,null,null,"","",null,2]
["",null,null,"00:00:00",null,"","",null,"","",null,null,null,null,"","",null,2]
["",null,null,"00:00:00",null,"","",null,"","",null,null,null,null,"","",null,2]
["",null,null,"00:00:00",null,"","",null,"","",null,null,null,null,"","",null,2]
["",null,null,"00:00:00",null,"","",null,"","",null,null,null,null,"","",null,2]
["",null,null,"00:00:00",null,"","",null,"","",null,null,null,null,"","",null,2]
["",null,null,"00:00:00",null,"","",null,"","",null,null,null,null,"","",null,2]
["",null,null,"00:00:00",null,"","",null,"","",null,null,null,null,"","",null,2]
["",null,null,"00:00:00",null,"","",null,"","",null,null,null,null,"","",null,2]
["",null,null,"00:00:00",null,"","",null,"","",null,null,null,null,"","",null,2]
["",null,null,"00:00:00",null,"","",null,"","",null,null,null,null,"","",null,2]
["",null,null,"00:00:00",null,"","",null,"","",null,null,null,null,"","",null,2]
["",null,null,"00:00:00",null,"","",null,"","",null,null,null,null,"","",null,2]
["",null,null,"00:00:00",null,"","",null,"","",null,null,null,null,"","",null,2]
["",null,null,"00:00:00",null,"","",null,"","",null,null,null,null,"","",null,2]
["",null,null,"00:00:00",null,"","",null,"","",null,null,null,null,"","",null,2]
["",null,null,"00:00:00",null,"","",null,"","",null,null,null,null,"","",null,2]
["",null,null,"00:00:00",null,"","",null,"","",null,null,null,null,"","",null,2]
["",null,null,"00:00:00",null,"","",null,"","",null,null,null,null,"","",null,2]
["",null,null,"00:00:00",null,"","",null,"","",null,null,null,null,"","",null,2]
["",null,null,"00:00:00",null,"","",null,"","",null,null,null,null,"","",null,2]
["",null,null,"00:00:00",null,"","",null,"","",null,null,null,null,"","",null,2]
["",null,null,"00:00:00",null,"","",null,"","",null,null,null,null,"","",null,2]
["",null,null,"00:00:00",null,"","",null,"","",null,null,null,null,"","",null,2]
["",null,null,"00:00:00",null,"","",null,"","",null,null,null,null,"","",null,2]
["",null,null,"00:00:00",null,"","",null,"","",null,null,null,null,"","",null,2]
["",null,null,"00:00:00",null,"","",null,"","",null,null,null,null,"","",null,2]
["",null,null,"00:00:00",null,"","",null,"","",null,null,null,null,"","",null,2]
["",null,null,"00:00:00",null,"","",null,"","",null,null,null,null,"","",null,2]
["",null,null,"00:00:00",null,"","",null,"","",null,null,null,null,"","",null,2]
["",null,null,"00:00:00",null,"","",null,"","",null,null,null,null,"","",null,2]
["",null,null,"00:00:00",null,"","",null,"","",null,null,null,null,"","",null,2]
["",null,null,"00:00:00",null,"","",null,"","",null,null,null,null,"","",null,2]
["",null,null,"00:00:00",null,"","",null,"","",null,null,null,null,"","",null,2]
["",null,null,"00:00:00",null,"","",null,"","",null,null,null,null,"","",null,2]
["",null,null,"00:00:00",null,"","",null,"","",null,null,null,null,"","",null,2]
["",null,null,"00:00:00",null,"","",null,"","",null,null,null,null,"","",null,2]
["",null,null,"00:00:00",null,"","",null,"","",null,null,null,null,"","",null,2]
["",null,null,"00:00:00",null,"","",null,"","",null,null,null,null,"","",null,2]
["",null,null,"00:00:00",null,"","",null,"","",null,null,null,null,"","",null,2]
["",null,null,"00:00:00",null,"","",null,"","",null,null,null,null,"","",null,2]
["",null,null,"00:00:00",null,"","",null,"","",null,null,null,null,"","",null,2]
[{"$f":"IF(E836=\"\",\"\",IF(A836=\"\",TODAY(),A836))","v":""},null,null,{"$f":"C836-B836+IF(B836>C836,1)","v":"00:00:00"},null,{"$f":"IFERROR(VLOOKUP(E836,$AJ$2:$AL$3155,2,FALSE),\"\")","v":""},{"$f":"IFERROR(VLOOKUP(E836,$AJ$2:$AL$3155,3,FALSE),\"\")","v":""},null,{"$f":"IFERROR(SUM(G836/7),\"\")","v":""},{"$f":"IFERROR(SUM(N836/C836),\"\")","v":""},null,null,null,null,{"$f":"IFERROR(ROUND(SUM(1000/K836),2),\"\")","v":""},{"$f":"IFERROR(ROUND(SUM(N836*O836),2),\"\")","v":""},null,2]
["",null,null,"00:00:00",null,"","",null,"","",null,null,null,null,"","",null,2]
["",null,null,"00:00:00",null,"","",null,"","",null,null,null,null,"","",null,2]
["",null,null,"00:00:00",null,"","",null,"","",null,null,null,null,"","",null,2]
["",null,null,"00:00:00",null,"","",null,"","",null,null,null,null,"","",null,2]
["",null,null,"00:00:00",null,"","",null,"","",null,null,null,null,"","",null,2]
["",null,null,"00:00:00",null,"","",null,"","",null,null,null,null,"","",null,2]
["",null,null,"00:00:00",null,"","",null,"","",null,null,null,null,"","",null,2]
["",null,null,"00:00:00",null,"","",null,"","",null,null,null,null,"","",null,2]
["",null,null,"00:00:00",null,"","",null,"","",null,null,null,null,"","",null,2]
["",null,null,"00:00:00",null,"","",null,"","",null,null,null,null,"","",null,2]
["",null,null,"00:00:00",null,"","",null,"","",null,null,null,null,"","",null,2]
["",null,null,"00:00:00",null,"","",null,"","",null,null,null,null,"","",null,2]
["",null,null,"00:00:00",null,"","",null,"","",null,null,null,null,"","",null,2]
["",null,null,"00:00:00",null,"","",null,"","",null,null,null,null,"","",null,2]
["",null,null,"00:00:00",null,"","",null,"","",null,null,null,null,"","",null,2]
["",null,null,"00:00:00",null,"","",null,"","",null,null,null,null,"","",null,2]
["",null,null,"00:00:00",null,"","",null,"","",null,null,null,null,"","",null,2]
["",null,null,"00:00:00",null,"","",null,"","",null,null,null,null,"","",null,2]
["",null,null,"00:00:00",null,"","",null,"","",null,null,null,null,"","",null,2]
["",null,null,"00:00:00",null,"","",null,"","",null,null,null,null,"","",null,2]
["",null,null,"00:00:00",null,"","",null,"","",null,null,null,null,"","",null,2]
["",null,null,"00:00:00",null,"","",null,"","",null,null,null,null,"","",null,2]
["",null,null,"00:00:00",null,"","",null,"","",null,null,null,null,"","",null,2]
["",null,null,"00:00:00",null,"","",null,"","",null,null,null,null,"","",null,2]
["",null,null,"00:00:00",null,"","",null,"","",null,null,null,null,"","",null,2]
["",null,null,"00:00:00",null,"","",null,"","",null,null,null,null,"","",null,2]
["",null,null,"00:00:00",null,"","",null,"","",null,null,null,null,"","",null,2]
["",null,null,"00:00:00",null,"","",null,"","",null,null,null,null,"","",null,2]
["",null,null,"00:00:00",null,"","",null,"","",null,null,null,null,"","",null,2]
["",null,null,"00:00:00",null,"","",null,"","",null,null,null,null,"","",null,2]
["",null,null,"00:00:00",null,"","",null,"","",null,null,null,null,"","",null,2]
["",null,null,"00:00:00",null,"","",null,"","",null,null,null,null,"","",null,2]
["",null,null,"00:00:00",null,"","",null,"","",null,null,null,null,"","",null,2]
["",null,null,"00:00:00",null,"","",null,"","",null,null,null,null,"","",null,2]
["",null,null,"00:00:00",null,"","",null,"","",null,null,null,null,"","",null,2]
["",null,null,"00:00:00",null,"","",null,"","",null,null,null,null,"","",null,2]
["",null,null,"00:00:00",null,"","",null,"","",null,null,null,null,"","",null,2]
["",null,null,"00:00:00",null,"","",null,"","",null,null,null,null,"","",null,2]
["",null,null,"00:00:00",null,"","",null,"","",null,null,null,null,"","",null,2]
["",null,null,"00:00:00",null,"","",null,"","",null,null,null,null,"","",null,2]
["",null,null,"00:00:00",null,"","",null,"","",null,null,null,null,"","",null,2]
["",null,null,"00:00:00",null,"","",null,"","",null,null,null,null,"","",null,2]
["",null,null,"00:00:00",null,"","",null,"","",null,null,null,null,"","",null,2]
["",null,null,"00:00:00",null,"","",null,"","",null,null,null,null,"","",null,2]
["",null,null,"00:00:00",null,"","",null,"","",null,null,null,null,"","",null,2]
["",null,null,"00:00:00",null,"","",null,"","",null,null,null,null,"","",null,2]
["",null,null,"00:00:00",null,"","",null,"","",null,null,null,null,"","",null,2]
["",null,null,"00:00:00",null,"","",null,"","",null,null,null,null,"","",null,2]
["",null,null,"00:00:00",null,"","",null,"","",null,null,null,null,"","",null,2]
["",null,null,"00:00:00",null,"","",null,"","",null,null,null,null,"","",null,2]
["",null,null,"00:00:00",null,"","",null,"","",null,null,null,null,"","",null,2]
["",null,null,"00:00:00",null,"","",null,"","",null,null,null,null,"","",null,2]
["",null,null,"00:00:00",null,"","",null,"","",null,null,null,null,"","",null,2]
["",null,null,"00:00:00",null,"","",null,"","",null,null,null,null,"","",null,2]
["",null,null,"00:00:00",null,"","",null,"","",null,null,null,null,"","",null,2]
["",null,null,"00:00:00",null,"","",null,"","",null,null,null,null,"","",null,2]
["",null,null,"00:00:00",null,"","",null,"","",null,null,null,null,"","",null,2]
["",null,null,"00:00:00",null,"","",null,"","",null,null,null,null,"","",null,2]
["",null,null,"00:00:00",null,"","",null,"","",null,null,null,null,"","",null,2]
["",null,null,"00:00:00",null,"","",null,"","",null,null,null,null,"","",null,2]
["",null,null,"00:00:00",null,"","",null,"","",null,null,null,null,"","",null,2]
["",null,null,"00:00:00",null,"","",null,"","",null,null,null,null,"","",null,2]
["",null,null,"00:00:00",null,"","",null,"","",null,null,null,null,"","",null,2]
[{"$f":"IF(E900=\"\",\"\",IF(A900=\"\",TODAY(),A900))","v":""},null,null,{"$f":"C900-B900+IF(B900>C900,1)","v":"00:00:00"},null,{"$f":"IFERROR(VLOOKUP(E900,$AJ$2:$AL$3155,2,FALSE),\"\")","v":""},{"$f":"IFERROR(VLOOKUP(E900,$AJ$2:$AL$3155,3,FALSE),\"\")","v":""},null,{"$f":"IFERROR(SUM(G900/7),\"\")","v":""},{"$f":"IFERROR(SUM(N900/C900),\"\")","v":""},null,null,null,null,{"$f":"IFERROR(ROUND(SUM(1000/K900),2),\"\")","v":""},{"$f":"IFERROR(ROUND(SUM(N900*O900),2),\"\")","v":""},null,2]
["",null,null,"00:00:00",null,"","",null,"","",null,null,null,null,"","",null,2]
["",null,null,"00:00:00",null,"","",null,"","",null,null,null,null,"","",null,2]
["",null,null,"00:00:00",null,"","",null,"","",null,null,null,null,"","",null,2]
["",null,null,"00:00:00",null,"","",null,"","",null,null,null,null,"","",null,2]
["",null,null,"00:00:00",null,"","",null,"","",null,null,null,null,"","",null,2]
["",null,null,"00:00:00",null,"","",null,"","",null,null,null,null,"","",null,2]
["",null,null,"00:00:00",null,"","",null,"","",null,null,null,null,"","",null,2]
["",null,null,"00:00:00",null,"","",null,"","",null,null,null,null,"","",null,2]
["",null,null,"00:00:00",null,"","",null,"","",null,null,null,null,"","",null,2]
["",null,null,"00:00:00",null,"","",null,"","",null,null,null,null,"","",null,2]
["",null,null,"00:00:00",null,"","",null,"","",null,null,null,null,"","",null,2]
["",null,null,"00:00:00",null,"","",null,"","",null,null,null,null,"","",null,2]
["",null,null,"00:00:00",null,"","",null,"","",null,null,null,null,"","",null,2]
["",null,null,"00:00:00",null,"","",null,"","",null,null,null,null,"","",null,2]
["",null,null,"00:00:00",null,"","",null,"","",null,null,null,null,"","",null,2]
["",null,null,"00:00:00",null,"","",null,"","",null,null,null,null,"","",null,2]
["",null,null,"00:00:00",null,"","",null,"","",null,null,null,null,"","",null,2]
["",null,null,"00:00:00",null,"","",null,"","",null,null,null,null,"","",null,2]
["",null,null,"00:00:00",null,"","",null,"","",null,null,null,null,"","",null,2]
["",null,null,"00:00:00",null,"","",null,"","",null,null,null,null,"","",null,2]
["",null,null,"00:00:00",null,"","",null,"","",null,null,null,null,"","",null,2]
["",null,null,"00:00:00",null,"","",null,"","",null,null,null,null,"","",null,2]
["",null,null,"00:00:00",null,"","",null,"","",null,null,null,null,"","",null,2]
["",null,null,"00:00:00",null,"","",null,"","",null,null,null,null,"","",null,2]
["",null,null,"00:00:00",null,"","",null,"","",null,null,null,null,"","",null,2]
["",null,null,"00:00:00",null,"","",null,"","",null,null,null,null,"","",null,2]
["",null,null,"00:00:00",null,"","",null,"","",null,null,null,null,"","",null,2]
["",null,null,"00:00:00",null,"","",null,"","",null,null,null,null,"","",null,2]
["",null,null,"00:00:00",null,"","",null,"","",null,null,null,null,"","",null,2]
["",null,null,"00:00:00",null,"","",null,"","",null,null,null,null,"","",null,2]
["",null,null,"00:00:00",null,"","",null,"","",null,null,null,null,"","",null,2]
["",null,null,"00:00:00",null,"","",null,"","",null,null,null,null,"","",null,2]
["",null,null,"00:00:00",null,"","",null,"","",null,null,null,null,"","",null,2]
["",null,null,"00:00:00",null,"","",null,"","",null,null,null,null,"","",null,2]
["",null,null,"00:00:00",null,"","",null,"","",null,null,null,null,"","",null,2]
["",null,null,"00:00:00",null,"","",null,"","",null,null,null,null,"","",null,2]
["",null,null,"00:00:00",null,"","",null,"","",null,null,null,null,"","",null,2]
["",null,null,"00:00:00",null,"","",null,"","",null,null,null,null,"","",null,2]
["",null,null,"00:00:00",null,"","",null,"","",null,null,null,null,"","",null,2]
["",null,null,"00:00:00",null,"","",null,"","",null,null,null,null,"","",null,2]
["",null,null,"00:00:00",null,"","",null,"","",null,null,null,null,"","",null,2]
["",null,null,"00:00:00",null,"","",null,"","",null,null,null,null,"","",null,2]
["",null,null,"00:00:00",null,"","",null,"","",null,null,null,null,"","",null,2]
["",null,null,"00:00:00",null,"","",null,"","",null,null,null,null,"","",null,2]
["",null,null,"00:00:00",null,"","",null,"","",null,null,null,null,"","",null,2]
["",null,null,"00:00:00",null,"","",null,"","",null,null,null,null,"","",null,2]
["",null,null,"00:00:00",null,"","",null,"","",null,null,null,null,"","",null,2]
["",null,null,"00:00:00",null,"","",null,"","",null,null,null,null,"","",null,2]
["",null,null,"00:00:00",null,"","",null,"","",null,null,null,null,"","",null,2]
["",null,null,"00:00:00",null,"","",null,"","",null,null,null,null,"","",null,2]
["",null,null,"00:00:00",null,"","",null,"","",null,null,null,null,"","",null,2]
["",null,null,"00:00:00",null,"","",null,"","",null,null,null,null,"","",null,2]
["",null,null,"00:00:00",null,"","",null,"","",null,null,null,null,"","",null,2]
["",null,null,"00:00:00",null,"","",null,"","",null,null,null,null,"","",null,2]
["",null,null,"00:00:00",null,"","",null,"","",null,null,null,null,"","",null,2]
["",null,null,"00:00:00",null,"","",null,"","",null,null,null,null,"","",null,2]
["",null,null,"00:00:00",null,"","",null,"","",null,null,null,null,"","",null,2]
["",null,null,"00:00:00",null,"","",null,"","",null,null,null,null,"","",null,2]
["",null,null,"00:00:00",null,"","",null,"","",null,null,null,null,"","",null,2]
["",null,null,"00:00:00",null,"","",null,"","",null,null,null,null,"","",null,2]
["",null,null,"00:00:00",null,"","",null,"","",null,null,null,null,"","",null,2]
["",null,null,"00:00:00",null,"","",null,"","",null,null,null,null,"","",null,2]
["",null,null,"00:00:00",null,"","",null,"","",null,null,null,null,"","",null,2]
[{"$f":"IF(E964=\"\",\"\",IF(A964=\"\",TODAY(),A964))","v":""},null,null,{"$f":"C964-B964+IF(B964>C964,1)","v":"00:00:00"},null,{"$f":"IFERROR(VLOOKUP(E964,$AJ$2:$AL$3155,2,FALSE),\"\")","v":""},{"$f":"IFERROR(VLOOKUP(E964,$AJ$2:$AL$3155,3,FALSE),\"\")","v":""},null,{"$f":"IFERROR(SUM(G964/7),\"\")","v":""},{"$f":"IFERROR(SUM(N964/C964),\"\")","v":""},null,null,null,null,{"$f":"IFERROR(ROUND(SUM(1000/K964),2),\"\")","v":""},{"$f":"IFERROR(ROUND(SUM(N964*O964),2),\"\")","v":""},null,2]
["",null,null,"00:00:00",null,"","",null,"","",null,null,null,null,"","",null,2]
["",null,null,"00:00:00",null,"","",null,"","",null,null,null,null,"","",null,2]
["",null,null,"00:00:00",null,"","",null,"","",null,null,null,null,"","",null,2]
["",null,null,"00:00:00",null,"","",null,"","",null,null,null,null,"","",null,2]
["",null,null,"00:00:00",null,"","",null,"","",null,null,null,null,"","",null,2]
["",null,null,"00:00:00",null,"","",null,"","",null,null,null,null,"","",null,2]
["",null,null,"00:00:00",null,"","",null,"","",null,null,null,null,"","",null,2]
["",null,null,"00:00:00",null,"","",null,"","",null,null,null,null,"","",null,2]
["",null,null,"00:00:00",null,"","",null,"","",null,null,null,null,"","",null,2]
["",null,null,"00:00:00",null,"","",null,"","",null,null,null,null,"","",null,2]
["",null,null,"00:00:00",null,"","",null,"","",null,null,null,null,"","",null,2]
["",null,null,"00:00:00",null,"","",null,"","",null,null,null,null,"","",null,2]
["",null,null,"00:00:00",null,"","",null,"","",null,null,null,null,"","",null,2]
["",null,null,"00:00:00",null,"","",null,"","",null,null,null,null,"","",null,2]
["",null,null,"00:00:00",null,"","",null,"","",null,null,null,null,"","",null,2]
["",null,null,"00:00:00",null,"","",null,"","",null,null,null,null,"","",null,2]
["",null,null,"00:00:00",null,"","",null,"","",null,null,null,null,"","",null,2]
["",null,null,"00:00:00",null,"","",null,"","",null,null,null,null,"","",null,2]
["",null,null,"00:00:00",null,"","",null,"","",null,null,null,null,"","",null,2]
["",null,null,"00:00:00",null,"","",null,"","",null,null,null,null,"","",null,2]
["",null,null,"00:00:00",null,"","",null,"","",null,null,null,null,"","",null,2]
["",null,null,"00:00:00",null,"","",null,"","",null,null,null,null,"","",null,2]
["",null,null,"00:00:00",null,"","",null,"","",null,null,null,null,"","",null,2]
["",null,null,"00:00:00",null,"","",null,"","",null,null,null,null,"","",null,2]
["",null,null,"00:00:00",null,"","",null,"","",null,null,null,null,"","",null,2]
["",null,null,"00:00:00",null,"","",null,"","",null,null,null,null,"","",null,2]
["",null,null,"00:00:00",null,"","",null,"","",null,null,null,null,"","",null,2]
["",null,null,"00:00:00",null,"","",null,"","",null,null,null,null,"","",null,2]
["",null,null,"00:00:00",null,"","",null,"","",null,null,null,null,"","",null,2]
["",null,null,"00:00:00",null,"","",null,"","",null,null,null,null,"","",null,2]
["",null,null,"00:00:00",null,"","",null,"","",null,null,null,null,"","",null,2]
["",null,null,"00:00:00",null,"","",null,"","",null,null,null,null,"","",null,2]
["",null,null,"00:00:00",null,"","",null,"","",null,null,null,null,"","",null,2]
["",null,null,"00:00:00",null,"","",null,"","",null,null,null,null,"","",null,2]
["",null,null,"00:00:00",null,"","",null,"","",null,null,null,null,"","",null,2]
["",null,null,"00:00:00",null,"","",null,"","",null,null,null,null,"","",null,2]
["",null,null,"00:00:00",null,"","",null,"","",null,null,null,null,"","",null,2]
["",null,null,"00:00:00",null,"","",null,"","",null,null,null,null,"","",null,2]
["",null,null,"00:00:00",null,"","",null,"","",null,null,null,null,"","",null,2]
["",null,null,"00:00:00",null,"","",null,"","",null,null,null,null,"","",null,2]
["",null,null,"00:00:00",null,"","",null,"","",null,null,null,null,"","",null,2]
["",null,null,"00:00:00",null,"","",null,"","",null,null,null,null,"","",null,2]
["",null,null,"00:00:00",null,"","",null,"","",null,null,null,null,"","",null,2]
["",null,null,"00:00:00",null,"","",null,"","",null,null,null,null,"","",null,2]
["",null,null,"00:00:00",null,"","",null,"","",null,null,null,null,"","",null,2]
["",null,null,"00:00:00",null,"","",null,"","",null,null,null,null,"","",null,2]
["",null,null,"00:00:00",null,"","",null,"","",null,null,null,null,"","",null,2]
["",null,null,"00:00:00",null,"","",null,"","",null,null,null,null,"","",null,2]
["",null,null,"00:00:00",null,"","",null,"","",null,null,null,null,"","",null,2]
["",null,null,"00:00:00",null,"","",null,"","",null,null,null,null,"","",null,2]
["",null,null,"00:00:00",null,"","",null,"","",null,null,null,null,"","",null,2]
["",null,null,"00:00:00",null,"","",null,"","",null,null,null,null,"","",null,2]
["",null,null,"00:00:00",null,"","",null,"","",null,null,null,null,"","",null,2]
["",null,null,"00:00:00",null,"","",null,"","",null,null,null,null,"","",null,2]
["",null,null,"00:00:00",null,"","",null,"","",null,null,null,null,"","",null,2]
["",null,null,"00:00:00",null,"","",null,"","",null,null,null,null,"","",null,2]
["",null,null,"00:00:00",null,"","",null,"","",null,null,null,null,"","",null,2]
["",null,null,"00:00:00",null,"","",null,"","",null,null,null,null,"","",null,2]
["",null,null,"00:00:00",null,"","",null,"","",null,null,null,null,"","",null,2]
["",null,null,"00:00:00",null,"","",null,"","",null,null,null,null,"","",null,2]
["",null,null,"00:00:00",null,"","",null,"","",null,null,null,null,"","",null,2]
["",null,null,"00:00:00",null,"","",null,"","",null,null,null,null,"","",null,2]
["",null,null,"00:00:00",null,"","",null,"","",null,null,null,null,"","",null,2]
[{"$f":"IF(E1028=\"\",\"\",IF(A1028=\"\",TODAY(),A1028))","v":""},null,null,{"$f":"C1028-B1028+IF(B1028>C1028,1)","v":"00:00:00"},null,{"$f":"IFERROR(VLOOKUP(E1028,$AJ$2:$AL$3155,2,FALSE),\"\")","v":""},{"$f":"IFERROR(VLOOKUP(E1028,$AJ$2:$AL$3155,3,FALSE),\"\")","v":""},null,{"$f":"IFERROR(SUM(G1028/7),\"\")","v":""},{"$f":"IFERROR(SUM(N1028/C1028),\"\")","v":""},null,null,null,null,{"$f":"IFERROR(ROUND(SUM(1000/K1028),2),\"\")","v":""},{"$f":"IFERROR(ROUND(SUM(N1028*O1028),2),\"\")","v":""},null,2]
["",null,null,"00:00:00",null,"","",null,"","",null,null,null,null,"","",null,2]
["",null,null,"00:00:00",null,"","",null,"","",null,null,null,null,"","",null,2]
["",null,null,"00:00:00",null,"","",null,"","",null,null,null,null,"","",null,2]
["",null,null,"00:00:00",null,"","",null,"","",null,null,null,null,"","",null,2]
["",null,null,"00:00:00",null,"","",null,"","",null,null,null,null,"","",null,2]
["",null,null,"00:00:00",null,"","",null,"","",null,null,null,null,"","",null,2]
["",null,null,"00:00:00",null,"","",null,"","",null,null,null,null,"","",null,2]
["",null,null,"00:00:00",null,"","",null,"","",null,null,null,null,"","",null,2]
["",null,null,"00:00:00",null,"","",null,"","",null,null,null,null,"","",null,2]
["",null,null,"00:00:00",null,"","",null,"","",null,null,null,null,"","",null,2]
["",null,null,"00:00:00",null,"","",null,"","",null,null,null,null,"","",null,2]
["",null,null,"00:00:00",null,"","",null,"","",null,null,null,null,"","",null,2]
["",null,null,"00:00:00",null,"","",null,"","",null,null,null,null,"","",null,2]
["",null,null,"00:00:00",null,"","",null,"","",null,null,null,null,"","",null,2]
["",null,null,"00:00:00",null,"","",null,"","",null,null,null,null,"","",null,2]
["",null,null,"00:00:00",null,"","",null,"","",null,null,null,null,"","",null,2]
["",null,null,"00:00:00",null,"","",null,"","",null,null,null,null,"","",null,2]
["",null,null,"00:00:00",null,"","",null,"","",null,null,null,null,"","",null,2]
["",null,null,"00:00:00",null,"","",null,"","",null,null,null,null,"","",null,2]
["",null,null,"00:00:00",null,"","",null,"","",null,null,null,null,"","",null,2]
["",null,null,"00:00:00",null,"","",null,"","",null,null,null,null,"","",null,2]
["",null,null,"00:00:00",null,"","",null,"","",null,null,null,null,"","",null,2]
["",null,null,"00:00:00",null,"","",null,"","",null,null,null,null,"","",null,2]
["",null,null,"00:00:00",null,"","",null,"","",null,null,null,null,"","",null,2]
["",null,null,"00:00:00",null,"","",null,"","",null,null,null,null,"","",null,2]
["",null,null,"00:00:00",null,"","",null,"","",null,null,null,null,"","",null,2]
["",null,null,"00:00:00",null,"","",null,"","",null,null,null,null,"","",null,2]
["",null,null,"00:00:00",null,"","",null,"","",null,null,null,null,"","",null,2]
["",null,null,"00:00:00",null,"","",null,"","",null,null,null,null,"","",null,2]
["",null,null,"00:00:00",null,"","",null,"","",null,null,null,null,"","",null,2]
["",null,null,"00:00:00",null,"","",null,"","",null,null,null,null,"","",null,2]
["",null,null,"00:00:00",null,"","",null,"","",null,null,null,null,"","",null,2]
["",null,null,"00:00:00",null,"","",null,"","",null,null,null,null,"","",null,2]
["",null,null,"00:00:00",null,"","",null,"","",null,null,null,null,"","",null,2]
["",null,null,"00:00:00",null,"","",null,"","",null,null,null,null,"","",null,2]
["",null,null,"00:00:00",null,"","",null,"","",null,null,null,null,"","",null,2]
["",null,null,"00:00:00",null,"","",null,"","",null,null,null,null,"","",null,2]
["",null,null,"00:00:00",null,"","",null,"","",null,null,null,null,"","",null,2]
["",null,null,"00:00:00",null,"","",null,"","",null,null,null,null,"","",null,2]
["",null,null,"00:00:00",null,"","",null,"","",null,null,null,null,"","",null,2]
["",null,null,"00:00:00",null,"","",null,"","",null,null,null,null,"","",null,2]
["",null,null,"00:00:00",null,"","",null,"","",null,null,null,null,"","",null,2]
["",null,null,"00:00:00",null,"","",null,"","",null,null,null,null,"","",null,2]
["",null,null,"00:00:00",null,"","",null,"","",null,null,null,null,"","",null,2]
["",null,null,"00:00:00",null,"","",null,"","",null,null,null,null,"","",null,2]
["",null,null,"00:00:00",null,"","",null,"","",null,null,null,null,"","",null,2]
["",null,null,"00:00:00",null,"","",null,"","",null,null,null,null,"","",null,2]
["",null,null,"00:00:00",null,"","",null,"","",null,null,null,null,"","",null,2]
["",null,null,"00:00:00",null,"","",null,"","",null,null,null,null,"","",null,2]
["",null,null,"00:00:00",null,"","",null,"","",null,null,null,null,"","",null,2]
["",null,null,"00:00:00",null,"","",null,"","",null,null,null,null,"","",null,2]
["",null,null,"00:00:00",null,"","",null,"","",null,null,null,null,"","",null,2]
["",null,null,"00:00:00",null,"","",null,"","",null,null,null,null,"","",null,2]
["",null,null,"00:00:00",null,"","",null,"","",null,null,null,null,"","",null,2]
["",null,null,"00:00:00",null,"","",null,"","",null,null,null,null,"","",null,2]
["",null,null,"00:00:00",null,"","",null,"","",null,null,null,null,"","",null,2]
["",null,null,"00:00:00",null,"","",null,"","",null,null,null,null,"","",null,2]
["",null,null,"00:00:00",null,"","",null,"","",null,null,null,null,"","",null,2]
["",null,null,"00:00:00",null,"","",null,"","",null,null,null,null,"","",null,2]
["",null,null,"00:00:00",null,"","",null,"","",null,null,null,null,"","",null,2]
["",null,null,"00:00:00",null,"","",null,"","",null,null,null,null,"","",null,2]
["",null,null,"00:00:00",null,"","",null,"","",null,null,null,null,"","",null,2]
["",null,null,"00:00:00",null,"","",null,"","",null,null,null,null,"","",null,2]
[{"$f":"IF(E1092=\"\",\"\",IF(A1092=\"\",TODAY(),A1092))","v":""},null,null,{"$f":"C1092-B1092+IF(B1092>C1092,1)","v":"00:00:00"},null,{"$f":"IFERROR(VLOOKUP(E1092,$AJ$2:$AL$3155,2,FALSE),\"\")","v":""},{"$f":"IFERROR(VLOOKUP(E1092,$AJ$2:$AL$3155,3,FALSE),\"\")","v":""},null,{"$f":"IFERROR(SUM(G1092/7),\"\")","v":""},{"$f":"IFERROR(SUM(N1092/C1092),\"\")","v":""},null,null,null,null,{"$f":"IFERROR(ROUND(SUM(1000/K1092),2),\"\")","v":""},{"$f":"IFERROR(ROUND(SUM(N1092*O1092),2),\"\")","v":""},null,2]
["",null,null,"00:00:00",null,"","",null,"","",null,null,null,null,"","",null,2]
["",null,null,"00:00:00",null,"","",null,"","",null,null,null,null,"","",null,2]
["",null,null,"00:00:00",null,"","",null,"","",null,null,null,null,"","",null,2]
["",null,null,"00:00:00",null,"","",null,"","",null,null,null,null,"","",null,2]
["",null,null,"00:00:00",null,"","",null,"","",null,null,null,null,"","",null,2]
["",null,null,"00:00:00",null,"","",null,"","",null,null,null,null,"","",null,2]
["",null,null,"00:00:00",null,"","",null,"","",null,null,null,null,"","",null,2]
["",null,null,"00:00:00",null,"","",null,"","",null,null,null,null,"","",null,2]
["",null,null,"00:00:00",null,"","",null,"","",null,null,null,null,"","",null,2]
["",null,null,"00:00:00",null,"","",null,"","",null,null,null,null,"","",null,2]
["",null,null,"00:00:00",null,"","",null,"","",null,null,null,null,"","",null,2]
["",null,null,"00:00:00",null,"","",null,"","",null,null,null,null,"","",null,2]
["",null,null,"00:00:00",null,"","",null,"","",null,null,null,null,"","",null,2]
["",null,null,"00:00:00",null,"","",null,"","",null,null,null,null,"","",null,2]
["",null,null,"00:00:00",null,"","",null,"","",null,null,null,null,"","",null,2]
["",null,null,"00:00:00",null,"","",null,"","",null,null,null,null,"","",null,2]
["",null,null,"00:00:00",null,"","",null,"","",null,null,null,null,"","",null,2]
["",null,null,"00:00:00",null,"","",null,"","",null,null,null,null,"","",null,2]
["",null,null,"00:00:00",null,"","",null,"","",null,null,null,null,"","",null,2]
["",null,null,"00:00:00",null,"","",null,"","",null,null,null,null,"","",null,2]
["",null,null,"00:00:00",null,"","",null,"","",null,null,null,null,"","",null,2]
["",null,null,"00:00:00",null,"","",null,"","",null,null,null,null,"","",null,2]
["",null,null,"00:00:00",null,"","",null,"","",null,null,null,null,"","",null,2]
["",null,null,"00:00:00",null,"","",null,"","",null,null,null,null,"","",null,2]
["",null,null,"00:00:00",null,"","",null,"","",null,null,null,null,"","",null,2]
["",null,null,"00:00:00",null,"","",null,"","",null,null,null,null,"","",null,2]
["",null,null,"00:00:00",null,"","",null,"","",null,null,null,null,"","",null,2]
["",null,null,"00:00:00",null,"","",null,"","",null,null,null,null,"","",null,2]
["",null,null,"00:00:00",null,"","",null,"","",null,null,null,null,"","",null,2]
["",null,null,"00:00:00",null,"","",null,"","",null,null,null,null,"","",null,2]
["",null,null,"00:00:00",null,"","",null,"","",null,null,null,null,"","",null,2]
["",null,null,"00:00:00",null,"","",null,"","",null,null,null,null,"","",null,2]
["",null,null,"00:00:00",null,"","",null,"","",null,null,null,null,"","",null,2]
["",null,null,"00:00:00",null,"","",null,"","",null,null,null,null,"","",null,2]
["",null,null,"00:00:00",null,"","",null,"","",null,null,null,null,"","",null,2]
["",null,null,"00:00:00",null,"","",null,"","",null,null,null,null,"","",null,2]
["",null,null,"00:00:00",null,"","",null,"","",null,null,null,null,"","",null,2]
["",null,null,"00:00:00",null,"","",null,"","",null,null,null,null,"","",null,2]
["",null,null,"00:00:00",null,"","",null,"","",null,null,null,null,"","",null,2]
["",null,null,"00:00:00",null,"","",null,"","",null,null,null,null,"","",null,2]
["",null,null,"00:00:00",null,"","",null,"","",null,null,null,null,"","",null,2]
["",null,null,"00:00:00",null,"","",null,"","",null,null,null,null,"","",null,2]
["",null,null,"00:00:00",null,"","",null,"","",null,null,null,null,"","",null,2]
["",null,null,"00:00:00",null,"","",null,"","",null,null,null,null,"","",null,2]
["",null,null,"00:00:00",null,"","",null,"","",null,null,null,null,"","",null,2]
["",null,null,"00:00:00",null,"","",null,"","",null,null,null,null,"","",null,2]
["",null,null,"00:00:00",null,"","",null,"","",null,null,null,null,"","",null,2]
["",null,null,"00:00:00",null,"","",null,"","",null,null,null,null,"","",null,2]
["",null,null,"00:00:00",null,"","",null,"","",null,null,null,null,"","",null,2]
["",null,null,"00:00:00",null,"","",null,"","",null,null,null,null,"","",null,2]
["",null,null,"00:00:00",null,"","",null,"","",null,null,null,null,"","",null,2]
["",null,null,"00:00:00",null,"","",null,"","",null,null,null,null,"","",null,2]
["",null,null,"00:00:00",null,"","",null,"","",null,null,null,null,"","",null,2]
["",null,null,"00:00:00",null,"","",null,"","",null,null,null,null,"","",null,2]
["",null,null,"00:00:00",null,"","",null,"","",null,null,null,null,"","",null,2]
["",null,null,"00:00:00",null,"","",null,"","",null,null,null,null,"","",null,2]
["",null,null,"00:00:00",null,"","",null,"","",null,null,null,null,"","",null,2]
["",null,null,"00:00:00",null,"","",null,"","",null,null,null,null,"","",null,2]
["",null,null,"00:00:00",null,"","",null,"","",null,null,null,null,"","",null,2]
["",null,null,"00:00:00",null,"","",null,"","",null,null,null,null,"","",null,2]
["",null,null,"00:00:00",null,"","",null,"","",null,null,null,null,"","",null,2]
["",null,null,"00:00:00",null,"","",null,"","",null,null,null,null,"","",null,2]
["",null,null,"00:00:00",null,"","",null,"","",null,null,null,null,"","",null,2]
[{"$f":"IF(E1156=\"\",\"\",IF(A1156=\"\",TODAY(),A1156))","v":""},null,null,{"$f":"C1156-B1156+IF(B1156>C1156,1)","v":"00:00:00"},null,{"$f":"IFERROR(VLOOKUP(E1156,$AJ$2:$AL$3155,2,FALSE),\"\")","v":""},{"$f":"IFERROR(VLOOKUP(E1156,$AJ$2:$AL$3155,3,FALSE),\"\")","v":""},null,{"$f":"IFERROR(SUM(G1156/7),\"\")","v":""},{"$f":"IFERROR(SUM(N1156/C1156),\"\")","v":""},null,null,null,null,{"$f":"IFERROR(ROUND(SUM(1000/K1156),2),\"\")","v":""},{"$f":"IFERROR(ROUND(SUM(N1156*O1156),2),\"\")","v":""},null,2]
["",null,null,"00:00:00",null,"","",null,"","",null,null,null,null,"","",null,2]
["",null,null,"00:00:00",null,"","",null,"","",null,null,null,null,"","",null,2]
["",null,null,"00:00:00",null,"","",null,"","",null,null,null,null,"","",null,2]
["",null,null,"00:00:00",null,"","",null,"","",null,null,null,null,"","",null,2]
["",null,null,"00:00:00",null,"","",null,"","",null,null,null,null,"","",null,2]
["",null,null,"00:00:00",null,"","",null,"","",null,null,null,null,"","",null,2]
["",null,null,"00:00:00",null,"","",null,"","",null,null,null,null,"","",null,2]
["",null,null,"00:00:00",null,"","",null,"","",null,null,null,null,"","",null,2]
["",null,null,"00:00:00",null,"","",null,"","",null,null,null,null,"","",null,2]
["",null,null,"00:00:00",null,"","",null,"","",null,null,null,null,"","",null,2]
["",null,null,"00:00:00",null,"","",null,"","",null,null,null,null,"","",null,2]
["",null,null,"00:00:00",null,"","",null,"","",null,null,null,null,"","",null,2]
["",null,null,"00:00:00",null,"","",null,"","",null,null,null,null,"","",null,2]
["",null,null,"00:00:00",null,"","",null,"","",null,null,null,null,"","",null,2]
["",null,null,"00:00:00",null,"","",null,"","",null,null,null,null,"","",null,2]
["",null,null,"00:00:00",null,"","",null,"","",null,null,null,null,"","",null,2]
["",null,null,"00:00:00",null,"","",null,"","",null,null,null,null,"","",null,2]
["",null,null,"00:00:00",null,"","",null,"","",null,null,null,null,"","",null,2]
["",null,null,"00:00:00",null,"","",null,"","",null,null,null,null,"","",null,2]
["",null,null,"00:00:00",null,"","",null,"","",null,null,null,null,"","",null,2]
["",null,null,"00:00:00",null,"","",null,"","",null,null,null,null,"","",null,2]
["",null,null,"00:00:00",null,"","",null,"","",null,null,null,null,"","",null,2]
["",null,null,"00:00:00",null,"","",null,"","",null,null,null,null,"","",null,2]
["",null,null,"00:00:00",null,"","",null,"","",null,null,null,null,"","",null,2]
["",null,null,"00:00:00",null,"","",null,"","",null,null,null,null,"","",null,2]
["",null,null,"00:00:00",null,"","",null,"","",null,null,null,null,"","",null,2]
["",null,null,"00:00:00",null,"","",null,"","",null,null,null,null,"","",null,2]
["",null,null,"00:00:00",null,"","",null,"","",null,null,null,null,"","",null,2]
["",null,null,"00:00:00",null,"","",null,"","",null,null,null,null,"","",null,2]
["",null,null,"00:00:00",null,"","",null,"","",null,null,null,null,"","",null,2]
["",null,null,"00:00:00",null,"","",null,"","",null,null,null,null,"","",null,2]
["",null,null,"00:00:00",null,"","",null,"","",null,null,null,null,"","",null,2]
["",null,null,"00:00:00",null,"","",null,"","",null,null,null,null,"","",null,2]
["",null,null,"00:00:00",null,"","",null,"","",null,null,null,null,"","",null,2]
["",null,null,"00:00:00",null,"","",null,"","",null,null,null,null,"","",null,2]
["",null,null,"00:00:00",null,"","",null,"","",null,null,null,null,"","",null,2]
["",null,null,"00:00:00",null,"","",null,"","",null,null,null,null,"","",null,2]
["",null,null,"00:00:00",null,"","",null,"","",null,null,null,null,"","",null,2]
["",null,null,"00:00:00",null,"","",null,"","",null,null,null,null,"","",null,2]
["",null,null,"00:00:00",null,"","",null,"","",null,null,null,null,"","",null,2]
["",null,null,"00:00:00",null,"","",null,"","",null,null,null,null,"","",null,2]
["",null,null,"00:00:00",null,"","",null,"","",null,null,null,null,"","",null,2]
["",null,null,"00:00:00",null,"","",null,"","",null,null,null,null,"","",null,2]
["",null,null,"00:00:00",null,"","",null,"","",null,null,null,null,"","",null,2]
["",null,null,"00:00:00",null,"","",null,"","",null,null,null,null,"","",null,2]
["",null,null,"00:00:00",null,"","",null,"","",null,null,null,null,"","",null,2]
["",null,null,"00:00:00",null,"","",null,"","",null,null,null,null,"","",null,2]
["",null,null,"00:00:00",null,"","",null,"","",null,null,null,null,"","",null,2]
["",null,null,"00:00:00",null,"","",null,"","",null,null,null,null,"","",null,2]
["",null,null,"00:00:00",null,"","",null,"","",null,null,null,null,"","",null,2]
["",null,null,"00:00:00",null,"","",null,"","",null,null,null,null,"","",null,2]
["",null,null,"00:00:00",null,"","",null,"","",null,null,null,null,"","",null,2]
["",null,null,"00:00:00",null,"","",null,"","",null,null,null,null,"","",null,2]
["",null,null,"00:00:00",null,"","",null,"","",null,null,null,null,"","",null,2]
["",null,null,"00:00:00",null,"","",null,"","",null,null,null,null,"","",null,2]
["",null,null,"00:00:00",null,"","",null,"","",null,null,null,null,"","",null,2]
["",null,null,"00:00:00",null,"","",null,"","",null,null,null,null,"","",null,2]
["",null,null,"00:00:00",null,"","",null,"","",null,null,null,null,"","",null,2]
["",null,null,"00:00:00",null,"","",null,"","",null,null,null,null,"","",null,2]
["",null,null,"00:00:00",null,"","",null,"","",null,null,null,null,"","",null,2]
["",null,null,"00:00:00",null,"","",null,"","",null,null,null,null,"","",null,2]
["",null,null,"00:00:00",null,"","",null,"","",null,null,null,null,"","",null,2]
["",null,null,"00:00:00",null,"","",null,"","",null,null,null,null,"","",null,2]
[{"$f":"IF(E1220=\"\",\"\",IF(A1220=\"\",TODAY(),A1220))","v":""},null,null,{"$f":"C1220-B1220+IF(B1220>C1220,1)","v":"00:00:00"},null,{"$f":"IFERROR(VLOOKUP(E1220,$AJ$2:$AL$3155,2,FALSE),\"\")","v":""},{"$f":"IFERROR(VLOOKUP(E1220,$AJ$2:$AL$3155,3,FALSE),\"\")","v":""},null,{"$f":"IFERROR(SUM(G1220/7),\"\")","v":""},{"$f":"IFERROR(SUM(N1220/C1220),\"\")","v":""},null,null,null,null,{"$f":"IFERROR(ROUND(SUM(1000/K1220),2),\"\")","v":""},{"$f":"IFERROR(ROUND(SUM(N1220*O1220),2),\"\")","v":""},null,2]
["",null,null,"00:00:00",null,"","",null,"","",null,null,null,null,"","",null,2]
["",null,null,"00:00:00",null,"","",null,"","",null,null,null,null,"","",null,2]
["",null,null,"00:00:00",null,"","",null,"","",null,null,null,null,"","",null,2]
["",null,null,"00:00:00",null,"","",null,"","",null,null,null,null,"","",null,2]
["",null,null,"00:00:00",null,"","",null,"","",null,null,null,null,"","",null,2]
["",null,null,"00:00:00",null,"","",null,"","",null,null,null,null,"","",null,2]
["",null,null,"00:00:00",null,"","",null,"","",null,null,null,null,"","",null,2]
["",null,null,"00:00:00",null,"","",null,"","",null,null,null,null,"","",null,2]
["",null,null,"00:00:00",null,"","",null,"","",null,null,null,null,"","",null,2]
["",null,null,"00:00:00",null,"","",null,"","",null,null,null,null,"","",null,2]
["",null,null,"00:00:00",null,"","",null,"","",null,null,null,null,"","",null,2]
["",null,null,"00:00:00",null,"","",null,"","",null,null,null,null,"","",null,2]
["",null,null,"00:00:00",null,"","",null,"","",null,null,null,null,"","",null,2]
["",null,null,"00:00:00",null,"","",null,"","",null,null,null,null,"","",null,2]
["",null,null,"00:00:00",null,"","",null,"","",null,null,null,null,"","",null,2]
["",null,null,"00:00:00",null,"","",null,"","",null,null,null,null,"","",null,2]
["",null,null,"00:00:00",null,"","",null,"","",null,null,null,null,"","",null,2]
["",null,null,"00:00:00",null,"","",null,"","",null,null,null,null,"","",null,2]
["",null,null,"00:00:00",null,"","",null,"","",null,null,null,null,"","",null,2]
["",null,null,"00:00:00",null,"","",null,"","",null,null,null,null,"","",null,2]
["",null,null,"00:00:00",null,"","",null,"","",null,null,null,null,"","",null,2]
["",null,null,"00:00:00",null,"","",null,"","",null,null,null,null,"","",null,2]
["",null,null,"00:00:00",null,"","",null,"","",null,null,null,null,"","",null,2]
["",null,null,"00:00:00",null,"","",null,"","",null,null,null,null,"","",null,2]
["",null,null,"00:00:00",null,"","",null,"","",null,null,null,null,"","",null,2]
["",null,null,"00:00:00",null,"","",null,"","",null,null,null,null,"","",null,2]
["",null,null,"00:00:00",null,"","",null,"","",null,null,null,null,"","",null,2]
["",null,null,"00:00:00",null,"","",null,"","",null,null,null,null,"","",null,2]
["",null,null,"00:00:00",null,"","",null,"","",null,null,null,null,"","",null,2]
["",null,null,"00:00:00",null,"","",null,"","",null,null,null,null,"","",null,2]
["",null,null,"00:00:00",null,"","",null,"","",null,null,null,null,"","",null,2]
["",null,null,"00:00:00",null,"","",null,"","",null,null,null,null,"","",null,2]
["",null,null,"00:00:00",null,"","",null,"","",null,null,null,null,"","",null,2]
["",null,null,"00:00:00",null,"","",null,"","",null,null,null,null,"","",null,2]
["",null,null,"00:00:00",null,"","",null,"","",null,null,null,null,"","",null,2]
["",null,null,"00:00:00",null,"","",null,"","",null,null,null,null,"","",null,2]
["",null,null,"00:00:00",null,"","",null,"","",null,null,null,null,"","",null,2]
["",null,null,"00:00:00",null,"","",null,"","",null,null,null,null,"","",null,2]
["",null,null,"00:00:00",null,"","",null,"","",null,null,null,null,"","",null,2]
["",null,null,"00:00:00",null,"","",null,"","",null,null,null,null,"","",null,2]
["",null,null,"00:00:00",null,"","",null,"","",null,null,null,null,"","",null,2]
["",null,null,"00:00:00",null,"","",null,"","",null,null,null,null,"","",null,2]
["",null,null,"00:00:00",null,"","",null,"","",null,null,null,null,"","",null,2]
["",null,null,"00:00:00",null,"","",null,"","",null,null,null,null,"","",null,2]
["",null,null,"00:00:00",null,"","",null,"","",null,null,null,null,"","",null,2]
["",null,null,"00:00:00",null,"","",null,"","",null,null,null,null,"","",null,2]
["",null,null,"00:00:00",null,"","",null,"","",null,null,null,null,"","",null,2]
["",null,null,"00:00:00",null,"","",null,"","",null,null,null,null,"","",null,2]
["",null,null,"00:00:00",null,"","",null,"","",null,null,null,null,"","",null,2]
["",null,null,"00:00:00",null,"","",null,"","",null,null,null,null,"","",null,2]
["",null,null,"00:00:00",null,"","",null,"","",null,null,null,null,"","",null,2]
["",null,null,"00:00:00",null,"","",null,"","",null,null,null,null,"","",null,2]
["",null,null,"00:00:00",null,"","",null,"","",null,null,null,null,"","",null,2]
["",null,null,"00:00:00",null,"","",null,"","",null,null,null,null,"","",null,2]
["",null,null,"00:00:00",null,"","",null,"","",null,null,null,null,"","",null,2]
["",null,null,"00:00:00",null,"","",null,"","",null,null,null,null,"","",null,2]
["",null,null,"00:00:00",null,"","",null,"","",null,null,null,null,"","",null,2]
["",null,null,"00:00:00",null,"","",null,"","",null,null,null,null,"","",null,2]
["",null,null,"00:00:00",null,"","",null,"","",null,null,null,null,"","",null,2]
["",null,null,"00:00:00",null,"","",null,"","",null,null,null,null,"","",null,2]
["",null,null,"00:00:00",null,"","",null,"","",null,null,null,null,"","",null,2]
["",null,null,"00:00:00",null,"","",null,"","",null,null,null,null,"","",null,2]
["",null,null,"00:00:00",null,"","",null,"","",null,null,null,null,"","",null,2]
[{"$f":"IF(E1284=\"\",\"\",IF(A1284=\"\",TODAY(),A1284))","v":""},null,null,{"$f":"C1284-B1284+IF(B1284>C1284,1)","v":"00:00:00"},null,{"$f":"IFERROR(VLOOKUP(E1284,$AJ$2:$AL$3155,2,FALSE),\"\")","v":""},{"$f":"IFERROR(VLOOKUP(E1284,$AJ$2:$AL$3155,3,FALSE),\"\")","v":""},null,{"$f":"IFERROR(SUM(G1284/7),\"\")","v":""},{"$f":"IFERROR(SUM(N1284/C1284),\"\")","v":""},null,null,null,null,{"$f":"IFERROR(ROUND(SUM(1000/K1284),2),\"\")","v":""},{"$f":"IFERROR(ROUND(SUM(N1284*O1284),2),\"\")","v":""},null,2]
["",null,null,"00:00:00",null,"","",null,"","",null,null,null,null,"","",null,2]
["",null,null,"00:00:00",null,"","",null,"","",null,null,null,null,"","",null,2]
["",null,null,"00:00:00",null,"","",null,"","",null,null,null,null,"","",null,2]
["",null,null,"00:00:00",null,"","",null,"","",null,null,null,null,"","",null,2]
["",null,null,"00:00:00",null,"","",null,"","",null,null,null,null,"","",null,2]
["",null,null,"00:00:00",null,"","",null,"","",null,null,null,null,"","",null,2]
["",null,null,"00:00:00",null,"","",null,"","",null,null,null,null,"","",null,2]
["",null,null,"00:00:00",null,"","",null,"","",null,null,null,null,"","",null,2]
["",null,null,"00:00:00",null,"","",null,"","",null,null,null,null,"","",null,2]
["",null,null,"00:00:00",null,"","",null,"","",null,null,null,null,"","",null,2]
["",null,null,"00:00:00",null,"","",null,"","",null,null,null,null,"","",null,2]
["",null,null,"00:00:00",null,"","",null,"","",null,null,null,null,"","",null,2]
["",null,null,"00:00:00",null,"","",null,"","",null,null,null,null,"","",null,2]
["",null,null,"00:00:00",null,"","",null,"","",null,null,null,null,"","",null,2]
["",null,null,"00:00:00",null,"","",null,"","",null,null,null,null,"","",null,2]
["",null,null,"00:00:00",null,"","",null,"","",null,null,null,null,"","",null,2]
["",null,null,"00:00:00",null,"","",null,"","",null,null,null,null,"","",null,2]
["",null,null,"00:00:00",null,"","",null,"","",null,null,null,null,"","",null,2]
["",null,null,"00:00:00",null,"","",null,"","",null,null,null,null,"","",null,2]
["",null,null,"00:00:00",null,"","",null,"","",null,null,null,null,"","",null,2]
["",null,null,"00:00:00",null,"","",null,"","",null,null,null,null,"","",null,2]
["",null,null,"00:00:00",null,"","",null,"","",null,null,null,null,"","",null,2]
["",null,null,"00:00:00",null,"","",null,"","",null,null,null,null,"","",null,2]
["",null,null,"00:00:00",null,"","",null,"","",null,null,null,null,"","",null,2]
["",null,null,"00:00:00",null,"","",null,"","",null,null,null,null,"","",null,2]
["",null,null,"00:00:00",null,"","",null,"","",null,null,null,null,"","",null,2]
["",null,null,"00:00:00",null,"","",null,"","",null,null,null,null,"","",null,2]
["",null,null,"00:00:00",null,"","",null,"","",null,null,null,null,"","",null,2]
["",null,null,"00:00:00",null,"","",null,"","",null,null,null,null,"","",null,2]
["",null,null,"00:00:00",null,"","",null,"","",null,null,null,null,"","",null,2]
["",null,null,"00:00:00",null,"","",null,"","",null,null,null,null,"","",null,2]
["",null,null,"00:00:00",null,"","",null,"","",null,null,null,null,"","",null,2]
["",null,null,"00:00:00",null,"","",null,"","",null,null,null,null,"","",null,2]
["",null,null,"00:00:00",null,"","",null,"","",null,null,null,null,"","",null,2]
["",null,null,"00:00:00",null,"","",null,"","",null,null,null,null,"","",null,2]
["",null,null,"00:00:00",null,"","",null,"","",null,null,null,null,"","",null,2]
["",null,null,"00:00:00",null,"","",null,"","",null,null,null,null,"","",null,2]
["",null,null,"00:00:00",null,"","",null,"","",null,null,null,null,"","",null,2]
["",null,null,"00:00:00",null,"","",null,"","",null,null,null,null,"","",null,2]
["",null,null,"00:00:00",null,"","",null,"","",null,null,null,null,"","",null,2]
["",null,null,"00:00:00",null,"","",null,"","",null,null,null,null,"","",null,2]
["",null,null,"00:00:00",null,"","",null,"","",null,null,null,null,"","",null,2]
["",null,null,"00:00:00",null,"","",null,"","",null,null,null,null,"","",null,2]
["",null,null,"00:00:00",null,"","",null,"","",null,null,null,null,"","",null,2]
["",null,null,"00:00:00",null,"","",null,"","",null,null,null,null,"","",null,2]
["",null,null,"00:00:00",null,"","",null,"","",null,null,null,null,"","",null,2]
["",null,null,"00:00:00",null,"","",null,"","",null,null,null,null,"","",null,2]
["",null,null,"00:00:00",null,"","",null,"","",null,null,null,null,"","",null,2]
["",null,null,"00:00:00",null,"","",null,"","",null,null,null,null,"","",null,2]
["",null,null,"00:00:00",null,"","",null,"","",null,null,null,null,"","",null,2]
["",null,null,"00:00:00",null,"","",null,"","",null,null,null,null,"","",null,2]
["",null,null,"00:00:00",null,"","",null,"","",null,null,null,null,"","",null,2]
["",null,null,"00:00:00",null,"","",null,"","",null,null,null,null,"","",null,2]
["",null,null,"00:00:00",null,"","",null,"","",null,null,null,null,"","",null,2]
["",null,null,"00:00:00",null,"","",null,"","",null,null,null,null,"","",null,2]
["",null,null,"00:00:00",null,"","",null,"","",null,null,null,null,"","",null,2]
["",null,null,"00:00:00",null,"","",null,"","",null,null,null,null,"","",null,2]
["",null,null,"00:00:00",null,"","",null,"","",null,null,null,null,"","",null,2]
["",null,null,"00:00:00",null,"","",null,"","",null,null,null,null,"","",null,2]
["",null,null,"00:00:00",null,"","",null,"","",null,null,null,null,"","",null,2]
["",null,null,"00:00:00",null,"","",null,"","",null,null,null,null,"","",null,2]
["",null,null,"00:00:00",null,"","",null,"","",null,null,null,null,"","",null,2]
["",null,null,"00:00:00",null,"","",null,"","",null,null,null,null,"","",null,2]
[{"$f":"IF(E1348=\"\",\"\",IF(A1348=\"\",TODAY(),A1348))","v":""},null,null,{"$f":"C1348-B1348+IF(B1348>C1348,1)","v":"00:00:00"},null,{"$f":"IFERROR(VLOOKUP(E1348,$AJ$2:$AL$3155,2,FALSE),\"\")","v":""},{"$f":"IFERROR(VLOOKUP(E1348,$AJ$2:$AL$3155,3,FALSE),\"\")","v":""},null,{"$f":"IFERROR(SUM(G1348/7),\"\")","v":""},{"$f":"IFERROR(SUM(N1348/C1348),\"\")","v":""},null,null,null,null,{"$f":"IFERROR(ROUND(SUM(1000/K1348),2),\"\")","v":""},{"$f":"IFERROR(ROUND(SUM(N1348*O1348),2),\"\")","v":""},null,2]
["",null,null,"00:00:00",null,"","",null,"","",null,null,null,null,"","",null,2]
["",null,null,"00:00:00",null,"","",null,"","",null,null,null,null,"","",null,2]
["",null,null,"00:00:00",null,"","",null,"","",null,null,null,null,"","",null,2]
["",null,null,"00:00:00",null,"","",null,"","",null,null,null,null,"","",null,2]
["",null,null,"00:00:00",null,"","",null,"","",null,null,null,null,"","",null,2]
["",null,null,"00:00:00",null,"","",null,"","",null,null,null,null,"","",null,2]
["",null,null,"00:00:00",null,"","",null,"","",null,null,null,null,"","",null,2]
["",null,null,"00:00:00",null,"","",null,"","",null,null,null,null,"","",null,2]
["",null,null,"00:00:00",null,"","",null,"","",null,null,null,null,"","",null,2]
["",null,null,"00:00:00",null,"","",null,"","",null,null,null,null,"","",null,2]
["",null,null,"00:00:00",null,"","",null,"","",null,null,null,null,"","",null,2]
["",null,null,"00:00:00",null,"","",null,"","",null,null,null,null,"","",null,2]
["",null,null,"00:00:00",null,"","",null,"","",null,null,null,null,"","",null,2]
["",null,null,"00:00:00",null,"","",null,"","",null,null,null,null,"","",null,2]
["",null,null,"00:00:00",null,"","",null,"","",null,null,null,null,"","",null,2]
["",null,null,"00:00:00",null,"","",null,"","",null,null,null,null,"","",null,2]
["",null,null,"00:00:00",null,"","",null,"","",null,null,null,null,"","",null,2]
["",null,null,"00:00:00",null,"","",null,"","",null,null,null,null,"","",null,2]
["",null,null,"00:00:00",null,"","",null,"","",null,null,null,null,"","",null,2]
["",null,null,"00:00:00",null,"","",null,"","",null,null,null,null,"","",null,2]
["",null,null,"00:00:00",null,"","",null,"","",null,null,null,null,"","",null,2]
["",null,null,"00:00:00",null,"","",null,"","",null,null,null,null,"","",null,2]
["",null,null,"00:00:00",null,"","",null,"","",null,null,null,null,"","",null,2]
["",null,null,"00:00:00",null,"","",null,"","",null,null,null,null,"","",null,2]
["",null,null,"00:00:00",null,"","",null,"","",null,null,null,null,"","",null,2]
["",null,null,"00:00:00",null,"","",null,"","",null,null,null,null,"","",null,2]
["",null,null,"00:00:00",null,"","",null,"","",null,null,null,null,"","",null,2]
["",null,null,"00:00:00",null,"","",null,"","",null,null,null,null,"","",null,2]
["",null,null,"00:00:00",null,"","",null,"","",null,null,null,null,"","",null,2]
["",null,null,"00:00:00",null,"","",null,"","",null,null,null,null,"","",null,2]
["",null,null,"00:00:00",null,"","",null,"","",null,null,null,null,"","",null,2]
["",null,null,"00:00:00",null,"","",null,"","",null,null,null,null,"","",null,2]
["",null,null,"00:00:00",null,"","",null,"","",null,null,null,null,"","",null,2]
["",null,null,"00:00:00",null,"","",null,"","",null,null,null,null,"","",null,2]
["",null,null,"00:00:00",null,"","",null,"","",null,null,null,null,"","",null,2]
["",null,null,"00:00:00",null,"","",null,"","",null,null,null,null,"","",null,2]
["",null,null,"00:00:00",null,"","",null,"","",null,null,null,null,"","",null,2]
["",null,null,"00:00:00",null,"","",null,"","",null,null,null,null,"","",null,2]
["",null,null,"00:00:00",null,"","",null,"","",null,null,null,null,"","",null,2]
["",null,null,"00:00:00",null,"","",null,"","",null,null,null,null,"","",null,2]
["",null,null,"00:00:00",null,"","",null,"","",null,null,null,null,"","",null,2]
["",null,null,"00:00:00",null,"","",null,"","",null,null,null,null,"","",null,2]
["",null,null,"00:00:00",null,"","",null,"","",null,null,null,null,"","",null,2]
["",null,null,"00:00:00",null,"","",null,"","",null,null,null,null,"","",null,2]
["",null,null,"00:00:00",null,"","",null,"","",null,null,null,null,"","",null,2]
["",null,null,"00:00:00",null,"","",null,"","",null,null,null,null,"","",null,2]
["",null,null,"00:00:00",null,"","",null,"","",null,null,null,null,"","",null,2]
["",null,null,"00:00:00",null,"","",null,"","",null,null,null,null,"","",null,2]
["",null,null,"00:00:00",null,"","",null,"","",null,null,null,null,"","",null,2]
["",null,null,"00:00:00",null,"","",null,"","",null,null,null,null,"","",null,2]
["",null,null,"00:00:00",null,"","",null,"","",null,null,null,null,"","",null,2]
["",null,null,"00:00:00",null,"","",null,"","",null,null,null,null,"","",null,2]
["",null,null,"00:00:00",null,"","",null,"","",null,null,null,null,"","",null,2]
["",null,null,"00:00:00",null,"","",null,"","",null,null,null,null,"","",null,2]
["",null,null,"00:00:00",null,"","",null,"","",null,null,null,null,"","",null,2]
["",null,null,"00:00:00",null,"","",null,"","",null,null,null,null,"","",null,2]
["",null,null,"00:00:00",null,"","",null,"","",null,null,null,null,"","",null,2]
["",null,null,"00:00:00",null,"","",null,"","",null,null,null,null,"","",null,2]
["",null,null,"00:00:00",null,"","",null,"","",null,null,null,null,"","",null,2]
["",null,null,"00:00:00",null,"","",null,"","",null,null,null,null,"","",null,2]
["",null,null,"00:00:00",null,"","",null,"","",null,null,null,null,"","",null,2]
["",null,null,"00:00:00",null,"","",null,"","",null,null,null,null,"","",null,2]
["",null,null,"00:00:00",null,"","",null,"","",null,null,null,null,"","",null,2]
[{"$f":"IF(E1412=\"\",\"\",IF(A1412=\"\",TODAY(),A1412))","v":""},null,null,{"$f":"C1412-B1412+IF(B1412>C1412,1)","v":"00:00:00"},null,{"$f":"IFERROR(VLOOKUP(E1412,$AJ$2:$AL$3155,2,FALSE),\"\")","v":""},{"$f":"IFERROR(VLOOKUP(E1412,$AJ$2:$AL$3155,3,FALSE),\"\")","v":""},null,{"$f":"IFERROR(SUM(G1412/7),\"\")","v":""},{"$f":"IFERROR(SUM(N1412/C1412),\"\")","v":""},null,null,null,null,{"$f":"IFERROR(ROUND(SUM(1000/K1412),2),\"\")","v":""},{"$f":"IFERROR(ROUND(SUM(N1412*O1412),2),\"\")","v":""},null,2]
["",null,null,"00:00:00",null,"","",null,"","",null,null,null,null,"","",null,2]
["",null,null,"00:00:00",null,"","",null,"","",null,null,null,null,"","",null,2]
["",null,null,"00:00:00",null,"","",null,"","",null,null,null,null,"","",null,2]
["",null,null,"00:00:00",null,"","",null,"","",null,null,null,null,"","",null,2]
["",null,null,"00:00:00",null,"","",null,"","",null,null,null,null,"","",null,2]
["",null,null,"00:00:00",null,"","",null,"","",null,null,null,null,"","",null,2]
["",null,null,"00:00:00",null,"","",null,"","",null,null,null,null,"","",null,2]
["",null,null,"00:00:00",null,"","",null,"","",null,null,null,null,"","",null,2]
["",null,null,"00:00:00",null,"","",null,"","",null,null,null,null,"","",null,2]
["",null,null,"00:00:00",null,"","",null,"","",null,null,null,null,"","",null,2]
["",null,null,"00:00:00",null,"","",null,"","",null,null,null,null,"","",null,2]
["",null,null,"00:00:00",null,"","",null,"","",null,null,null,null,"","",null,2]
["",null,null,"00:00:00",null,"","",null,"","",null,null,null,null,"","",null,2]
["",null,null,"00:00:00",null,"","",null,"","",null,null,null,null,"","",null,2]
["",null,null,"00:00:00",null,"","",null,"","",null,null,null,null,"","",null,2]
["",null,null,"00:00:00",null,"","",null,"","",null,null,null,null,"","",null,2]
["",null,null,"00:00:00",null,"","",null,"","",null,null,null,null,"","",null,2]
["",null,null,"00:00:00",null,"","",null,"","",null,null,null,null,"","",null,2]
["",null,null,"00:00:00",null,"","",null,"","",null,null,null,null,"","",null,2]
["",null,null,"00:00:00",null,"","",null,"","",null,null,null,null,"","",null,2]
["",null,null,"00:00:00",null,"","",null,"","",null,null,null,null,"","",null,2]
["",null,null,"00:00:00",null,"","",null,"","",null,null,null,null,"","",null,2]
["",null,null,"00:00:00",null,"","",null,"","",null,null,null,null,"","",null,2]
["",null,null,"00:00:00",null,"","",null,"","",null,null,null,null,"","",null,2]
["",null,null,"00:00:00",null,"","",null,"","",null,null,null,null,"","",null,2]
["",null,null,"00:00:00",null,"","",null,"","",null,null,null,null,"","",null,2]
["",null,null,"00:00:00",null,"","",null,"","",null,null,null,null,"","",null,2]
["",null,null,"00:00:00",null,"","",null,"","",null,null,null,null,"","",null,2]
["",null,null,"00:00:00",null,"","",null,"","",null,null,null,null,"","",null,2]
["",null,null,"00:00:00",null,"","",null,"","",null,null,null,null,"","",null,2]
["",null,null,"00:00:00",null,"","",null,"","",null,null,null,null,"","",null,2]
["",null,null,"00:00:00",null,"","",null,"","",null,null,null,null,"","",null,2]
["",null,null,"00:00:00",null,"","",null,"","",null,null,null,null,"","",null,2]
["",null,null,"00:00:00",null,"","",null,"","",null,null,null,null,"","",null,2]
["",null,null,"00:00:00",null,"","",null,"","",null,null,null,null,"","",null,2]
["",null,null,"00:00:00",null,"","",null,"","",null,null,null,null,"","",null,2]
["",null,null,"00:00:00",null,"","",null,"","",null,null,null,null,"","",null,2]
["",null,null,"00:00:00",null,"","",null,"","",null,null,null,null,"","",null,2]
["",null,null,"00:00:00",null,"","",null,"","",null,null,null,null,"","",null,2]
["",null,null,"00:00:00",null,"","",null,"","",null,null,null,null,"","",null,2]
["",null,null,"00:00:00",null,"","",null,"","",null,null,null,null,"","",null,2]
["",null,null,"00:00:00",null,"","",null,"","",null,null,null,null,"","",null,2]
["",null,null,"00:00:00",null,"","",null,"","",null,null,null,null,"","",null,2]
["",null,null,"00:00:00",null,"","",null,"","",null,null,null,null,"","",null,2]
["",null,null,"00:00:00",null,"","",null,"","",null,null,null,null,"","",null,2]
["",null,null,"00:00:00",null,"","",null,"","",null,null,null,null,"","",null,2]
["",null,null,"00:00:00",null,"","",null,"","",null,null,null,null,"","",null,2]
["",null,null,"00:00:00",null,"","",null,"","",null,null,null,null,"","",null,2]
["",null,null,"00:00:00",null,"","",null,"","",null,null,null,null,"","",null,2]
["",null,null,"00:00:00",null,"","",null,"","",null,null,null,null,"","",null,2]
["",null,null,"00:00:00",null,"","",null,"","",null,null,null,null,"","",null,2]
["",null,null,"00:00:00",null,"","",null,"","",null,null,null,null,"","",null,2]
["",null,null,"00:00:00",null,"","",null,"","",null,null,null,null,"","",null,2]
["",null,null,"00:00:00",null,"","",null,"","",null,null,null,null,"","",null,2]
["",null,null,"00:00:00",null,"","",null,"","",null,null,null,null,"","",null,2]
["",null,null,"00:00:00",null,"","",null,"","",null,null,null,null,"","",null,2]
["",null,null,"00:00:00",null,"","",null,"","",null,null,null,null,"","",null,2]
["",null,null,"00:00:00",null,"","",null,"","",null,null,null,null,"","",null,2]
["",null,null,"00:00:00",null,"","",null,"","",null,null,null,null,"","",null,2]
["",null,null,"00:00:00",null,"","",null,"","",null,null,null,null,"","",null,2]
["",null,null,"00:00:00",null,"","",null,"","",null,null,null,null,"","",null,2]
["",null,null,"00:00:00",null,"","",null,"","",null,null,null,null,"","",null,2]
["",null,null,"00:00:00",null,"","",null,"","",null,null,null,null,"","",null,2]
[{"$f":"IF(E1476=\"\",\"\",IF(A1476=\"\",TODAY(),A1476))","v":""},null,null,{"$f":"C1476-B1476+IF(B1476>C1476,1)","v":"00:00:00"},null,{"$f":"IFERROR(VLOOKUP(E1476,$AJ$2:$AL$3155,2,FALSE),\"\")","v":""},{"$f":"IFERROR(VLOOKUP(E1476,$AJ$2:$AL$3155,3,FALSE),\"\")","v":""},null,{"$f":"IFERROR(SUM(G1476/7),\"\")","v":""},{"$f":"IFERROR(SUM(N1476/C1476),\"\")","v":""},null,null,null,null,{"$f":"IFERROR(ROUND(SUM(1000/K1476),2),\"\")","v":""},{"$f":"IFERROR(ROUND(SUM(N1476*O1476),2),\"\")","v":""},null,2]
["",null,null,"00:00:00",null,"","",null,"","",null,null,null,null,"","",null,2]
["",null,null,"00:00:00",null,"","",null,"","",null,null,null,null,"","",null,2]
["",null,null,"00:00:00",null,"","",null,"","",null,null,null,null,"","",null,2]
["",null,null,"00:00:00",null,"","",null,"","",null,null,null,null,"","",null,2]
["",null,null,"00:00:00",null,"","",null,"","",null,null,null,null,"","",null,2]
["",null,null,"00:00:00",null,"","",null,"","",null,null,null,null,"","",null,2]
["",null,null,"00:00:00",null,"","",null,"","",null,null,null,null,"","",null,2]
["",null,null,"00:00:00",null,"","",null,"","",null,null,null,null,"","",null,2]
["",null,null,"00:00:00",null,"","",null,"","",null,null,null,null,"","",null,2]
["",null,null,"00:00:00",null,"","",null,"","",null,null,null,null,"","",null,2]
["",null,null,"00:00:00",null,"","",null,"","",null,null,null,null,"","",null,2]
["",null,null,"00:00:00",null,"","",null,"","",null,null,null,null,"","",null,2]
["",null,null,"00:00:00",null,"","",null,"","",null,null,null,null,"","",null,2]
["",null,null,"00:00:00",null,"","",null,"","",null,null,null,null,"","",null,2]
["",null,null,"00:00:00",null,"","",null,"","",null,null,null,null,"","",null,2]
["",null,null,"00:00:00",null,"","",null,"","",null,null,null,null,"","",null,2]
["",null,null,"00:00:00",null,"","",null,"","",null,null,null,null,"","",null,2]
["",null,null,"00:00:00",null,"","",null,"","",null,null,null,null,"","",null,2]
["",null,null,"00:00:00",null,"","",null,"","",null,null,null,null,"","",null,2]
["",null,null,"00:00:00",null,"","",null,"","",null,null,null,null,"","",null,2]
["",null,null,"00:00:00",null,"","",null,"","",null,null,null,null,"","",null,2]
["",null,null,"00:00:00",null,"","",null,"","",null,null,null,null,"","",null,2]
["",null,null,"00:00:00",null,"","",null,"","",null,null,null,null,"","",null,2]
["",null,null,"00:00:00",null,"","",null,"","",null,null,null,null,"","",null,2]
["",null,null,"00:00:00",null,"","",null,"","",null,null,null,null,"","",null,2]
["",null,null,"00:00:00",null,"","",null,"","",null,null,null,null,"","",null,2]
["",null,null,"00:00:00",null,"","",null,"","",null,null,null,null,"","",null,2]
["",null,null,"00:00:00",null,"","",null,"","",null,null,null,null,"","",null,2]
["",null,null,"00:00:00",null,"","",null,"","",null,null,null,null,"","",null,2]
["",null,null,"00:00:00",null,"","",null,"","",null,null,null,null,"","",null,2]
["",null,null,"00:00:00",null,"","",null,"","",null,null,null,null,"","",null,2]
["",null,null,"00:00:00",null,"","",null,"","",null,null,null,null,"","",null,2]
["",null,null,"00:00:00",null,"","",null,"","",null,null,null,null,"","",null,2]
["",null,null,"00:00:00",null,"","",null,"","",null,null,null,null,"","",null,2]
["",null,null,"00:00:00",null,"","",null,"","",null,null,null,null,"","",null,2]
["",null,null,"00:00:00",null,"","",null,"","",null,null,null,null,"","",null,2]
["",null,null,"00:00:00",null,"","",null,"","",null,null,null,null,"","",null,2]
["",null,null,"00:00:00",null,"","",null,"","",null,null,null,null,"","",null,2]
["",null,null,"00:00:00",null,"","",null,"","",null,null,null,null,"","",null,2]
["",null,null,"00:00:00",null,"","",null,"","",null,null,null,null,"","",null,2]
["",null,null,"00:00:00",null,"","",null,"","",null,null,null,null,"","",null,2]
["",null,null,"00:00:00",null,"","",null,"","",null,null,null,null,"","",null,2]
["",null,null,"00:00:00",null,"","",null,"","",null,null,null,null,"","",null,2]
["",null,null,"00:00:00",null,"","",null,"","",null,null,null,null,"","",null,2]
["",null,null,"00:00:00",null,"","",null,"","",null,null,null,null,"","",null,2]
["",null,null,"00:00:00",null,"","",null,"","",null,null,null,null,"","",null,2]
["",null,null,"00:00:00",null,"","",null,"","",null,null,null,null,"","",null,2]
["",null,null,"00:00:00",null,"","",null,"","",null,null,null,null,"","",null,2]
["",null,null,"00:00:00",null,"","",null,"","",null,null,null,null,"","",null,2]
["",null,null,"00:00:00",null,"","",null,"","",null,null,null,null,"","",null,2]
["",null,null,"00:00:00",null,"","",null,"","",null,null,null,null,"","",null,2]
["",null,null,"00:00:00",null,"","",null,"","",null,null,null,null,"","",null,2]
["",null,null,"00:00:00",null,"","",null,"","",null,null,null,null,"","",null,2]
["",null,null,"00:00:00",null,"","",null,"","",null,null,null,null,"","",null,2]
["",null,null,"00:00:00",null,"","",null,"","",null,null,null,null,"","",null,2]
["",null,null,"00:00:00",null,"","",null,"","",null,null,null,null,"","",null,2]
["",null,null,"00:00:00",null,"","",null,"","",null,null,null,null,"","",null,2]
["",null,null,"00:00:00",null,"","",null,"","",null,null,null,null,"","",null,2]
["",null,null,"00:00:00",null,"","",null,"","",null,null,null,null,"","",null,2]
["",null,null,"00:00:00",null,"","",null,"","",null,null,null,null,"","",null,2]
["",null,null,"00:00:00",null,"","",null,"","",null,null,null,null,"","",null,2]
["",null,null,"00:00:00",null,"","",null,"","",null,null,null,null,"","",null,2]
["",null,null,"00:00:00",null,"","",null,"","",null,null,null,null,"","",null,2]
[{"$f":"IF(E1540=\"\",\"\",IF(A1540=\"\",TODAY(),A1540))","v":""},null,null,{"$f":"C1540-B1540+IF(B1540>C1540,1)","v":"00:00:00"},null,{"$f":"IFERROR(VLOOKUP(E1540,$AJ$2:$AL$3155,2,FALSE),\"\")","v":""},{"$f":"IFERROR(VLOOKUP(E1540,$AJ$2:$AL$3155,3,FALSE),\"\")","v":""},null,{"$f":"IFERROR(SUM(G1540/7),\"\")","v":""},{"$f":"IFERROR(SUM(N1540/C1540),\"\")","v":""},null,null,null,null,{"$f":"IFERROR(ROUND(SUM(1000/K1540),2),\"\")","v":""},{"$f":"IFERROR(ROUND(SUM(N1540*O1540),2),\"\")","v":""},null,2]
["",null,null,"00:00:00",null,"","",null,"","",null,null,null,null,"","",null,2]
["",null,null,"00:00:00",null,"","",null,"","",null,null,null,null,"","",null,2]
["",null,null,"00:00:00",null,"","",null,"","",null,null,null,null,"","",null,2]
["",null,null,"00:00:00",null,"","",null,"","",null,null,null,null,"","",null,2]
["",null,null,"00:00:00",null,"","",null,"","",null,null,null,null,"","",null,2]
["",null,null,"00:00:00",null,"","",null,"","",null,null,null,null,"","",null,2]
["",null,null,"00:00:00",null,"","",null,"","",null,null,null,null,"","",null,2]
["",null,null,"00:00:00",null,"","",null,"","",null,null,null,null,"","",null,2]
["",null,null,"00:00:00",null,"","",null,"","",null,null,null,null,"","",null,2]
["",null,null,"00:00:00",null,"","",null,"","",null,null,null,null,"","",null,2]
["",null,null,"00:00:00",null,"","",null,"","",null,null,null,null,"","",null,2]
["",null,null,"00:00:00",null,"","",null,"","",null,null,null,null,"","",null,2]
["",null,null,"00:00:00",null,"","",null,"","",null,null,null,null,"","",null,2]
["",null,null,"00:00:00",null,"","",null,"","",null,null,null,null,"","",null,2]
["",null,null,"00:00:00",null,"","",null,"","",null,null,null,null,"","",null,2]
["",null,null,"00:00:00",null,"","",null,"","",null,null,null,null,"","",null,2]
["",null,null,"00:00:00",null,"","",null,"","",null,null,null,null,"","",null,2]
["",null,null,"00:00:00",null,"","",null,"","",null,null,null,null,"","",null,2]
["",null,null,"00:00:00",null,"","",null,"","",null,null,null,null,"","",null,2]
["",null,null,"00:00:00",null,"","",null,"","",null,null,null,null,"","",null,2]
["",null,null,"00:00:00",null,"","",null,"","",null,null,null,null,"","",null,2]
["",null,null,"00:00:00",null,"","",null,"","",null,null,null,null,"","",null,2]
["",null,null,"00:00:00",null,"","",null,"","",null,null,null,null,"","",null,2]
["",null,null,"00:00:00",null,"","",null,"","",null,null,null,null,"","",null,2]
["",null,null,"00:00:00",null,"","",null,"","",null,null,null,null,"","",null,2]
["",null,null,"00:00:00",null,"","",null,"","",null,null,null,null,"","",null,2]
["",null,null,"00:00:00",null,"","",null,"","",null,null,null,null,"","",null,2]
["",null,null,"00:00:00",null,"","",null,"","",null,null,null,null,"","",null,2]
["",null,null,"00:00:00",null,"","",null,"","",null,null,null,null,"","",null,2]
["",null,null,"00:00:00",null,"","",null,"","",null,null,null,null,"","",null,2]
["",null,null,"00:00:00",null,"","",null,"","",null,null,null,null,"","",null,2]
["",null,null,"00:00:00",null,"","",null,"","",null,null,null,null,"","",null,2]
["",null,null,"00:00:00",null,"","",null,"","",null,null,null,null,"","",null,2]
["",null,null,"00:00:00",null,"","",null,"","",null,null,null,null,"","",null,2]
["",null,null,"00:00:00",null,"","",null,"","",null,null,null,null,"","",null,2]
["",null,null,"00:00:00",null,"","",null,"","",null,null,null,null,"","",null,2]
["",null,null,"00:00:00",null,"","",null,"","",null,null,null,null,"","",null,2]
["",null,null,"00:00:00",null,"","",null,"","",null,null,null,null,"","",null,2]
["",null,null,"00:00:00",null,"","",null,"","",null,null,null,null,"","",null,2]
["",null,null,"00:00:00",null,"","",null,"","",null,null,null,null,"","",null,2]
["",null,null,"00:00:00",null,"","",null,"","",null,null,null,null,"","",null,2]
["",null,null,"00:00:00",null,"","",null,"","",null,null,null,null,"","",null,2]
["",null,null,"00:00:00",null,"","",null,"","",null,null,null,null,"","",null,2]
["",null,null,"00:00:00",null,"","",null,"","",null,null,null,null,"","",null,2]
["",null,null,"00:00:00",null,"","",null,"","",null,null,null,null,"","",null,2]
["",null,null,"00:00:00",null,"","",null,"","",null,null,null,null,"","",null,2]
["",null,null,"00:00:00",null,"","",null,"","",null,null,null,null,"","",null,2]
["",null,null,"00:00:00",null,"","",null,"","",null,null,null,null,"","",null,2]
["",null,null,"00:00:00",null,"","",null,"","",null,null,null,null,"","",null,2]
["",null,null,"00:00:00",null,"","",null,"","",null,null,null,null,"","",null,2]
["",null,null,"00:00:00",null,"","",null,"","",null,null,null,null,"","",null,2]
["",null,null,"00:00:00",null,"","",null,"","",null,null,null,null,"","",null,2]
["",null,null,"00:00:00",null,"","",null,"","",null,null,null,null,"","",null,2]
["",null,null,"00:00:00",null,"","",null,"","",null,null,null,null,"","",null,2]
["",null,null,"00:00:00",null,"","",null,"","",null,null,null,null,"","",null,2]
["",null,null,"00:00:00",null,"","",null,"","",null,null,null,null,"","",null,2]
["",null,null,"00:00:00",null,"","",null,"","",null,null,null,null,"","",null,2]
["",null,null,"00:00:00",null,"","",null,"","",null,null,null,null,"","",null,2]
["",null,null,"00:00:00",null,"","",null,"","",null,null,null,null,"","",null,2]
["",null,null,"00:00:00",null,"","",null,"","",null,null,null,null,"","",null,2]
["",null,null,"00:00:00",null,"","",null,"","",null,null,null,null,"","",null,2]
["",null,null,"00:00:00",null,"","",null,"","",null,null,null,null,"","",null,2]
["",null,null,"00:00:00",null,"","",null,"","",null,null,null,null,"","",null,2]
[{"$f":"IF(E1604=\"\",\"\",IF(A1604=\"\",TODAY(),A1604))","v":""},null,null,{"$f":"C1604-B1604+IF(B1604>C1604,1)","v":"00:00:00"},null,{"$f":"IFERROR(VLOOKUP(E1604,$AJ$2:$AL$3155,2,FALSE),\"\")","v":""},{"$f":"IFERROR(VLOOKUP(E1604,$AJ$2:$AL$3155,3,FALSE),\"\")","v":""},null,{"$f":"IFERROR(SUM(G1604/7),\"\")","v":""},{"$f":"IFERROR(SUM(N1604/C1604),\"\")","v":""},null,null,null,null,{"$f":"IFERROR(ROUND(SUM(1000/K1604),2),\"\")","v":""},{"$f":"IFERROR(ROUND(SUM(N1604*O1604),2),\"\")","v":""},null,2]
["",null,null,"00:00:00",null,"","",null,"","",null,null,null,null,"","",null,2]
["",null,null,"00:00:00",null,"","",null,"","",null,null,null,null,"","",null,2]
["",null,null,"00:00:00",null,"","",null,"","",null,null,null,null,"","",null,2]
["",null,null,"00:00:00",null,"","",null,"","",null,null,null,null,"","",null,2]
["",null,null,"00:00:00",null,"","",null,"","",null,null,null,null,"","",null,2]
["",null,null,"00:00:00",null,"","",null,"","",null,null,null,null,"","",null,2]
["",null,null,"00:00:00",null,"","",null,"","",null,null,null,null,"","",null,2]
["",null,null,"00:00:00",null,"","",null,"","",null,null,null,null,"","",null,2]
["",null,null,"00:00:00",null,"","",null,"","",null,null,null,null,"","",null,2]
["",null,null,"00:00:00",null,"","",null,"","",null,null,null,null,"","",null,2]
["",null,null,"00:00:00",null,"","",null,"","",null,null,null,null,"","",null,2]
["",null,null,"00:00:00",null,"","",null,"","",null,null,null,null,"","",null,2]
["",null,null,"00:00:00",null,"","",null,"","",null,null,null,null,"","",null,2]
["",null,null,"00:00:00",null,"","",null,"","",null,null,null,null,"","",null,2]
["",null,null,"00:00:00",null,"","",null,"","",null,null,null,null,"","",null,2]
["",null,null,"00:00:00",null,"","",null,"","",null,null,null,null,"","",null,2]
["",null,null,"00:00:00",null,"","",null,"","",null,null,null,null,"","",null,2]
["",null,null,"00:00:00",null,"","",null,"","",null,null,null,null,"","",null,2]
["",null,null,"00:00:00",null,"","",null,"","",null,null,null,null,"","",null,2]
["",null,null,"00:00:00",null,"","",null,"","",null,null,null,null,"","",null,2]
["",null,null,"00:00:00",null,"","",null,"","",null,null,null,null,"","",null,2]
["",null,null,"00:00:00",null,"","",null,"","",null,null,null,null,"","",null,2]
["",null,null,"00:00:00",null,"","",null,"","",null,null,null,null,"","",null,2]
["",null,null,"00:00:00",null,"","",null,"","",null,null,null,null,"","",null,2]
["",null,null,"00:00:00",null,"","",null,"","",null,null,null,null,"","",null,2]
["",null,null,"00:00:00",null,"","",null,"","",null,null,null,null,"","",null,2]
["",null,null,"00:00:00",null,"","",null,"","",null,null,null,null,"","",null,2]
["",null,null,"00:00:00",null,"","",null,"","",null,null,null,null,"","",null,2]
["",null,null,"00:00:00",null,"","",null,"","",null,null,null,null,"","",null,2]
["",null,null,"00:00:00",null,"","",null,"","",null,null,null,null,"","",null,2]
["",null,null,"00:00:00",null,"","",null,"","",null,null,null,null,"","",null,2]
["",null,null,"00:00:00",null,"","",null,"","",null,null,null,null,"","",null,2]
["",null,null,"00:00:00",null,"","",null,"","",null,null,null,null,"","",null,2]
["",null,null,"00:00:00",null,"","",null,"","",null,null,null,null,"","",null,2]
["",null,null,"00:00:00",null,"","",null,"","",null,null,null,null,"","",null,2]
["",null,null,"00:00:00",null,"","",null,"","",null,null,null,null,"","",null,2]
["",null,null,"00:00:00",null,"","",null,"","",null,null,null,null,"","",null,2]
["",null,null,"00:00:00",null,"","",null,"","",null,null,null,null,"","",null,2]
["",null,null,"00:00:00",null,"","",null,"","",null,null,null,null,"","",null,2]
["",null,null,"00:00:00",null,"","",null,"","",null,null,null,null,"","",null,2]
["",null,null,"00:00:00",null,"","",null,"","",null,null,null,null,"","",null,2]
["",null,null,"00:00:00",null,"","",null,"","",null,null,null,null,"","",null,2]
["",null,null,"00:00:00",null,"","",null,"","",null,null,null,null,"","",null,2]
["",null,null,"00:00:00",null,"","",null,"","",null,null,null,null,"","",null,2]
["",null,null,"00:00:00",null,"","",null,"","",null,null,null,null,"","",null,2]
["",null,null,"00:00:00",null,"","",null,"","",null,null,null,null,"","",null,2]
["",null,null,"00:00:00",null,"","",null,"","",null,null,null,null,"","",null,2]
["",null,null,"00:00:00",null,"","",null,"","",null,null,null,null,"","",null,2]
["",null,null,"00:00:00",null,"","",null,"","",null,null,null,null,"","",null,2]
["",null,null,"00:00:00",null,"","",null,"","",null,null,null,null,"","",null,2]
["",null,null,"00:00:00",null,"","",null,"","",null,null,null,null,"","",null,2]
["",null,null,"00:00:00",null,"","",null,"","",null,null,null,null,"","",null,2]
["",null,null,"00:00:00",null,"","",null,"","",null,null,null,null,"","",null,2]
["",null,null,"00:00:00",null,"","",null,"","",null,null,null,null,"","",null,2]
["",null,null,"00:00:00",null,"","",null,"","",null,null,null,null,"","",null,2]
["",null,null,"00:00:00",null,"","",null,"","",null,null,null,null,"","",null,2]
["",null,null,"00:00:00",null,"","",null,"","",null,null,null,null,"","",null,2]
["",null,null,"00:00:00",null,"","",null,"","",null,null,null,null,"","",null,2]
["",null,null,"00:00:00",null,"","",null,"","",null,null,null,null,"","",null,2]
["",null,null,"00:00:00",null,"","",null,"","",null,null,null,null,"","",null,2]
["",null,null,"00:00:00",null,"","",null,"","",null,null,null,null,"","",null,2]
["",null,null,"00:00:00",null,"","",null,"","",null,null,null,null,"","",null,2]
["",null,null,"00:00:00",null,"","",null,"","",null,null,null,null,"","",null,2]
[{"$f":"IF(E1668=\"\",\"\",IF(A1668=\"\",TODAY(),A1668))","v":""},null,null,{"$f":"C1668-B1668+IF(B1668>C1668,1)","v":"00:00:00"},null,{"$f":"IFERROR(VLOOKUP(E1668,$AJ$2:$AL$3155,2,FALSE),\"\")","v":""},{"$f":"IFERROR(VLOOKUP(E1668,$AJ$2:$AL$3155,3,FALSE),\"\")","v":""},null,{"$f":"IFERROR(SUM(G1668/7),\"\")","v":""},{"$f":"IFERROR(SUM(N1668/C1668),\"\")","v":""},null,null,null,null,{"$f":"IFERROR(ROUND(SUM(1000/K1668),2),\"\")","v":""},{"$f":"IFERROR(ROUND(SUM(N1668*O1668),2),\"\")","v":""},null,2]
["",null,null,"00:00:00",null,"","",null,"","",null,null,null,null,"","",null,2]
["",null,null,"00:00:00",null,"","",null,"","",null,null,null,null,"","",null,2]
["",null,null,"00:00:00",null,"","",null,"","",null,null,null,null,"","",null,2]
["",null,null,"00:00:00",null,"","",null,"","",null,null,null,null,"","",null,2]
["",null,null,"00:00:00",null,"","",null,"","",null,null,null,null,"","",null,2]
["",null,null,"00:00:00",null,"","",null,"","",null,null,null,null,"","",null,2]
["",null,null,"00:00:00",null,"","",null,"","",null,null,null,null,"","",null,2]
["",null,null,"00:00:00",null,"","",null,"","",null,null,null,null,"","",null,2]
["",null,null,"00:00:00",null,"","",null,"","",null,null,null,null,"","",null,2]
["",null,null,"00:00:00",null,"","",null,"","",null,null,null,null,"","",null,2]
["",null,null,"00:00:00",null,"","",null,"","",null,null,null,null,"","",null,2]
["",null,null,"00:00:00",null,"","",null,"","",null,null,null,null,"","",null,2]
["",null,null,"00:00:00",null,"","",null,"","",null,null,null,null,"","",null,2]
["",null,null,"00:00:00",null,"","",null,"","",null,null,null,null,"","",null,2]
["",null,null,"00:00:00",null,"","",null,"","",null,null,null,null,"","",null,2]
["",null,null,"00:00:00",null,"","",null,"","",null,null,null,null,"","",null,2]
["",null,null,"00:00:00",null,"","",null,"","",null,null,null,null,"","",null,2]
["",null,null,"00:00:00",null,"","",null,"","",null,null,null,null,"","",null,2]
["",null,null,"00:00:00",null,"","",null,"","",null,null,null,null,"","",null,2]
["",null,null,"00:00:00",null,"","",null,"","",null,null,null,null,"","",null,2]
["",null,null,"00:00:00",null,"","",null,"","",null,null,null,null,"","",null,2]
["",null,null,"00:00:00",null,"","",null,"","",null,null,null,null,"","",null,2]
["",null,null,"00:00:00",null,"","",null,"","",null,null,null,null,"","",null,2]
["",null,null,"00:00:00",null,"","",null,"","",null,null,null,null,"","",null,2]
["",null,null,"00:00:00",null,"","",null,"","",null,null,null,null,"","",null,2]
["",null,null,"00:00:00",null,"","",null,"","",null,null,null,null,"","",null,2]
["",null,null,"00:00:00",null,"","",null,"","",null,null,null,null,"","",null,2]
["",null,null,"00:00:00",null,"","",null,"","",null,null,null,null,"","",null,2]
["",null,null,"00:00:00",null,"","",null,"","",null,null,null,null,"","",null,2]
["",null,null,"00:00:00",null,"","",null,"","",null,null,null,null,"","",null,2]
["",null,null,"00:00:00",null,"","",null,"","",null,null,null,null,"","",null,2]
["",null,null,"00:00:00",null,"","",null,"","",null,null,null,null,"","",null,2]
["",null,null,"00:00:00",null,"","",null,"","",null,null,null,null,"","",null,2]
["",null,null,"00:00:00",null,"","",null,"","",null,null,null,null,"","",null,2]
["",null,null,"00:00:00",null,"","",null,"","",null,null,null,null,"","",null,2]
["",null,null,"00:00:00",null,"","",null,"","",null,null,null,null,"","",null,2]
["",null,null,"00:00:00",null,"","",null,"","",null,null,null,null,"","",null,2]
["",null,null,"00:00:00",null,"","",null,"","",null,null,null,null,"","",null,2]
["",null,null,"00:00:00",null,"","",null,"","",null,null,null,null,"","",null,2]
["",null,null,"00:00:00",null,"","",null,"","",null,null,null,null,"","",null,2]
["",null,null,"00:00:00",null,"","",null,"","",null,null,null,null,"","",null,2]
["",null,null,"00:00:00",null,"","",null,"","",null,null,null,null,"","",null,2]
["",null,null,"00:00:00",null,"","",null,"","",null,null,null,null,"","",null,2]
["",null,null,"00:00:00",null,"","",null,"","",null,null,null,null,"","",null,2]
["",null,null,"00:00:00",null,"","",null,"","",null,null,null,null,"","",null,2]
["",null,null,"00:00:00",null,"","",null,"","",null,null,null,null,"","",null,2]
["",null,null,"00:00:00",null,"","",null,"","",null,null,null,null,"","",null,2]
["",null,null,"00:00:00",null,"","",null,"","",null,null,null,null,"","",null,2]
["",null,null,"00:00:00",null,"","",null,"","",null,null,null,null,"","",null,2]
["",null,null,"00:00:00",null,"","",null,"","",null,null,null,null,"","",null,2]
["",null,null,"00:00:00",null,"","",null,"","",null,null,null,null,"","",null,2]
["",null,null,"00:00:00",null,"","",null,"","",null,null,null,null,"","",null,2]
["",null,null,"00:00:00",null,"","",null,"","",null,null,null,null,"","",null,2]
["",null,null,"00:00:00",null,"","",null,"","",null,null,null,null,"","",null,2]
["",null,null,"00:00:00",null,"","",null,"","",null,null,null,null,"","",null,2]
["",null,null,"00:00:00",null,"","",null,"","",null,null,null,null,"","",null,2]
["",null,null,"00:00:00",null,"","",null,"","",null,null,null,null,"","",null,2]
["",null,null,"00:00:00",null,"","",null,"","",null,null,null,null,"","",null,2]
["",null,null,"00:00:00",null,"","",null,"","",null,null,null,null,"","",null,2]
["",null,null,"00:00:00",null,"","",null,"","",null,null,null,null,"","",null,2]
["",null,null,"00:00:00",null,"","",null,"","",null,null,null,null,"","",null,2]
["",null,null,"00:00:00",null,"","",null,"","",null,null,null,null,"","",null,2]
["",null,null,"00:00:00",null,"","",null,"","",null,null,null,null,"","",null,2]
[{"$f":"IF(E1732=\"\",\"\",IF(A1732=\"\",TODAY(),A1732))","v":""},null,null,{"$f":"C1732-B1732+IF(B1732>C1732,1)","v":"00:00:00"},null,{"$f":"IFERROR(VLOOKUP(E1732,$AJ$2:$AL$3155,2,FALSE),\"\")","v":""},{"$f":"IFERROR(VLOOKUP(E1732,$AJ$2:$AL$3155,3,FALSE),\"\")","v":""},null,{"$f":"IFERROR(SUM(G1732/7),\"\")","v":""},{"$f":"IFERROR(SUM(N1732/C1732),\"\")","v":""},null,null,null,null,{"$f":"IFERROR(ROUND(SUM(1000/K1732),2),\"\")","v":""},{"$f":"IFERROR(ROUND(SUM(N1732*O1732),2),\"\")","v":""},null,2]
["",null,null,"00:00:00",null,"","",null,"","",null,null,null,null,"","",null,2]
["",null,null,"00:00:00",null,"","",null,"","",null,null,null,null,"","",null,2]
["",null,null,"00:00:00",null,"","",null,"","",null,null,null,null,"","",null,2]
["",null,null,"00:00:00",null,"","",null,"","",null,null,null,null,"","",null,2]
["",null,null,"00:00:00",null,"","",null,"","",null,null,null,null,"","",null,2]
["",null,null,"00:00:00",null,"","",null,"","",null,null,null,null,"","",null,2]
["",null,null,"00:00:00",null,"","",null,"","",null,null,null,null,"","",null,2]
["",null,null,"00:00:00",null,"","",null,"","",null,null,null,null,"","",null,2]
["",null,null,"00:00:00",null,"","",null,"","",null,null,null,null,"","",null,2]
["",null,null,"00:00:00",null,"","",null,"","",null,null,null,null,"","",null,2]
["",null,null,"00:00:00",null,"","",null,"","",null,null,null,null,"","",null,2]
["",null,null,"00:00:00",null,"","",null,"","",null,null,null,null,"","",null,2]
["",null,null,"00:00:00",null,"","",null,"","",null,null,null,null,"","",null,2]
["",null,null,"00:00:00",null,"","",null,"","",null,null,null,null,"","",null,2]
["",null,null,"00:00:00",null,"","",null,"","",null,null,null,null,"","",null,2]
["",null,null,"00:00:00",null,"","",null,"","",null,null,null,null,"","",null,2]
["",null,null,"00:00:00",null,"","",null,"","",null,null,null,null,"","",null,2]
["",null,null,"00:00:00",null,"","",null,"","",null,null,null,null,"","",null,2]
["",null,null,"00:00:00",null,"","",null,"","",null,null,null,null,"","",null,2]
["",null,null,"00:00:00",null,"","",null,"","",null,null,null,null,"","",null,2]
["",null,null,"00:00:00",null,"","",null,"","",null,null,null,null,"","",null,2]
["",null,null,"00:00:00",null,"","",null,"","",null,null,null,null,"","",null,2]
["",null,null,"00:00:00",null,"","",null,"","",null,null,null,null,"","",null,2]
["",null,null,"00:00:00",null,"","",null,"","",null,null,null,null,"","",null,2]
["",null,null,"00:00:00",null,"","",null,"","",null,null,null,null,"","",null,2]
["",null,null,"00:00:00",null,"","",null,"","",null,null,null,null,"","",null,2]
["",null,null,"00:00:00",null,"","",null,"","",null,null,null,null,"","",null,2]
["",null,null,"00:00:00",null,"","",null,"","",null,null,null,null,"","",null,2]
["",null,null,"00:00:00",null,"","",null,"","",null,null,null,null,"","",null,2]
["",null,null,"00:00:00",null,"","",null,"","",null,null,null,null,"","",null,2]
["",null,null,"00:00:00",null,"","",null,"","",null,null,null,null,"","",null,2]
["",null,null,"00:00:00",null,"","",null,"","",null,null,null,null,"","",null,2]
["",null,null,"00:00:00",null,"","",null,"","",null,null,null,null,"","",null,2]
["",null,null,"00:00:00",null,"","",null,"","",null,null,null,null,"","",null,2]
["",null,null,"00:00:00",null,"","",null,"","",null,null,null,null,"","",null,2]
["",null,null,"00:00:00",null,"","",null,"","",null,null,null,null,"","",null,2]
["",null,null,"00:00:00",null,"","",null,"","",null,null,null,null,"","",null,2]
["",null,null,"00:00:00",null,"","",null,"","",null,null,null,null,"","",null,2]
["",null,null,"00:00:00",null,"","",null,"","",null,null,null,null,"","",null,2]
["",null,null,"00:00:00",null,"","",null,"","",null,null,null,null,"","",null,2]
["",null,null,"00:00:00",null,"","",null,"","",null,null,null,null,"","",null,2]
["",null,null,"00:00:00",null,"","",null,"","",null,null,null,null,"","",null,2]
["",null,null,"00:00:00",null,"","",null,"","",null,null,null,null,"","",null,2]
["",null,null,"00:00:00",null,"","",null,"","",null,null,null,null,"","",null,2]
["",null,null,"00:00:00",null,"","",null,"","",null,null,null,null,"","",null,2]
["",null,null,"00:00:00",null,"","",null,"","",null,null,null,null,"","",null,2]
["",null,null,"00:00:00",null,"","",null,"","",null,null,null,null,"","",null,2]
["",null,null,"00:00:00",null,"","",null,"","",null,null,null,null,"","",null,2]
["",null,null,"00:00:00",null,"","",null,"","",null,null,null,null,"","",null,2]
["",null,null,"00:00:00",null,"","",null,"","",null,null,null,null,"","",null,2]
["",null,null,"00:00:00",null,"","",null,"","",null,null,null,null,"","",null,2]
["",null,null,"00:00:00",null,"","",null,"","",null,null,null,null,"","",null,2]
["",null,null,"00:00:00",null,"","",null,"","",null,null,null,null,"","",null,2]
["",null,null,"00:00:00",null,"","",null,"","",null,null,null,null,"","",null,2]
["",null,null,"00:00:00",null,"","",null,"","",null,null,null,null,"","",null,2]
["",null,null,"00:00:00",null,"","",null,"","",null,null,null,null,"","",null,2]
["",null,null,"00:00:00",null,"","",null,"","",null,null,null,null,"","",null,2]
["",null,null,"00:00:00",null,"","",null,"","",null,null,null,null,"","",null,2]
["",null,null,"00:00:00",null,"","",null,"","",null,null,null,null,"","",null,2]
["",null,null,"00:00:00",null,"","",null,"","",null,null,null,null,"","",null,2]
["",null,null,"00:00:00",null,"","",null,"","",null,null,null,null,"","",null,2]
["",null,null,"00:00:00",null,"","",null,"","",null,null,null,null,"","",null,2]
["",null,null,"00:00:00",null,"","",null,"","",null,null,null,null,"","",null,2]
[{"$f":"IF(E1796=\"\",\"\",IF(A1796=\"\",TODAY(),A1796))","v":""},null,null,{"$f":"C1796-B1796+IF(B1796>C1796,1)","v":"00:00:00"},null,{"$f":"IFERROR(VLOOKUP(E1796,$AJ$2:$AL$3155,2,FALSE),\"\")","v":""},{"$f":"IFERROR(VLOOKUP(E1796,$AJ$2:$AL$3155,3,FALSE),\"\")","v":""},null,{"$f":"IFERROR(SUM(G1796/7),\"\")","v":""},{"$f":"IFERROR(SUM(N1796/C1796),\"\")","v":""},null,null,null,null,{"$f":"IFERROR(ROUND(SUM(1000/K1796),2),\"\")","v":""},{"$f":"IFERROR(ROUND(SUM(N1796*O1796),2),\"\")","v":""},null,2]
["",null,null,"00:00:00",null,"","",null,"","",null,null,null,null,"","",null,2]
["",null,null,"00:00:00",null,"","",null,"","",null,null,null,null,"","",null,2]
["",null,null,"00:00:00",null,"","",null,"","",null,null,null,null,"","",null,2]
["",null,null,"00:00:00",null,"","",null,"","",null,null,null,null,"","",null,2]
["",null,null,"00:00:00",null,"","",null,"","",null,null,null,null,"","",null,2]
["",null,null,"00:00:00",null,"","",null,"","",null,null,null,null,"","",null,2]
["",null,null,"00:00:00",null,"","",null,"","",null,null,null,null,"","",null,2]
["",null,null,"00:00:00",null,"","",null,"","",null,null,null,null,"","",null,2]
["",null,null,"00:00:00",null,"","",null,"","",null,null,null,null,"","",null,2]
["",null,null,"00:00:00",null,"","",null,"","",null,null,null,null,"","",null,2]
["",null,null,"00:00:00",null,"","",null,"","",null,null,null,null,"","",null,2]
["",null,null,"00:00:00",null,"","",null,"","",null,null,null,null,"","",null,2]
["",null,null,"00:00:00",null,"","",null,"","",null,null,null,null,"","",null,2]
["",null,null,"00:00:00",null,"","",null,"","",null,null,null,null,"","",null,2]
["",null,null,"00:00:00",null,"","",null,"","",null,null,null,null,"","",null,2]
["",null,null,"00:00:00",null,"","",null,"","",null,null,null,null,"","",null,2]
["",null,null,"00:00:00",null,"","",null,"","",null,null,null,null,"","",null,2]
["",null,null,"00:00:00",null,"","",null,"","",null,null,null,null,"","",null,2]
["",null,null,"00:00:00",null,"","",null,"","",null,null,null,null,"","",null,2]
["",null,null,"00:00:00",null,"","",null,"","",null,null,null,null,"","",null,2]
["",null,null,"00:00:00",null,"","",null,"","",null,null,null,null,"","",null,2]
["",null,null,"00:00:00",null,"","",null,"","",null,null,null,null,"","",null,2]
["",null,null,"00:00:00",null,"","",null,"","",null,null,null,null,"","",null,2]
["",null,null,"00:00:00",null,"","",null,"","",null,null,null,null,"","",null,2]
["",null,null,"00:00:00",null,"","",null,"","",null,null,null,null,"","",null,2]
["",null,null,"00:00:00",null,"","",null,"","",null,null,null,null,"","",null,2]
["",null,null,"00:00:00",null,"","",null,"","",null,null,null,null,"","",null,2]
["",null,null,"00:00:00",null,"","",null,"","",null,null,null,null,"","",null,2]
["",null,null,"00:00:00",null,"","",null,"","",null,null,null,null,"","",null,2]
["",null,null,"00:00:00",null,"","",null,"","",null,null,null,null,"","",null,2]
["",null,null,"00:00:00",null,"","",null,"","",null,null,null,null,"","",null,2]
["",null,null,"00:00:00",null,"","",null,"","",null,null,null,null,"","",null,2]
["",null,null,"00:00:00",null,"","",null,"","",null,null,null,null,"","",null,2]
["",null,null,"00:00:00",null,"","",null,"","",null,null,null,null,"","",null,2]
["",null,null,"00:00:00",null,"","",null,"","",null,null,null,null,"","",null,2]
["",null,null,"00:00:00",null,"","",null,"","",null,null,null,null,"","",null,2]
["",null,null,"00:00:00",null,"","",null,"","",null,null,null,null,"","",null,2]
["",null,null,"00:00:00",null,"","",null,"","",null,null,null,null,"","",null,2]
["",null,null,"00:00:00",null,"","",null,"","",null,null,null,null,"","",null,2]
["",null,null,"00:00:00",null,"","",null,"","",null,null,null,null,"","",null,2]
["",null,null,"00:00:00",null,"","",null,"","",null,null,null,null,"","",null,2]
["",null,null,"00:00:00",null,"","",null,"","",null,null,null,null,"","",null,2]
["",null,null,"00:00:00",null,"","",null,"","",null,null,null,null,"","",null,2]
["",null,null,"00:00:00",null,"","",null,"","",null,null,null,null,"","",null,2]
["",null,null,"00:00:00",null,"","",null,"","",null,null,null,null,"","",null,2]
["",null,null,"00:00:00",null,"","",null,"","",null,null,null,null,"","",null,2]
["",null,null,"00:00:00",null,"","",null,"","",null,null,null,null,"","",null,2]
["",null,null,"00:00:00",null,"","",null,"","",null,null,null,null,"","",null,2]
["",null,null,"00:00:00",null,"","",null,"","",null,null,null,null,"","",null,2]
["",null,null,"00:00:00",null,"","",null,"","",null,null,null,null,"","",null,2]
["",null,null,"00:00:00",null,"","",null,"","",null,null,null,null,"","",null,2]
["",null,null,"00:00:00",null,"","",null,"","",null,null,null,null,"","",null,2]
["",null,null,"00:00:00",null,"","",null,"","",null,null,null,null,"","",null,2]
["",null,null,"00:00:00",null,"","",null,"","",null,null,null,null,"","",null,2]
["",null,null,"00:00:00",null,"","",null,"","",null,null,null,null,"","",null,2]
["",null,null,"00:00:00",null,"","",null,"","",null,null,null,null,"","",null,2]
["",null,null,"00:00:00",null,"","",null,"","",null,null,null,null,"","",null,2]
["",null,null,"00:00:00",null,"","",null,"","",null,null,null,null,"","",null,2]
["",null,null,"00:00:00",null,"","",null,"","",null,null,null,null,"","",null,2]
["",null,null,"00:00:00",null,"","",null,"","",null,null,null,null,"","",null,2]
["",null,null,"00:00:00",null,"","",null,"","",null,null,null,null,"","",null,2]
["",null,null,"00:00:00",null,"","",null,"","",null,null,null,null,"","",null,2]
["",null,null,"00:00:00",null,"","",null,"","",null,null,null,null,"","",null,2]
[{"$f":"IF(E1860=\"\",\"\",IF(A1860=\"\",TODAY(),A1860))","v":""},null,null,{"$f":"C1860-B1860+IF(B1860>C1860,1)","v":"00:00:00"},null,{"$f":"IFERROR(VLOOKUP(E1860,$AJ$2:$AL$3155,2,FALSE),\"\")","v":""},{"$f":"IFERROR(VLOOKUP(E1860,$AJ$2:$AL$3155,3,FALSE),\"\")","v":""},null,{"$f":"IFERROR(SUM(G1860/7),\"\")","v":""},{"$f":"IFERROR(SUM(N1860/C1860),\"\")","v":""},null,null,null,null,{"$f":"IFERROR(ROUND(SUM(1000/K1860),2),\"\")","v":""},{"$f":"IFERROR(ROUND(SUM(N1860*O1860),2),\"\")","v":""},null,2]
["",null,null,"00:00:00",null,"","",null,"","",null,null,null,null,"","",null,2]
["",null,null,"00:00:00",null,"","",null,"","",null,null,null,null,"","",null,2]
["",null,null,"00:00:00",null,"","",null,"","",null,null,null,null,"","",null,2]
["",null,null,"00:00:00",null,"","",null,"","",null,null,null,null,"","",null,2]
["",null,null,"00:00:00",null,"","",null,"","",null,null,null,null,"","",null,2]
["",null,null,"00:00:00",null,"","",null,"","",null,null,null,null,"","",null,2]
["",null,null,"00:00:00",null,"","",null,"","",null,null,null,null,"","",null,2]
["",null,null,"00:00:00",null,"","",null,"","",null,null,null,null,"","",null,2]
["",null,null,"00:00:00",null,"","",null,"","",null,null,null,null,"","",null,2]
["",null,null,"00:00:00",null,"","",null,"","",null,null,null,null,"","",null,2]
["",null,null,"00:00:00",null,"","",null,"","",null,null,null,null,"","",null,2]
["",null,null,"00:00:00",null,"","",null,"","",null,null,null,null,"","",null,2]
["",null,null,"00:00:00",null,"","",null,"","",null,null,null,null,"","",null,2]
["",null,null,"00:00:00",null,"","",null,"","",null,null,null,null,"","",null,2]
["",null,null,"00:00:00",null,"","",null,"","",null,null,null,null,"","",null,2]
["",null,null,"00:00:00",null,"","",null,"","",null,null,null,null,"","",null,2]
["",null,null,"00:00:00",null,"","",null,"","",null,null,null,null,"","",null,2]
["",null,null,"00:00:00",null,"","",null,"","",null,null,null,null,"","",null,2]
["",null,null,"00:00:00",null,"","",null,"","",null,null,null,null,"","",null,2]
["",null,null,"00:00:00",null,"","",null,"","",null,null,null,null,"","",null,2]
["",null,null,"00:00:00",null,"","",null,"","",null,null,null,null,"","",null,2]
["",null,null,"00:00:00",null,"","",null,"","",null,null,null,null,"","",null,2]
["",null,null,"00:00:00",null,"","",null,"","",null,null,null,null,"","",null,2]
["",null,null,"00:00:00",null,"","",null,"","",null,null,null,null,"","",null,2]
["",null,null,"00:00:00",null,"","",null,"","",null,null,null,null,"","",null,2]
["",null,null,"00:00:00",null,"","",null,"","",null,null,null,null,"","",null,2]
["",null,null,"00:00:00",null,"","",null,"","",null,null,null,null,"","",null,2]
["",null,null,"00:00:00",null,"","",null,"","",null,null,null,null,"","",null,2]
["",null,null,"00:00:00",null,"","",null,"","",null,null,null,null,"","",null,2]
["",null,null,"00:00:00",null,"","",null,"","",null,null,null,null,"","",null,2]
["",null,null,"00:00:00",null,"","",null,"","",null,null,null,null,"","",null,2]
["",null,null,"00:00:00",null,"","",null,"","",null,null,null,null,"","",null,2]
["",null,null,"00:00:00",null,"","",null,"","",null,null,null,null,"","",null,2]
["",null,null,"00:00:00",null,"","",null,"","",null,null,null,null,"","",null,2]
["",null,null,"00:00:00",null,"","",null,"","",null,null,null,null,"","",null,2]
["",null,null,"00:00:00",null,"","",null,"","",null,null,null,null,"","",null,2]
["",null,null,"00:00:00",null,"","",null,"","",null,null,null,null,"","",null,2]
["",null,null,"00:00:00",null,"","",null,"","",null,null,null,null,"","",null,2]
["",null,null,"00:00:00",null,"","",null,"","",null,null,null,null,"","",null,2]
["",null,null,"00:00:00",null,"","",null,"","",null,null,null,null,"","",null,2]
["",null,null,"00:00:00",null,"","",null,"","",null,null,null,null,"","",null,2]
["",null,null,"00:00:00",null,"","",null,"","",null,null,null,null,"","",null,2]
["",null,null,"00:00:00",null,"","",null,"","",null,null,null,null,"","",null,2]
["",null,null,"00:00:00",null,"","",null,"","",null,null,null,null,"","",null,2]
["",null,null,"00:00:00",null,"","",null,"","",null,null,null,null,"","",null,2]
["",null,null,"00:00:00",null,"","",null,"","",null,null,null,null,"","",null,2]
["",null,null,"00:00:00",null,"","",null,"","",null,null,null,null,"","",null,2]
["",null,null,"00:00:00",null,"","",null,"","",null,null,null,null,"","",null,2]
["",null,null,"00:00:00",null,"","",null,"","",null,null,null,null,"","",null,2]
["",null,null,"00:00:00",null,"","",null,"","",null,null,null,null,"","",null,2]
["",null,null,"00:00:00",null,"","",null,"","",null,null,null,null,"","",null,2]
["",null,null,"00:00:00",null,"","",null,"","",null,null,null,null,"","",null,2]
["",null,null,"00:00:00",null,"","",null,"","",null,null,null,null,"","",null,2]
["",null,null,"00:00:00",null,"","",null,"","",null,null,null,null,"","",null,2]
["",null,null,"00:00:00",null,"","",null,"","",null,null,null,null,"","",null,2]
["",null,null,"00:00:00",null,"","",null,"","",null,null,null,null,"","",null,2]
["",null,null,"00:00:00",null,"","",null,"","",null,null,null,null,"","",null,2]
["",null,null,"00:00:00",null,"","",null,"","",null,null,null,null,"","",null,2]
["",null,null,"00:00:00",null,"","",null,"","",null,null,null,null,"","",null,2]
["",null,null,"00:00:00",null,"","",null,"","",null,null,null,null,"","",null,2]
["",null,null,"00:00:00",null,"","",null,"","",null,null,null,null,"","",null,2]
["",null,null,"00:00:00",null,"","",null,"","",null,null,null,null,"","",null,2]
["",null,null,"00:00:00",null,"","",null,"","",null,null,null,null,"","",null,2]
[{"$f":"IF(E1924=\"\",\"\",IF(A1924=\"\",TODAY(),A1924))","v":""},null,null,{"$f":"C1924-B1924+IF(B1924>C1924,1)","v":"00:00:00"},null,{"$f":"IFERROR(VLOOKUP(E1924,$AJ$2:$AL$3155,2,FALSE),\"\")","v":""},{"$f":"IFERROR(VLOOKUP(E1924,$AJ$2:$AL$3155,3,FALSE),\"\")","v":""},null,{"$f":"IFERROR(SUM(G1924/7),\"\")","v":""},{"$f":"IFERROR(SUM(N1924/C1924),\"\")","v":""},null,null,null,null,{"$f":"IFERROR(ROUND(SUM(1000/K1924),2),\"\")","v":""},{"$f":"IFERROR(ROUND(SUM(N1924*O1924),2),\"\")","v":""},null,2]
["",null,null,"00:00:00",null,"","",null,"","",null,null,null,null,"","",null,2]
["",null,null,"00:00:00",null,"","",null,"","",null,null,null,null,"","",null,2]
["",null,null,"00:00:00",null,"","",null,"","",null,null,null,null,"","",null,2]
["",null,null,"00:00:00",null,"","",null,"","",null,null,null,null,"","",null,2]
["",null,null,"00:00:00",null,"","",null,"","",null,null,null,null,"","",null,2]
["",null,null,"00:00:00",null,"","",null,"","",null,null,null,null,"","",null,2]
["",null,null,"00:00:00",null,"","",null,"","",null,null,null,null,"","",null,2]
["",null,null,"00:00:00",null,"","",null,"","",null,null,null,null,"","",null,2]
["",null,null,"00:00:00",null,"","",null,"","",null,null,null,null,"","",null,2]
["",null,null,"00:00:00",null,"","",null,"","",null,null,null,null,"","",null,2]
["",null,null,"00:00:00",null,"","",null,"","",null,null,null,null,"","",null,2]
["",null,null,"00:00:00",null,"","",null,"","",null,null,null,null,"","",null,2]
["",null,null,"00:00:00",null,"","",null,"","",null,null,null,null,"","",null,2]
["",null,null,"00:00:00",null,"","",null,"","",null,null,null,null,"","",null,2]
["",null,null,"00:00:00",null,"","",null,"","",null,null,null,null,"","",null,2]
["",null,null,"00:00:00",null,"","",null,"","",null,null,null,null,"","",null,2]
["",null,null,"00:00:00",null,"","",null,"","",null,null,null,null,"","",null,2]
["",null,null,"00:00:00",null,"","",null,"","",null,null,null,null,"","",null,2]
["",null,null,"00:00:00",null,"","",null,"","",null,null,null,null,"","",null,2]
["",null,null,"00:00:00",null,"","",null,"","",null,null,null,null,"","",null,2]
["",null,null,"00:00:00",null,"","",null,"","",null,null,null,null,"","",null,2]
["",null,null,"00:00:00",null,"","",null,"","",null,null,null,null,"","",null,2]
["",null,null,"00:00:00",null,"","",null,"","",null,null,null,null,"","",null,2]
["",null,null,"00:00:00",null,"","",null,"","",null,null,null,null,"","",null,2]
["",null,null,"00:00:00",null,"","",null,"","",null,null,null,null,"","",null,2]
["",null,null,"00:00:00",null,"","",null,"","",null,null,null,null,"","",null,2]
["",null,null,"00:00:00",null,"","",null,"","",null,null,null,null,"","",null,2]
["",null,null,"00:00:00",null,"","",null,"","",null,null,null,null,"","",null,2]
["",null,null,"00:00:00",null,"","",null,"","",null,null,null,null,"","",null,2]
["",null,null,"00:00:00",null,"","",null,"","",null,null,null,null,"","",null,2]
["",null,null,"00:00:00",null,"","",null,"","",null,null,null,null,"","",null,2]
["",null,null,"00:00:00",null,"","",null,"","",null,null,null,null,"","",null,2]
["",null,null,"00:00:00",null,"","",null,"","",null,null,null,null,"","",null,2]
["",null,null,"00:00:00",null,"","",null,"","",null,null,null,null,"","",null,2]
["",null,null,"00:00:00",null,"","",null,"","",null,null,null,null,"","",null,2]
["",null,null,"00:00:00",null,"","",null,"","",null,null,null,null,"","",null,2]
["",null,null,"00:00:00",null,"","",null,"","",null,null,null,null,"","",null,2]
["",null,null,"00:00:00",null,"","",null,"","",null,null,null,null,"","",null,2]
["",null,null,"00:00:00",null,"","",null,"","",null,null,null,null,"","",null,2]
["",null,null,"00:00:00",null,"","",null,"","",null,null,null,null,"","",null,2]
["",null,null,"00:00:00",null,"","",null,"","",null,null,null,null,"","",null,2]
["",null,null,"00:00:00",null,"","",null,"","",null,null,null,null,"","",null,2]
["",null,null,"00:00:00",null,"","",null,"","",null,null,null,null,"","",null,2]
["",null,null,"00:00:00",null,"","",null,"","",null,null,null,null,"","",null,2]
["",null,null,"00:00:00",null,"","",null,"","",null,null,null,null,"","",null,2]
["",null,null,"00:00:00",null,"","",null,"","",null,null,null,null,"","",null,2]
["",null,null,"00:00:00",null,"","",null,"","",null,null,null,null,"","",null,2]
["",null,null,"00:00:00",null,"","",null,"","",null,null,null,null,"","",null,2]
["",null,null,"00:00:00",null,"","",null,"","",null,null,null,null,"","",null,2]
["",null,null,"00:00:00",null,"","",null,"","",null,null,null,null,"","",null,2]
["",null,null,"00:00:00",null,"","",null,"","",null,null,null,null,"","",null,2]
["",null,null,"00:00:00",null,"","",null,"","",null,null,null,null,"","",null,2]
["",null,null,"00:00:00",null,"","",null,"","",null,null,null,null,"","",null,2]
["",null,null,"00:00:00",null,"","",null,"","",null,null,null,null,"","",null,2]
["",null,null,"00:00:00",null,"","",null,"","",null,null,null,null,"","",null,2]
["",null,null,"00:00:00",null,"","",null,"","",null,null,null,null,"","",null,2]
["",null,null,"00:00:00",null,"","",null,"","",null,null,null,null,"","",null,2]
["",null,null,"00:00:00",null,"","",null,"","",null,null,null,null,"","",null,2]
["",null,null,"00:00:00",null,"","",null,"","",null,null,null,null,"","",null,2]
["",null,null,"00:00:00",null,"","",null,"","",null,null,null,null,"","",null,2]
["",null,null,"00:00:00",null,"","",null,"","",null,null,null,null,"","",null,2]
["",null,null,"00:00:00",null,"","",null,"","",null,null,null,null,"","",null,2]
["",null,null,"00:00:00",null,"","",null,"","",null,null,null,null,"","",null,2]
[{"$f":"IF(E1988=\"\",\"\",IF(A1988=\"\",TODAY(),A1988))","v":""},null,null,{"$f":"C1988-B1988+IF(B1988>C1988,1)","v":"00:00:00"},null,{"$f":"IFERROR(VLOOKUP(E1988,$AJ$2:$AL$3155,2,FALSE),\"\")","v":""},{"$f":"IFERROR(VLOOKUP(E1988,$AJ$2:$AL$3155,3,FALSE),\"\")","v":""},null,{"$f":"IFERROR(SUM(G1988/7),\"\")","v":""},{"$f":"IFERROR(SUM(N1988/C1988),\"\")","v":""},null,null,null,null,{"$f":"IFERROR(ROUND(SUM(1000/K1988),2),\"\")","v":""},{"$f":"IFERROR(ROUND(SUM(N1988*O1988),2),\"\")","v":""},null,2]
["",null,null,"00:00:00",null,"","",null,"","",null,null,null,null,"","",null,2]
["",null,null,"00:00:00",null,"","",null,"","",null,null,null,null,"","",null,2]
["",null,null,"00:00:00",null,"","",null,"","",null,null,null,null,"","",null,2]
["",null,null,"00:00:00",null,"","",null,"","",null,null,null,null,"","",null,2]
["",null,null,"00:00:00",null,"","",null,"","",null,null,null,null,"","",null,2]
["",null,null,"00:00:00",null,"","",null,"","",null,null,null,null,"","",null,2]
["",null,null,"00:00:00",null,"","",null,"","",null,null,null,null,"","",null,2]
["",null,null,"00:00:00",null,"","",null,"","",null,null,null,null,"","",null,2]
["",null,null,"00:00:00",null,"","",null,"","",null,null,null,null,"","",null,2]
["",null,null,"00:00:00",null,"","",null,"","",null,null,null,null,"","",null,2]
["",null,null,"00:00:00",null,"","",null,"","",null,null,null,null,"","",null,2]
["",null,null,"00:00:00",null,"","",null,"","",null,null,null,null,"","",null,2]
["",null,null,"00:00:00",null,"","",null,"","",null,null,null,null,"","",null,2]

{"sheet":"Shift_3","index":2,"n_rows":2001,"n_cols":42,"rows_kept":2001,"cut":false,"hidden":false,"merged":[]}
[]
["Date","Start Time","End Time","Total","Machine No.","Machine Name","Maximum power","Production rate per Shift","Average hourly output","Average hourly output","Gm/ML","Size MM"," Drawing  "," KG.\\ day","ML X KG."," ML.\\ day","Color","Shift","Name of the employee","Name of Supervisor","OR No.","Comment",null,null,null,null,null,null,null,null,null,null,null,null,null,1,"Crosha COMEZ 2017",20,0.05,"Black ","منصور محمد منصور","محمد"]
[{"$f":"IF(E3=\"\",\"\",IF(A3=\"\",TODAY(),A3))","v":"2019-02-18"},"11:30:00","15:30:00",{"$f":"C3-B3+IF(B3>C3,1)","v":"04:00:00"},3,{"$f":"IFERROR(VLOOKUP(E3,$AJ$2:$AL$3155,2,FALSE),\"\")","v":"Crosha F.COLLIC 1996"},{"$f":"IFERROR(VLOOKUP(E3,$AJ$2:$AL$3155,3,FALSE),\"\")","v":12},13,{"$f":"IFERROR(SUM(G3/7),\"\")","v":1.7142857142857142},{"$f":"IFERROR(SUM(N3/C3),\"\")","v":20.129032258064516},5,0.08,"gfd",13,{"$f":"IFERROR(ROUND(SUM(1000/K3),2),\"\")","v":200},{"$f":"IFERROR(ROUND(SUM(N3*O3),2),\"\")","v":2600},"White",3,"صبحي محمد محمود","محمود",1000,null,null,null,null,null,null,null,null,null,null,null,null,null,null,2,"Crosha COMEZ 2017",15.2,0.06,"White","علي مراد حسن","محمود"]
[{"$f":"IF(E4=\"\",\"\",IF(A4=\"\",TODAY(),A4))","v":"2019-02-18"},"09:00:00","16:00:00",{"$f":"C4-B4+IF(B4>C4,1)","v":"07:00:00"},5,{"$f":"IFERROR(VLOOKUP(E4,$AJ$2:$AL$3155,2,FALSE),\"\")","v":"Crosha F.COLLIC 1996"},{"$f":"IFERROR(VLOOKUP(E4,$AJ$2:$AL$3155,3,FALSE),\"\")","v":10.4},11,{"$f":"IFERROR(SUM(G4/7),\"\")","v":1.4857142857142858},{"$f":"IFERROR(SUM(N4/C4),\"\")","v":16.5},6,7.0000000000000007E-2,"erer",11,{"$f":"IFERROR(ROUND(SUM(1000/K4),2),\"\")","v":166.67},{"$f":"IFERROR(ROUND(SUM(N4*O4),2),\"\")","v":1833.37},"Black ",3,"السيد محمد عبد العال","محمود",2000,null,null,null,null,null,null,null,null,null,null,null,null,null,null,3,"Crosha F.COLLIC 1996",12,7.0000000000000007E-2,"Black&White","ابراهيم محمود ابراهيم","اسامة"]
["",null,null,"00:00:00",null,"","",null,"","",null,null,null,null,"","",null,3,null,null,null,null,null,null,null,null,null,null,null,null,null,null,null,null,null,4,"Crosha F.COLLIC 1997",10.8,0.08,"A prominent Black","مسعد رمزي مسعد"]
["",null,null,"00:00:00",null,"","",null,"","",null,null,null,null,"","",null,3,null,null,null,null,null,null,null,null,null,null,null,null,null,null,null,null,null,5,"Crosha F.COLLIC 1996",10.4,0.09,"A prominent White","عادل عزمي شنودة"]
["",null,null,"00:00:00",null,"","",null,"","",null,null,null,null,"","",null,3,null,null,null,null,null,null,null,null,null,null,null,null,null,null,null,null,null,6,"Crosha",null,0.1,null,"صبحي محمد محمود"]
["",null,null,"00:00:00",null,"","",null,"","",null,null,null,null,"","",null,3,null,null,null,null,null,null,null,null,null,null,null,null,null,null,null,null,null,7,"Crosha",null,0.11,null,"السيد محمد عبد العال"]
["",null,null,"00:00:00",null,"","",null,"","",null,null,null,null,"","",null,3,null,null,null,null,null,null,null,null,null,null,null,null,null,null,null,null,null,8,"Crosha",null,0.12,null,"عادل سيف الله السيد"]
["",null,null,"00:00:00",null,"","",null,"","",null,null,null,null,"","",null,3,null,null,null,null,null,null,null,null,null,null,null,null,null,null,null,null,null,9,"Crosha",null,0.13,null,"خالد السيد عبد القادر"]
["",null,null,"00:00:00",null,"","",null,"","",null,null,null,null,"","",null,3,null,null,null,null,null,null,null,null,null,null,null,null,null,null,null,null,null,10,"Crosha",null,0.14000000000000001,null,"عادل صادق بشير"]
["",null,null,"00:00:00",null,"","",null,"","",null,null,null,null,"","",null,3,null,null,null,null,null,null,null,null,null,null,null,null,null,null,null,null,null,11,"Crosha",null,0.15,null,"روماني عطية حبشي"]
["",null,null,"00:00:00",null,"","",null,"","",null,null,null,null,"","",null,3,null,null,null,null,null,null,null,null,null,null,null,null,null,null,null,null,null,12,"Crosha",null,0.16,null,"احمد صادق توفيق"]
["",null,null,"00:00:00",null,"","",null,"","",null,null,null,null,"","",null,3,null,null,null,null,null,null,null,null,null,null,null,null,null,null,null,null,null,13,"Crosha",null,0.17,null,"دينا مجدي ابراهيم"]
["",null,null,"00:00:00",null,"","",null,"","",null,null,null,null,"","",null,3,null,null,null,null,null,null,null,null,null,null,null,null,null,null,null,null,null,14,"Crosha",null,0.18,null,"علي فرج على محمد"]
["",null,null,"00:00:00",null,"","",null,"","",null,null,null,null,"","",null,3,null,null,null,null,null,null,null,null,null,null,null,null,null,null,null,null,null,15,"Crosha",null,0.19,null,"بوسي السيد عبد المنعم"]
["",null,null,"00:00:00",null,"","",null,"","",null,null,null,null,"","",null,3,null,null,null,null,null,null,null,null,null,null,null,null,null,null,null,null,null,16,"Crosha",null,0.2,null,"محمد محمد عبد الوهاب"]
["",null,null,"00:00:00",null,"","",null,"","",null,null,null,null,"","",null,3,null,null,null,null,null,null,null,null,null,null,null,null,null,null,null,null,null,17,"Crosha",null,0.21,null,"سعيد الليثي جاب الله"]
["",null,null,"00:00:00",null,"","",null,"","",null,null,null,null,"","",null,3,null,null,null,null,null,null,null,null,null,null,null,null,null,null,null,null,null,18,"Crosha",null,0.22,null,"احمد عبد الظاهر"]
["",null,null,"00:00:00",null,"","",null,"","",null,null,null,null,"","",null,3,null,null,null,null,null,null,null,null,null,null,null,null,null,null,null,null,null,19,"Crosha",null,0.23,null,"مصطفى عبد النبي مصطفى"]
["",null,null,"00:00:00",null,"","",null,"","",null,null,null,null,"","",null,3,null,null,null,null,null,null,null,null,null,null,null,null,null,null,null,null,null,20,"Crosha",null,0.24,null,"ابراهيم صبحي محمد السيد"]
["",null,null,"00:00:00",null,"","",null,"","",null,null,null,null,"","",null,3,null,null,null,null,null,null,null,null,null,null,null,null,null,null,null,null,null,21,"Crosha",null,0.25,null,"خميس حسن حسنين"]
["",null,null,"00:00:00",null,"","",null,"","",null,null,null,null,"","",null,3,null,null,null,null,null,null,null,null,null,null,null,null,null,null,null,null,null,22,"Crosha",null,0.26,null,"محمد حسني حسن"]
["",null,null,"00:00:00",null,"","",null,"","",null,null,null,null,"","",null,3,null,null,null,null,null,null,null,null,null,null,null,null,null,null,null,null,null,23,"Crosha",null,0.27,null,"محمد عادل محمد محمد"]
["",null,null,"00:00:00",null,"","",null,"","",null,null,null,null,"","",null,3,null,null,null,null,null,null,null,null,null,null,null,null,null,null,null,null,null,24,"Crosha",null,0.28000000000000003,null,"السيد عبد الحميد اسماعيل"]
["",null,null,"00:00:00",null,"","",null,"","",null,null,null,null,"","",null,3,null,null,null,null,null,null,null,null,null,null,null,null,null,null,null,null,null,25,"Crosha",null,0.28999999999999998,null,"ابراهيم محمد فتوح"]
["",null,null,"00:00:00",null,"","",null,"","",null,null,null,null,"","",null,3,null,null,null,null,null,null,null,null,null,null,null,null,null,null,null,null,null,26,"Crosha",null,0.3,null,"عمرو محمد عبد الجليل"]
["",null,null,"00:00:00",null,"","",null,"","",null,null,null,null,"","",null,3,null,null,null,null,null,null,null,null,null,null,null,null,null,null,null,null,null,27,"Crosha",null,0.31,null,"خالد مصطفى العوضي"]
["",null,null,"00:00:00",null,"","",null,"","",null,null,null,null,"","",null,3,null,null,null,null,null,null,null,null,null,null,null,null,null,null,null,null,null,28,"Crosha",null,0.32,null,"حمادة احمد على النجار"]
["",null,null,"00:00:00",null,"","",null,"","",null,null,null,null,"","",null,3,null,null,null,null,null,null,null,null,null,null,null,null,null,null,null,null,null,29,"Crosha",null,0.33,null,"عاطف وليم لبيب"]
["",null,null,"00:00:00",null,"","",null,"","",null,null,null,null,"","",null,3,null,null,null,null,null,null,null,null,null,null,null,null,null,null,null,null,null,30,"Crosha",null,0.34,null,"عادل وليم نبيل"]
["",null,null,"00:00:00",null,"","",null,"","",null,null,null,null,"","",null,3,null,null,null,null,null,null,null,null,null,null,null,null,null,null,null,null,null,31,"Crosha",null,0.35,null,"بيشوي عزت شفيق"]
["",null,null,"00:00:00",null,"","",null,"","",null,null,null,null,"","",null,3,null,null,null,null,null,null,null,null,null,null,null,null,null,null,null,null,null,32,"Crosha",null,0.36,null,"محمد يحيى محمود"]
["",null,null,"00:00:00",null,"","",null,"","",null,null,null,null,"","",null,3,null,null,null,null,null,null,null,null,null,null,null,null,null,null,null,null,null,33,"Crosha",null,0.37,null,"احمد رمضان احمد"]
["",null,null,"00:00:00",null,"","",null,"","",null,null,null,null,"","",null,3,null,null,null,null,null,null,null,null,null,null,null,null,null,null,null,null,null,34,"Crosha",null,0.38]
["",null,null,"00:00:00",null,"","",null,"","",null,null,null,null,"","",null,3,null,null,null,null,null,null,null,null,null,null,null,null,null,null,null,null,null,35,"Crosha",null,0.39]
["",null,null,"00:00:00",null,"","",null,"","",null,null,null,null,"","",null,3,null,null,null,null,null,null,null,null,null,null,null,null,null,null,null,null,null,36,"Crosha",null,0.4]
["",null,null,"00:00:00",null,"","",null,"","",null,null,null,null,"","",null,3,null,null,null,null,null,null,null,null,null,null,null,null,null,null,null,null,null,37,"Crosha",null,0.41]
["",null,null,"00:00:00",null,"","",null,"","",null,null,null,null,"","",null,3,null,null,null,null,null,null,null,null,null,null,null,null,null,null,null,null,null,38,"Crosha",null,0.42]
["",null,null,"00:00:00",null,"","",null,"","",null,null,null,null,"","",null,3,null,null,null,null,null,null,null,null,null,null,null,null,null,null,null,null,null,39,"Crosha",null,0.43]
["",null,null,"00:00:00",null,"","",null,"","",null,null,null,null,"","",null,3,null,null,null,null,null,null,null,null,null,null,null,null,null,null,null,null,null,40,"Crosha",null,0.44]
["",null,null,"00:00:00",null,"","",null,"","",null,null,null,null,"","",null,3,null,null,null,null,null,null,null,null,null,null,null,null,null,null,null,null,null,41,"Crosha",null,0.45]
["",null,null,"00:00:00",null,"","",null,"","",null,null,null,null,"","",null,3,null,null,null,null,null,null,null,null,null,null,null,null,null,null,null,null,null,42,"Crosha",null,0.46]
["",null,null,"00:00:00",null,"","",null,"","",null,null,null,null,"","",null,3,null,null,null,null,null,null,null,null,null,null,null,null,null,null,null,null,null,43,"Crosha",null,0.47]
["",null,null,"00:00:00",null,"","",null,"","",null,null,null,null,"","",null,3,null,null,null,null,null,null,null,null,null,null,null,null,null,null,null,null,null,44,"Crosha",null,0.48]
["",null,null,"00:00:00",null,"","",null,"","",null,null,null,null,"","",null,3,null,null,null,null,null,null,null,null,null,null,null,null,null,null,null,null,null,45,"Crosha",null,0.49]
["",null,null,"00:00:00",null,"","",null,"","",null,null,null,null,"","",null,3,null,null,null,null,null,null,null,null,null,null,null,null,null,null,null,null,null,46,"Crosha",null,0.5]
["",null,null,"00:00:00",null,"","",null,"","",null,null,null,null,"","",null,3,null,null,null,null,null,null,null,null,null,null,null,null,null,null,null,null,null,47,"Crosha",null,0.51]
["",null,null,"00:00:00",null,"","",null,"","",null,null,null,null,"","",null,3,null,null,null,null,null,null,null,null,null,null,null,null,null,null,null,null,null,48,"Crosha",null,0.52]
["",null,null,"00:00:00",null,"","",null,"","",null,null,null,null,"","",null,3,null,null,null,null,null,null,null,null,null,null,null,null,null,null,null,null,null,49,"Crosha",null,0.53]
["",null,null,"00:00:00",null,"","",null,"","",null,null,null,null,"","",null,3,null,null,null,null,null,null,null,null,null,null,null,null,null,null,null,null,null,50,"Crosha",null,0.54]
["",null,null,"00:00:00",null,"","",null,"","",null,null,null,null,"","",null,3,null,null,null,null,null,null,null,null,null,null,null,null,null,null,null,null,null,51,"Crosha",null,0.55000000000000004]
["",null,null,"00:00:00",null,"","",null,"","",null,null,null,null,"","",null,3,null,null,null,null,null,null,null,null,null,null,null,null,null,null,null,null,null,52,"Crosha",null,0.56000000000000005]
["",null,null,"00:00:00",null,"","",null,"","",null,null,null,null,"","",null,3,null,null,null,null,null,null,null,null,null,null,null,null,null,null,null,null,null,53,"Crosha",null,0.56999999999999995]
["",null,null,"00:00:00",null,"","",null,"","",null,null,null,null,"","",null,3,null,null,null,null,null,null,null,null,null,null,null,null,null,null,null,null,null,54,"Crosha",null,0.57999999999999996]
["",null,null,"00:00:00",null,"","",null,"","",null,null,null,null,"","",null,3,null,null,null,null,null,null,null,null,null,null,null,null,null,null,null,null,null,55,"Crosha",null,0.59]
["",null,null,"00:00:00",null,"","",null,"","",null,null,null,null,"","",null,3,null,null,null,null,null,null,null,null,null,null,null,null,null,null,null,null,null,56,"Crosha",null,0.6]
["",null,null,"00:00:00",null,"","",null,"","",null,null,null,null,"","",null,3,null,null,null,null,null,null,null,null,null,null,null,null,null,null,null,null,null,57,"Crosha",null,0.61]
["",null,null,"00:00:00",null,"","",null,"","",null,null,null,null,"","",null,3,null,null,null,null,null,null,null,null,null,null,null,null,null,null,null,null,null,58,"Crosha",null,0.62]
["",null,null,"00:00:00",null,"","",null,"","",null,null,null,null,"","",null,3,null,null,null,null,null,null,null,null,null,null,null,null,null,null,null,null,null,59,"Crosha",null,0.63]
["",null,null,"00:00:00",null,"","",null,"","",null,null,null,null,"","",null,3,null,null,null,null,null,null,null,null,null,null,null,null,null,null,null,null,null,60,"Crosha",null,0.64]
["",null,null,"00:00:00",null,"","",null,"","",null,null,null,null,"","",null,3,null,null,null,null,null,null,null,null,null,null,null,null,null,null,null,null,null,61,"Crosha",null,0.65]
["",null,null,"00:00:00",null,"","",null,"","",null,null,null,null,"","",null,3,null,null,null,null,null,null,null,null,null,null,null,null,null,null,null,null,null,62,"Crosha",null,0.66]
["",null,null,"00:00:00",null,"","",null,"","",null,null,null,null,"","",null,3,null,null,null,null,null,null,null,null,null,null,null,null,null,null,null,null,null,63,"Crosha",null,0.67]
["",null,null,"00:00:00",null,"","",null,"","",null,null,null,null,"","",null,3,null,null,null,null,null,null,null,null,null,null,null,null,null,null,null,null,null,64,"Crosha",null,0.68]
["",null,null,"00:00:00",null,"","",null,"","",null,null,null,null,"","",null,3,null,null,null,null,null,null,null,null,null,null,null,null,null,null,null,null,null,65,"Crosha",null,0.69]
["",null,null,"00:00:00",null,"","",null,"","",null,null,null,null,"","",null,3,null,null,null,null,null,null,null,null,null,null,null,null,null,null,null,null,null,66,"Crosha",null,0.7]
[{"$f":"IF(E68=\"\",\"\",IF(A68=\"\",TODAY(),A68))","v":""},null,null,{"$f":"C68-B68+IF(B68>C68,1)","v":"00:00:00"},null,{"$f":"IFERROR(VLOOKUP(E68,$AJ$2:$AL$3155,2,FALSE),\"\")","v":""},{"$f":"IFERROR(VLOOKUP(E68,$AJ$2:$AL$3155,3,FALSE),\"\")","v":""},null,{"$f":"IFERROR(SUM(G68/7),\"\")","v":""},{"$f":"IFERROR(SUM(N68/C68),\"\")","v":""},null,null,null,null,{"$f":"IFERROR(ROUND(SUM(1000/K68),2),\"\")","v":""},{"$f":"IFERROR(ROUND(SUM(N68*O68),2),\"\")","v":""},null,3,null,null,null,null,null,null,null,null,null,null,null,null,null,null,null,null,null,67,"Crosha",null,0.71]
["",null,null,"00:00:00",null,"","",null,"","",null,null,null,null,"","",null,3,null,null,null,null,null,null,null,null,null,null,null,null,null,null,null,null,null,68,"Crosha",null,0.72]
["",null,null,"00:00:00",null,"","",null,"","",null,null,null,null,"","",null,3,null,null,null,null,null,null,null,null,null,null,null,null,null,null,null,null,null,69,"Crosha",null,0.73]
["",null,null,"00:00:00",null,"","",null,"","",null,null,null,null,"","",null,3,null,null,null,null,null,null,null,null,null,null,null,null,null,null,null,null,null,70,"Crosha",null,0.74]
["",null,null,"00:00:00",null,"","",null,"","",null,null,null,null,"","",null,3,null,null,null,null,null,null,null,null,null,null,null,null,null,null,null,null,null,71,"Crosha",null,0.75]
["",null,null,"00:00:00",null,"","",null,"","",null,null,null,null,"","",null,3,null,null,null,null,null,null,null,null,null,null,null,null,null,null,null,null,null,72,"Crosha",null,0.76]
["",null,null,"00:00:00",null,"","",null,"","",null,null,null,null,"","",null,3,null,null,null,null,null,null,null,null,null,null,null,null,null,null,null,null,null,73,"Crosha",null,0.77]
["",null,null,"00:00:00",null,"","",null,"","",null,null,null,null,"","",null,3,null,null,null,null,null,null,null,null,null,null,null,null,null,null,null,null,null,74,"Crosha",null,0.78]
["",null,null,"00:00:00",null,"","",null,"","",null,null,null,null,"","",null,3,null,null,null,null,null,null,null,null,null,null,null,null,null,null,null,null,null,75,"Crosha",null,0.79]
["",null,null,"00:00:00",null,"","",null,"","",null,null,null,null,"","",null,3,null,null,null,null,null,null,null,null,null,null,null,null,null,null,null,null,null,76,"Crosha",null,0.8]
["",null,null,"00:00:00",null,"","",null,"","",null,null,null,null,"","",null,3,null,null,null,null,null,null,null,null,null,null,null,null,null,null,null,null,null,77,"Crosha",null,0.81]
["",null,null,"00:00:00",null,"","",null,"","",null,null,null,null,"","",null,3,null,null,null,null,null,null,null,null,null,null,null,null,null,null,null,null,null,78,"Crosha",null,0.82]
["",null,null,"00:00:00",null,"","",null,"","",null,null,null,null,"","",null,3,null,null,null,null,null,null,null,null,null,null,null,null,null,null,null,null,null,79,"Crosha",null,0.83]
["",null,null,"00:00:00",null,"","",null,"","",null,null,null,null,"","",null,3,null,null,null,null,null,null,null,null,null,null,null,null,null,null,null,null,null,80,"Crosha",null,0.84]
["",null,null,"00:00:00",null,"","",null,"","",null,null,null,null,"","",null,3,null,null,null,null,null,null,null,null,null,null,null,null,null,null,null,null,null,81,"Crosha",null,0.85]
["",null,null,"00:00:00",null,"","",null,"","",null,null,null,null,"","",null,3,null,null,null,null,null,null,null,null,null,null,null,null,null,null,null,null,null,82,"Crosha",null,0.86]
["",null,null,"00:00:00",null,"","",null,"","",null,null,null,null,"","",null,3,null,null,null,null,null,null,null,null,null,null,null,null,null,null,null,null,null,83,"Crosha",null,0.87]
["",null,null,"00:00:00",null,"","",null,"","",null,null,null,null,"","",null,3,null,null,null,null,null,null,null,null,null,null,null,null,null,null,null,null,null,84,"Crosha",null,0.88]
["",null,null,"00:00:00",null,"","",null,"","",null,null,null,null,"","",null,3,null,null,null,null,null,null,null,null,null,null,null,null,null,null,null,null,null,85,"Crosha",null,0.89]
["",null,null,"00:00:00",null,"","",null,"","",null,null,null,null,"","",null,3,null,null,null,null,null,null,null,null,null,null,null,null,null,null,null,null,null,86,"Crosha",null,0.9]
["",null,null,"00:00:00",null,"","",null,"","",null,null,null,null,"","",null,3,null,null,null,null,null,null,null,null,null,null,null,null,null,null,null,null,null,87,"Crosha",null,0.91]
["",null,null,"00:00:00",null,"","",null,"","",null,null,null,null,"","",null,3,null,null,null,null,null,null,null,null,null,null,null,null,null,null,null,null,null,88,"Crosha",null,0.92]
["",null,null,"00:00:00",null,"","",null,"","",null,null,null,null,"","",null,3,null,null,null,null,null,null,null,null,null,null,null,null,null,null,null,null,null,89,"Crosha",null,0.93]
["",null,null,"00:00:00",null,"","",null,"","",null,null,null,null,"","",null,3,null,null,null,null,null,null,null,null,null,null,null,null,null,null,null,null,null,90,"Crosha",null,0.94]
["",null,null,"00:00:00",null,"","",null,"","",null,null,null,null,"","",null,3,null,null,null,null,null,null,null,null,null,null,null,null,null,null,null,null,null,91,"Crosha",null,0.95]
["",null,null,"00:00:00",null,"","",null,"","",null,null,null,null,"","",null,3,null,null,null,null,null,null,null,null,null,null,null,null,null,null,null,null,null,92,"Crosha",null,0.96]
["",null,null,"00:00:00",null,"","",null,"","",null,null,null,null,"","",null,3,null,null,null,null,null,null,null,null,null,null,null,null,null,null,null,null,null,93,"Crosha",null,0.97]
["",null,null,"00:00:00",null,"","",null,"","",null,null,null,null,"","",null,3,null,null,null,null,null,null,null,null,null,null,null,null,null,null,null,null,null,94,"Crosha",null,0.98]
["",null,null,"00:00:00",null,"","",null,"","",null,null,null,null,"","",null,3,null,null,null,null,null,null,null,null,null,null,null,null,null,null,null,null,null,95,"Crosha",null,0.99]
["",null,null,"00:00:00",null,"","",null,"","",null,null,null,null,"","",null,3,null,null,null,null,null,null,null,null,null,null,null,null,null,null,null,null,null,96,"Crosha",null,1]
["",null,null,"00:00:00",null,"","",null,"","",null,null,null,null,"","",null,3,null,null,null,null,null,null,null,null,null,null,null,null,null,null,null,null,null,97,"Crosha",null,1.01]
["",null,null,"00:00:00",null,"","",null,"","",null,null,null,null,"","",null,3,null,null,null,null,null,null,null,null,null,null,null,null,null,null,null,null,null,98,"Crosha",null,1.02]
["",null,null,"00:00:00",null,"","",null,"","",null,null,null,null,"","",null,3,null,null,null,null,null,null,null,null,null,null,null,null,null,null,null,null,null,99,"Crosha",null,1.03]
["",null,null,"00:00:00",null,"","",null,"","",null,null,null,null,"","",null,3,null,null,null,null,null,null,null,null,null,null,null,null,null,null,null,null,null,100,"Crosha",null,1.04]
["",null,null,"00:00:00",null,"","",null,"","",null,null,null,null,"","",null,3,null,null,null,null,null,null,null,null,null,null,null,null,null,null,null,null,null,101,"Jakar - MULLER 2017",4.46,1.05]
["",null,null,"00:00:00",null,"","",null,"","",null,null,null,null,"","",null,3,null,null,null,null,null,null,null,null,null,null,null,null,null,null,null,null,null,102,"Jakar - MULLER 2017",6.78,1.06]
["",null,null,"00:00:00",null,"","",null,"","",null,null,null,null,"","",null,3,null,null,null,null,null,null,null,null,null,null,null,null,null,null,null,null,null,103,"Jakar",null,1.07]
["",null,null,"00:00:00",null,"","",null,"","",null,null,null,null,"","",null,3,null,null,null,null,null,null,null,null,null,null,null,null,null,null,null,null,null,104,"Jakar",null,1.08]
["",null,null,"00:00:00",null,"","",null,"","",null,null,null,null,"","",null,3,null,null,null,null,null,null,null,null,null,null,null,null,null,null,null,null,null,105,"Jakar",null,1.0900000000000001]
["",null,null,"00:00:00",null,"","",null,"","",null,null,null,null,"","",null,3,null,null,null,null,null,null,null,null,null,null,null,null,null,null,null,null,null,106,"Jakar",null,1.1000000000000001]
["",null,null,"00:00:00",null,"","",null,"","",null,null,null,null,"","",null,3,null,null,null,null,null,null,null,null,null,null,null,null,null,null,null,null,null,107,"Jakar",null,1.1100000000000001]
["",null,null,"00:00:00",null,"","",null,"","",null,null,null,null,"","",null,3,null,null,null,null,null,null,null,null,null,null,null,null,null,null,null,null,null,108,"Jakar",null,1.1200000000000001]
["",null,null,"00:00:00",null,"","",null,"","",null,null,null,null,"","",null,3,null,null,null,null,null,null,null,null,null,null,null,null,null,null,null,null,null,109,"Jakar",null,1.1299999999999999]
["",null,null,"00:00:00",null,"","",null,"","",null,null,null,null,"","",null,3,null,null,null,null,null,null,null,null,null,null,null,null,null,null,null,null,null,110,"Jakar",null,1.1399999999999999]
["",null,null,"00:00:00",null,"","",null,"","",null,null,null,null,"","",null,3,null,null,null,null,null,null,null,null,null,null,null,null,null,null,null,null,null,111,"Jakar",null,1.1499999999999999]
["",null,null,"00:00:00",null,"","",null,"","",null,null,null,null,"","",null,3,null,null,null,null,null,null,null,null,null,null,null,null,null,null,null,null,null,112,"Jakar",null,1.1599999999999999]
["",null,null,"00:00:00",null,"","",null,"","",null,null,null,null,"","",null,3,null,null,null,null,null,null,null,null,null,null,null,null,null,null,null,null,null,113,"Jakar",null,1.17]
["",null,null,"00:00:00",null,"","",null,"","",null,null,null,null,"","",null,3,null,null,null,null,null,null,null,null,null,null,null,null,null,null,null,null,null,114,"Jakar",null,1.18]
["",null,null,"00:00:00",null,"","",null,"","",null,null,null,null,"","",null,3,null,null,null,null,null,null,null,null,null,null,null,null,null,null,null,null,null,115,"Jakar",null,1.19]
["",null,null,"00:00:00",null,"","",null,"","",null,null,null,null,"","",null,3,null,null,null,null,null,null,null,null,null,null,null,null,null,null,null,null,null,116,"Jakar",null,1.2]
["",null,null,"00:00:00",null,"","",null,"","",null,null,null,null,"","",null,3,null,null,null,null,null,null,null,null,null,null,null,null,null,null,null,null,null,117,"Jakar",null,1.21]
["",null,null,"00:00:00",null,"","",null,"","",null,null,null,null,"","",null,3,null,null,null,null,null,null,null,null,null,null,null,null,null,null,null,null,null,118,"Jakar",null,1.22]
["",null,null,"00:00:00",null,"","",null,"","",null,null,null,null,"","",null,3,null,null,null,null,null,null,null,null,null,null,null,null,null,null,null,null,null,119,"Jakar",null,1.23]
["",null,null,"00:00:00",null,"","",null,"","",null,null,null,null,"","",null,3,null,null,null,null,null,null,null,null,null,null,null,null,null,null,null,null,null,120,"Jakar",null,1.24]
["",null,null,"00:00:00",null,"","",null,"","",null,null,null,null,"","",null,3,null,null,null,null,null,null,null,null,null,null,null,null,null,null,null,null,null,121,"Jakar",null,1.25]
["",null,null,"00:00:00",null,"","",null,"","",null,null,null,null,"","",null,3,null,null,null,null,null,null,null,null,null,null,null,null,null,null,null,null,null,122,"Jakar",null,1.26]
["",null,null,"00:00:00",null,"","",null,"","",null,null,null,null,"","",null,3,null,null,null,null,null,null,null,null,null,null,null,null,null,null,null,null,null,123,"Jakar",null,1.27]
["",null,null,"00:00:00",null,"","",null,"","",null,null,null,null,"","",null,3,null,null,null,null,null,null,null,null,null,null,null,null,null,null,null,null,null,124,"Jakar",null,1.28]
["",null,null,"00:00:00",null,"","",null,"","",null,null,null,null,"","",null,3,null,null,null,null,null,null,null,null,null,null,null,null,null,null,null,null,null,125,"Jakar",null,1.29]
["",null,null,"00:00:00",null,"","",null,"","",null,null,null,null,"","",null,3,null,null,null,null,null,null,null,null,null,null,null,null,null,null,null,null,null,126,"Jakar",null,1.3]
["",null,null,"00:00:00",null,"","",null,"","",null,null,null,null,"","",null,3,null,null,null,null,null,null,null,null,null,null,null,null,null,null,null,null,null,127,"Jakar",null,1.31]
["",null,null,"00:00:00",null,"","",null,"","",null,null,null,null,"","",null,3,null,null,null,null,null,null,null,null,null,null,null,null,null,null,null,null,null,128,"Jakar",null,1.32]
["",null,null,"00:00:00",null,"","",null,"","",null,null,null,null,"","",null,3,null,null,null,null,null,null,null,null,null,null,null,null,null,null,null,null,null,129,"Jakar",null,1.33]
["",null,null,"00:00:00",null,"","",null,"","",null,null,null,null,"","",null,3,null,null,null,null,null,null,null,null,null,null,null,null,null,null,null,null,null,130,"Jakar",null,1.34]
[{"$f":"IF(E132=\"\",\"\",IF(A132=\"\",TODAY(),A132))","v":""},null,null,{"$f":"C132-B132+IF(B132>C132,1)","v":"00:00:00"},null,{"$f":"IFERROR(VLOOKUP(E132,$AJ$2:$AL$3155,2,FALSE),\"\")","v":""},{"$f":"IFERROR(VLOOKUP(E132,$AJ$2:$AL$3155,3,FALSE),\"\")","v":""},null,{"$f":"IFERROR(SUM(G132/7),\"\")","v":""},{"$f":"IFERROR(SUM(N132/C132),\"\")","v":""},null,null,null,null,{"$f":"IFERROR(ROUND(SUM(1000/K132),2),\"\")","v":""},{"$f":"IFERROR(ROUND(SUM(N132*O132),2),\"\")","v":""},null,3,null,null,null,null,null,null,null,null,null,null,null,null,null,null,null,null,null,131,"Jakar",null,1.35]
["",null,null,"00:00:00",null,"","",null,"","",null,null,null,null,"","",null,3,null,null,null,null,null,null,null,null,null,null,null,null,null,null,null,null,null,132,"Jakar",null,1.36]
["",null,null,"00:00:00",null,"","",null,"","",null,null,null,null,"","",null,3,null,null,null,null,null,null,null,null,null,null,null,null,null,null,null,null,null,133,"Jakar",null,1.37]
["",null,null,"00:00:00",null,"","",null,"","",null,null,null,null,"","",null,3,null,null,null,null,null,null,null,null,null,null,null,null,null,null,null,null,null,134,"Jakar",null,1.38]
["",null,null,"00:00:00",null,"","",null,"","",null,null,null,null,"","",null,3,null,null,null,null,null,null,null,null,null,null,null,null,null,null,null,null,null,135,"Jakar",null,1.39]
["",null,null,"00:00:00",null,"","",null,"","",null,null,null,null,"","",null,3,null,null,null,null,null,null,null,null,null,null,null,null,null,null,null,null,null,136,"Jakar",null,1.4]
["",null,null,"00:00:00",null,"","",null,"","",null,null,null,null,"","",null,3,null,null,null,null,null,null,null,null,null,null,null,null,null,null,null,null,null,137,"Jakar",null,1.41]
["",null,null,"00:00:00",null,"","",null,"","",null,null,null,null,"","",null,3,null,null,null,null,null,null,null,null,null,null,null,null,null,null,null,null,null,138,"Jakar",null,1.42]
["",null,null,"00:00:00",null,"","",null,"","",null,null,null,null,"","",null,3,null,null,null,null,null,null,null,null,null,null,null,null,null,null,null,null,null,139,"Jakar",null,1.43]
["",null,null,"00:00:00",null,"","",null,"","",null,null,null,null,"","",null,3,null,null,null,null,null,null,null,null,null,null,null,null,null,null,null,null,null,140,"Jakar",null,1.44]
["",null,null,"00:00:00",null,"","",null,"","",null,null,null,null,"","",null,3,null,null,null,null,null,null,null,null,null,null,null,null,null,null,null,null,null,141,"Jakar",null,1.45]
["",null,null,"00:00:00",null,"","",null,"","",null,null,null,null,"","",null,3,null,null,null,null,null,null,null,null,null,null,null,null,null,null,null,null,null,142,"Jakar",null,1.46]
["",null,null,"00:00:00",null,"","",null,"","",null,null,null,null,"","",null,3,null,null,null,null,null,null,null,null,null,null,null,null,null,null,null,null,null,143,"Jakar",null,1.47]
["",null,null,"00:00:00",null,"","",null,"","",null,null,null,null,"","",null,3,null,null,null,null,null,null,null,null,null,null,null,null,null,null,null,null,null,144,"Jakar",null,1.48]
["",null,null,"00:00:00",null,"","",null,"","",null,null,null,null,"","",null,3,null,null,null,null,null,null,null,null,null,null,null,null,null,null,null,null,null,145,"Jakar",null,1.49]
["",null,null,"00:00:00",null,"","",null,"","",null,null,null,null,"","",null,3,null,null,null,null,null,null,null,null,null,null,null,null,null,null,null,null,null,146,"Jakar",null,1.5]
["",null,null,"00:00:00",null,"","",null,"","",null,null,null,null,"","",null,3,null,null,null,null,null,null,null,null,null,null,null,null,null,null,null,null,null,147,"Jakar",null,1.51]
["",null,null,"00:00:00",null,"","",null,"","",null,null,null,null,"","",null,3,null,null,null,null,null,null,null,null,null,null,null,null,null,null,null,null,null,148,"Jakar",null,1.52]
["",null,null,"00:00:00",null,"","",null,"","",null,null,null,null,"","",null,3,null,null,null,null,null,null,null,null,null,null,null,null,null,null,null,null,null,149,"Jakar",null,1.53]
["",null,null,"00:00:00",null,"","",null,"","",null,null,null,null,"","",null,3,null,null,null,null,null,null,null,null,null,null,null,null,null,null,null,null,null,150,"Jakar",null,1.54]
["",null,null,"00:00:00",null,"","",null,"","",null,null,null,null,"","",null,3,null,null,null,null,null,null,null,null,null,null,null,null,null,null,null,null,null,151,"Jakar",null,1.55]
["",null,null,"00:00:00",null,"","",null,"","",null,null,null,null,"","",null,3,null,null,null,null,null,null,null,null,null,null,null,null,null,null,null,null,null,152,"Jakar",null,1.56]
["",null,null,"00:00:00",null,"","",null,"","",null,null,null,null,"","",null,3,null,null,null,null,null,null,null,null,null,null,null,null,null,null,null,null,null,153,"Jakar",null,1.57]
["",null,null,"00:00:00",null,"","",null,"","",null,null,null,null,"","",null,3,null,null,null,null,null,null,null,null,null,null,null,null,null,null,null,null,null,154,"Jakar",null,1.58]
["",null,null,"00:00:00",null,"","",null,"","",null,null,null,null,"","",null,3,null,null,null,null,null,null,null,null,null,null,null,null,null,null,null,null,null,155,"Jakar",null,1.59]
["",null,null,"00:00:00",null,"","",null,"","",null,null,null,null,"","",null,3,null,null,null,null,null,null,null,null,null,null,null,null,null,null,null,null,null,156,"Jakar",null,1.6]
["",null,null,"00:00:00",null,"","",null,"","",null,null,null,null,"","",null,3,null,null,null,null,null,null,null,null,null,null,null,null,null,null,null,null,null,157,"Jakar",null,1.61]
["",null,null,"00:00:00",null,"","",null,"","",null,null,null,null,"","",null,3,null,null,null,null,null,null,null,null,null,null,null,null,null,null,null,null,null,158,"Jakar",null,1.62]
["",null,null,"00:00:00",null,"","",null,"","",null,null,null,null,"","",null,3,null,null,null,null,null,null,null,null,null,null,null,null,null,null,null,null,null,159,"Jakar",null,1.63]
["",null,null,"00:00:00",null,"","",null,"","",null,null,null,null,"","",null,3,null,null,null,null,null,null,null,null,null,null,null,null,null,null,null,null,null,160,"Jakar",null,1.64]
["",null,null,"00:00:00",null,"","",null,"","",null,null,null,null,"","",null,3,null,null,null,null,null,null,null,null,null,null,null,null,null,null,null,null,null,161,"Jakar",null,1.65]
["",null,null,"00:00:00",null,"","",null,"","",null,null,null,null,"","",null,3,null,null,null,null,null,null,null,null,null,null,null,null,null,null,null,null,null,162,"Jakar",null,1.66]
["",null,null,"00:00:00",null,"","",null,"","",null,null,null,null,"","",null,3,null,null,null,null,null,null,null,null,null,null,null,null,null,null,null,null,null,163,"Jakar",null,1.67]
["",null,null,"00:00:00",null,"","",null,"","",null,null,null,null,"","",null,3,null,null,null,null,null,null,null,null,null,null,null,null,null,null,null,null,null,164,"Jakar",null,1.68]
["",null,null,"00:00:00",null,"","",null,"","",null,null,null,null,"","",null,3,null,null,null,null,null,null,null,null,null,null,null,null,null,null,null,null,null,165,"Jakar",null,1.69]
["",null,null,"00:00:00",null,"","",null,"","",null,null,null,null,"","",null,3,null,null,null,null,null,null,null,null,null,null,null,null,null,null,null,null,null,166,"Jakar",null,1.7]
["",null,null,"00:00:00",null,"","",null,"","",null,null,null,null,"","",null,3,null,null,null,null,null,null,null,null,null,null,null,null,null,null,null,null,null,167,"Jakar",null,1.71]
["",null,null,"00:00:00",null,"","",null,"","",null,null,null,null,"","",null,3,null,null,null,null,null,null,null,null,null,null,null,null,null,null,null,null,null,168,"Jakar",null,1.72]
["",null,null,"00:00:00",null,"","",null,"","",null,null,null,null,"","",null,3,null,null,null,null,null,null,null,null,null,null,null,null,null,null,null,null,null,169,"Jakar",null,1.73]
["",null,null,"00:00:00",null,"","",null,"","",null,null,null,null,"","",null,3,null,null,null,null,null,null,null,null,null,null,null,null,null,null,null,null,null,170,"Jakar",null,1.74]
["",null,null,"00:00:00",null,"","",null,"","",null,null,null,null,"","",null,3,null,null,null,null,null,null,null,null,null,null,null,null,null,null,null,null,null,171,"Jakar",null,1.75]
["",null,null,"00:00:00",null,"","",null,"","",null,null,null,null,"","",null,3,null,null,null,null,null,null,null,null,null,null,null,null,null,null,null,null,null,172,"Jakar",null,1.76]
["",null,null,"00:00:00",null,"","",null,"","",null,null,null,null,"","",null,3,null,null,null,null,null,null,null,null,null,null,null,null,null,null,null,null,null,173,"Jakar",null,1.77]
["",null,null,"00:00:00",null,"","",null,"","",null,null,null,null,"","",null,3,null,null,null,null,null,null,null,null,null,null,null,null,null,null,null,null,null,174,"Jakar",null,1.78]
["",null,null,"00:00:00",null,"","",null,"","",null,null,null,null,"","",null,3,null,null,null,null,null,null,null,null,null,null,null,null,null,null,null,null,null,175,"Jakar",null,1.79]
["",null,null,"00:00:00",null,"","",null,"","",null,null,null,null,"","",null,3,null,null,null,null,null,null,null,null,null,null,null,null,null,null,null,null,null,176,"Jakar",null,1.8]
["",null,null,"00:00:00",null,"","",null,"","",null,null,null,null,"","",null,3,null,null,null,null,null,null,null,null,null,null,null,null,null,null,null,null,null,177,"Jakar",null,1.81]
["",null,null,"00:00:00",null,"","",null,"","",null,null,null,null,"","",null,3,null,null,null,null,null,null,null,null,null,null,null,null,null,null,null,null,null,178,"Jakar",null,1.82]
["",null,null,"00:00:00",null,"","",null,"","",null,null,null,null,"","",null,3,null,null,null,null,null,null,null,null,null,null,null,null,null,null,null,null,null,179,"Jakar",null,1.83]
["",null,null,"00:00:00",null,"","",null,"","",null,null,null,null,"","",null,3,null,null,null,null,null,null,null,null,null,null,null,null,null,null,null,null,null,180,"Jakar",null,1.84]
["",null,null,"00:00:00",null,"","",null,"","",null,null,null,null,"","",null,3,null,null,null,null,null,null,null,null,null,null,null,null,null,null,null,null,null,181,"Jakar",null,1.85]
["",null,null,"00:00:00",null,"","",null,"","",null,null,null,null,"","",null,3,null,null,null,null,null,null,null,null,null,null,null,null,null,null,null,null,null,182,"Jakar",null,1.86]
["",null,null,"00:00:00",null,"","",null,"","",null,null,null,null,"","",null,3,null,null,null,null,null,null,null,null,null,null,null,null,null,null,null,null,null,183,"Jakar",null,1.87]
["",null,null,"00:00:00",null,"","",null,"","",null,null,null,null,"","",null,3,null,null,null,null,null,null,null,null,null,null,null,null,null,null,null,null,null,184,"Jakar",null,1.88]
["",null,null,"00:00:00",null,"","",null,"","",null,null,null,null,"","",null,3,null,null,null,null,null,null,null,null,null,null,null,null,null,null,null,null,null,185,"Jakar",null,1.89]
["",null,null,"00:00:00",null,"","",null,"","",null,null,null,null,"","",null,3,null,null,null,null,null,null,null,null,null,null,null,null,null,null,null,null,null,186,"Jakar",null,1.9]
["",null,null,"00:00:00",null,"","",null,"","",null,null,null,null,"","",null,3,null,null,null,null,null,null,null,null,null,null,null,null,null,null,null,null,null,187,"Jakar",null,1.91]
["",null,null,"00:00:00",null,"","",null,"","",null,null,null,null,"","",null,3,null,null,null,null,null,null,null,null,null,null,null,null,null,null,null,null,null,188,"Jakar",null,1.92]
["",null,null,"00:00:00",null,"","",null,"","",null,null,null,null,"","",null,3,null,null,null,null,null,null,null,null,null,null,null,null,null,null,null,null,null,189,"Jakar",null,1.93]
["",null,null,"00:00:00",null,"","",null,"","",null,null,null,null,"","",null,3,null,null,null,null,null,null,null,null,null,null,null,null,null,null,null,null,null,190,"Jakar",null,1.94]
["",null,null,"00:00:00",null,"","",null,"","",null,null,null,null,"","",null,3,null,null,null,null,null,null,null,null,null,null,null,null,null,null,null,null,null,191,"Jakar",null,1.95]
["",null,null,"00:00:00",null,"","",null,"","",null,null,null,null,"","",null,3,null,null,null,null,null,null,null,null,null,null,null,null,null,null,null,null,null,192,"Jakar",null,1.96]
["",null,null,"00:00:00",null,"","",null,"","",null,null,null,null,"","",null,3,null,null,null,null,null,null,null,null,null,null,null,null,null,null,null,null,null,193,"Jakar",null,1.97]
["",null,null,"00:00:00",null,"","",null,"","",null,null,null,null,"","",null,3,null,null,null,null,null,null,null,null,null,null,null,null,null,null,null,null,null,194,"Jakar",null,1.98]
[{"$f":"IF(E196=\"\",\"\",IF(A196=\"\",TODAY(),A196))","v":""},null,null,{"$f":"C196-B196+IF(B196>C196,1)","v":"00:00:00"},null,{"$f":"IFERROR(VLOOKUP(E196,$AJ$2:$AL$3155,2,FALSE),\"\")","v":""},{"$f":"IFERROR(VLOOKUP(E196,$AJ$2:$AL$3155,3,FALSE),\"\")","v":""},null,{"$f":"IFERROR(SUM(G196/7),\"\")","v":""},{"$f":"IFERROR(SUM(N196/C196),\"\")","v":""},null,null,null,null,{"$f":"IFERROR(ROUND(SUM(1000/K196),2),\"\")","v":""},{"$f":"IFERROR(ROUND(SUM(N196*O196),2),\"\")","v":""},null,3,null,null,null,null,null,null,null,null,null,null,null,null,null,null,null,null,null,195,"Jakar",null,1.99]
["",null,null,"00:00:00",null,"","",null,"","",null,null,null,null,"","",null,3,null,null,null,null,null,null,null,null,null,null,null,null,null,null,null,null,null,196,"Jakar",null,2]
["",null,null,"00:00:00",null,"","",null,"","",null,null,null,null,"","",null,3,null,null,null,null,null,null,null,null,null,null,null,null,null,null,null,null,null,197,"Jakar",null,2.0099999999999998]
["",null,null,"00:00:00",null,"","",null,"","",null,null,null,null,"","",null,3,null,null,null,null,null,null,null,null,null,null,null,null,null,null,null,null,null,198,"Jakar",null,2.02]
["",null,null,"00:00:00",null,"","",null,"","",null,null,null,null,"","",null,3,null,null,null,null,null,null,null,null,null,null,null,null,null,null,null,null,null,199,"Jakar",null,2.0299999999999998]
["",null,null,"00:00:00",null,"","",null,"","",null,null,null,null,"","",null,3,null,null,null,null,null,null,null,null,null,null,null,null,null,null,null,null,null,200,"Jakar",null,2.04]
["",null,null,"00:00:00",null,"","",null,"","",null,null,null,null,"","",null,3,null,null,null,null,null,null,null,null,null,null,null,null,null,null,null,null,null,201,"Jakar",null,2.0499999999999998]
["",null,null,"00:00:00",null,"","",null,"","",null,null,null,null,"","",null,3,null,null,null,null,null,null,null,null,null,null,null,null,null,null,null,null,null,202,"Jakar",null,2.06]
["",null,null,"00:00:00",null,"","",null,"","",null,null,null,null,"","",null,3,null,null,null,null,null,null,null,null,null,null,null,null,null,null,null,null,null,203,"Jakar",null,2.0699999999999998]
["",null,null,"00:00:00",null,"","",null,"","",null,null,null,null,"","",null,3,null,null,null,null,null,null,null,null,null,null,null,null,null,null,null,null,null,204,"Jakar",null,2.08]
["",null,null,"00:00:00",null,"","",null,"","",null,null,null,null,"","",null,3,null,null,null,null,null,null,null,null,null,null,null,null,null,null,null,null,null,205,"Jakar",null,2.09]
["",null,null,"00:00:00",null,"","",null,"","",null,null,null,null,"","",null,3,null,null,null,null,null,null,null,null,null,null,null,null,null,null,null,null,null,206,"Jakar",null,2.1]
["",null,null,"00:00:00",null,"","",null,"","",null,null,null,null,"","",null,3,null,null,null,null,null,null,null,null,null,null,null,null,null,null,null,null,null,207,"Jakar",null,2.11]
["",null,null,"00:00:00",null,"","",null,"","",null,null,null,null,"","",null,3,null,null,null,null,null,null,null,null,null,null,null,null,null,null,null,null,null,208,"Jakar",null,2.12]
["",null,null,"00:00:00",null,"","",null,"","",null,null,null,null,"","",null,3,null,null,null,null,null,null,null,null,null,null,null,null,null,null,null,null,null,209,"Jakar",null,2.13]
["",null,null,"00:00:00",null,"","",null,"","",null,null,null,null,"","",null,3,null,null,null,null,null,null,null,null,null,null,null,null,null,null,null,null,null,210,"Jakar",null,2.14]
["",null,null,"00:00:00",null,"","",null,"","",null,null,null,null,"","",null,3,null,null,null,null,null,null,null,null,null,null,null,null,null,null,null,null,null,211,"Jakar",null,2.15]
["",null,null,"00:00:00",null,"","",null,"","",null,null,null,null,"","",null,3,null,null,null,null,null,null,null,null,null,null,null,null,null,null,null,null,null,212,"Jakar",null,2.16]
["",null,null,"00:00:00",null,"","",null,"","",null,null,null,null,"","",null,3,null,null,null,null,null,null,null,null,null,null,null,null,null,null,null,null,null,213,"Jakar",null,2.17]
["",null,null,"00:00:00",null,"","",null,"","",null,null,null,null,"","",null,3,null,null,null,null,null,null,null,null,null,null,null,null,null,null,null,null,null,214,"Jakar",null,2.1800000000000002]
["",null,null,"00:00:00",null,"","",null,"","",null,null,null,null,"","",null,3,null,null,null,null,null,null,null,null,null,null,null,null,null,null,null,null,null,215,"Jakar",null,2.19]
["",null,null,"00:00:00",null,"","",null,"","",null,null,null,null,"","",null,3,null,null,null,null,null,null,null,null,null,null,null,null,null,null,null,null,null,216,"Jakar",null,2.2000000000000002]
["",null,null,"00:00:00",null,"","",null,"","",null,null,null,null,"","",null,3,null,null,null,null,null,null,null,null,null,null,null,null,null,null,null,null,null,217,"Jakar",null,2.21]
["",null,null,"00:00:00",null,"","",null,"","",null,null,null,null,"","",null,3,null,null,null,null,null,null,null,null,null,null,null,null,null,null,null,null,null,218,"Jakar",null,2.2200000000000002]
["",null,null,"00:00:00",null,"","",null,"","",null,null,null,null,"","",null,3,null,null,null,null,null,null,null,null,null,null,null,null,null,null,null,null,null,219,"Jakar",null,2.23]
["",null,null,"00:00:00",null,"","",null,"","",null,null,null,null,"","",null,3,null,null,null,null,null,null,null,null,null,null,null,null,null,null,null,null,null,220,"Jakar",null,2.2400000000000002]
["",null,null,"00:00:00",null,"","",null,"","",null,null,null,null,"","",null,3,null,null,null,null,null,null,null,null,null,null,null,null,null,null,null,null,null,221,"Jakar",null,2.25]
["",null,null,"00:00:00",null,"","",null,"","",null,null,null,null,"","",null,3,null,null,null,null,null,null,null,null,null,null,null,null,null,null,null,null,null,222,"Jakar",null,2.2599999999999998]
["",null,null,"00:00:00",null,"","",null,"","",null,null,null,null,"","",null,3,null,null,null,null,null,null,null,null,null,null,null,null,null,null,null,null,null,223,"Jakar",null,2.27]
["",null,null,"00:00:00",null,"","",null,"","",null,null,null,null,"","",null,3,null,null,null,null,null,null,null,null,null,null,null,null,null,null,null,null,null,224,"Jakar",null,2.2799999999999998]
["",null,null,"00:00:00",null,"","",null,"","",null,null,null,null,"","",null,3,null,null,null,null,null,null,null,null,null,null,null,null,null,null,null,null,null,225,"Jakar",null,2.29]
["",null,null,"00:00:00",null,"","",null,"","",null,null,null,null,"","",null,3,null,null,null,null,null,null,null,null,null,null,null,null,null,null,null,null,null,226,"Jakar",null,2.2999999999999998]
["",null,null,"00:00:00",null,"","",null,"","",null,null,null,null,"","",null,3,null,null,null,null,null,null,null,null,null,null,null,null,null,null,null,null,null,227,"Jakar",null,2.31]
["",null,null,"00:00:00",null,"","",null,"","",null,null,null,null,"","",null,3,null,null,null,null,null,null,null,null,null,null,null,null,null,null,null,null,null,228,"Jakar",null,2.3199999999999998]
["",null,null,"00:00:00",null,"","",null,"","",null,null,null,null,"","",null,3,null,null,null,null,null,null,null,null,null,null,null,null,null,null,null,null,null,229,"Jakar",null,2.33]
["",null,null,"00:00:00",null,"","",null,"","",null,null,null,null,"","",null,3,null,null,null,null,null,null,null,null,null,null,null,null,null,null,null,null,null,230,"Jakar",null,2.34]
["",null,null,"00:00:00",null,"","",null,"","",null,null,null,null,"","",null,3,null,null,null,null,null,null,null,null,null,null,null,null,null,null,null,null,null,231,"Jakar",null,2.35]
["",null,null,"00:00:00",null,"","",null,"","",null,null,null,null,"","",null,3,null,null,null,null,null,null,null,null,null,null,null,null,null,null,null,null,null,232,"Jakar",null,2.36]
["",null,null,"00:00:00",null,"","",null,"","",null,null,null,null,"","",null,3,null,null,null,null,null,null,null,null,null,null,null,null,null,null,null,null,null,233,"Jakar",null,2.37]
["",null,null,"00:00:00",null,"","",null,"","",null,null,null,null,"","",null,3,null,null,null,null,null,null,null,null,null,null,null,null,null,null,null,null,null,234,"Jakar",null,2.38]
["",null,null,"00:00:00",null,"","",null,"","",null,null,null,null,"","",null,3,null,null,null,null,null,null,null,null,null,null,null,null,null,null,null,null,null,235,"Jakar",null,2.39]
["",null,null,"00:00:00",null,"","",null,"","",null,null,null,null,"","",null,3,null,null,null,null,null,null,null,null,null,null,null,null,null,null,null,null,null,236,"Jakar",null,2.4]
["",null,null,"00:00:00",null,"","",null,"","",null,null,null,null,"","",null,3,null,null,null,null,null,null,null,null,null,null,null,null,null,null,null,null,null,237,"Jakar",null,2.41]
["",null,null,"00:00:00",null,"","",null,"","",null,null,null,null,"","",null,3,null,null,null,null,null,null,null,null,null,null,null,null,null,null,null,null,null,238,"Jakar",null,2.42]
["",null,null,"00:00:00",null,"","",null,"","",null,null,null,null,"","",null,3,null,null,null,null,null,null,null,null,null,null,null,null,null,null,null,null,null,239,"Jakar",null,2.4300000000000002]
["",null,null,"00:00:00",null,"","",null,"","",null,null,null,null,"","",null,3,null,null,null,null,null,null,null,null,null,null,null,null,null,null,null,null,null,240,"Jakar",null,2.44]
["",null,null,"00:00:00",null,"","",null,"","",null,null,null,null,"","",null,3,null,null,null,null,null,null,null,null,null,null,null,null,null,null,null,null,null,241,"Jakar",null,2.4500000000000002]
["",null,null,"00:00:00",null,"","",null,"","",null,null,null,null,"","",null,3,null,null,null,null,null,null,null,null,null,null,null,null,null,null,null,null,null,242,"Jakar",null,2.46]
["",null,null,"00:00:00",null,"","",null,"","",null,null,null,null,"","",null,3,null,null,null,null,null,null,null,null,null,null,null,null,null,null,null,null,null,243,"Jakar",null,2.4700000000000002]
["",null,null,"00:00:00",null,"","",null,"","",null,null,null,null,"","",null,3,null,null,null,null,null,null,null,null,null,null,null,null,null,null,null,null,null,244,"Jakar",null,2.48]
["",null,null,"00:00:00",null,"","",null,"","",null,null,null,null,"","",null,3,null,null,null,null,null,null,null,null,null,null,null,null,null,null,null,null,null,245,"Jakar",null,2.4900000000000002]
["",null,null,"00:00:00",null,"","",null,"","",null,null,null,null,"","",null,3,null,null,null,null,null,null,null,null,null,null,null,null,null,null,null,null,null,246,"Jakar",null,2.5]
["",null,null,"00:00:00",null,"","",null,"","",null,null,null,null,"","",null,3,null,null,null,null,null,null,null,null,null,null,null,null,null,null,null,null,null,247,"Jakar",null,2.5099999999999998]
["",null,null,"00:00:00",null,"","",null,"","",null,null,null,null,"","",null,3,null,null,null,null,null,null,null,null,null,null,null,null,null,null,null,null,null,248,"Jakar",null,2.52]
["",null,null,"00:00:00",null,"","",null,"","",null,null,null,null,"","",null,3,null,null,null,null,null,null,null,null,null,null,null,null,null,null,null,null,null,249,"Jakar",null,2.5299999999999998]
["",null,null,"00:00:00",null,"","",null,"","",null,null,null,null,"","",null,3,null,null,null,null,null,null,null,null,null,null,null,null,null,null,null,null,null,250,"Jakar",null,2.54]
["",null,null,"00:00:00",null,"","",null,"","",null,null,null,null,"","",null,3,null,null,null,null,null,null,null,null,null,null,null,null,null,null,null,null,null,251,"Jakar",null,2.5499999999999998]
["",null,null,"00:00:00",null,"","",null,"","",null,null,null,null,"","",null,3,null,null,null,null,null,null,null,null,null,null,null,null,null,null,null,null,null,252,"Jakar",null,2.56]
["",null,null,"00:00:00",null,"","",null,"","",null,null,null,null,"","",null,3,null,null,null,null,null,null,null,null,null,null,null,null,null,null,null,null,null,253,"Jakar",null,2.57]
["",null,null,"00:00:00",null,"","",null,"","",null,null,null,null,"","",null,3,null,null,null,null,null,null,null,null,null,null,null,null,null,null,null,null,null,254,"Jakar",null,2.58]
["",null,null,"00:00:00",null,"","",null,"","",null,null,null,null,"","",null,3,null,null,null,null,null,null,null,null,null,null,null,null,null,null,null,null,null,255,"Jakar",null,2.59]
["",null,null,"00:00:00",null,"","",null,"","",null,null,null,null,"","",null,3,null,null,null,null,null,null,null,null,null,null,null,null,null,null,null,null,null,256,"Jakar",null,2.6]
["",null,null,"00:00:00",null,"","",null,"","",null,null,null,null,"","",null,3,null,null,null,null,null,null,null,null,null,null,null,null,null,null,null,null,null,257,"Jakar",null,2.61]
["",null,null,"00:00:00",null,"","",null,"","",null,null,null,null,"","",null,3,null,null,null,null,null,null,null,null,null,null,null,null,null,null,null,null,null,258,"Jakar",null,2.62]
[{"$f":"IF(E260=\"\",\"\",IF(A260=\"\",TODAY(),A260))","v":""},null,null,{"$f":"C260-B260+IF(B260>C260,1)","v":"00:00:00"},null,{"$f":"IFERROR(VLOOKUP(E260,$AJ$2:$AL$3155,2,FALSE),\"\")","v":""},{"$f":"IFERROR(VLOOKUP(E260,$AJ$2:$AL$3155,3,FALSE),\"\")","v":""},null,{"$f":"IFERROR(SUM(G260/7),\"\")","v":""},{"$f":"IFERROR(SUM(N260/C260),\"\")","v":""},null,null,null,null,{"$f":"IFERROR(ROUND(SUM(1000/K260),2),\"\")","v":""},{"$f":"IFERROR(ROUND(SUM(N260*O260),2),\"\")","v":""},null,3,null,null,null,null,null,null,null,null,null,null,null,null,null,null,null,null,null,259,"Jakar",null,2.63]
["",null,null,"00:00:00",null,"","",null,"","",null,null,null,null,"","",null,3,null,null,null,null,null,null,null,null,null,null,null,null,null,null,null,null,null,260,"Jakar",null,2.64]
["",null,null,"00:00:00",null,"","",null,"","",null,null,null,null,"","",null,3,null,null,null,null,null,null,null,null,null,null,null,null,null,null,null,null,null,261,"Jakar",null,2.65]
["",null,null,"00:00:00",null,"","",null,"","",null,null,null,null,"","",null,3,null,null,null,null,null,null,null,null,null,null,null,null,null,null,null,null,null,262,"Jakar",null,2.66]
["",null,null,"00:00:00",null,"","",null,"","",null,null,null,null,"","",null,3,null,null,null,null,null,null,null,null,null,null,null,null,null,null,null,null,null,263,"Jakar",null,2.67]
["",null,null,"00:00:00",null,"","",null,"","",null,null,null,null,"","",null,3,null,null,null,null,null,null,null,null,null,null,null,null,null,null,null,null,null,264,"Jakar",null,2.68]
["",null,null,"00:00:00",null,"","",null,"","",null,null,null,null,"","",null,3,null,null,null,null,null,null,null,null,null,null,null,null,null,null,null,null,null,265,"Jakar",null,2.69]
["",null,null,"00:00:00",null,"","",null,"","",null,null,null,null,"","",null,3,null,null,null,null,null,null,null,null,null,null,null,null,null,null,null,null,null,266,"Jakar",null,2.7]
["",null,null,"00:00:00",null,"","",null,"","",null,null,null,null,"","",null,3,null,null,null,null,null,null,null,null,null,null,null,null,null,null,null,null,null,267,"Jakar",null,2.71]
["",null,null,"00:00:00",null,"","",null,"","",null,null,null,null,"","",null,3,null,null,null,null,null,null,null,null,null,null,null,null,null,null,null,null,null,268,"Jakar",null,2.72]
["",null,null,"00:00:00",null,"","",null,"","",null,null,null,null,"","",null,3,null,null,null,null,null,null,null,null,null,null,null,null,null,null,null,null,null,269,"Jakar",null,2.73]
["",null,null,"00:00:00",null,"","",null,"","",null,null,null,null,"","",null,3,null,null,null,null,null,null,null,null,null,null,null,null,null,null,null,null,null,270,"Jakar",null,2.74]
["",null,null,"00:00:00",null,"","",null,"","",null,null,null,null,"","",null,3,null,null,null,null,null,null,null,null,null,null,null,null,null,null,null,null,null,271,"Jakar",null,2.75]
["",null,null,"00:00:00",null,"","",null,"","",null,null,null,null,"","",null,3,null,null,null,null,null,null,null,null,null,null,null,null,null,null,null,null,null,272,"Jakar",null,2.76]
["",null,null,"00:00:00",null,"","",null,"","",null,null,null,null,"","",null,3,null,null,null,null,null,null,null,null,null,null,null,null,null,null,null,null,null,273,"Jakar",null,2.77]
["",null,null,"00:00:00",null,"","",null,"","",null,null,null,null,"","",null,3,null,null,null,null,null,null,null,null,null,null,null,null,null,null,null,null,null,274,"Jakar",null,2.78]
["",null,null,"00:00:00",null,"","",null,"","",null,null,null,null,"","",null,3,null,null,null,null,null,null,null,null,null,null,null,null,null,null,null,null,null,275,"Jakar",null,2.79]
["",null,null,"00:00:00",null,"","",null,"","",null,null,null,null,"","",null,3,null,null,null,null,null,null,null,null,null,null,null,null,null,null,null,null,null,276,"Jakar",null,2.8]
["",null,null,"00:00:00",null,"","",null,"","",null,null,null,null,"","",null,3,null,null,null,null,null,null,null,null,null,null,null,null,null,null,null,null,null,277,"Jakar",null,2.81]
["",null,null,"00:00:00",null,"","",null,"","",null,null,null,null,"","",null,3,null,null,null,null,null,null,null,null,null,null,null,null,null,null,null,null,null,278,"Jakar",null,2.82]
["",null,null,"00:00:00",null,"","",null,"","",null,null,null,null,"","",null,3,null,null,null,null,null,null,null,null,null,null,null,null,null,null,null,null,null,279,"Jakar",null,2.83]
["",null,null,"00:00:00",null,"","",null,"","",null,null,null,null,"","",null,3,null,null,null,null,null,null,null,null,null,null,null,null,null,null,null,null,null,280,"Jakar",null,2.84]
["",null,null,"00:00:00",null,"","",null,"","",null,null,null,null,"","",null,3,null,null,null,null,null,null,null,null,null,null,null,null,null,null,null,null,null,281,"Jakar",null,2.85]
["",null,null,"00:00:00",null,"","",null,"","",null,null,null,null,"","",null,3,null,null,null,null,null,null,null,null,null,null,null,null,null,null,null,null,null,282,"Jakar",null,2.86]
["",null,null,"00:00:00",null,"","",null,"","",null,null,null,null,"","",null,3,null,null,null,null,null,null,null,null,null,null,null,null,null,null,null,null,null,283,"Jakar",null,2.87]
["",null,null,"00:00:00",null,"","",null,"","",null,null,null,null,"","",null,3,null,null,null,null,null,null,null,null,null,null,null,null,null,null,null,null,null,284,"Jakar",null,2.88]
["",null,null,"00:00:00",null,"","",null,"","",null,null,null,null,"","",null,3,null,null,null,null,null,null,null,null,null,null,null,null,null,null,null,null,null,285,"Jakar",null,2.89]
["",null,null,"00:00:00",null,"","",null,"","",null,null,null,null,"","",null,3,null,null,null,null,null,null,null,null,null,null,null,null,null,null,null,null,null,286,"Jakar",null,2.9]
["",null,null,"00:00:00",null,"","",null,"","",null,null,null,null,"","",null,3,null,null,null,null,null,null,null,null,null,null,null,null,null,null,null,null,null,287,"Jakar",null,2.91]
["",null,null,"00:00:00",null,"","",null,"","",null,null,null,null,"","",null,3,null,null,null,null,null,null,null,null,null,null,null,null,null,null,null,null,null,288,"Jakar",null,2.92]
["",null,null,"00:00:00",null,"","",null,"","",null,null,null,null,"","",null,3,null,null,null,null,null,null,null,null,null,null,null,null,null,null,null,null,null,289,"Jakar",null,2.93]
["",null,null,"00:00:00",null,"","",null,"","",null,null,null,null,"","",null,3,null,null,null,null,null,null,null,null,null,null,null,null,null,null,null,null,null,290,"Jakar",null,2.94]
["",null,null,"00:00:00",null,"","",null,"","",null,null,null,null,"","",null,3,null,null,null,null,null,null,null,null,null,null,null,null,null,null,null,null,null,291,"Jakar",null,2.95]
["",null,null,"00:00:00",null,"","",null,"","",null,null,null,null,"","",null,3,null,null,null,null,null,null,null,null,null,null,null,null,null,null,null,null,null,292,"Jakar",null,2.96]
["",null,null,"00:00:00",null,"","",null,"","",null,null,null,null,"","",null,3,null,null,null,null,null,null,null,null,null,null,null,null,null,null,null,null,null,293,"Jakar",null,2.97]
["",null,null,"00:00:00",null,"","",null,"","",null,null,null,null,"","",null,3,null,null,null,null,null,null,null,null,null,null,null,null,null,null,null,null,null,294,"Jakar",null,2.98]
["",null,null,"00:00:00",null,"","",null,"","",null,null,null,null,"","",null,3,null,null,null,null,null,null,null,null,null,null,null,null,null,null,null,null,null,295,"Jakar",null,2.99]
["",null,null,"00:00:00",null,"","",null,"","",null,null,null,null,"","",null,3,null,null,null,null,null,null,null,null,null,null,null,null,null,null,null,null,null,296,"Jakar",null,3]
["",null,null,"00:00:00",null,"","",null,"","",null,null,null,null,"","",null,3,null,null,null,null,null,null,null,null,null,null,null,null,null,null,null,null,null,297,"Jakar",null,3.01]
["",null,null,"00:00:00",null,"","",null,"","",null,null,null,null,"","",null,3,null,null,null,null,null,null,null,null,null,null,null,null,null,null,null,null,null,298,"Jakar",null,3.02]
["",null,null,"00:00:00",null,"","",null,"","",null,null,null,null,"","",null,3,null,null,null,null,null,null,null,null,null,null,null,null,null,null,null,null,null,299,"Jakar",null,3.03]
["",null,null,"00:00:00",null,"","",null,"","",null,null,null,null,"","",null,3,null,null,null,null,null,null,null,null,null,null,null,null,null,null,null,null,null,300,"Jakar",null,3.04]
["",null,null,"00:00:00",null,"","",null,"","",null,null,null,null,"","",null,3,null,null,null,null,null,null,null,null,null,null,null,null,null,null,null,null,null,301,"Electric iron",null,3.05]
["",null,null,"00:00:00",null,"","",null,"","",null,null,null,null,"","",null,3,null,null,null,null,null,null,null,null,null,null,null,null,null,null,null,null,null,302,"Electric iron",null,3.06]
["",null,null,"00:00:00",null,"","",null,"","",null,null,null,null,"","",null,3,null,null,null,null,null,null,null,null,null,null,null,null,null,null,null,null,null,303,"Electric iron",null,3.07]
["",null,null,"00:00:00",null,"","",null,"","",null,null,null,null,"","",null,3,null,null,null,null,null,null,null,null,null,null,null,null,null,null,null,null,null,304,"Electric iron",null,3.08]
["",null,null,"00:00:00",null,"","",null,"","",null,null,null,null,"","",null,3,null,null,null,null,null,null,null,null,null,null,null,null,null,null,null,null,null,305,"Electric iron",null,3.09]
["",null,null,"00:00:00",null,"","",null,"","",null,null,null,null,"","",null,3,null,null,null,null,null,null,null,null,null,null,null,null,null,null,null,null,null,306,"Electric iron",null,3.1]
["",null,null,"00:00:00",null,"","",null,"","",null,null,null,null,"","",null,3,null,null,null,null,null,null,null,null,null,null,null,null,null,null,null,null,null,307,"Electric iron",null,3.11]
["",null,null,"00:00:00",null,"","",null,"","",null,null,null,null,"","",null,3,null,null,null,null,null,null,null,null,null,null,null,null,null,null,null,null,null,308,"Electric iron",null,3.12]
["",null,null,"00:00:00",null,"","",null,"","",null,null,null,null,"","",null,3,null,null,null,null,null,null,null,null,null,null,null,null,null,null,null,null,null,309,"Electric iron",null,3.13]
["",null,null,"00:00:00",null,"","",null,"","",null,null,null,null,"","",null,3,null,null,null,null,null,null,null,null,null,null,null,null,null,null,null,null,null,310,"Electric iron",null,3.14]
["",null,null,"00:00:00",null,"","",null,"","",null,null,null,null,"","",null,3,null,null,null,null,null,null,null,null,null,null,null,null,null,null,null,null,null,311,"Electric iron",null,3.15]
["",null,null,"00:00:00",null,"","",null,"","",null,null,null,null,"","",null,3,null,null,null,null,null,null,null,null,null,null,null,null,null,null,null,null,null,312,"Electric iron",null,3.16]
["",null,null,"00:00:00",null,"","",null,"","",null,null,null,null,"","",null,3,null,null,null,null,null,null,null,null,null,null,null,null,null,null,null,null,null,313,"Electric iron",null,3.17]
["",null,null,"00:00:00",null,"","",null,"","",null,null,null,null,"","",null,3,null,null,null,null,null,null,null,null,null,null,null,null,null,null,null,null,null,314,"Electric iron",null,3.18]
["",null,null,"00:00:00",null,"","",null,"","",null,null,null,null,"","",null,3,null,null,null,null,null,null,null,null,null,null,null,null,null,null,null,null,null,315,"Electric iron",null,3.19]
["",null,null,"00:00:00",null,"","",null,"","",null,null,null,null,"","",null,3,null,null,null,null,null,null,null,null,null,null,null,null,null,null,null,null,null,null,null,null,3.2]
["",null,null,"00:00:00",null,"","",null,"","",null,null,null,null,"","",null,3,null,null,null,null,null,null,null,null,null,null,null,null,null,null,null,null,null,null,null,null,3.21]
["",null,null,"00:00:00",null,"","",null,"","",null,null,null,null,"","",null,3,null,null,null,null,null,null,null,null,null,null,null,null,null,null,null,null,null,null,null,null,3.22]
["",null,null,"00:00:00",null,"","",null,"","",null,null,null,null,"","",null,3,null,null,null,null,null,null,null,null,null,null,null,null,null,null,null,null,null,null,null,null,3.23]
["",null,null,"00:00:00",null,"","",null,"","",null,null,null,null,"","",null,3,null,null,null,null,null,null,null,null,null,null,null,null,null,null,null,null,null,null,null,null,3.24]
["",null,null,"00:00:00",null,"","",null,"","",null,null,null,null,"","",null,3,null,null,null,null,null,null,null,null,null,null,null,null,null,null,null,null,null,null,null,null,3.25]
["",null,null,"00:00:00",null,"","",null,"","",null,null,null,null,"","",null,3,null,null,null,null,null,null,null,null,null,null,null,null,null,null,null,null,null,null,null,null,3.26]
[{"$f":"IF(E324=\"\",\"\",IF(A324=\"\",TODAY(),A324))","v":""},null,null,{"$f":"C324-B324+IF(B324>C324,1)","v":"00:00:00"},null,{"$f":"IFERROR(VLOOKUP(E324,$AJ$2:$AL$3155,2,FALSE),\"\")","v":""},{"$f":"IFERROR(VLOOKUP(E324,$AJ$2:$AL$3155,3,FALSE),\"\")","v":""},null,{"$f":"IFERROR(SUM(G324/7),\"\")","v":""},{"$f":"IFERROR(SUM(N324/C324),\"\")","v":""},null,null,null,null,{"$f":"IFERROR(ROUND(SUM(1000/K324),2),\"\")","v":""},{"$f":"IFERROR(ROUND(SUM(N324*O324),2),\"\")","v":""},null,3,null,null,null,null,null,null,null,null,null,null,null,null,null,null,null,null,null,null,null,null,3.27]
["",null,null,"00:00:00",null,"","",null,"","",null,null,null,null,"","",null,3,null,null,null,null,null,null,null,null,null,null,null,null,null,null,null,null,null,null,null,null,3.28]
["",null,null,"00:00:00",null,"","",null,"","",null,null,null,null,"","",null,3,null,null,null,null,null,null,null,null,null,null,null,null,null,null,null,null,null,null,null,null,3.29]
["",null,null,"00:00:00",null,"","",null,"","",null,null,null,null,"","",null,3,null,null,null,null,null,null,null,null,null,null,null,null,null,null,null,null,null,null,null,null,3.3]
["",null,null,"00:00:00",null,"","",null,"","",null,null,null,null,"","",null,3,null,null,null,null,null,null,null,null,null,null,null,null,null,null,null,null,null,null,null,null,3.31]
["",null,null,"00:00:00",null,"","",null,"","",null,null,null,null,"","",null,3,null,null,null,null,null,null,null,null,null,null,null,null,null,null,null,null,null,null,null,null,3.32]
["",null,null,"00:00:00",null,"","",null,"","",null,null,null,null,"","",null,3,null,null,null,null,null,null,null,null,null,null,null,null,null,null,null,null,null,null,null,null,3.33]
["",null,null,"00:00:00",null,"","",null,"","",null,null,null,null,"","",null,3,null,null,null,null,null,null,null,null,null,null,null,null,null,null,null,null,null,null,null,null,3.34]
["",null,null,"00:00:00",null,"","",null,"","",null,null,null,null,"","",null,3,null,null,null,null,null,null,null,null,null,null,null,null,null,null,null,null,null,null,null,null,3.35]
["",null,null,"00:00:00",null,"","",null,"","",null,null,null,null,"","",null,3,null,null,null,null,null,null,null,null,null,null,null,null,null,null,null,null,null,null,null,null,3.36]
["",null,null,"00:00:00",null,"","",null,"","",null,null,null,null,"","",null,3,null,null,null,null,null,null,null,null,null,null,null,null,null,null,null,null,null,null,null,null,3.37]
["",null,null,"00:00:00",null,"","",null,"","",null,null,null,null,"","",null,3,null,null,null,null,null,null,null,null,null,null,null,null,null,null,null,null,null,null,null,null,3.38]
["",null,null,"00:00:00",null,"","",null,"","",null,null,null,null,"","",null,3,null,null,null,null,null,null,null,null,null,null,null,null,null,null,null,null,null,null,null,null,3.39]
["",null,null,"00:00:00",null,"","",null,"","",null,null,null,null,"","",null,3,null,null,null,null,null,null,null,null,null,null,null,null,null,null,null,null,null,null,null,null,3.4]
["",null,null,"00:00:00",null,"","",null,"","",null,null,null,null,"","",null,3,null,null,null,null,null,null,null,null,null,null,null,null,null,null,null,null,null,null,null,null,3.41]
["",null,null,"00:00:00",null,"","",null,"","",null,null,null,null,"","",null,3,null,null,null,null,null,null,null,null,null,null,null,null,null,null,null,null,null,null,null,null,3.42]
["",null,null,"00:00:00",null,"","",null,"","",null,null,null,null,"","",null,3,null,null,null,null,null,null,null,null,null,null,null,null,null,null,null,null,null,null,null,null,3.43]
["",null,null,"00:00:00",null,"","",null,"","",null,null,null,null,"","",null,3,null,null,null,null,null,null,null,null,null,null,null,null,null,null,null,null,null,null,null,null,3.44]
["",null,null,"00:00:00",null,"","",null,"","",null,null,null,null,"","",null,3,null,null,null,null,null,null,null,null,null,null,null,null,null,null,null,null,null,null,null,null,3.45]
["",null,null,"00:00:00",null,"","",null,"","",null,null,null,null,"","",null,3,null,null,null,null,null,null,null,null,null,null,null,null,null,null,null,null,null,null,null,null,3.46]
["",null,null,"00:00:00",null,"","",null,"","",null,null,null,null,"","",null,3,null,null,null,null,null,null,null,null,null,null,null,null,null,null,null,null,null,null,null,null,3.47]
["",null,null,"00:00:00",null,"","",null,"","",null,null,null,null,"","",null,3,null,null,null,null,null,null,null,null,null,null,null,null,null,null,null,null,null,null,null,null,3.48]
["",null,null,"00:00:00",null,"","",null,"","",null,null,null,null,"","",null,3,null,null,null,null,null,null,null,null,null,null,null,null,null,null,null,null,null,null,null,null,3.49]
["",null,null,"00:00:00",null,"","",null,"","",null,null,null,null,"","",null,3,null,null,null,null,null,null,null,null,null,null,null,null,null,null,null,null,null,null,null,null,3.5]
["",null,null,"00:00:00",null,"","",null,"","",null,null,null,null,"","",null,3,null,null,null,null,null,null,null,null,null,null,null,null,null,null,null,null,null,null,null,null,3.51]
["",null,null,"00:00:00",null,"","",null,"","",null,null,null,null,"","",null,3,null,null,null,null,null,null,null,null,null,null,null,null,null,null,null,null,null,null,null,null,3.52]
["",null,null,"00:00:00",null,"","",null,"","",null,null,null,null,"","",null,3,null,null,null,null,null,null,null,null,null,null,null,null,null,null,null,null,null,null,null,null,3.53]
["",null,null,"00:00:00",null,"","",null,"","",null,null,null,null,"","",null,3,null,null,null,null,null,null,null,null,null,null,null,null,null,null,null,null,null,null,null,null,3.54]
["",null,null,"00:00:00",null,"","",null,"","",null,null,null,null,"","",null,3,null,null,null,null,null,null,null,null,null,null,null,null,null,null,null,null,null,null,null,null,3.55]
["",null,null,"00:00:00",null,"","",null,"","",null,null,null,null,"","",null,3,null,null,null,null,null,null,null,null,null,null,null,null,null,null,null,null,null,null,null,null,3.56]
["",null,null,"00:00:00",null,"","",null,"","",null,null,null,null,"","",null,3,null,null,null,null,null,null,null,null,null,null,null,null,null,null,null,null,null,null,null,null,3.57]
["",null,null,"00:00:00",null,"","",null,"","",null,null,null,null,"","",null,3,null,null,null,null,null,null,null,null,null,null,null,null,null,null,null,null,null,null,null,null,3.58]
["",null,null,"00:00:00",null,"","",null,"","",null,null,null,null,"","",null,3,null,null,null,null,null,null,null,null,null,null,null,null,null,null,null,null,null,null,null,null,3.59]
["",null,null,"00:00:00",null,"","",null,"","",null,null,null,null,"","",null,3,null,null,null,null,null,null,null,null,null,null,null,null,null,null,null,null,null,null,null,null,3.6]
["",null,null,"00:00:00",null,"","",null,"","",null,null,null,null,"","",null,3,null,null,null,null,null,null,null,null,null,null,null,null,null,null,null,null,null,null,null,null,3.61]
["",null,null,"00:00:00",null,"","",null,"","",null,null,null,null,"","",null,3,null,null,null,null,null,null,null,null,null,null,null,null,null,null,null,null,null,null,null,null,3.62]
["",null,null,"00:00:00",null,"","",null,"","",null,null,null,null,"","",null,3,null,null,null,null,null,null,null,null,null,null,null,null,null,null,null,null,null,null,null,null,3.63]
["",null,null,"00:00:00",null,"","",null,"","",null,null,null,null,"","",null,3,null,null,null,null,null,null,null,null,null,null,null,null,null,null,null,null,null,null,null,null,3.64]
["",null,null,"00:00:00",null,"","",null,"","",null,null,null,null,"","",null,3,null,null,null,null,null,null,null,null,null,null,null,null,null,null,null,null,null,null,null,null,3.65]
["",null,null,"00:00:00",null,"","",null,"","",null,null,null,null,"","",null,3,null,null,null,null,null,null,null,null,null,null,null,null,null,null,null,null,null,null,null,null,3.66]
["",null,null,"00:00:00",null,"","",null,"","",null,null,null,null,"","",null,3,null,null,null,null,null,null,null,null,null,null,null,null,null,null,null,null,null,null,null,null,3.67]
["",null,null,"00:00:00",null,"","",null,"","",null,null,null,null,"","",null,3,null,null,null,null,null,null,null,null,null,null,null,null,null,null,null,null,null,null,null,null,3.68]
["",null,null,"00:00:00",null,"","",null,"","",null,null,null,null,"","",null,3,null,null,null,null,null,null,null,null,null,null,null,null,null,null,null,null,null,null,null,null,3.69]
["",null,null,"00:00:00",null,"","",null,"","",null,null,null,null,"","",null,3,null,null,null,null,null,null,null,null,null,null,null,null,null,null,null,null,null,null,null,null,3.7]
["",null,null,"00:00:00",null,"","",null,"","",null,null,null,null,"","",null,3,null,null,null,null,null,null,null,null,null,null,null,null,null,null,null,null,null,null,null,null,3.71]
["",null,null,"00:00:00",null,"","",null,"","",null,null,null,null,"","",null,3,null,null,null,null,null,null,null,null,null,null,null,null,null,null,null,null,null,null,null,null,3.72]
["",null,null,"00:00:00",null,"","",null,"","",null,null,null,null,"","",null,3,null,null,null,null,null,null,null,null,null,null,null,null,null,null,null,null,null,null,null,null,3.73]
["",null,null,"00:00:00",null,"","",null,"","",null,null,null,null,"","",null,3,null,null,null,null,null,null,null,null,null,null,null,null,null,null,null,null,null,null,null,null,3.74]
["",null,null,"00:00:00",null,"","",null,"","",null,null,null,null,"","",null,3,null,null,null,null,null,null,null,null,null,null,null,null,null,null,null,null,null,null,null,null,3.75]
["",null,null,"00:00:00",null,"","",null,"","",null,null,null,null,"","",null,3,null,null,null,null,null,null,null,null,null,null,null,null,null,null,null,null,null,null,null,null,3.76]
["",null,null,"00:00:00",null,"","",null,"","",null,null,null,null,"","",null,3,null,null,null,null,null,null,null,null,null,null,null,null,null,null,null,null,null,null,null,null,3.77]
["",null,null,"00:00:00",null,"","",null,"","",null,null,null,null,"","",null,3,null,null,null,null,null,null,null,null,null,null,null,null,null,null,null,null,null,null,null,null,3.78]
["",null,null,"00:00:00",null,"","",null,"","",null,null,null,null,"","",null,3,null,null,null,null,null,null,null,null,null,null,null,null,null,null,null,null,null,null,null,null,3.79]
["",null,null,"00:00:00",null,"","",null,"","",null,null,null,null,"","",null,3,null,null,null,null,null,null,null,null,null,null,null,null,null,null,null,null,null,null,null,null,3.8]
["",null,null,"00:00:00",null,"","",null,"","",null,null,null,null,"","",null,3,null,null,null,null,null,null,null,null,null,null,null,null,null,null,null,null,null,null,null,null,3.81]
["",null,null,"00:00:00",null,"","",null,"","",null,null,null,null,"","",null,3,null,null,null,null,null,null,null,null,null,null,null,null,null,null,null,null,null,null,null,null,3.82]
["",null,null,"00:00:00",null,"","",null,"","",null,null,null,null,"","",null,3,null,null,null,null,null,null,null,null,null,null,null,null,null,null,null,null,null,null,null,null,3.83]
["",null,null,"00:00:00",null,"","",null,"","",null,null,null,null,"","",null,3,null,null,null,null,null,null,null,null,null,null,null,null,null,null,null,null,null,null,null,null,3.84]
["",null,null,"00:00:00",null,"","",null,"","",null,null,null,null,"","",null,3,null,null,null,null,null,null,null,null,null,null,null,null,null,null,null,null,null,null,null,null,3.85]
["",null,null,"00:00:00",null,"","",null,"","",null,null,null,null,"","",null,3,null,null,null,null,null,null,null,null,null,null,null,null,null,null,null,null,null,null,null,null,3.86]
["",null,null,"00:00:00",null,"","",null,"","",null,null,null,null,"","",null,3,null,null,null,null,null,null,null,null,null,null,null,null,null,null,null,null,null,null,null,null,3.87]
["",null,null,"00:00:00",null,"","",null,"","",null,null,null,null,"","",null,3,null,null,null,null,null,null,null,null,null,null,null,null,null,null,null,null,null,null,null,null,3.88]
["",null,null,"00:00:00",null,"","",null,"","",null,null,null,null,"","",null,3,null,null,null,null,null,null,null,null,null,null,null,null,null,null,null,null,null,null,null,null,3.89]
["",null,null,"00:00:00",null,"","",null,"","",null,null,null,null,"","",null,3,null,null,null,null,null,null,null,null,null,null,null,null,null,null,null,null,null,null,null,null,3.9]
[{"$f":"IF(E388=\"\",\"\",IF(A388=\"\",TODAY(),A388))","v":""},null,null,{"$f":"C388-B388+IF(B388>C388,1)","v":"00:00:00"},null,{"$f":"IFERROR(VLOOKUP(E388,$AJ$2:$AL$3155,2,FALSE),\"\")","v":""},{"$f":"IFERROR(VLOOKUP(E388,$AJ$2:$AL$3155,3,FALSE),\"\")","v":""},null,{"$f":"IFERROR(SUM(G388/7),\"\")","v":""},{"$f":"IFERROR(SUM(N388/C388),\"\")","v":""},null,null,null,null,{"$f":"IFERROR(ROUND(SUM(1000/K388),2),\"\")","v":""},{"$f":"IFERROR(ROUND(SUM(N388*O388),2),\"\")","v":""},null,3,null,null,null,null,null,null,null,null,null,null,null,null,null,null,null,null,null,null,null,null,3.91]
["",null,null,"00:00:00",null,"","",null,"","",null,null,null,null,"","",null,3,null,null,null,null,null,null,null,null,null,null,null,null,null,null,null,null,null,null,null,null,3.92]
["",null,null,"00:00:00",null,"","",null,"","",null,null,null,null,"","",null,3,null,null,null,null,null,null,null,null,null,null,null,null,null,null,null,null,null,null,null,null,3.93]
["",null,null,"00:00:00",null,"","",null,"","",null,null,null,null,"","",null,3,null,null,null,null,null,null,null,null,null,null,null,null,null,null,null,null,null,null,null,null,3.94]
["",null,null,"00:00:00",null,"","",null,"","",null,null,null,null,"","",null,3,null,null,null,null,null,null,null,null,null,null,null,null,null,null,null,null,null,null,null,null,3.95]
["",null,null,"00:00:00",null,"","",null,"","",null,null,null,null,"","",null,3,null,null,null,null,null,null,null,null,null,null,null,null,null,null,null,null,null,null,null,null,3.96]
["",null,null,"00:00:00",null,"","",null,"","",null,null,null,null,"","",null,3,null,null,null,null,null,null,null,null,null,null,null,null,null,null,null,null,null,null,null,null,3.97]
["",null,null,"00:00:00",null,"","",null,"","",null,null,null,null,"","",null,3,null,null,null,null,null,null,null,null,null,null,null,null,null,null,null,null,null,null,null,null,3.98]
["",null,null,"00:00:00",null,"","",null,"","",null,null,null,null,"","",null,3,null,null,null,null,null,null,null,null,null,null,null,null,null,null,null,null,null,null,null,null,3.99]
["",null,null,"00:00:00",null,"","",null,"","",null,null,null,null,"","",null,3,null,null,null,null,null,null,null,null,null,null,null,null,null,null,null,null,null,null,null,null,4]
["",null,null,"00:00:00",null,"","",null,"","",null,null,null,null,"","",null,3,null,null,null,null,null,null,null,null,null,null,null,null,null,null,null,null,null,null,null,null,4.01]
["",null,null,"00:00:00",null,"","",null,"","",null,null,null,null,"","",null,3,null,null,null,null,null,null,null,null,null,null,null,null,null,null,null,null,null,null,null,null,4.0199999999999996]
["",null,null,"00:00:00",null,"","",null,"","",null,null,null,null,"","",null,3,null,null,null,null,null,null,null,null,null,null,null,null,null,null,null,null,null,null,null,null,4.03]
["",null,null,"00:00:00",null,"","",null,"","",null,null,null,null,"","",null,3,null,null,null,null,null,null,null,null,null,null,null,null,null,null,null,null,null,null,null,null,4.04]
["",null,null,"00:00:00",null,"","",null,"","",null,null,null,null,"","",null,3,null,null,null,null,null,null,null,null,null,null,null,null,null,null,null,null,null,null,null,null,4.05]
["",null,null,"00:00:00",null,"","",null,"","",null,null,null,null,"","",null,3,null,null,null,null,null,null,null,null,null,null,null,null,null,null,null,null,null,null,null,null,4.0599999999999996]
["",null,null,"00:00:00",null,"","",null,"","",null,null,null,null,"","",null,3,null,null,null,null,null,null,null,null,null,null,null,null,null,null,null,null,null,null,null,null,4.07]
["",null,null,"00:00:00",null,"","",null,"","",null,null,null,null,"","",null,3,null,null,null,null,null,null,null,null,null,null,null,null,null,null,null,null,null,null,null,null,4.08]
["",null,null,"00:00:00",null,"","",null,"","",null,null,null,null,"","",null,3,null,null,null,null,null,null,null,null,null,null,null,null,null,null,null,null,null,null,null,null,4.09]
["",null,null,"00:00:00",null,"","",null,"","",null,null,null,null,"","",null,3,null,null,null,null,null,null,null,null,null,null,null,null,null,null,null,null,null,null,null,null,4.0999999999999996]
["",null,null,"00:00:00",null,"","",null,"","",null,null,null,null,"","",null,3,null,null,null,null,null,null,null,null,null,null,null,null,null,null,null,null,null,null,null,null,4.1100000000000003]
["",null,null,"00:00:00",null,"","",null,"","",null,null,null,null,"","",null,3,null,null,null,null,null,null,null,null,null,null,null,null,null,null,null,null,null,null,null,null,4.12]
["",null,null,"00:00:00",null,"","",null,"","",null,null,null,null,"","",null,3,null,null,null,null,null,null,null,null,null,null,null,null,null,null,null,null,null,null,null,null,4.13]
["",null,null,"00:00:00",null,"","",null,"","",null,null,null,null,"","",null,3,null,null,null,null,null,null,null,null,null,null,null,null,null,null,null,null,null,null,null,null,4.1399999999999997]
["",null,null,"00:00:00",null,"","",null,"","",null,null,null,null,"","",null,3,null,null,null,null,null,null,null,null,null,null,null,null,null,null,null,null,null,null,null,null,4.1500000000000004]
["",null,null,"00:00:00",null,"","",null,"","",null,null,null,null,"","",null,3,null,null,null,null,null,null,null,null,null,null,null,null,null,null,null,null,null,null,null,null,4.16]
["",null,null,"00:00:00",null,"","",null,"","",null,null,null,null,"","",null,3,null,null,null,null,null,null,null,null,null,null,null,null,null,null,null,null,null,null,null,null,4.17]
["",null,null,"00:00:00",null,"","",null,"","",null,null,null,null,"","",null,3,null,null,null,null,null,null,null,null,null,null,null,null,null,null,null,null,null,null,null,null,4.18]
["",null,null,"00:00:00",null,"","",null,"","",null,null,null,null,"","",null,3,null,null,null,null,null,null,null,null,null,null,null,null,null,null,null,null,null,null,null,null,4.1900000000000004]
["",null,null,"00:00:00",null,"","",null,"","",null,null,null,null,"","",null,3,null,null,null,null,null,null,null,null,null,null,null,null,null,null,null,null,null,null,null,null,4.2]
["",null,null,"00:00:00",null,"","",null,"","",null,null,null,null,"","",null,3,null,null,null,null,null,null,null,null,null,null,null,null,null,null,null,null,null,null,null,null,4.21]
["",null,null,"00:00:00",null,"","",null,"","",null,null,null,null,"","",null,3,null,null,null,null,null,null,null,null,null,null,null,null,null,null,null,null,null,null,null,null,4.22]
["",null,null,"00:00:00",null,"","",null,"","",null,null,null,null,"","",null,3,null,null,null,null,null,null,null,null,null,null,null,null,null,null,null,null,null,null,null,null,4.2300000000000004]
["",null,null,"00:00:00",null,"","",null,"","",null,null,null,null,"","",null,3,null,null,null,null,null,null,null,null,null,null,null,null,null,null,null,null,null,null,null,null,4.24]
["",null,null,"00:00:00",null,"","",null,"","",null,null,null,null,"","",null,3,null,null,null,null,null,null,null,null,null,null,null,null,null,null,null,null,null,null,null,null,4.25]
["",null,null,"00:00:00",null,"","",null,"","",null,null,null,null,"","",null,3,null,null,null,null,null,null,null,null,null,null,null,null,null,null,null,null,null,null,null,null,4.26]
["",null,null,"00:00:00",null,"","",null,"","",null,null,null,null,"","",null,3,null,null,null,null,null,null,null,null,null,null,null,null,null,null,null,null,null,null,null,null,4.2699999999999996]
["",null,null,"00:00:00",null,"","",null,"","",null,null,null,null,"","",null,3,null,null,null,null,null,null,null,null,null,null,null,null,null,null,null,null,null,null,null,null,4.28]
["",null,null,"00:00:00",null,"","",null,"","",null,null,null,null,"","",null,3,null,null,null,null,null,null,null,null,null,null,null,null,null,null,null,null,null,null,null,null,4.29]
["",null,null,"00:00:00",null,"","",null,"","",null,null,null,null,"","",null,3,null,null,null,null,null,null,null,null,null,null,null,null,null,null,null,null,null,null,null,null,4.3]
["",null,null,"00:00:00",null,"","",null,"","",null,null,null,null,"","",null,3,null,null,null,null,null,null,null,null,null,null,null,null,null,null,null,null,null,null,null,null,4.3099999999999996]
["",null,null,"00:00:00",null,"","",null,"","",null,null,null,null,"","",null,3,null,null,null,null,null,null,null,null,null,null,null,null,null,null,null,null,null,null,null,null,4.32]
["",null,null,"00:00:00",null,"","",null,"","",null,null,null,null,"","",null,3,null,null,null,null,null,null,null,null,null,null,null,null,null,null,null,null,null,null,null,null,4.33]
["",null,null,"00:00:00",null,"","",null,"","",null,null,null,null,"","",null,3,null,null,null,null,null,null,null,null,null,null,null,null,null,null,null,null,null,null,null,null,4.34]
["",null,null,"00:00:00",null,"","",null,"","",null,null,null,null,"","",null,3,null,null,null,null,null,null,null,null,null,null,null,null,null,null,null,null,null,null,null,null,4.3499999999999996]
["",null,null,"00:00:00",null,"","",null,"","",null,null,null,null,"","",null,3,null,null,null,null,null,null,null,null,null,null,null,null,null,null,null,null,null,null,null,null,4.3600000000000003]
["",null,null,"00:00:00",null,"","",null,"","",null,null,null,null,"","",null,3,null,null,null,null,null,null,null,null,null,null,null,null,null,null,null,null,null,null,null,null,4.37]
["",null,null,"00:00:00",null,"","",null,"","",null,null,null,null,"","",null,3,null,null,null,null,null,null,null,null,null,null,null,null,null,null,null,null,null,null,null,null,4.38]
["",null,null,"00:00:00",null,"","",null,"","",null,null,null,null,"","",null,3,null,null,null,null,null,null,null,null,null,null,null,null,null,null,null,null,null,null,null,null,4.3899999999999997]
["",null,null,"00:00:00",null,"","",null,"","",null,null,null,null,"","",null,3,null,null,null,null,null,null,null,null,null,null,null,null,null,null,null,null,null,null,null,null,4.4000000000000004]
["",null,null,"00:00:00",null,"","",null,"","",null,null,null,null,"","",null,3,null,null,null,null,null,null,null,null,null,null,null,null,null,null,null,null,null,null,null,null,4.41]
["",null,null,"00:00:00",null,"","",null,"","",null,null,null,null,"","",null,3,null,null,null,null,null,null,null,null,null,null,null,null,null,null,null,null,null,null,null,null,4.42]
["",null,null,"00:00:00",null,"","",null,"","",null,null,null,null,"","",null,3,null,null,null,null,null,null,null,null,null,null,null,null,null,null,null,null,null,null,null,null,4.43]
["",null,null,"00:00:00",null,"","",null,"","",null,null,null,null,"","",null,3,null,null,null,null,null,null,null,null,null,null,null,null,null,null,null,null,null,null,null,null,4.4400000000000004]
["",null,null,"00:00:00",null,"","",null,"","",null,null,null,null,"","",null,3,null,null,null,null,null,null,null,null,null,null,null,null,null,null,null,null,null,null,null,null,4.45]
["",null,null,"00:00:00",null,"","",null,"","",null,null,null,null,"","",null,3,null,null,null,null,null,null,null,null,null,null,null,null,null,null,null,null,null,null,null,null,4.46]
["",null,null,"00:00:00",null,"","",null,"","",null,null,null,null,"","",null,3,null,null,null,null,null,null,null,null,null,null,null,null,null,null,null,null,null,null,null,null,4.47]
["",null,null,"00:00:00",null,"","",null,"","",null,null,null,null,"","",null,3,null,null,null,null,null,null,null,null,null,null,null,null,null,null,null,null,null,null,null,null,4.4800000000000004]
["",null,null,"00:00:00",null,"","",null,"","",null,null,null,null,"","",null,3,null,null,null,null,null,null,null,null,null,null,null,null,null,null,null,null,null,null,null,null,4.49]
["",null,null,"00:00:00",null,"","",null,"","",null,null,null,null,"","",null,3,null,null,null,null,null,null,null,null,null,null,null,null,null,null,null,null,null,null,null,null,4.5]
["",null,null,"00:00:00",null,"","",null,"","",null,null,null,null,"","",null,3,null,null,null,null,null,null,null,null,null,null,null,null,null,null,null,null,null,null,null,null,4.51]
["",null,null,"00:00:00",null,"","",null,"","",null,null,null,null,"","",null,3,null,null,null,null,null,null,null,null,null,null,null,null,null,null,null,null,null,null,null,null,4.5199999999999996]
["",null,null,"00:00:00",null,"","",null,"","",null,null,null,null,"","",null,3,null,null,null,null,null,null,null,null,null,null,null,null,null,null,null,null,null,null,null,null,4.53]
["",null,null,"00:00:00",null,"","",null,"","",null,null,null,null,"","",null,3,null,null,null,null,null,null,null,null,null,null,null,null,null,null,null,null,null,null,null,null,4.54]
[{"$f":"IF(E452=\"\",\"\",IF(A452=\"\",TODAY(),A452))","v":""},null,null,{"$f":"C452-B452+IF(B452>C452,1)","v":"00:00:00"},null,{"$f":"IFERROR(VLOOKUP(E452,$AJ$2:$AL$3155,2,FALSE),\"\")","v":""},{"$f":"IFERROR(VLOOKUP(E452,$AJ$2:$AL$3155,3,FALSE),\"\")","v":""},null,{"$f":"IFERROR(SUM(G452/7),\"\")","v":""},{"$f":"IFERROR(SUM(N452/C452),\"\")","v":""},null,null,null,null,{"$f":"IFERROR(ROUND(SUM(1000/K452),2),\"\")","v":""},{"$f":"IFERROR(ROUND(SUM(N452*O452),2),\"\")","v":""},null,3,null,null,null,null,null,null,null,null,null,null,null,null,null,null,null,null,null,null,null,null,4.55]
["",null,null,"00:00:00",null,"","",null,"","",null,null,null,null,"","",null,3,null,null,null,null,null,null,null,null,null,null,null,null,null,null,null,null,null,null,null,null,4.5599999999999996]
["",null,null,"00:00:00",null,"","",null,"","",null,null,null,null,"","",null,3,null,null,null,null,null,null,null,null,null,null,null,null,null,null,null,null,null,null,null,null,4.57]
["",null,null,"00:00:00",null,"","",null,"","",null,null,null,null,"","",null,3,null,null,null,null,null,null,null,null,null,null,null,null,null,null,null,null,null,null,null,null,4.58]
["",null,null,"00:00:00",null,"","",null,"","",null,null,null,null,"","",null,3,null,null,null,null,null,null,null,null,null,null,null,null,null,null,null,null,null,null,null,null,4.59]
["",null,null,"00:00:00",null,"","",null,"","",null,null,null,null,"","",null,3,null,null,null,null,null,null,null,null,null,null,null,null,null,null,null,null,null,null,null,null,4.5999999999999996]
["",null,null,"00:00:00",null,"","",null,"","",null,null,null,null,"","",null,3,null,null,null,null,null,null,null,null,null,null,null,null,null,null,null,null,null,null,null,null,4.6100000000000003]
["",null,null,"00:00:00",null,"","",null,"","",null,null,null,null,"","",null,3,null,null,null,null,null,null,null,null,null,null,null,null,null,null,null,null,null,null,null,null,4.62]
["",null,null,"00:00:00",null,"","",null,"","",null,null,null,null,"","",null,3,null,null,null,null,null,null,null,null,null,null,null,null,null,null,null,null,null,null,null,null,4.63]
["",null,null,"00:00:00",null,"","",null,"","",null,null,null,null,"","",null,3,null,null,null,null,null,null,null,null,null,null,null,null,null,null,null,null,null,null,null,null,4.6399999999999997]
["",null,null,"00:00:00",null,"","",null,"","",null,null,null,null,"","",null,3,null,null,null,null,null,null,null,null,null,null,null,null,null,null,null,null,null,null,null,null,4.6500000000000004]
["",null,null,"00:00:00",null,"","",null,"","",null,null,null,null,"","",null,3,null,null,null,null,null,null,null,null,null,null,null,null,null,null,null,null,null,null,null,null,4.66]
["",null,null,"00:00:00",null,"","",null,"","",null,null,null,null,"","",null,3,null,null,null,null,null,null,null,null,null,null,null,null,null,null,null,null,null,null,null,null,4.67]
["",null,null,"00:00:00",null,"","",null,"","",null,null,null,null,"","",null,3,null,null,null,null,null,null,null,null,null,null,null,null,null,null,null,null,null,null,null,null,4.68]
["",null,null,"00:00:00",null,"","",null,"","",null,null,null,null,"","",null,3,null,null,null,null,null,null,null,null,null,null,null,null,null,null,null,null,null,null,null,null,4.6900000000000004]
["",null,null,"00:00:00",null,"","",null,"","",null,null,null,null,"","",null,3,null,null,null,null,null,null,null,null,null,null,null,null,null,null,null,null,null,null,null,null,4.7]
["",null,null,"00:00:00",null,"","",null,"","",null,null,null,null,"","",null,3,null,null,null,null,null,null,null,null,null,null,null,null,null,null,null,null,null,null,null,null,4.71]
["",null,null,"00:00:00",null,"","",null,"","",null,null,null,null,"","",null,3,null,null,null,null,null,null,null,null,null,null,null,null,null,null,null,null,null,null,null,null,4.72]
["",null,null,"00:00:00",null,"","",null,"","",null,null,null,null,"","",null,3,null,null,null,null,null,null,null,null,null,null,null,null,null,null,null,null,null,null,null,null,4.7300000000000004]
["",null,null,"00:00:00",null,"","",null,"","",null,null,null,null,"","",null,3,null,null,null,null,null,null,null,null,null,null,null,null,null,null,null,null,null,null,null,null,4.74]
["",null,null,"00:00:00",null,"","",null,"","",null,null,null,null,"","",null,3,null,null,null,null,null,null,null,null,null,null,null,null,null,null,null,null,null,null,null,null,4.75]
["",null,null,"00:00:00",null,"","",null,"","",null,null,null,null,"","",null,3,null,null,null,null,null,null,null,null,null,null,null,null,null,null,null,null,null,null,null,null,4.76]
["",null,null,"00:00:00",null,"","",null,"","",null,null,null,null,"","",null,3,null,null,null,null,null,null,null,null,null,null,null,null,null,null,null,null,null,null,null,null,4.7699999999999996]
["",null,null,"00:00:00",null,"","",null,"","",null,null,null,null,"","",null,3,null,null,null,null,null,null,null,null,null,null,null,null,null,null,null,null,null,null,null,null,4.78]
["",null,null,"00:00:00",null,"","",null,"","",null,null,null,null,"","",null,3,null,null,null,null,null,null,null,null,null,null,null,null,null,null,null,null,null,null,null,null,4.79]
["",null,null,"00:00:00",null,"","",null,"","",null,null,null,null,"","",null,3,null,null,null,null,null,null,null,null,null,null,null,null,null,null,null,null,null,null,null,null,4.8]
["",null,null,"00:00:00",null,"","",null,"","",null,null,null,null,"","",null,3,null,null,null,null,null,null,null,null,null,null,null,null,null,null,null,null,null,null,null,null,4.8099999999999996]
["",null,null,"00:00:00",null,"","",null,"","",null,null,null,null,"","",null,3,null,null,null,null,null,null,null,null,null,null,null,null,null,null,null,null,null,null,null,null,4.82]
["",null,null,"00:00:00",null,"","",null,"","",null,null,null,null,"","",null,3,null,null,null,null,null,null,null,null,null,null,null,null,null,null,null,null,null,null,null,null,4.83]
["",null,null,"00:00:00",null,"","",null,"","",null,null,null,null,"","",null,3,null,null,null,null,null,null,null,null,null,null,null,null,null,null,null,null,null,null,null,null,4.84]
["",null,null,"00:00:00",null,"","",null,"","",null,null,null,null,"","",null,3,null,null,null,null,null,null,null,null,null,null,null,null,null,null,null,null,null,null,null,null,4.8499999999999996]
["",null,null,"00:00:00",null,"","",null,"","",null,null,null,null,"","",null,3,null,null,null,null,null,null,null,null,null,null,null,null,null,null,null,null,null,null,null,null,4.8600000000000003]
["",null,null,"00:00:00",null,"","",null,"","",null,null,null,null,"","",null,3,null,null,null,null,null,null,null,null,null,null,null,null,null,null,null,null,null,null,null,null,4.87]
["",null,null,"00:00:00",null,"","",null,"","",null,null,null,null,"","",null,3,null,null,null,null,null,null,null,null,null,null,null,null,null,null,null,null,null,null,null,null,4.88]
["",null,null,"00:00:00",null,"","",null,"","",null,null,null,null,"","",null,3,null,null,null,null,null,null,null,null,null,null,null,null,null,null,null,null,null,null,null,null,4.8899999999999997]
["",null,null,"00:00:00",null,"","",null,"","",null,null,null,null,"","",null,3,null,null,null,null,null,null,null,null,null,null,null,null,null,null,null,null,null,null,null,null,4.9000000000000004]
["",null,null,"00:00:00",null,"","",null,"","",null,null,null,null,"","",null,3,null,null,null,null,null,null,null,null,null,null,null,null,null,null,null,null,null,null,null,null,4.91]
["",null,null,"00:00:00",null,"","",null,"","",null,null,null,null,"","",null,3,null,null,null,null,null,null,null,null,null,null,null,null,null,null,null,null,null,null,null,null,4.92]
["",null,null,"00:00:00",null,"","",null,"","",null,null,null,null,"","",null,3,null,null,null,null,null,null,null,null,null,null,null,null,null,null,null,null,null,null,null,null,4.93]
["",null,null,"00:00:00",null,"","",null,"","",null,null,null,null,"","",null,3,null,null,null,null,null,null,null,null,null,null,null,null,null,null,null,null,null,null,null,null,4.9400000000000004]
["",null,null,"00:00:00",null,"","",null,"","",null,null,null,null,"","",null,3,null,null,null,null,null,null,null,null,null,null,null,null,null,null,null,null,null,null,null,null,4.95]
["",null,null,"00:00:00",null,"","",null,"","",null,null,null,null,"","",null,3,null,null,null,null,null,null,null,null,null,null,null,null,null,null,null,null,null,null,null,null,4.96]
["",null,null,"00:00:00",null,"","",null,"","",null,null,null,null,"","",null,3,null,null,null,null,null,null,null,null,null,null,null,null,null,null,null,null,null,null,null,null,4.97]
["",null,null,"00:00:00",null,"","",null,"","",null,null,null,null,"","",null,3,null,null,null,null,null,null,null,null,null,null,null,null,null,null,null,null,null,null,null,null,4.9800000000000004]
["",null,null,"00:00:00",null,"","",null,"","",null,null,null,null,"","",null,3,null,null,null,null,null,null,null,null,null,null,null,null,null,null,null,null,null,null,null,null,4.99]
["",null,null,"00:00:00",null,"","",null,"","",null,null,null,null,"","",null,3,null,null,null,null,null,null,null,null,null,null,null,null,null,null,null,null,null,null,null,null,5]
["",null,null,"00:00:00",null,"","",null,"","",null,null,null,null,"","",null,3,null,null,null,null,null,null,null,null,null,null,null,null,null,null,null,null,null,null,null,null,5.01]
["",null,null,"00:00:00",null,"","",null,"","",null,null,null,null,"","",null,3,null,null,null,null,null,null,null,null,null,null,null,null,null,null,null,null,null,null,null,null,5.0199999999999996]
["",null,null,"00:00:00",null,"","",null,"","",null,null,null,null,"","",null,3,null,null,null,null,null,null,null,null,null,null,null,null,null,null,null,null,null,null,null,null,5.03]
["",null,null,"00:00:00",null,"","",null,"","",null,null,null,null,"","",null,3,null,null,null,null,null,null,null,null,null,null,null,null,null,null,null,null,null,null,null,null,5.04]
["",null,null,"00:00:00",null,"","",null,"","",null,null,null,null,"","",null,3,null,null,null,null,null,null,null,null,null,null,null,null,null,null,null,null,null,null,null,null,5.05]
["",null,null,"00:00:00",null,"","",null,"","",null,null,null,null,"","",null,3,null,null,null,null,null,null,null,null,null,null,null,null,null,null,null,null,null,null,null,null,5.0599999999999996]
["",null,null,"00:00:00",null,"","",null,"","",null,null,null,null,"","",null,3,null,null,null,null,null,null,null,null,null,null,null,null,null,null,null,null,null,null,null,null,5.07]
["",null,null,"00:00:00",null,"","",null,"","",null,null,null,null,"","",null,3,null,null,null,null,null,null,null,null,null,null,null,null,null,null,null,null,null,null,null,null,5.08]
["",null,null,"00:00:00",null,"","",null,"","",null,null,null,null,"","",null,3,null,null,null,null,null,null,null,null,null,null,null,null,null,null,null,null,null,null,null,null,5.09]
["",null,null,"00:00:00",null,"","",null,"","",null,null,null,null,"","",null,3,null,null,null,null,null,null,null,null,null,null,null,null,null,null,null,null,null,null,null,null,5.0999999999999996]
["",null,null,"00:00:00",null,"","",null,"","",null,null,null,null,"","",null,3,null,null,null,null,null,null,null,null,null,null,null,null,null,null,null,null,null,null,null,null,5.1100000000000003]
["",null,null,"00:00:00",null,"","",null,"","",null,null,null,null,"","",null,3,null,null,null,null,null,null,null,null,null,null,null,null,null,null,null,null,null,null,null,null,5.12]
["",null,null,"00:00:00",null,"","",null,"","",null,null,null,null,"","",null,3,null,null,null,null,null,null,null,null,null,null,null,null,null,null,null,null,null,null,null,null,5.13]
["",null,null,"00:00:00",null,"","",null,"","",null,null,null,null,"","",null,3,null,null,null,null,null,null,null,null,null,null,null,null,null,null,null,null,null,null,null,null,5.14]
["",null,null,"00:00:00",null,"","",null,"","",null,null,null,null,"","",null,3,null,null,null,null,null,null,null,null,null,null,null,null,null,null,null,null,null,null,null,null,5.15]
["",null,null,"00:00:00",null,"","",null,"","",null,null,null,null,"","",null,3,null,null,null,null,null,null,null,null,null,null,null,null,null,null,null,null,null,null,null,null,5.16]
["",null,null,"00:00:00",null,"","",null,"","",null,null,null,null,"","",null,3,null,null,null,null,null,null,null,null,null,null,null,null,null,null,null,null,null,null,null,null,5.17]
["",null,null,"00:00:00",null,"","",null,"","",null,null,null,null,"","",null,3,null,null,null,null,null,null,null,null,null,null,null,null,null,null,null,null,null,null,null,null,5.18]
[{"$f":"IF(E516=\"\",\"\",IF(A516=\"\",TODAY(),A516))","v":""},null,null,{"$f":"C516-B516+IF(B516>C516,1)","v":"00:00:00"},null,{"$f":"IFERROR(VLOOKUP(E516,$AJ$2:$AL$3155,2,FALSE),\"\")","v":""},{"$f":"IFERROR(VLOOKUP(E516,$AJ$2:$AL$3155,3,FALSE),\"\")","v":""},null,{"$f":"IFERROR(SUM(G516/7),\"\")","v":""},{"$f":"IFERROR(SUM(N516/C516),\"\")","v":""},null,null,null,null,{"$f":"IFERROR(ROUND(SUM(1000/K516),2),\"\")","v":""},{"$f":"IFERROR(ROUND(SUM(N516*O516),2),\"\")","v":""},null,3,null,null,null,null,null,null,null,null,null,null,null,null,null,null,null,null,null,null,null,null,5.19]
["",null,null,"00:00:00",null,"","",null,"","",null,null,null,null,"","",null,3,null,null,null,null,null,null,null,null,null,null,null,null,null,null,null,null,null,null,null,null,5.2]
["",null,null,"00:00:00",null,"","",null,"","",null,null,null,null,"","",null,3,null,null,null,null,null,null,null,null,null,null,null,null,null,null,null,null,null,null,null,null,5.21]
["",null,null,"00:00:00",null,"","",null,"","",null,null,null,null,"","",null,3,null,null,null,null,null,null,null,null,null,null,null,null,null,null,null,null,null,null,null,null,5.22]
["",null,null,"00:00:00",null,"","",null,"","",null,null,null,null,"","",null,3,null,null,null,null,null,null,null,null,null,null,null,null,null,null,null,null,null,null,null,null,5.23]
["",null,null,"00:00:00",null,"","",null,"","",null,null,null,null,"","",null,3,null,null,null,null,null,null,null,null,null,null,null,null,null,null,null,null,null,null,null,null,5.24]
["",null,null,"00:00:00",null,"","",null,"","",null,null,null,null,"","",null,3,null,null,null,null,null,null,null,null,null,null,null,null,null,null,null,null,null,null,null,null,5.25]
["",null,null,"00:00:00",null,"","",null,"","",null,null,null,null,"","",null,3,null,null,null,null,null,null,null,null,null,null,null,null,null,null,null,null,null,null,null,null,5.26]
["",null,null,"00:00:00",null,"","",null,"","",null,null,null,null,"","",null,3,null,null,null,null,null,null,null,null,null,null,null,null,null,null,null,null,null,null,null,null,5.27]
["",null,null,"00:00:00",null,"","",null,"","",null,null,null,null,"","",null,3,null,null,null,null,null,null,null,null,null,null,null,null,null,null,null,null,null,null,null,null,5.28]
["",null,null,"00:00:00",null,"","",null,"","",null,null,null,null,"","",null,3,null,null,null,null,null,null,null,null,null,null,null,null,null,null,null,null,null,null,null,null,5.29]
["",null,null,"00:00:00",null,"","",null,"","",null,null,null,null,"","",null,3,null,null,null,null,null,null,null,null,null,null,null,null,null,null,null,null,null,null,null,null,5.3]
["",null,null,"00:00:00",null,"","",null,"","",null,null,null,null,"","",null,3,null,null,null,null,null,null,null,null,null,null,null,null,null,null,null,null,null,null,null,null,5.31]
["",null,null,"00:00:00",null,"","",null,"","",null,null,null,null,"","",null,3,null,null,null,null,null,null,null,null,null,null,null,null,null,null,null,null,null,null,null,null,5.32]
["",null,null,"00:00:00",null,"","",null,"","",null,null,null,null,"","",null,3,null,null,null,null,null,null,null,null,null,null,null,null,null,null,null,null,null,null,null,null,5.33]
["",null,null,"00:00:00",null,"","",null,"","",null,null,null,null,"","",null,3,null,null,null,null,null,null,null,null,null,null,null,null,null,null,null,null,null,null,null,null,5.34]
["",null,null,"00:00:00",null,"","",null,"","",null,null,null,null,"","",null,3,null,null,null,null,null,null,null,null,null,null,null,null,null,null,null,null,null,null,null,null,5.35]
["",null,null,"00:00:00",null,"","",null,"","",null,null,null,null,"","",null,3,null,null,null,null,null,null,null,null,null,null,null,null,null,null,null,null,null,null,null,null,5.36]
["",null,null,"00:00:00",null,"","",null,"","",null,null,null,null,"","",null,3,null,null,null,null,null,null,null,null,null,null,null,null,null,null,null,null,null,null,null,null,5.37]
["",null,null,"00:00:00",null,"","",null,"","",null,null,null,null,"","",null,3,null,null,null,null,null,null,null,null,null,null,null,null,null,null,null,null,null,null,null,null,5.38]
["",null,null,"00:00:00",null,"","",null,"","",null,null,null,null,"","",null,3,null,null,null,null,null,null,null,null,null,null,null,null,null,null,null,null,null,null,null,null,5.39]
["",null,null,"00:00:00",null,"","",null,"","",null,null,null,null,"","",null,3,null,null,null,null,null,null,null,null,null,null,null,null,null,null,null,null,null,null,null,null,5.4]
["",null,null,"00:00:00",null,"","",null,"","",null,null,null,null,"","",null,3,null,null,null,null,null,null,null,null,null,null,null,null,null,null,null,null,null,null,null,null,5.41]
["",null,null,"00:00:00",null,"","",null,"","",null,null,null,null,"","",null,3,null,null,null,null,null,null,null,null,null,null,null,null,null,null,null,null,null,null,null,null,5.42]
["",null,null,"00:00:00",null,"","",null,"","",null,null,null,null,"","",null,3,null,null,null,null,null,null,null,null,null,null,null,null,null,null,null,null,null,null,null,null,5.43]
["",null,null,"00:00:00",null,"","",null,"","",null,null,null,null,"","",null,3,null,null,null,null,null,null,null,null,null,null,null,null,null,null,null,null,null,null,null,null,5.44]
["",null,null,"00:00:00",null,"","",null,"","",null,null,null,null,"","",null,3,null,null,null,null,null,null,null,null,null,null,null,null,null,null,null,null,null,null,null,null,5.45]
["",null,null,"00:00:00",null,"","",null,"","",null,null,null,null,"","",null,3,null,null,null,null,null,null,null,null,null,null,null,null,null,null,null,null,null,null,null,null,5.46]
["",null,null,"00:00:00",null,"","",null,"","",null,null,null,null,"","",null,3,null,null,null,null,null,null,null,null,null,null,null,null,null,null,null,null,null,null,null,null,5.47]
["",null,null,"00:00:00",null,"","",null,"","",null,null,null,null,"","",null,3,null,null,null,null,null,null,null,null,null,null,null,null,null,null,null,null,null,null,null,null,5.48]
["",null,null,"00:00:00",null,"","",null,"","",null,null,null,null,"","",null,3,null,null,null,null,null,null,null,null,null,null,null,null,null,null,null,null,null,null,null,null,5.49]
["",null,null,"00:00:00",null,"","",null,"","",null,null,null,null,"","",null,3,null,null,null,null,null,null,null,null,null,null,null,null,null,null,null,null,null,null,null,null,5.5]
["",null,null,"00:00:00",null,"","",null,"","",null,null,null,null,"","",null,3,null,null,null,null,null,null,null,null,null,null,null,null,null,null,null,null,null,null,null,null,5.51]
["",null,null,"00:00:00",null,"","",null,"","",null,null,null,null,"","",null,3,null,null,null,null,null,null,null,null,null,null,null,null,null,null,null,null,null,null,null,null,5.52]
["",null,null,"00:00:00",null,"","",null,"","",null,null,null,null,"","",null,3,null,null,null,null,null,null,null,null,null,null,null,null,null,null,null,null,null,null,null,null,5.53]
["",null,null,"00:00:00",null,"","",null,"","",null,null,null,null,"","",null,3,null,null,null,null,null,null,null,null,null,null,null,null,null,null,null,null,null,null,null,null,5.54]
["",null,null,"00:00:00",null,"","",null,"","",null,null,null,null,"","",null,3,null,null,null,null,null,null,null,null,null,null,null,null,null,null,null,null,null,null,null,null,5.55]
["",null,null,"00:00:00",null,"","",null,"","",null,null,null,null,"","",null,3,null,null,null,null,null,null,null,null,null,null,null,null,null,null,null,null,null,null,null,null,5.56]
["",null,null,"00:00:00",null,"","",null,"","",null,null,null,null,"","",null,3,null,null,null,null,null,null,null,null,null,null,null,null,null,null,null,null,null,null,null,null,5.57]
["",null,null,"00:00:00",null,"","",null,"","",null,null,null,null,"","",null,3,null,null,null,null,null,null,null,null,null,null,null,null,null,null,null,null,null,null,null,null,5.58]
["",null,null,"00:00:00",null,"","",null,"","",null,null,null,null,"","",null,3,null,null,null,null,null,null,null,null,null,null,null,null,null,null,null,null,null,null,null,null,5.59]
["",null,null,"00:00:00",null,"","",null,"","",null,null,null,null,"","",null,3,null,null,null,null,null,null,null,null,null,null,null,null,null,null,null,null,null,null,null,null,5.6]
["",null,null,"00:00:00",null,"","",null,"","",null,null,null,null,"","",null,3,null,null,null,null,null,null,null,null,null,null,null,null,null,null,null,null,null,null,null,null,5.61]
["",null,null,"00:00:00",null,"","",null,"","",null,null,null,null,"","",null,3,null,null,null,null,null,null,null,null,null,null,null,null,null,null,null,null,null,null,null,null,5.62]
["",null,null,"00:00:00",null,"","",null,"","",null,null,null,null,"","",null,3,null,null,null,null,null,null,null,null,null,null,null,null,null,null,null,null,null,null,null,null,5.63]
["",null,null,"00:00:00",null,"","",null,"","",null,null,null,null,"","",null,3,null,null,null,null,null,null,null,null,null,null,null,null,null,null,null,null,null,null,null,null,5.64]
["",null,null,"00:00:00",null,"","",null,"","",null,null,null,null,"","",null,3,null,null,null,null,null,null,null,null,null,null,null,null,null,null,null,null,null,null,null,null,5.65]
["",null,null,"00:00:00",null,"","",null,"","",null,null,null,null,"","",null,3,null,null,null,null,null,null,null,null,null,null,null,null,null,null,null,null,null,null,null,null,5.66]
["",null,null,"00:00:00",null,"","",null,"","",null,null,null,null,"","",null,3,null,null,null,null,null,null,null,null,null,null,null,null,null,null,null,null,null,null,null,null,5.67]
["",null,null,"00:00:00",null,"","",null,"","",null,null,null,null,"","",null,3,null,null,null,null,null,null,null,null,null,null,null,null,null,null,null,null,null,null,null,null,5.68]
["",null,null,"00:00:00",null,"","",null,"","",null,null,null,null,"","",null,3,null,null,null,null,null,null,null,null,null,null,null,null,null,null,null,null,null,null,null,null,5.69]
["",null,null,"00:00:00",null,"","",null,"","",null,null,null,null,"","",null,3,null,null,null,null,null,null,null,null,null,null,null,null,null,null,null,null,null,null,null,null,5.7]
["",null,null,"00:00:00",null,"","",null,"","",null,null,null,null,"","",null,3,null,null,null,null,null,null,null,null,null,null,null,null,null,null,null,null,null,null,null,null,5.71]
["",null,null,"00:00:00",null,"","",null,"","",null,null,null,null,"","",null,3,null,null,null,null,null,null,null,null,null,null,null,null,null,null,null,null,null,null,null,null,5.72]
["",null,null,"00:00:00",null,"","",null,"","",null,null,null,null,"","",null,3,null,null,null,null,null,null,null,null,null,null,null,null,null,null,null,null,null,null,null,null,5.73]
["",null,null,"00:00:00",null,"","",null,"","",null,null,null,null,"","",null,3,null,null,null,null,null,null,null,null,null,null,null,null,null,null,null,null,null,null,null,null,5.74]
["",null,null,"00:00:00",null,"","",null,"","",null,null,null,null,"","",null,3,null,null,null,null,null,null,null,null,null,null,null,null,null,null,null,null,null,null,null,null,5.75]
["",null,null,"00:00:00",null,"","",null,"","",null,null,null,null,"","",null,3,null,null,null,null,null,null,null,null,null,null,null,null,null,null,null,null,null,null,null,null,5.76]
["",null,null,"00:00:00",null,"","",null,"","",null,null,null,null,"","",null,3,null,null,null,null,null,null,null,null,null,null,null,null,null,null,null,null,null,null,null,null,5.77]
["",null,null,"00:00:00",null,"","",null,"","",null,null,null,null,"","",null,3,null,null,null,null,null,null,null,null,null,null,null,null,null,null,null,null,null,null,null,null,5.78]
["",null,null,"00:00:00",null,"","",null,"","",null,null,null,null,"","",null,3,null,null,null,null,null,null,null,null,null,null,null,null,null,null,null,null,null,null,null,null,5.79]
["",null,null,"00:00:00",null,"","",null,"","",null,null,null,null,"","",null,3,null,null,null,null,null,null,null,null,null,null,null,null,null,null,null,null,null,null,null,null,5.8]
["",null,null,"00:00:00",null,"","",null,"","",null,null,null,null,"","",null,3,null,null,null,null,null,null,null,null,null,null,null,null,null,null,null,null,null,null,null,null,5.81]
["",null,null,"00:00:00",null,"","",null,"","",null,null,null,null,"","",null,3,null,null,null,null,null,null,null,null,null,null,null,null,null,null,null,null,null,null,null,null,5.82]
[{"$f":"IF(E580=\"\",\"\",IF(A580=\"\",TODAY(),A580))","v":""},null,null,{"$f":"C580-B580+IF(B580>C580,1)","v":"00:00:00"},null,{"$f":"IFERROR(VLOOKUP(E580,$AJ$2:$AL$3155,2,FALSE),\"\")","v":""},{"$f":"IFERROR(VLOOKUP(E580,$AJ$2:$AL$3155,3,FALSE),\"\")","v":""},null,{"$f":"IFERROR(SUM(G580/7),\"\")","v":""},{"$f":"IFERROR(SUM(N580/C580),\"\")","v":""},null,null,null,null,{"$f":"IFERROR(ROUND(SUM(1000/K580),2),\"\")","v":""},{"$f":"IFERROR(ROUND(SUM(N580*O580),2),\"\")","v":""},null,3,null,null,null,null,null,null,null,null,null,null,null,null,null,null,null,null,null,null,null,null,5.83]
["",null,null,"00:00:00",null,"","",null,"","",null,null,null,null,"","",null,3,null,null,null,null,null,null,null,null,null,null,null,null,null,null,null,null,null,null,null,null,5.84]
["",null,null,"00:00:00",null,"","",null,"","",null,null,null,null,"","",null,3,null,null,null,null,null,null,null,null,null,null,null,null,null,null,null,null,null,null,null,null,5.85]
["",null,null,"00:00:00",null,"","",null,"","",null,null,null,null,"","",null,3,null,null,null,null,null,null,null,null,null,null,null,null,null,null,null,null,null,null,null,null,5.86]
["",null,null,"00:00:00",null,"","",null,"","",null,null,null,null,"","",null,3,null,null,null,null,null,null,null,null,null,null,null,null,null,null,null,null,null,null,null,null,5.87]
["",null,null,"00:00:00",null,"","",null,"","",null,null,null,null,"","",null,3,null,null,null,null,null,null,null,null,null,null,null,null,null,null,null,null,null,null,null,null,5.88]
["",null,null,"00:00:00",null,"","",null,"","",null,null,null,null,"","",null,3,null,null,null,null,null,null,null,null,null,null,null,null,null,null,null,null,null,null,null,null,5.89]
["",null,null,"00:00:00",null,"","",null,"","",null,null,null,null,"","",null,3,null,null,null,null,null,null,null,null,null,null,null,null,null,null,null,null,null,null,null,null,5.9]
["",null,null,"00:00:00",null,"","",null,"","",null,null,null,null,"","",null,3,null,null,null,null,null,null,null,null,null,null,null,null,null,null,null,null,null,null,null,null,5.91]
["",null,null,"00:00:00",null,"","",null,"","",null,null,null,null,"","",null,3,null,null,null,null,null,null,null,null,null,null,null,null,null,null,null,null,null,null,null,null,5.92]
["",null,null,"00:00:00",null,"","",null,"","",null,null,null,null,"","",null,3,null,null,null,null,null,null,null,null,null,null,null,null,null,null,null,null,null,null,null,null,5.93]
["",null,null,"00:00:00",null,"","",null,"","",null,null,null,null,"","",null,3,null,null,null,null,null,null,null,null,null,null,null,null,null,null,null,null,null,null,null,null,5.94]
["",null,null,"00:00:00",null,"","",null,"","",null,null,null,null,"","",null,3,null,null,null,null,null,null,null,null,null,null,null,null,null,null,null,null,null,null,null,null,5.95]
["",null,null,"00:00:00",null,"","",null,"","",null,null,null,null,"","",null,3,null,null,null,null,null,null,null,null,null,null,null,null,null,null,null,null,null,null,null,null,5.96]
["",null,null,"00:00:00",null,"","",null,"","",null,null,null,null,"","",null,3,null,null,null,null,null,null,null,null,null,null,null,null,null,null,null,null,null,null,null,null,5.97]
["",null,null,"00:00:00",null,"","",null,"","",null,null,null,null,"","",null,3,null,null,null,null,null,null,null,null,null,null,null,null,null,null,null,null,null,null,null,null,5.98]
["",null,null,"00:00:00",null,"","",null,"","",null,null,null,null,"","",null,3,null,null,null,null,null,null,null,null,null,null,null,null,null,null,null,null,null,null,null,null,5.99]
["",null,null,"00:00:00",null,"","",null,"","",null,null,null,null,"","",null,3,null,null,null,null,null,null,null,null,null,null,null,null,null,null,null,null,null,null,null,null,6]
["",null,null,"00:00:00",null,"","",null,"","",null,null,null,null,"","",null,3]
["",null,null,"00:00:00",null,"","",null,"","",null,null,null,null,"","",null,3]
["",null,null,"00:00:00",null,"","",null,"","",null,null,null,null,"","",null,3]
["",null,null,"00:00:00",null,"","",null,"","",null,null,null,null,"","",null,3]
["",null,null,"00:00:00",null,"","",null,"","",null,null,null,null,"","",null,3]
["",null,null,"00:00:00",null,"","",null,"","",null,null,null,null,"","",null,3]
["",null,null,"00:00:00",null,"","",null,"","",null,null,null,null,"","",null,3]
["",null,null,"00:00:00",null,"","",null,"","",null,null,null,null,"","",null,3]
["",null,null,"00:00:00",null,"","",null,"","",null,null,null,null,"","",null,3]
["",null,null,"00:00:00",null,"","",null,"","",null,null,null,null,"","",null,3]
["",null,null,"00:00:00",null,"","",null,"","",null,null,null,null,"","",null,3]
["",null,null,"00:00:00",null,"","",null,"","",null,null,null,null,"","",null,3]
["",null,null,"00:00:00",null,"","",null,"","",null,null,null,null,"","",null,3]
["",null,null,"00:00:00",null,"","",null,"","",null,null,null,null,"","",null,3]
["",null,null,"00:00:00",null,"","",null,"","",null,null,null,null,"","",null,3]
["",null,null,"00:00:00",null,"","",null,"","",null,null,null,null,"","",null,3]
["",null,null,"00:00:00",null,"","",null,"","",null,null,null,null,"","",null,3]
["",null,null,"00:00:00",null,"","",null,"","",null,null,null,null,"","",null,3]
["",null,null,"00:00:00",null,"","",null,"","",null,null,null,null,"","",null,3]
["",null,null,"00:00:00",null,"","",null,"","",null,null,null,null,"","",null,3]
["",null,null,"00:00:00",null,"","",null,"","",null,null,null,null,"","",null,3]
["",null,null,"00:00:00",null,"","",null,"","",null,null,null,null,"","",null,3]
["",null,null,"00:00:00",null,"","",null,"","",null,null,null,null,"","",null,3]
["",null,null,"00:00:00",null,"","",null,"","",null,null,null,null,"","",null,3]
["",null,null,"00:00:00",null,"","",null,"","",null,null,null,null,"","",null,3]
["",null,null,"00:00:00",null,"","",null,"","",null,null,null,null,"","",null,3]
["",null,null,"00:00:00",null,"","",null,"","",null,null,null,null,"","",null,3]
["",null,null,"00:00:00",null,"","",null,"","",null,null,null,null,"","",null,3]
["",null,null,"00:00:00",null,"","",null,"","",null,null,null,null,"","",null,3]
["",null,null,"00:00:00",null,"","",null,"","",null,null,null,null,"","",null,3]
["",null,null,"00:00:00",null,"","",null,"","",null,null,null,null,"","",null,3]
["",null,null,"00:00:00",null,"","",null,"","",null,null,null,null,"","",null,3]
["",null,null,"00:00:00",null,"","",null,"","",null,null,null,null,"","",null,3]
["",null,null,"00:00:00",null,"","",null,"","",null,null,null,null,"","",null,3]
["",null,null,"00:00:00",null,"","",null,"","",null,null,null,null,"","",null,3]
["",null,null,"00:00:00",null,"","",null,"","",null,null,null,null,"","",null,3]
["",null,null,"00:00:00",null,"","",null,"","",null,null,null,null,"","",null,3]
["",null,null,"00:00:00",null,"","",null,"","",null,null,null,null,"","",null,3]
["",null,null,"00:00:00",null,"","",null,"","",null,null,null,null,"","",null,3]
["",null,null,"00:00:00",null,"","",null,"","",null,null,null,null,"","",null,3]
["",null,null,"00:00:00",null,"","",null,"","",null,null,null,null,"","",null,3]
["",null,null,"00:00:00",null,"","",null,"","",null,null,null,null,"","",null,3]
["",null,null,"00:00:00",null,"","",null,"","",null,null,null,null,"","",null,3]
["",null,null,"00:00:00",null,"","",null,"","",null,null,null,null,"","",null,3]
["",null,null,"00:00:00",null,"","",null,"","",null,null,null,null,"","",null,3]
["",null,null,"00:00:00",null,"","",null,"","",null,null,null,null,"","",null,3]
[{"$f":"IF(E644=\"\",\"\",IF(A644=\"\",TODAY(),A644))","v":""},null,null,{"$f":"C644-B644+IF(B644>C644,1)","v":"00:00:00"},null,{"$f":"IFERROR(VLOOKUP(E644,$AJ$2:$AL$3155,2,FALSE),\"\")","v":""},{"$f":"IFERROR(VLOOKUP(E644,$AJ$2:$AL$3155,3,FALSE),\"\")","v":""},null,{"$f":"IFERROR(SUM(G644/7),\"\")","v":""},{"$f":"IFERROR(SUM(N644/C644),\"\")","v":""},null,null,null,null,{"$f":"IFERROR(ROUND(SUM(1000/K644),2),\"\")","v":""},{"$f":"IFERROR(ROUND(SUM(N644*O644),2),\"\")","v":""},null,3]
["",null,null,"00:00:00",null,"","",null,"","",null,null,null,null,"","",null,3]
["",null,null,"00:00:00",null,"","",null,"","",null,null,null,null,"","",null,3]
["",null,null,"00:00:00",null,"","",null,"","",null,null,null,null,"","",null,3]
["",null,null,"00:00:00",null,"","",null,"","",null,null,null,null,"","",null,3]
["",null,null,"00:00:00",null,"","",null,"","",null,null,null,null,"","",null,3]
["",null,null,"00:00:00",null,"","",null,"","",null,null,null,null,"","",null,3]
["",null,null,"00:00:00",null,"","",null,"","",null,null,null,null,"","",null,3]
["",null,null,"00:00:00",null,"","",null,"","",null,null,null,null,"","",null,3]
["",null,null,"00:00:00",null,"","",null,"","",null,null,null,null,"","",null,3]
["",null,null,"00:00:00",null,"","",null,"","",null,null,null,null,"","",null,3]
["",null,null,"00:00:00",null,"","",null,"","",null,null,null,null,"","",null,3]
["",null,null,"00:00:00",null,"","",null,"","",null,null,null,null,"","",null,3]
["",null,null,"00:00:00",null,"","",null,"","",null,null,null,null,"","",null,3]
["",null,null,"00:00:00",null,"","",null,"","",null,null,null,null,"","",null,3]
["",null,null,"00:00:00",null,"","",null,"","",null,null,null,null,"","",null,3]
["",null,null,"00:00:00",null,"","",null,"","",null,null,null,null,"","",null,3]
["",null,null,"00:00:00",null,"","",null,"","",null,null,null,null,"","",null,3]
["",null,null,"00:00:00",null,"","",null,"","",null,null,null,null,"","",null,3]
["",null,null,"00:00:00",null,"","",null,"","",null,null,null,null,"","",null,3]
["",null,null,"00:00:00",null,"","",null,"","",null,null,null,null,"","",null,3]
["",null,null,"00:00:00",null,"","",null,"","",null,null,null,null,"","",null,3]
["",null,null,"00:00:00",null,"","",null,"","",null,null,null,null,"","",null,3]
["",null,null,"00:00:00",null,"","",null,"","",null,null,null,null,"","",null,3]
["",null,null,"00:00:00",null,"","",null,"","",null,null,null,null,"","",null,3]
["",null,null,"00:00:00",null,"","",null,"","",null,null,null,null,"","",null,3]
["",null,null,"00:00:00",null,"","",null,"","",null,null,null,null,"","",null,3]
["",null,null,"00:00:00",null,"","",null,"","",null,null,null,null,"","",null,3]
["",null,null,"00:00:00",null,"","",null,"","",null,null,null,null,"","",null,3]
["",null,null,"00:00:00",null,"","",null,"","",null,null,null,null,"","",null,3]
["",null,null,"00:00:00",null,"","",null,"","",null,null,null,null,"","",null,3]
["",null,null,"00:00:00",null,"","",null,"","",null,null,null,null,"","",null,3]
["",null,null,"00:00:00",null,"","",null,"","",null,null,null,null,"","",null,3]
["",null,null,"00:00:00",null,"","",null,"","",null,null,null,null,"","",null,3]
["",null,null,"00:00:00",null,"","",null,"","",null,null,null,null,"","",null,3]
["",null,null,"00:00:00",null,"","",null,"","",null,null,null,null,"","",null,3]
["",null,null,"00:00:00",null,"","",null,"","",null,null,null,null,"","",null,3]
["",null,null,"00:00:00",null,"","",null,"","",null,null,null,null,"","",null,3]
["",null,null,"00:00:00",null,"","",null,"","",null,null,null,null,"","",null,3]
["",null,null,"00:00:00",null,"","",null,"","",null,null,null,null,"","",null,3]
["",null,null,"00:00:00",null,"","",null,"","",null,null,null,null,"","",null,3]
["",null,null,"00:00:00",null,"","",null,"","",null,null,null,null,"","",null,3]
["",null,null,"00:00:00",null,"","",null,"","",null,null,null,null,"","",null,3]
["",null,null,"00:00:00",null,"","",null,"","",null,null,null,null,"","",null,3]
["",null,null,"00:00:00",null,"","",null,"","",null,null,null,null,"","",null,3]
["",null,null,"00:00:00",null,"","",null,"","",null,null,null,null,"","",null,3]
["",null,null,"00:00:00",null,"","",null,"","",null,null,null,null,"","",null,3]
["",null,null,"00:00:00",null,"","",null,"","",null,null,null,null,"","",null,3]
["",null,null,"00:00:00",null,"","",null,"","",null,null,null,null,"","",null,3]
["",null,null,"00:00:00",null,"","",null,"","",null,null,null,null,"","",null,3]
["",null,null,"00:00:00",null,"","",null,"","",null,null,null,null,"","",null,3]
["",null,null,"00:00:00",null,"","",null,"","",null,null,null,null,"","",null,3]
["",null,null,"00:00:00",null,"","",null,"","",null,null,null,null,"","",null,3]
["",null,null,"00:00:00",null,"","",null,"","",null,null,null,null,"","",null,3]
["",null,null,"00:00:00",null,"","",null,"","",null,null,null,null,"","",null,3]
["",null,null,"00:00:00",null,"","",null,"","",null,null,null,null,"","",null,3]
["",null,null,"00:00:00",null,"","",null,"","",null,null,null,null,"","",null,3]
["",null,null,"00:00:00",null,"","",null,"","",null,null,null,null,"","",null,3]
["",null,null,"00:00:00",null,"","",null,"","",null,null,null,null,"","",null,3]
["",null,null,"00:00:00",null,"","",null,"","",null,null,null,null,"","",null,3]
["",null,null,"00:00:00",null,"","",null,"","",null,null,null,null,"","",null,3]
["",null,null,"00:00:00",null,"","",null,"","",null,null,null,null,"","",null,3]
["",null,null,"00:00:00",null,"","",null,"","",null,null,null,null,"","",null,3]
["",null,null,"00:00:00",null,"","",null,"","",null,null,null,null,"","",null,3]
[{"$f":"IF(E708=\"\",\"\",IF(A708=\"\",TODAY(),A708))","v":""},null,null,{"$f":"C708-B708+IF(B708>C708,1)","v":"00:00:00"},null,{"$f":"IFERROR(VLOOKUP(E708,$AJ$2:$AL$3155,2,FALSE),\"\")","v":""},{"$f":"IFERROR(VLOOKUP(E708,$AJ$2:$AL$3155,3,FALSE),\"\")","v":""},null,{"$f":"IFERROR(SUM(G708/7),\"\")","v":""},{"$f":"IFERROR(SUM(N708/C708),\"\")","v":""},null,null,null,null,{"$f":"IFERROR(ROUND(SUM(1000/K708),2),\"\")","v":""},{"$f":"IFERROR(ROUND(SUM(N708*O708),2),\"\")","v":""},null,3]
["",null,null,"00:00:00",null,"","",null,"","",null,null,null,null,"","",null,3]
["",null,null,"00:00:00",null,"","",null,"","",null,null,null,null,"","",null,3]
["",null,null,"00:00:00",null,"","",null,"","",null,null,null,null,"","",null,3]
["",null,null,"00:00:00",null,"","",null,"","",null,null,null,null,"","",null,3]
["",null,null,"00:00:00",null,"","",null,"","",null,null,null,null,"","",null,3]
["",null,null,"00:00:00",null,"","",null,"","",null,null,null,null,"","",null,3]
["",null,null,"00:00:00",null,"","",null,"","",null,null,null,null,"","",null,3]
["",null,null,"00:00:00",null,"","",null,"","",null,null,null,null,"","",null,3]
["",null,null,"00:00:00",null,"","",null,"","",null,null,null,null,"","",null,3]
["",null,null,"00:00:00",null,"","",null,"","",null,null,null,null,"","",null,3]
["",null,null,"00:00:00",null,"","",null,"","",null,null,null,null,"","",null,3]
["",null,null,"00:00:00",null,"","",null,"","",null,null,null,null,"","",null,3]
["",null,null,"00:00:00",null,"","",null,"","",null,null,null,null,"","",null,3]
["",null,null,"00:00:00",null,"","",null,"","",null,null,null,null,"","",null,3]
["",null,null,"00:00:00",null,"","",null,"","",null,null,null,null,"","",null,3]
["",null,null,"00:00:00",null,"","",null,"","",null,null,null,null,"","",null,3]
["",null,null,"00:00:00",null,"","",null,"","",null,null,null,null,"","",null,3]
["",null,null,"00:00:00",null,"","",null,"","",null,null,null,null,"","",null,3]
["",null,null,"00:00:00",null,"","",null,"","",null,null,null,null,"","",null,3]
["",null,null,"00:00:00",null,"","",null,"","",null,null,null,null,"","",null,3]
["",null,null,"00:00:00",null,"","",null,"","",null,null,null,null,"","",null,3]
["",null,null,"00:00:00",null,"","",null,"","",null,null,null,null,"","",null,3]
["",null,null,"00:00:00",null,"","",null,"","",null,null,null,null,"","",null,3]
["",null,null,"00:00:00",null,"","",null,"","",null,null,null,null,"","",null,3]
["",null,null,"00:00:00",null,"","",null,"","",null,null,null,null,"","",null,3]
["",null,null,"00:00:00",null,"","",null,"","",null,null,null,null,"","",null,3]
["",null,null,"00:00:00",null,"","",null,"","",null,null,null,null,"","",null,3]
["",null,null,"00:00:00",null,"","",null,"","",null,null,null,null,"","",null,3]
["",null,null,"00:00:00",null,"","",null,"","",null,null,null,null,"","",null,3]
["",null,null,"00:00:00",null,"","",null,"","",null,null,null,null,"","",null,3]
["",null,null,"00:00:00",null,"","",null,"","",null,null,null,null,"","",null,3]
["",null,null,"00:00:00",null,"","",null,"","",null,null,null,null,"","",null,3]
["",null,null,"00:00:00",null,"","",null,"","",null,null,null,null,"","",null,3]
["",null,null,"00:00:00",null,"","",null,"","",null,null,null,null,"","",null,3]
["",null,null,"00:00:00",null,"","",null,"","",null,null,null,null,"","",null,3]
["",null,null,"00:00:00",null,"","",null,"","",null,null,null,null,"","",null,3]
["",null,null,"00:00:00",null,"","",null,"","",null,null,null,null,"","",null,3]
["",null,null,"00:00:00",null,"","",null,"","",null,null,null,null,"","",null,3]
["",null,null,"00:00:00",null,"","",null,"","",null,null,null,null,"","",null,3]
["",null,null,"00:00:00",null,"","",null,"","",null,null,null,null,"","",null,3]
["",null,null,"00:00:00",null,"","",null,"","",null,null,null,null,"","",null,3]
["",null,null,"00:00:00",null,"","",null,"","",null,null,null,null,"","",null,3]
["",null,null,"00:00:00",null,"","",null,"","",null,null,null,null,"","",null,3]
["",null,null,"00:00:00",null,"","",null,"","",null,null,null,null,"","",null,3]
["",null,null,"00:00:00",null,"","",null,"","",null,null,null,null,"","",null,3]
["",null,null,"00:00:00",null,"","",null,"","",null,null,null,null,"","",null,3]
["",null,null,"00:00:00",null,"","",null,"","",null,null,null,null,"","",null,3]
["",null,null,"00:00:00",null,"","",null,"","",null,null,null,null,"","",null,3]
["",null,null,"00:00:00",null,"","",null,"","",null,null,null,null,"","",null,3]
["",null,null,"00:00:00",null,"","",null,"","",null,null,null,null,"","",null,3]
["",null,null,"00:00:00",null,"","",null,"","",null,null,null,null,"","",null,3]
["",null,null,"00:00:00",null,"","",null,"","",null,null,null,null,"","",null,3]
["",null,null,"00:00:00",null,"","",null,"","",null,null,null,null,"","",null,3]
["",null,null,"00:00:00",null,"","",null,"","",null,null,null,null,"","",null,3]
["",null,null,"00:00:00",null,"","",null,"","",null,null,null,null,"","",null,3]
["",null,null,"00:00:00",null,"","",null,"","",null,null,null,null,"","",null,3]
["",null,null,"00:00:00",null,"","",null,"","",null,null,null,null,"","",null,3]
["",null,null,"00:00:00",null,"","",null,"","",null,null,null,null,"","",null,3]
["",null,null,"00:00:00",null,"","",null,"","",null,null,null,null,"","",null,3]
["",null,null,"00:00:00",null,"","",null,"","",null,null,null,null,"","",null,3]
["",null,null,"00:00:00",null,"","",null,"","",null,null,null,null,"","",null,3]
["",null,null,"00:00:00",null,"","",null,"","",null,null,null,null,"","",null,3]
["",null,null,"00:00:00",null,"","",null,"","",null,null,null,null,"","",null,3]
[{"$f":"IF(E772=\"\",\"\",IF(A772=\"\",TODAY(),A772))","v":""},null,null,{"$f":"C772-B772+IF(B772>C772,1)","v":"00:00:00"},null,{"$f":"IFERROR(VLOOKUP(E772,$AJ$2:$AL$3155,2,FALSE),\"\")","v":""},{"$f":"IFERROR(VLOOKUP(E772,$AJ$2:$AL$3155,3,FALSE),\"\")","v":""},null,{"$f":"IFERROR(SUM(G772/7),\"\")","v":""},{"$f":"IFERROR(SUM(N772/C772),\"\")","v":""},null,null,null,null,{"$f":"IFERROR(ROUND(SUM(1000/K772),2),\"\")","v":""},{"$f":"IFERROR(ROUND(SUM(N772*O772),2),\"\")","v":""},null,3]
["",null,null,"00:00:00",null,"","",null,"","",null,null,null,null,"","",null,3]
["",null,null,"00:00:00",null,"","",null,"","",null,null,null,null,"","",null,3]
["",null,null,"00:00:00",null,"","",null,"","",null,null,null,null,"","",null,3]
["",null,null,"00:00:00",null,"","",null,"","",null,null,null,null,"","",null,3]
["",null,null,"00:00:00",null,"","",null,"","",null,null,null,null,"","",null,3]
["",null,null,"00:00:00",null,"","",null,"","",null,null,null,null,"","",null,3]
["",null,null,"00:00:00",null,"","",null,"","",null,null,null,null,"","",null,3]
["",null,null,"00:00:00",null,"","",null,"","",null,null,null,null,"","",null,3]
["",null,null,"00:00:00",null,"","",null,"","",null,null,null,null,"","",null,3]
["",null,null,"00:00:00",null,"","",null,"","",null,null,null,null,"","",null,3]
["",null,null,"00:00:00",null,"","",null,"","",null,null,null,null,"","",null,3]
["",null,null,"00:00:00",null,"","",null,"","",null,null,null,null,"","",null,3]
["",null,null,"00:00:00",null,"","",null,"","",null,null,null,null,"","",null,3]
["",null,null,"00:00:00",null,"","",null,"","",null,null,null,null,"","",null,3]
["",null,null,"00:00:00",null,"","",null,"","",null,null,null,null,"","",null,3]
["",null,null,"00:00:00",null,"","",null,"","",null,null,null,null,"","",null,3]
["",null,null,"00:00:00",null,"","",null,"","",null,null,null,null,"","",null,3]
["",null,null,"00:00:00",null,"","",null,"","",null,null,null,null,"","",null,3]
["",null,null,"00:00:00",null,"","",null,"","",null,null,null,null,"","",null,3]
["",null,null,"00:00:00",null,"","",null,"","",null,null,null,null,"","",null,3]
["",null,null,"00:00:00",null,"","",null,"","",null,null,null,null,"","",null,3]
["",null,null,"00:00:00",null,"","",null,"","",null,null,null,null,"","",null,3]
["",null,null,"00:00:00",null,"","",null,"","",null,null,null,null,"","",null,3]
["",null,null,"00:00:00",null,"","",null,"","",null,null,null,null,"","",null,3]
["",null,null,"00:00:00",null,"","",null,"","",null,null,null,null,"","",null,3]
["",null,null,"00:00:00",null,"","",null,"","",null,null,null,null,"","",null,3]
["",null,null,"00:00:00",null,"","",null,"","",null,null,null,null,"","",null,3]
["",null,null,"00:00:00",null,"","",null,"","",null,null,null,null,"","",null,3]
["",null,null,"00:00:00",null,"","",null,"","",null,null,null,null,"","",null,3]
["",null,null,"00:00:00",null,"","",null,"","",null,null,null,null,"","",null,3]
["",null,null,"00:00:00",null,"","",null,"","",null,null,null,null,"","",null,3]
["",null,null,"00:00:00",null,"","",null,"","",null,null,null,null,"","",null,3]
["",null,null,"00:00:00",null,"","",null,"","",null,null,null,null,"","",null,3]
["",null,null,"00:00:00",null,"","",null,"","",null,null,null,null,"","",null,3]
["",null,null,"00:00:00",null,"","",null,"","",null,null,null,null,"","",null,3]
["",null,null,"00:00:00",null,"","",null,"","",null,null,null,null,"","",null,3]
["",null,null,"00:00:00",null,"","",null,"","",null,null,null,null,"","",null,3]
["",null,null,"00:00:00",null,"","",null,"","",null,null,null,null,"","",null,3]
["",null,null,"00:00:00",null,"","",null,"","",null,null,null,null,"","",null,3]
["",null,null,"00:00:00",null,"","",null,"","",null,null,null,null,"","",null,3]
["",null,null,"00:00:00",null,"","",null,"","",null,null,null,null,"","",null,3]
["",null,null,"00:00:00",null,"","",null,"","",null,null,null,null,"","",null,3]
["",null,null,"00:00:00",null,"","",null,"","",null,null,null,null,"","",null,3]
["",null,null,"00:00:00",null,"","",null,"","",null,null,null,null,"","",null,3]
["",null,null,"00:00:00",null,"","",null,"","",null,null,null,null,"","",null,3]
["",null,null,"00:00:00",null,"","",null,"","",null,null,null,null,"","",null,3]
["",null,null,"00:00:00",null,"","",null,"","",null,null,null,null,"","",null,3]
["",null,null,"00:00:00",null,"","",null,"","",null,null,null,null,"","",null,3]
["",null,null,"00:00:00",null,"","",null,"","",null,null,null,null,"","",null,3]
["",null,null,"00:00:00",null,"","",null,"","",null,null,null,null,"","",null,3]
["",null,null,"00:00:00",null,"","",null,"","",null,null,null,null,"","",null,3]
["",null,null,"00:00:00",null,"","",null,"","",null,null,null,null,"","",null,3]
["",null,null,"00:00:00",null,"","",null,"","",null,null,null,null,"","",null,3]
["",null,null,"00:00:00",null,"","",null,"","",null,null,null,null,"","",null,3]
["",null,null,"00:00:00",null,"","",null,"","",null,null,null,null,"","",null,3]
["",null,null,"00:00:00",null,"","",null,"","",null,null,null,null,"","",null,3]
["",null,null,"00:00:00",null,"","",null,"","",null,null,null,null,"","",null,3]
["",null,null,"00:00:00",null,"","",null,"","",null,null,null,null,"","",null,3]
["",null,null,"00:00:00",null,"","",null,"","",null,null,null,null,"","",null,3]
["",null,null,"00:00:00",null,"","",null,"","",null,null,null,null,"","",null,3]
["",null,null,"00:00:00",null,"","",null,"","",null,null,null,null,"","",null,3]
["",null,null,"00:00:00",null,"","",null,"","",null,null,null,null,"","",null,3]
["",null,null,"00:00:00",null,"","",null,"","",null,null,null,null,"","",null,3]
[{"$f":"IF(E836=\"\",\"\",IF(A836=\"\",TODAY(),A836))","v":""},null,null,{"$f":"C836-B836+IF(B836>C836,1)","v":"00:00:00"},null,{"$f":"IFERROR(VLOOKUP(E836,$AJ$2:$AL$3155,2,FALSE),\"\")","v":""},{"$f":"IFERROR(VLOOKUP(E836,$AJ$2:$AL$3155,3,FALSE),\"\")","v":""},null,{"$f":"IFERROR(SUM(G836/7),\"\")","v":""},{"$f":"IFERROR(SUM(N836/C836),\"\")","v":""},null,null,null,null,{"$f":"IFERROR(ROUND(SUM(1000/K836),2),\"\")","v":""},{"$f":"IFERROR(ROUND(SUM(N836*O836),2),\"\")","v":""},null,3]
["",null,null,"00:00:00",null,"","",null,"","",null,null,null,null,"","",null,3]
["",null,null,"00:00:00",null,"","",null,"","",null,null,null,null,"","",null,3]
["",null,null,"00:00:00",null,"","",null,"","",null,null,null,null,"","",null,3]
["",null,null,"00:00:00",null,"","",null,"","",null,null,null,null,"","",null,3]
["",null,null,"00:00:00",null,"","",null,"","",null,null,null,null,"","",null,3]
["",null,null,"00:00:00",null,"","",null,"","",null,null,null,null,"","",null,3]
["",null,null,"00:00:00",null,"","",null,"","",null,null,null,null,"","",null,3]
["",null,null,"00:00:00",null,"","",null,"","",null,null,null,null,"","",null,3]
["",null,null,"00:00:00",null,"","",null,"","",null,null,null,null,"","",null,3]
["",null,null,"00:00:00",null,"","",null,"","",null,null,null,null,"","",null,3]
["",null,null,"00:00:00",null,"","",null,"","",null,null,null,null,"","",null,3]
["",null,null,"00:00:00",null,"","",null,"","",null,null,null,null,"","",null,3]
["",null,null,"00:00:00",null,"","",null,"","",null,null,null,null,"","",null,3]
["",null,null,"00:00:00",null,"","",null,"","",null,null,null,null,"","",null,3]
["",null,null,"00:00:00",null,"","",null,"","",null,null,null,null,"","",null,3]
["",null,null,"00:00:00",null,"","",null,"","",null,null,null,null,"","",null,3]
["",null,null,"00:00:00",null,"","",null,"","",null,null,null,null,"","",null,3]
["",null,null,"00:00:00",null,"","",null,"","",null,null,null,null,"","",null,3]
["",null,null,"00:00:00",null,"","",null,"","",null,null,null,null,"","",null,3]
["",null,null,"00:00:00",null,"","",null,"","",null,null,null,null,"","",null,3]
["",null,null,"00:00:00",null,"","",null,"","",null,null,null,null,"","",null,3]
["",null,null,"00:00:00",null,"","",null,"","",null,null,null,null,"","",null,3]
["",null,null,"00:00:00",null,"","",null,"","",null,null,null,null,"","",null,3]
["",null,null,"00:00:00",null,"","",null,"","",null,null,null,null,"","",null,3]
["",null,null,"00:00:00",null,"","",null,"","",null,null,null,null,"","",null,3]
["",null,null,"00:00:00",null,"","",null,"","",null,null,null,null,"","",null,3]
["",null,null,"00:00:00",null,"","",null,"","",null,null,null,null,"","",null,3]
["",null,null,"00:00:00",null,"","",null,"","",null,null,null,null,"","",null,3]
["",null,null,"00:00:00",null,"","",null,"","",null,null,null,null,"","",null,3]
["",null,null,"00:00:00",null,"","",null,"","",null,null,null,null,"","",null,3]
["",null,null,"00:00:00",null,"","",null,"","",null,null,null,null,"","",null,3]
["",null,null,"00:00:00",null,"","",null,"","",null,null,null,null,"","",null,3]
["",null,null,"00:00:00",null,"","",null,"","",null,null,null,null,"","",null,3]
["",null,null,"00:00:00",null,"","",null,"","",null,null,null,null,"","",null,3]
["",null,null,"00:00:00",null,"","",null,"","",null,null,null,null,"","",null,3]
["",null,null,"00:00:00",null,"","",null,"","",null,null,null,null,"","",null,3]
["",null,null,"00:00:00",null,"","",null,"","",null,null,null,null,"","",null,3]
["",null,null,"00:00:00",null,"","",null,"","",null,null,null,null,"","",null,3]
["",null,null,"00:00:00",null,"","",null,"","",null,null,null,null,"","",null,3]
["",null,null,"00:00:00",null,"","",null,"","",null,null,null,null,"","",null,3]
["",null,null,"00:00:00",null,"","",null,"","",null,null,null,null,"","",null,3]
["",null,null,"00:00:00",null,"","",null,"","",null,null,null,null,"","",null,3]
["",null,null,"00:00:00",null,"","",null,"","",null,null,null,null,"","",null,3]
["",null,null,"00:00:00",null,"","",null,"","",null,null,null,null,"","",null,3]
["",null,null,"00:00:00",null,"","",null,"","",null,null,null,null,"","",null,3]
["",null,null,"00:00:00",null,"","",null,"","",null,null,null,null,"","",null,3]
["",null,null,"00:00:00",null,"","",null,"","",null,null,null,null,"","",null,3]
["",null,null,"00:00:00",null,"","",null,"","",null,null,null,null,"","",null,3]
["",null,null,"00:00:00",null,"","",null,"","",null,null,null,null,"","",null,3]
["",null,null,"00:00:00",null,"","",null,"","",null,null,null,null,"","",null,3]
["",null,null,"00:00:00",null,"","",null,"","",null,null,null,null,"","",null,3]
["",null,null,"00:00:00",null,"","",null,"","",null,null,null,null,"","",null,3]
["",null,null,"00:00:00",null,"","",null,"","",null,null,null,null,"","",null,3]
["",null,null,"00:00:00",null,"","",null,"","",null,null,null,null,"","",null,3]
["",null,null,"00:00:00",null,"","",null,"","",null,null,null,null,"","",null,3]
["",null,null,"00:00:00",null,"","",null,"","",null,null,null,null,"","",null,3]
["",null,null,"00:00:00",null,"","",null,"","",null,null,null,null,"","",null,3]
["",null,null,"00:00:00",null,"","",null,"","",null,null,null,null,"","",null,3]
["",null,null,"00:00:00",null,"","",null,"","",null,null,null,null,"","",null,3]
["",null,null,"00:00:00",null,"","",null,"","",null,null,null,null,"","",null,3]
["",null,null,"00:00:00",null,"","",null,"","",null,null,null,null,"","",null,3]
["",null,null,"00:00:00",null,"","",null,"","",null,null,null,null,"","",null,3]
["",null,null,"00:00:00",null,"","",null,"","",null,null,null,null,"","",null,3]
[{"$f":"IF(E900=\"\",\"\",IF(A900=\"\",TODAY(),A900))","v":""},null,null,{"$f":"C900-B900+IF(B900>C900,1)","v":"00:00:00"},null,{"$f":"IFERROR(VLOOKUP(E900,$AJ$2:$AL$3155,2,FALSE),\"\")","v":""},{"$f":"IFERROR(VLOOKUP(E900,$AJ$2:$AL$3155,3,FALSE),\"\")","v":""},null,{"$f":"IFERROR(SUM(G900/7),\"\")","v":""},{"$f":"IFERROR(SUM(N900/C900),\"\")","v":""},null,null,null,null,{"$f":"IFERROR(ROUND(SUM(1000/K900),2),\"\")","v":""},{"$f":"IFERROR(ROUND(SUM(N900*O900),2),\"\")","v":""},null,3]
["",null,null,"00:00:00",null,"","",null,"","",null,null,null,null,"","",null,3]
["",null,null,"00:00:00",null,"","",null,"","",null,null,null,null,"","",null,3]
["",null,null,"00:00:00",null,"","",null,"","",null,null,null,null,"","",null,3]
["",null,null,"00:00:00",null,"","",null,"","",null,null,null,null,"","",null,3]
["",null,null,"00:00:00",null,"","",null,"","",null,null,null,null,"","",null,3]
["",null,null,"00:00:00",null,"","",null,"","",null,null,null,null,"","",null,3]
["",null,null,"00:00:00",null,"","",null,"","",null,null,null,null,"","",null,3]
["",null,null,"00:00:00",null,"","",null,"","",null,null,null,null,"","",null,3]
["",null,null,"00:00:00",null,"","",null,"","",null,null,null,null,"","",null,3]
["",null,null,"00:00:00",null,"","",null,"","",null,null,null,null,"","",null,3]
["",null,null,"00:00:00",null,"","",null,"","",null,null,null,null,"","",null,3]
["",null,null,"00:00:00",null,"","",null,"","",null,null,null,null,"","",null,3]
["",null,null,"00:00:00",null,"","",null,"","",null,null,null,null,"","",null,3]
["",null,null,"00:00:00",null,"","",null,"","",null,null,null,null,"","",null,3]
["",null,null,"00:00:00",null,"","",null,"","",null,null,null,null,"","",null,3]
["",null,null,"00:00:00",null,"","",null,"","",null,null,null,null,"","",null,3]
["",null,null,"00:00:00",null,"","",null,"","",null,null,null,null,"","",null,3]
["",null,null,"00:00:00",null,"","",null,"","",null,null,null,null,"","",null,3]
["",null,null,"00:00:00",null,"","",null,"","",null,null,null,null,"","",null,3]
["",null,null,"00:00:00",null,"","",null,"","",null,null,null,null,"","",null,3]
["",null,null,"00:00:00",null,"","",null,"","",null,null,null,null,"","",null,3]
["",null,null,"00:00:00",null,"","",null,"","",null,null,null,null,"","",null,3]
["",null,null,"00:00:00",null,"","",null,"","",null,null,null,null,"","",null,3]
["",null,null,"00:00:00",null,"","",null,"","",null,null,null,null,"","",null,3]
["",null,null,"00:00:00",null,"","",null,"","",null,null,null,null,"","",null,3]
["",null,null,"00:00:00",null,"","",null,"","",null,null,null,null,"","",null,3]
["",null,null,"00:00:00",null,"","",null,"","",null,null,null,null,"","",null,3]
["",null,null,"00:00:00",null,"","",null,"","",null,null,null,null,"","",null,3]
["",null,null,"00:00:00",null,"","",null,"","",null,null,null,null,"","",null,3]
["",null,null,"00:00:00",null,"","",null,"","",null,null,null,null,"","",null,3]
["",null,null,"00:00:00",null,"","",null,"","",null,null,null,null,"","",null,3]
["",null,null,"00:00:00",null,"","",null,"","",null,null,null,null,"","",null,3]
["",null,null,"00:00:00",null,"","",null,"","",null,null,null,null,"","",null,3]
["",null,null,"00:00:00",null,"","",null,"","",null,null,null,null,"","",null,3]
["",null,null,"00:00:00",null,"","",null,"","",null,null,null,null,"","",null,3]
["",null,null,"00:00:00",null,"","",null,"","",null,null,null,null,"","",null,3]
["",null,null,"00:00:00",null,"","",null,"","",null,null,null,null,"","",null,3]
["",null,null,"00:00:00",null,"","",null,"","",null,null,null,null,"","",null,3]
["",null,null,"00:00:00",null,"","",null,"","",null,null,null,null,"","",null,3]
["",null,null,"00:00:00",null,"","",null,"","",null,null,null,null,"","",null,3]
["",null,null,"00:00:00",null,"","",null,"","",null,null,null,null,"","",null,3]
["",null,null,"00:00:00",null,"","",null,"","",null,null,null,null,"","",null,3]
["",null,null,"00:00:00",null,"","",null,"","",null,null,null,null,"","",null,3]
["",null,null,"00:00:00",null,"","",null,"","",null,null,null,null,"","",null,3]
["",null,null,"00:00:00",null,"","",null,"","",null,null,null,null,"","",null,3]
["",null,null,"00:00:00",null,"","",null,"","",null,null,null,null,"","",null,3]
["",null,null,"00:00:00",null,"","",null,"","",null,null,null,null,"","",null,3]
["",null,null,"00:00:00",null,"","",null,"","",null,null,null,null,"","",null,3]
["",null,null,"00:00:00",null,"","",null,"","",null,null,null,null,"","",null,3]
["",null,null,"00:00:00",null,"","",null,"","",null,null,null,null,"","",null,3]
["",null,null,"00:00:00",null,"","",null,"","",null,null,null,null,"","",null,3]
["",null,null,"00:00:00",null,"","",null,"","",null,null,null,null,"","",null,3]
["",null,null,"00:00:00",null,"","",null,"","",null,null,null,null,"","",null,3]
["",null,null,"00:00:00",null,"","",null,"","",null,null,null,null,"","",null,3]
["",null,null,"00:00:00",null,"","",null,"","",null,null,null,null,"","",null,3]
["",null,null,"00:00:00",null,"","",null,"","",null,null,null,null,"","",null,3]
["",null,null,"00:00:00",null,"","",null,"","",null,null,null,null,"","",null,3]
["",null,null,"00:00:00",null,"","",null,"","",null,null,null,null,"","",null,3]
["",null,null,"00:00:00",null,"","",null,"","",null,null,null,null,"","",null,3]
["",null,null,"00:00:00",null,"","",null,"","",null,null,null,null,"","",null,3]
["",null,null,"00:00:00",null,"","",null,"","",null,null,null,null,"","",null,3]
["",null,null,"00:00:00",null,"","",null,"","",null,null,null,null,"","",null,3]
["",null,null,"00:00:00",null,"","",null,"","",null,null,null,null,"","",null,3]
[{"$f":"IF(E964=\"\",\"\",IF(A964=\"\",TODAY(),A964))","v":""},null,null,{"$f":"C964-B964+IF(B964>C964,1)","v":"00:00:00"},null,{"$f":"IFERROR(VLOOKUP(E964,$AJ$2:$AL$3155,2,FALSE),\"\")","v":""},{"$f":"IFERROR(VLOOKUP(E964,$AJ$2:$AL$3155,3,FALSE),\"\")","v":""},null,{"$f":"IFERROR(SUM(G964/7),\"\")","v":""},{"$f":"IFERROR(SUM(N964/C964),\"\")","v":""},null,null,null,null,{"$f":"IFERROR(ROUND(SUM(1000/K964),2),\"\")","v":""},{"$f":"IFERROR(ROUND(SUM(N964*O964),2),\"\")","v":""},null,3]
["",null,null,"00:00:00",null,"","",null,"","",null,null,null,null,"","",null,3]
["",null,null,"00:00:00",null,"","",null,"","",null,null,null,null,"","",null,3]
["",null,null,"00:00:00",null,"","",null,"","",null,null,null,null,"","",null,3]
["",null,null,"00:00:00",null,"","",null,"","",null,null,null,null,"","",null,3]
["",null,null,"00:00:00",null,"","",null,"","",null,null,null,null,"","",null,3]
["",null,null,"00:00:00",null,"","",null,"","",null,null,null,null,"","",null,3]
["",null,null,"00:00:00",null,"","",null,"","",null,null,null,null,"","",null,3]
["",null,null,"00:00:00",null,"","",null,"","",null,null,null,null,"","",null,3]
["",null,null,"00:00:00",null,"","",null,"","",null,null,null,null,"","",null,3]
["",null,null,"00:00:00",null,"","",null,"","",null,null,null,null,"","",null,3]
["",null,null,"00:00:00",null,"","",null,"","",null,null,null,null,"","",null,3]
["",null,null,"00:00:00",null,"","",null,"","",null,null,null,null,"","",null,3]
["",null,null,"00:00:00",null,"","",null,"","",null,null,null,null,"","",null,3]
["",null,null,"00:00:00",null,"","",null,"","",null,null,null,null,"","",null,3]
["",null,null,"00:00:00",null,"","",null,"","",null,null,null,null,"","",null,3]
["",null,null,"00:00:00",null,"","",null,"","",null,null,null,null,"","",null,3]
["",null,null,"00:00:00",null,"","",null,"","",null,null,null,null,"","",null,3]
["",null,null,"00:00:00",null,"","",null,"","",null,null,null,null,"","",null,3]
["",null,null,"00:00:00",null,"","",null,"","",null,null,null,null,"","",null,3]
["",null,null,"00:00:00",null,"","",null,"","",null,null,null,null,"","",null,3]
["",null,null,"00:00:00",null,"","",null,"","",null,null,null,null,"","",null,3]
["",null,null,"00:00:00",null,"","",null,"","",null,null,null,null,"","",null,3]
["",null,null,"00:00:00",null,"","",null,"","",null,null,null,null,"","",null,3]
["",null,null,"00:00:00",null,"","",null,"","",null,null,null,null,"","",null,3]
["",null,null,"00:00:00",null,"","",null,"","",null,null,null,null,"","",null,3]
["",null,null,"00:00:00",null,"","",null,"","",null,null,null,null,"","",null,3]
["",null,null,"00:00:00",null,"","",null,"","",null,null,null,null,"","",null,3]
["",null,null,"00:00:00",null,"","",null,"","",null,null,null,null,"","",null,3]
["",null,null,"00:00:00",null,"","",null,"","",null,null,null,null,"","",null,3]
["",null,null,"00:00:00",null,"","",null,"","",null,null,null,null,"","",null,3]
["",null,null,"00:00:00",null,"","",null,"","",null,null,null,null,"","",null,3]
["",null,null,"00:00:00",null,"","",null,"","",null,null,null,null,"","",null,3]
["",null,null,"00:00:00",null,"","",null,"","",null,null,null,null,"","",null,3]
["",null,null,"00:00:00",null,"","",null,"","",null,null,null,null,"","",null,3]
["",null,null,"00:00:00",null,"","",null,"","",null,null,null,null,"","",null,3]
["",null,null,"00:00:00",null,"","",null,"","",null,null,null,null,"","",null,3]
["",null,null,"00:00:00",null,"","",null,"","",null,null,null,null,"","",null,3]
["",null,null,"00:00:00",null,"","",null,"","",null,null,null,null,"","",null,3]
["",null,null,"00:00:00",null,"","",null,"","",null,null,null,null,"","",null,3]
["",null,null,"00:00:00",null,"","",null,"","",null,null,null,null,"","",null,3]
["",null,null,"00:00:00",null,"","",null,"","",null,null,null,null,"","",null,3]
["",null,null,"00:00:00",null,"","",null,"","",null,null,null,null,"","",null,3]
["",null,null,"00:00:00",null,"","",null,"","",null,null,null,null,"","",null,3]
["",null,null,"00:00:00",null,"","",null,"","",null,null,null,null,"","",null,3]
["",null,null,"00:00:00",null,"","",null,"","",null,null,null,null,"","",null,3]
["",null,null,"00:00:00",null,"","",null,"","",null,null,null,null,"","",null,3]
["",null,null,"00:00:00",null,"","",null,"","",null,null,null,null,"","",null,3]
["",null,null,"00:00:00",null,"","",null,"","",null,null,null,null,"","",null,3]
["",null,null,"00:00:00",null,"","",null,"","",null,null,null,null,"","",null,3]
["",null,null,"00:00:00",null,"","",null,"","",null,null,null,null,"","",null,3]
["",null,null,"00:00:00",null,"","",null,"","",null,null,null,null,"","",null,3]
["",null,null,"00:00:00",null,"","",null,"","",null,null,null,null,"","",null,3]
["",null,null,"00:00:00",null,"","",null,"","",null,null,null,null,"","",null,3]
["",null,null,"00:00:00",null,"","",null,"","",null,null,null,null,"","",null,3]
["",null,null,"00:00:00",null,"","",null,"","",null,null,null,null,"","",null,3]
["",null,null,"00:00:00",null,"","",null,"","",null,null,null,null,"","",null,3]
["",null,null,"00:00:00",null,"","",null,"","",null,null,null,null,"","",null,3]
["",null,null,"00:00:00",null,"","",null,"","",null,null,null,null,"","",null,3]
["",null,null,"00:00:00",null,"","",null,"","",null,null,null,null,"","",null,3]
["",null,null,"00:00:00",null,"","",null,"","",null,null,null,null,"","",null,3]
["",null,null,"00:00:00",null,"","",null,"","",null,null,null,null,"","",null,3]
["",null,null,"00:00:00",null,"","",null,"","",null,null,null,null,"","",null,3]
["",null,null,"00:00:00",null,"","",null,"","",null,null,null,null,"","",null,3]
[{"$f":"IF(E1028=\"\",\"\",IF(A1028=\"\",TODAY(),A1028))","v":""},null,null,{"$f":"C1028-B1028+IF(B1028>C1028,1)","v":"00:00:00"},null,{"$f":"IFERROR(VLOOKUP(E1028,$AJ$2:$AL$3155,2,FALSE),\"\")","v":""},{"$f":"IFERROR(VLOOKUP(E1028,$AJ$2:$AL$3155,3,FALSE),\"\")","v":""},null,{"$f":"IFERROR(SUM(G1028/7),\"\")","v":""},{"$f":"IFERROR(SUM(N1028/C1028),\"\")","v":""},null,null,null,null,{"$f":"IFERROR(ROUND(SUM(1000/K1028),2),\"\")","v":""},{"$f":"IFERROR(ROUND(SUM(N1028*O1028),2),\"\")","v":""},null,3]
["",null,null,"00:00:00",null,"","",null,"","",null,null,null,null,"","",null,3]
["",null,null,"00:00:00",null,"","",null,"","",null,null,null,null,"","",null,3]
["",null,null,"00:00:00",null,"","",null,"","",null,null,null,null,"","",null,3]
["",null,null,"00:00:00",null,"","",null,"","",null,null,null,null,"","",null,3]
["",null,null,"00:00:00",null,"","",null,"","",null,null,null,null,"","",null,3]
["",null,null,"00:00:00",null,"","",null,"","",null,null,null,null,"","",null,3]
["",null,null,"00:00:00",null,"","",null,"","",null,null,null,null,"","",null,3]
["",null,null,"00:00:00",null,"","",null,"","",null,null,null,null,"","",null,3]
["",null,null,"00:00:00",null,"","",null,"","",null,null,null,null,"","",null,3]
["",null,null,"00:00:00",null,"","",null,"","",null,null,null,null,"","",null,3]
["",null,null,"00:00:00",null,"","",null,"","",null,null,null,null,"","",null,3]
["",null,null,"00:00:00",null,"","",null,"","",null,null,null,null,"","",null,3]
["",null,null,"00:00:00",null,"","",null,"","",null,null,null,null,"","",null,3]
["",null,null,"00:00:00",null,"","",null,"","",null,null,null,null,"","",null,3]
["",null,null,"00:00:00",null,"","",null,"","",null,null,null,null,"","",null,3]
["",null,null,"00:00:00",null,"","",null,"","",null,null,null,null,"","",null,3]
["",null,null,"00:00:00",null,"","",null,"","",null,null,null,null,"","",null,3]
["",null,null,"00:00:00",null,"","",null,"","",null,null,null,null,"","",null,3]
["",null,null,"00:00:00",null,"","",null,"","",null,null,null,null,"","",null,3]
["",null,null,"00:00:00",null,"","",null,"","",null,null,null,null,"","",null,3]
["",null,null,"00:00:00",null,"","",null,"","",null,null,null,null,"","",null,3]
["",null,null,"00:00:00",null,"","",null,"","",null,null,null,null,"","",null,3]
["",null,null,"00:00:00",null,"","",null,"","",null,null,null,null,"","",null,3]
["",null,null,"00:00:00",null,"","",null,"","",null,null,null,null,"","",null,3]
["",null,null,"00:00:00",null,"","",null,"","",null,null,null,null,"","",null,3]
["",null,null,"00:00:00",null,"","",null,"","",null,null,null,null,"","",null,3]
["",null,null,"00:00:00",null,"","",null,"","",null,null,null,null,"","",null,3]
["",null,null,"00:00:00",null,"","",null,"","",null,null,null,null,"","",null,3]
["",null,null,"00:00:00",null,"","",null,"","",null,null,null,null,"","",null,3]
["",null,null,"00:00:00",null,"","",null,"","",null,null,null,null,"","",null,3]
["",null,null,"00:00:00",null,"","",null,"","",null,null,null,null,"","",null,3]
["",null,null,"00:00:00",null,"","",null,"","",null,null,null,null,"","",null,3]
["",null,null,"00:00:00",null,"","",null,"","",null,null,null,null,"","",null,3]
["",null,null,"00:00:00",null,"","",null,"","",null,null,null,null,"","",null,3]
["",null,null,"00:00:00",null,"","",null,"","",null,null,null,null,"","",null,3]
["",null,null,"00:00:00",null,"","",null,"","",null,null,null,null,"","",null,3]
["",null,null,"00:00:00",null,"","",null,"","",null,null,null,null,"","",null,3]
["",null,null,"00:00:00",null,"","",null,"","",null,null,null,null,"","",null,3]
["",null,null,"00:00:00",null,"","",null,"","",null,null,null,null,"","",null,3]
["",null,null,"00:00:00",null,"","",null,"","",null,null,null,null,"","",null,3]
["",null,null,"00:00:00",null,"","",null,"","",null,null,null,null,"","",null,3]
["",null,null,"00:00:00",null,"","",null,"","",null,null,null,null,"","",null,3]
["",null,null,"00:00:00",null,"","",null,"","",null,null,null,null,"","",null,3]
["",null,null,"00:00:00",null,"","",null,"","",null,null,null,null,"","",null,3]
["",null,null,"00:00:00",null,"","",null,"","",null,null,null,null,"","",null,3]
["",null,null,"00:00:00",null,"","",null,"","",null,null,null,null,"","",null,3]
["",null,null,"00:00:00",null,"","",null,"","",null,null,null,null,"","",null,3]
["",null,null,"00:00:00",null,"","",null,"","",null,null,null,null,"","",null,3]
["",null,null,"00:00:00",null,"","",null,"","",null,null,null,null,"","",null,3]
["",null,null,"00:00:00",null,"","",null,"","",null,null,null,null,"","",null,3]
["",null,null,"00:00:00",null,"","",null,"","",null,null,null,null,"","",null,3]
["",null,null,"00:00:00",null,"","",null,"","",null,null,null,null,"","",null,3]
["",null,null,"00:00:00",null,"","",null,"","",null,null,null,null,"","",null,3]
["",null,null,"00:00:00",null,"","",null,"","",null,null,null,null,"","",null,3]
["",null,null,"00:00:00",null,"","",null,"","",null,null,null,null,"","",null,3]
["",null,null,"00:00:00",null,"","",null,"","",null,null,null,null,"","",null,3]
["",null,null,"00:00:00",null,"","",null,"","",null,null,null,null,"","",null,3]
["",null,null,"00:00:00",null,"","",null,"","",null,null,null,null,"","",null,3]
["",null,null,"00:00:00",null,"","",null,"","",null,null,null,null,"","",null,3]
["",null,null,"00:00:00",null,"","",null,"","",null,null,null,null,"","",null,3]
["",null,null,"00:00:00",null,"","",null,"","",null,null,null,null,"","",null,3]
["",null,null,"00:00:00",null,"","",null,"","",null,null,null,null,"","",null,3]
["",null,null,"00:00:00",null,"","",null,"","",null,null,null,null,"","",null,3]
[{"$f":"IF(E1092=\"\",\"\",IF(A1092=\"\",TODAY(),A1092))","v":""},null,null,{"$f":"C1092-B1092+IF(B1092>C1092,1)","v":"00:00:00"},null,{"$f":"IFERROR(VLOOKUP(E1092,$AJ$2:$AL$3155,2,FALSE),\"\")","v":""},{"$f":"IFERROR(VLOOKUP(E1092,$AJ$2:$AL$3155,3,FALSE),\"\")","v":""},null,{"$f":"IFERROR(SUM(G1092/7),\"\")","v":""},{"$f":"IFERROR(SUM(N1092/C1092),\"\")","v":""},null,null,null,null,{"$f":"IFERROR(ROUND(SUM(1000/K1092),2),\"\")","v":""},{"$f":"IFERROR(ROUND(SUM(N1092*O1092),2),\"\")","v":""},null,3]
["",null,null,"00:00:00",null,"","",null,"","",null,null,null,null,"","",null,3]
["",null,null,"00:00:00",null,"","",null,"","",null,null,null,null,"","",null,3]
["",null,null,"00:00:00",null,"","",null,"","",null,null,null,null,"","",null,3]
["",null,null,"00:00:00",null,"","",null,"","",null,null,null,null,"","",null,3]
["",null,null,"00:00:00",null,"","",null,"","",null,null,null,null,"","",null,3]
["",null,null,"00:00:00",null,"","",null,"","",null,null,null,null,"","",null,3]
["",null,null,"00:00:00",null,"","",null,"","",null,null,null,null,"","",null,3]
["",null,null,"00:00:00",null,"","",null,"","",null,null,null,null,"","",null,3]
["",null,null,"00:00:00",null,"","",null,"","",null,null,null,null,"","",null,3]
["",null,null,"00:00:00",null,"","",null,"","",null,null,null,null,"","",null,3]
["",null,null,"00:00:00",null,"","",null,"","",null,null,null,null,"","",null,3]
["",null,null,"00:00:00",null,"","",null,"","",null,null,null,null,"","",null,3]
["",null,null,"00:00:00",null,"","",null,"","",null,null,null,null,"","",null,3]
["",null,null,"00:00:00",null,"","",null,"","",null,null,null,null,"","",null,3]
["",null,null,"00:00:00",null,"","",null,"","",null,null,null,null,"","",null,3]
["",null,null,"00:00:00",null,"","",null,"","",null,null,null,null,"","",null,3]
["",null,null,"00:00:00",null,"","",null,"","",null,null,null,null,"","",null,3]
["",null,null,"00:00:00",null,"","",null,"","",null,null,null,null,"","",null,3]
["",null,null,"00:00:00",null,"","",null,"","",null,null,null,null,"","",null,3]
["",null,null,"00:00:00",null,"","",null,"","",null,null,null,null,"","",null,3]
["",null,null,"00:00:00",null,"","",null,"","",null,null,null,null,"","",null,3]
["",null,null,"00:00:00",null,"","",null,"","",null,null,null,null,"","",null,3]
["",null,null,"00:00:00",null,"","",null,"","",null,null,null,null,"","",null,3]
["",null,null,"00:00:00",null,"","",null,"","",null,null,null,null,"","",null,3]
["",null,null,"00:00:00",null,"","",null,"","",null,null,null,null,"","",null,3]
["",null,null,"00:00:00",null,"","",null,"","",null,null,null,null,"","",null,3]
["",null,null,"00:00:00",null,"","",null,"","",null,null,null,null,"","",null,3]
["",null,null,"00:00:00",null,"","",null,"","",null,null,null,null,"","",null,3]
["",null,null,"00:00:00",null,"","",null,"","",null,null,null,null,"","",null,3]
["",null,null,"00:00:00",null,"","",null,"","",null,null,null,null,"","",null,3]
["",null,null,"00:00:00",null,"","",null,"","",null,null,null,null,"","",null,3]
["",null,null,"00:00:00",null,"","",null,"","",null,null,null,null,"","",null,3]
["",null,null,"00:00:00",null,"","",null,"","",null,null,null,null,"","",null,3]
["",null,null,"00:00:00",null,"","",null,"","",null,null,null,null,"","",null,3]
["",null,null,"00:00:00",null,"","",null,"","",null,null,null,null,"","",null,3]
["",null,null,"00:00:00",null,"","",null,"","",null,null,null,null,"","",null,3]
["",null,null,"00:00:00",null,"","",null,"","",null,null,null,null,"","",null,3]
["",null,null,"00:00:00",null,"","",null,"","",null,null,null,null,"","",null,3]
["",null,null,"00:00:00",null,"","",null,"","",null,null,null,null,"","",null,3]
["",null,null,"00:00:00",null,"","",null,"","",null,null,null,null,"","",null,3]
["",null,null,"00:00:00",null,"","",null,"","",null,null,null,null,"","",null,3]
["",null,null,"00:00:00",null,"","",null,"","",null,null,null,null,"","",null,3]
["",null,null,"00:00:00",null,"","",null,"","",null,null,null,null,"","",null,3]
["",null,null,"00:00:00",null,"","",null,"","",null,null,null,null,"","",null,3]
["",null,null,"00:00:00",null,"","",null,"","",null,null,null,null,"","",null,3]
["",null,null,"00:00:00",null,"","",null,"","",null,null,null,null,"","",null,3]
["",null,null,"00:00:00",null,"","",null,"","",null,null,null,null,"","",null,3]
["",null,null,"00:00:00",null,"","",null,"","",null,null,null,null,"","",null,3]
["",null,null,"00:00:00",null,"","",null,"","",null,null,null,null,"","",null,3]
["",null,null,"00:00:00",null,"","",null,"","",null,null,null,null,"","",null,3]
["",null,null,"00:00:00",null,"","",null,"","",null,null,null,null,"","",null,3]
["",null,null,"00:00:00",null,"","",null,"","",null,null,null,null,"","",null,3]
["",null,null,"00:00:00",null,"","",null,"","",null,null,null,null,"","",null,3]
["",null,null,"00:00:00",null,"","",null,"","",null,null,null,null,"","",null,3]
["",null,null,"00:00:00",null,"","",null,"","",null,null,null,null,"","",null,3]
["",null,null,"00:00:00",null,"","",null,"","",null,null,null,null,"","",null,3]
["",null,null,"00:00:00",null,"","",null,"","",null,null,null,null,"","",null,3]
["",null,null,"00:00:00",null,"","",null,"","",null,null,null,null,"","",null,3]
["",null,null,"00:00:00",null,"","",null,"","",null,null,null,null,"","",null,3]
["",null,null,"00:00:00",null,"","",null,"","",null,null,null,null,"","",null,3]
["",null,null,"00:00:00",null,"","",null,"","",null,null,null,null,"","",null,3]
["",null,null,"00:00:00",null,"","",null,"","",null,null,null,null,"","",null,3]
["",null,null,"00:00:00",null,"","",null,"","",null,null,null,null,"","",null,3]
[{"$f":"IF(E1156=\"\",\"\",IF(A1156=\"\",TODAY(),A1156))","v":""},null,null,{"$f":"C1156-B1156+IF(B1156>C1156,1)","v":"00:00:00"},null,{"$f":"IFERROR(VLOOKUP(E1156,$AJ$2:$AL$3155,2,FALSE),\"\")","v":""},{"$f":"IFERROR(VLOOKUP(E1156,$AJ$2:$AL$3155,3,FALSE),\"\")","v":""},null,{"$f":"IFERROR(SUM(G1156/7),\"\")","v":""},{"$f":"IFERROR(SUM(N1156/C1156),\"\")","v":""},null,null,null,null,{"$f":"IFERROR(ROUND(SUM(1000/K1156),2),\"\")","v":""},{"$f":"IFERROR(ROUND(SUM(N1156*O1156),2),\"\")","v":""},null,3]
["",null,null,"00:00:00",null,"","",null,"","",null,null,null,null,"","",null,3]
["",null,null,"00:00:00",null,"","",null,"","",null,null,null,null,"","",null,3]
["",null,null,"00:00:00",null,"","",null,"","",null,null,null,null,"","",null,3]
["",null,null,"00:00:00",null,"","",null,"","",null,null,null,null,"","",null,3]
["",null,null,"00:00:00",null,"","",null,"","",null,null,null,null,"","",null,3]
["",null,null,"00:00:00",null,"","",null,"","",null,null,null,null,"","",null,3]
["",null,null,"00:00:00",null,"","",null,"","",null,null,null,null,"","",null,3]
["",null,null,"00:00:00",null,"","",null,"","",null,null,null,null,"","",null,3]
["",null,null,"00:00:00",null,"","",null,"","",null,null,null,null,"","",null,3]
["",null,null,"00:00:00",null,"","",null,"","",null,null,null,null,"","",null,3]
["",null,null,"00:00:00",null,"","",null,"","",null,null,null,null,"","",null,3]
["",null,null,"00:00:00",null,"","",null,"","",null,null,null,null,"","",null,3]
["",null,null,"00:00:00",null,"","",null,"","",null,null,null,null,"","",null,3]
["",null,null,"00:00:00",null,"","",null,"","",null,null,null,null,"","",null,3]
["",null,null,"00:00:00",null,"","",null,"","",null,null,null,null,"","",null,3]
["",null,null,"00:00:00",null,"","",null,"","",null,null,null,null,"","",null,3]
["",null,null,"00:00:00",null,"","",null,"","",null,null,null,null,"","",null,3]
["",null,null,"00:00:00",null,"","",null,"","",null,null,null,null,"","",null,3]
["",null,null,"00:00:00",null,"","",null,"","",null,null,null,null,"","",null,3]
["",null,null,"00:00:00",null,"","",null,"","",null,null,null,null,"","",null,3]
["",null,null,"00:00:00",null,"","",null,"","",null,null,null,null,"","",null,3]
["",null,null,"00:00:00",null,"","",null,"","",null,null,null,null,"","",null,3]
["",null,null,"00:00:00",null,"","",null,"","",null,null,null,null,"","",null,3]
["",null,null,"00:00:00",null,"","",null,"","",null,null,null,null,"","",null,3]
["",null,null,"00:00:00",null,"","",null,"","",null,null,null,null,"","",null,3]
["",null,null,"00:00:00",null,"","",null,"","",null,null,null,null,"","",null,3]
["",null,null,"00:00:00",null,"","",null,"","",null,null,null,null,"","",null,3]
["",null,null,"00:00:00",null,"","",null,"","",null,null,null,null,"","",null,3]
["",null,null,"00:00:00",null,"","",null,"","",null,null,null,null,"","",null,3]
["",null,null,"00:00:00",null,"","",null,"","",null,null,null,null,"","",null,3]
["",null,null,"00:00:00",null,"","",null,"","",null,null,null,null,"","",null,3]
["",null,null,"00:00:00",null,"","",null,"","",null,null,null,null,"","",null,3]
["",null,null,"00:00:00",null,"","",null,"","",null,null,null,null,"","",null,3]
["",null,null,"00:00:00",null,"","",null,"","",null,null,null,null,"","",null,3]
["",null,null,"00:00:00",null,"","",null,"","",null,null,null,null,"","",null,3]
["",null,null,"00:00:00",null,"","",null,"","",null,null,null,null,"","",null,3]
["",null,null,"00:00:00",null,"","",null,"","",null,null,null,null,"","",null,3]
["",null,null,"00:00:00",null,"","",null,"","",null,null,null,null,"","",null,3]
["",null,null,"00:00:00",null,"","",null,"","",null,null,null,null,"","",null,3]
["",null,null,"00:00:00",null,"","",null,"","",null,null,null,null,"","",null,3]
["",null,null,"00:00:00",null,"","",null,"","",null,null,null,null,"","",null,3]
["",null,null,"00:00:00",null,"","",null,"","",null,null,null,null,"","",null,3]
["",null,null,"00:00:00",null,"","",null,"","",null,null,null,null,"","",null,3]
["",null,null,"00:00:00",null,"","",null,"","",null,null,null,null,"","",null,3]
["",null,null,"00:00:00",null,"","",null,"","",null,null,null,null,"","",null,3]
["",null,null,"00:00:00",null,"","",null,"","",null,null,null,null,"","",null,3]
["",null,null,"00:00:00",null,"","",null,"","",null,null,null,null,"","",null,3]
["",null,null,"00:00:00",null,"","",null,"","",null,null,null,null,"","",null,3]
["",null,null,"00:00:00",null,"","",null,"","",null,null,null,null,"","",null,3]
["",null,null,"00:00:00",null,"","",null,"","",null,null,null,null,"","",null,3]
["",null,null,"00:00:00",null,"","",null,"","",null,null,null,null,"","",null,3]
["",null,null,"00:00:00",null,"","",null,"","",null,null,null,null,"","",null,3]
["",null,null,"00:00:00",null,"","",null,"","",null,null,null,null,"","",null,3]
["",null,null,"00:00:00",null,"","",null,"","",null,null,null,null,"","",null,3]
["",null,null,"00:00:00",null,"","",null,"","",null,null,null,null,"","",null,3]
["",null,null,"00:00:00",null,"","",null,"","",null,null,null,null,"","",null,3]
["",null,null,"00:00:00",null,"","",null,"","",null,null,null,null,"","",null,3]
["",null,null,"00:00:00",null,"","",null,"","",null,null,null,null,"","",null,3]
["",null,null,"00:00:00",null,"","",null,"","",null,null,null,null,"","",null,3]
["",null,null,"00:00:00",null,"","",null,"","",null,null,null,null,"","",null,3]
["",null,null,"00:00:00",null,"","",null,"","",null,null,null,null,"","",null,3]
["",null,null,"00:00:00",null,"","",null,"","",null,null,null,null,"","",null,3]
["",null,null,"00:00:00",null,"","",null,"","",null,null,null,null,"","",null,3]
[{"$f":"IF(E1220=\"\",\"\",IF(A1220=\"\",TODAY(),A1220))","v":""},null,null,{"$f":"C1220-B1220+IF(B1220>C1220,1)","v":"00:00:00"},null,{"$f":"IFERROR(VLOOKUP(E1220,$AJ$2:$AL$3155,2,FALSE),\"\")","v":""},{"$f":"IFERROR(VLOOKUP(E1220,$AJ$2:$AL$3155,3,FALSE),\"\")","v":""},null,{"$f":"IFERROR(SUM(G1220/7),\"\")","v":""},{"$f":"IFERROR(SUM(N1220/C1220),\"\")","v":""},null,null,null,null,{"$f":"IFERROR(ROUND(SUM(1000/K1220),2),\"\")","v":""},{"$f":"IFERROR(ROUND(SUM(N1220*O1220),2),\"\")","v":""},null,3]
["",null,null,"00:00:00",null,"","",null,"","",null,null,null,null,"","",null,3]
["",null,null,"00:00:00",null,"","",null,"","",null,null,null,null,"","",null,3]
["",null,null,"00:00:00",null,"","",null,"","",null,null,null,null,"","",null,3]
["",null,null,"00:00:00",null,"","",null,"","",null,null,null,null,"","",null,3]
["",null,null,"00:00:00",null,"","",null,"","",null,null,null,null,"","",null,3]
["",null,null,"00:00:00",null,"","",null,"","",null,null,null,null,"","",null,3]
["",null,null,"00:00:00",null,"","",null,"","",null,null,null,null,"","",null,3]
["",null,null,"00:00:00",null,"","",null,"","",null,null,null,null,"","",null,3]
["",null,null,"00:00:00",null,"","",null,"","",null,null,null,null,"","",null,3]
["",null,null,"00:00:00",null,"","",null,"","",null,null,null,null,"","",null,3]
["",null,null,"00:00:00",null,"","",null,"","",null,null,null,null,"","",null,3]
["",null,null,"00:00:00",null,"","",null,"","",null,null,null,null,"","",null,3]
["",null,null,"00:00:00",null,"","",null,"","",null,null,null,null,"","",null,3]
["",null,null,"00:00:00",null,"","",null,"","",null,null,null,null,"","",null,3]
["",null,null,"00:00:00",null,"","",null,"","",null,null,null,null,"","",null,3]
["",null,null,"00:00:00",null,"","",null,"","",null,null,null,null,"","",null,3]
["",null,null,"00:00:00",null,"","",null,"","",null,null,null,null,"","",null,3]
["",null,null,"00:00:00",null,"","",null,"","",null,null,null,null,"","",null,3]
["",null,null,"00:00:00",null,"","",null,"","",null,null,null,null,"","",null,3]
["",null,null,"00:00:00",null,"","",null,"","",null,null,null,null,"","",null,3]
["",null,null,"00:00:00",null,"","",null,"","",null,null,null,null,"","",null,3]
["",null,null,"00:00:00",null,"","",null,"","",null,null,null,null,"","",null,3]
["",null,null,"00:00:00",null,"","",null,"","",null,null,null,null,"","",null,3]
["",null,null,"00:00:00",null,"","",null,"","",null,null,null,null,"","",null,3]
["",null,null,"00:00:00",null,"","",null,"","",null,null,null,null,"","",null,3]
["",null,null,"00:00:00",null,"","",null,"","",null,null,null,null,"","",null,3]
["",null,null,"00:00:00",null,"","",null,"","",null,null,null,null,"","",null,3]
["",null,null,"00:00:00",null,"","",null,"","",null,null,null,null,"","",null,3]
["",null,null,"00:00:00",null,"","",null,"","",null,null,null,null,"","",null,3]
["",null,null,"00:00:00",null,"","",null,"","",null,null,null,null,"","",null,3]
["",null,null,"00:00:00",null,"","",null,"","",null,null,null,null,"","",null,3]
["",null,null,"00:00:00",null,"","",null,"","",null,null,null,null,"","",null,3]
["",null,null,"00:00:00",null,"","",null,"","",null,null,null,null,"","",null,3]
["",null,null,"00:00:00",null,"","",null,"","",null,null,null,null,"","",null,3]
["",null,null,"00:00:00",null,"","",null,"","",null,null,null,null,"","",null,3]
["",null,null,"00:00:00",null,"","",null,"","",null,null,null,null,"","",null,3]
["",null,null,"00:00:00",null,"","",null,"","",null,null,null,null,"","",null,3]
["",null,null,"00:00:00",null,"","",null,"","",null,null,null,null,"","",null,3]
["",null,null,"00:00:00",null,"","",null,"","",null,null,null,null,"","",null,3]
["",null,null,"00:00:00",null,"","",null,"","",null,null,null,null,"","",null,3]
["",null,null,"00:00:00",null,"","",null,"","",null,null,null,null,"","",null,3]
["",null,null,"00:00:00",null,"","",null,"","",null,null,null,null,"","",null,3]
["",null,null,"00:00:00",null,"","",null,"","",null,null,null,null,"","",null,3]
["",null,null,"00:00:00",null,"","",null,"","",null,null,null,null,"","",null,3]
["",null,null,"00:00:00",null,"","",null,"","",null,null,null,null,"","",null,3]
["",null,null,"00:00:00",null,"","",null,"","",null,null,null,null,"","",null,3]
["",null,null,"00:00:00",null,"","",null,"","",null,null,null,null,"","",null,3]
["",null,null,"00:00:00",null,"","",null,"","",null,null,null,null,"","",null,3]
["",null,null,"00:00:00",null,"","",null,"","",null,null,null,null,"","",null,3]
["",null,null,"00:00:00",null,"","",null,"","",null,null,null,null,"","",null,3]
["",null,null,"00:00:00",null,"","",null,"","",null,null,null,null,"","",null,3]
["",null,null,"00:00:00",null,"","",null,"","",null,null,null,null,"","",null,3]
["",null,null,"00:00:00",null,"","",null,"","",null,null,null,null,"","",null,3]
["",null,null,"00:00:00",null,"","",null,"","",null,null,null,null,"","",null,3]
["",null,null,"00:00:00",null,"","",null,"","",null,null,null,null,"","",null,3]
["",null,null,"00:00:00",null,"","",null,"","",null,null,null,null,"","",null,3]
["",null,null,"00:00:00",null,"","",null,"","",null,null,null,null,"","",null,3]
["",null,null,"00:00:00",null,"","",null,"","",null,null,null,null,"","",null,3]
["",null,null,"00:00:00",null,"","",null,"","",null,null,null,null,"","",null,3]
["",null,null,"00:00:00",null,"","",null,"","",null,null,null,null,"","",null,3]
["",null,null,"00:00:00",null,"","",null,"","",null,null,null,null,"","",null,3]
["",null,null,"00:00:00",null,"","",null,"","",null,null,null,null,"","",null,3]
["",null,null,"00:00:00",null,"","",null,"","",null,null,null,null,"","",null,3]
[{"$f":"IF(E1284=\"\",\"\",IF(A1284=\"\",TODAY(),A1284))","v":""},null,null,{"$f":"C1284-B1284+IF(B1284>C1284,1)","v":"00:00:00"},null,{"$f":"IFERROR(VLOOKUP(E1284,$AJ$2:$AL$3155,2,FALSE),\"\")","v":""},{"$f":"IFERROR(VLOOKUP(E1284,$AJ$2:$AL$3155,3,FALSE),\"\")","v":""},null,{"$f":"IFERROR(SUM(G1284/7),\"\")","v":""},{"$f":"IFERROR(SUM(N1284/C1284),\"\")","v":""},null,null,null,null,{"$f":"IFERROR(ROUND(SUM(1000/K1284),2),\"\")","v":""},{"$f":"IFERROR(ROUND(SUM(N1284*O1284),2),\"\")","v":""},null,3]
["",null,null,"00:00:00",null,"","",null,"","",null,null,null,null,"","",null,3]
["",null,null,"00:00:00",null,"","",null,"","",null,null,null,null,"","",null,3]
["",null,null,"00:00:00",null,"","",null,"","",null,null,null,null,"","",null,3]
["",null,null,"00:00:00",null,"","",null,"","",null,null,null,null,"","",null,3]
["",null,null,"00:00:00",null,"","",null,"","",null,null,null,null,"","",null,3]
["",null,null,"00:00:00",null,"","",null,"","",null,null,null,null,"","",null,3]
["",null,null,"00:00:00",null,"","",null,"","",null,null,null,null,"","",null,3]
["",null,null,"00:00:00",null,"","",null,"","",null,null,null,null,"","",null,3]
["",null,null,"00:00:00",null,"","",null,"","",null,null,null,null,"","",null,3]
["",null,null,"00:00:00",null,"","",null,"","",null,null,null,null,"","",null,3]
["",null,null,"00:00:00",null,"","",null,"","",null,null,null,null,"","",null,3]
["",null,null,"00:00:00",null,"","",null,"","",null,null,null,null,"","",null,3]
["",null,null,"00:00:00",null,"","",null,"","",null,null,null,null,"","",null,3]
["",null,null,"00:00:00",null,"","",null,"","",null,null,null,null,"","",null,3]
["",null,null,"00:00:00",null,"","",null,"","",null,null,null,null,"","",null,3]
["",null,null,"00:00:00",null,"","",null,"","",null,null,null,null,"","",null,3]
["",null,null,"00:00:00",null,"","",null,"","",null,null,null,null,"","",null,3]
["",null,null,"00:00:00",null,"","",null,"","",null,null,null,null,"","",null,3]
["",null,null,"00:00:00",null,"","",null,"","",null,null,null,null,"","",null,3]
["",null,null,"00:00:00",null,"","",null,"","",null,null,null,null,"","",null,3]
["",null,null,"00:00:00",null,"","",null,"","",null,null,null,null,"","",null,3]
["",null,null,"00:00:00",null,"","",null,"","",null,null,null,null,"","",null,3]
["",null,null,"00:00:00",null,"","",null,"","",null,null,null,null,"","",null,3]
["",null,null,"00:00:00",null,"","",null,"","",null,null,null,null,"","",null,3]
["",null,null,"00:00:00",null,"","",null,"","",null,null,null,null,"","",null,3]
["",null,null,"00:00:00",null,"","",null,"","",null,null,null,null,"","",null,3]
["",null,null,"00:00:00",null,"","",null,"","",null,null,null,null,"","",null,3]
["",null,null,"00:00:00",null,"","",null,"","",null,null,null,null,"","",null,3]
["",null,null,"00:00:00",null,"","",null,"","",null,null,null,null,"","",null,3]
["",null,null,"00:00:00",null,"","",null,"","",null,null,null,null,"","",null,3]
["",null,null,"00:00:00",null,"","",null,"","",null,null,null,null,"","",null,3]
["",null,null,"00:00:00",null,"","",null,"","",null,null,null,null,"","",null,3]
["",null,null,"00:00:00",null,"","",null,"","",null,null,null,null,"","",null,3]
["",null,null,"00:00:00",null,"","",null,"","",null,null,null,null,"","",null,3]
["",null,null,"00:00:00",null,"","",null,"","",null,null,null,null,"","",null,3]
["",null,null,"00:00:00",null,"","",null,"","",null,null,null,null,"","",null,3]
["",null,null,"00:00:00",null,"","",null,"","",null,null,null,null,"","",null,3]
["",null,null,"00:00:00",null,"","",null,"","",null,null,null,null,"","",null,3]
["",null,null,"00:00:00",null,"","",null,"","",null,null,null,null,"","",null,3]
["",null,null,"00:00:00",null,"","",null,"","",null,null,null,null,"","",null,3]
["",null,null,"00:00:00",null,"","",null,"","",null,null,null,null,"","",null,3]
["",null,null,"00:00:00",null,"","",null,"","",null,null,null,null,"","",null,3]
["",null,null,"00:00:00",null,"","",null,"","",null,null,null,null,"","",null,3]
["",null,null,"00:00:00",null,"","",null,"","",null,null,null,null,"","",null,3]
["",null,null,"00:00:00",null,"","",null,"","",null,null,null,null,"","",null,3]
["",null,null,"00:00:00",null,"","",null,"","",null,null,null,null,"","",null,3]
["",null,null,"00:00:00",null,"","",null,"","",null,null,null,null,"","",null,3]
["",null,null,"00:00:00",null,"","",null,"","",null,null,null,null,"","",null,3]
["",null,null,"00:00:00",null,"","",null,"","",null,null,null,null,"","",null,3]
["",null,null,"00:00:00",null,"","",null,"","",null,null,null,null,"","",null,3]
["",null,null,"00:00:00",null,"","",null,"","",null,null,null,null,"","",null,3]
["",null,null,"00:00:00",null,"","",null,"","",null,null,null,null,"","",null,3]
["",null,null,"00:00:00",null,"","",null,"","",null,null,null,null,"","",null,3]
["",null,null,"00:00:00",null,"","",null,"","",null,null,null,null,"","",null,3]
["",null,null,"00:00:00",null,"","",null,"","",null,null,null,null,"","",null,3]
["",null,null,"00:00:00",null,"","",null,"","",null,null,null,null,"","",null,3]
["",null,null,"00:00:00",null,"","",null,"","",null,null,null,null,"","",null,3]
["",null,null,"00:00:00",null,"","",null,"","",null,null,null,null,"","",null,3]
["",null,null,"00:00:00",null,"","",null,"","",null,null,null,null,"","",null,3]
["",null,null,"00:00:00",null,"","",null,"","",null,null,null,null,"","",null,3]
["",null,null,"00:00:00",null,"","",null,"","",null,null,null,null,"","",null,3]
["",null,null,"00:00:00",null,"","",null,"","",null,null,null,null,"","",null,3]
["",null,null,"00:00:00",null,"","",null,"","",null,null,null,null,"","",null,3]
[{"$f":"IF(E1348=\"\",\"\",IF(A1348=\"\",TODAY(),A1348))","v":""},null,null,{"$f":"C1348-B1348+IF(B1348>C1348,1)","v":"00:00:00"},null,{"$f":"IFERROR(VLOOKUP(E1348,$AJ$2:$AL$3155,2,FALSE),\"\")","v":""},{"$f":"IFERROR(VLOOKUP(E1348,$AJ$2:$AL$3155,3,FALSE),\"\")","v":""},null,{"$f":"IFERROR(SUM(G1348/7),\"\")","v":""},{"$f":"IFERROR(SUM(N1348/C1348),\"\")","v":""},null,null,null,null,{"$f":"IFERROR(ROUND(SUM(1000/K1348),2),\"\")","v":""},{"$f":"IFERROR(ROUND(SUM(N1348*O1348),2),\"\")","v":""},null,3]
["",null,null,"00:00:00",null,"","",null,"","",null,null,null,null,"","",null,3]
["",null,null,"00:00:00",null,"","",null,"","",null,null,null,null,"","",null,3]
["",null,null,"00:00:00",null,"","",null,"","",null,null,null,null,"","",null,3]
["",null,null,"00:00:00",null,"","",null,"","",null,null,null,null,"","",null,3]
["",null,null,"00:00:00",null,"","",null,"","",null,null,null,null,"","",null,3]
["",null,null,"00:00:00",null,"","",null,"","",null,null,null,null,"","",null,3]
["",null,null,"00:00:00",null,"","",null,"","",null,null,null,null,"","",null,3]
["",null,null,"00:00:00",null,"","",null,"","",null,null,null,null,"","",null,3]
["",null,null,"00:00:00",null,"","",null,"","",null,null,null,null,"","",null,3]
["",null,null,"00:00:00",null,"","",null,"","",null,null,null,null,"","",null,3]
["",null,null,"00:00:00",null,"","",null,"","",null,null,null,null,"","",null,3]
["",null,null,"00:00:00",null,"","",null,"","",null,null,null,null,"","",null,3]
["",null,null,"00:00:00",null,"","",null,"","",null,null,null,null,"","",null,3]
["",null,null,"00:00:00",null,"","",null,"","",null,null,null,null,"","",null,3]
["",null,null,"00:00:00",null,"","",null,"","",null,null,null,null,"","",null,3]
["",null,null,"00:00:00",null,"","",null,"","",null,null,null,null,"","",null,3]
["",null,null,"00:00:00",null,"","",null,"","",null,null,null,null,"","",null,3]
["",null,null,"00:00:00",null,"","",null,"","",null,null,null,null,"","",null,3]
["",null,null,"00:00:00",null,"","",null,"","",null,null,null,null,"","",null,3]
["",null,null,"00:00:00",null,"","",null,"","",null,null,null,null,"","",null,3]
["",null,null,"00:00:00",null,"","",null,"","",null,null,null,null,"","",null,3]
["",null,null,"00:00:00",null,"","",null,"","",null,null,null,null,"","",null,3]
["",null,null,"00:00:00",null,"","",null,"","",null,null,null,null,"","",null,3]
["",null,null,"00:00:00",null,"","",null,"","",null,null,null,null,"","",null,3]
["",null,null,"00:00:00",null,"","",null,"","",null,null,null,null,"","",null,3]
["",null,null,"00:00:00",null,"","",null,"","",null,null,null,null,"","",null,3]
["",null,null,"00:00:00",null,"","",null,"","",null,null,null,null,"","",null,3]
["",null,null,"00:00:00",null,"","",null,"","",null,null,null,null,"","",null,3]
["",null,null,"00:00:00",null,"","",null,"","",null,null,null,null,"","",null,3]
["",null,null,"00:00:00",null,"","",null,"","",null,null,null,null,"","",null,3]
["",null,null,"00:00:00",null,"","",null,"","",null,null,null,null,"","",null,3]
["",null,null,"00:00:00",null,"","",null,"","",null,null,null,null,"","",null,3]
["",null,null,"00:00:00",null,"","",null,"","",null,null,null,null,"","",null,3]
["",null,null,"00:00:00",null,"","",null,"","",null,null,null,null,"","",null,3]
["",null,null,"00:00:00",null,"","",null,"","",null,null,null,null,"","",null,3]
["",null,null,"00:00:00",null,"","",null,"","",null,null,null,null,"","",null,3]
["",null,null,"00:00:00",null,"","",null,"","",null,null,null,null,"","",null,3]
["",null,null,"00:00:00",null,"","",null,"","",null,null,null,null,"","",null,3]
["",null,null,"00:00:00",null,"","",null,"","",null,null,null,null,"","",null,3]
["",null,null,"00:00:00",null,"","",null,"","",null,null,null,null,"","",null,3]
["",null,null,"00:00:00",null,"","",null,"","",null,null,null,null,"","",null,3]
["",null,null,"00:00:00",null,"","",null,"","",null,null,null,null,"","",null,3]
["",null,null,"00:00:00",null,"","",null,"","",null,null,null,null,"","",null,3]
["",null,null,"00:00:00",null,"","",null,"","",null,null,null,null,"","",null,3]
["",null,null,"00:00:00",null,"","",null,"","",null,null,null,null,"","",null,3]
["",null,null,"00:00:00",null,"","",null,"","",null,null,null,null,"","",null,3]
["",null,null,"00:00:00",null,"","",null,"","",null,null,null,null,"","",null,3]
["",null,null,"00:00:00",null,"","",null,"","",null,null,null,null,"","",null,3]
["",null,null,"00:00:00",null,"","",null,"","",null,null,null,null,"","",null,3]
["",null,null,"00:00:00",null,"","",null,"","",null,null,null,null,"","",null,3]
["",null,null,"00:00:00",null,"","",null,"","",null,null,null,null,"","",null,3]
["",null,null,"00:00:00",null,"","",null,"","",null,null,null,null,"","",null,3]
["",null,null,"00:00:00",null,"","",null,"","",null,null,null,null,"","",null,3]
["",null,null,"00:00:00",null,"","",null,"","",null,null,null,null,"","",null,3]
["",null,null,"00:00:00",null,"","",null,"","",null,null,null,null,"","",null,3]
["",null,null,"00:00:00",null,"","",null,"","",null,null,null,null,"","",null,3]
["",null,null,"00:00:00",null,"","",null,"","",null,null,null,null,"","",null,3]
["",null,null,"00:00:00",null,"","",null,"","",null,null,null,null,"","",null,3]
["",null,null,"00:00:00",null,"","",null,"","",null,null,null,null,"","",null,3]
["",null,null,"00:00:00",null,"","",null,"","",null,null,null,null,"","",null,3]
["",null,null,"00:00:00",null,"","",null,"","",null,null,null,null,"","",null,3]
["",null,null,"00:00:00",null,"","",null,"","",null,null,null,null,"","",null,3]
["",null,null,"00:00:00",null,"","",null,"","",null,null,null,null,"","",null,3]
[{"$f":"IF(E1412=\"\",\"\",IF(A1412=\"\",TODAY(),A1412))","v":""},null,null,{"$f":"C1412-B1412+IF(B1412>C1412,1)","v":"00:00:00"},null,{"$f":"IFERROR(VLOOKUP(E1412,$AJ$2:$AL$3155,2,FALSE),\"\")","v":""},{"$f":"IFERROR(VLOOKUP(E1412,$AJ$2:$AL$3155,3,FALSE),\"\")","v":""},null,{"$f":"IFERROR(SUM(G1412/7),\"\")","v":""},{"$f":"IFERROR(SUM(N1412/C1412),\"\")","v":""},null,null,null,null,{"$f":"IFERROR(ROUND(SUM(1000/K1412),2),\"\")","v":""},{"$f":"IFERROR(ROUND(SUM(N1412*O1412),2),\"\")","v":""},null,3]
["",null,null,"00:00:00",null,"","",null,"","",null,null,null,null,"","",null,3]
["",null,null,"00:00:00",null,"","",null,"","",null,null,null,null,"","",null,3]
["",null,null,"00:00:00",null,"","",null,"","",null,null,null,null,"","",null,3]
["",null,null,"00:00:00",null,"","",null,"","",null,null,null,null,"","",null,3]
["",null,null,"00:00:00",null,"","",null,"","",null,null,null,null,"","",null,3]
["",null,null,"00:00:00",null,"","",null,"","",null,null,null,null,"","",null,3]
["",null,null,"00:00:00",null,"","",null,"","",null,null,null,null,"","",null,3]
["",null,null,"00:00:00",null,"","",null,"","",null,null,null,null,"","",null,3]
["",null,null,"00:00:00",null,"","",null,"","",null,null,null,null,"","",null,3]
["",null,null,"00:00:00",null,"","",null,"","",null,null,null,null,"","",null,3]
["",null,null,"00:00:00",null,"","",null,"","",null,null,null,null,"","",null,3]
["",null,null,"00:00:00",null,"","",null,"","",null,null,null,null,"","",null,3]
["",null,null,"00:00:00",null,"","",null,"","",null,null,null,null,"","",null,3]
["",null,null,"00:00:00",null,"","",null,"","",null,null,null,null,"","",null,3]
["",null,null,"00:00:00",null,"","",null,"","",null,null,null,null,"","",null,3]
["",null,null,"00:00:00",null,"","",null,"","",null,null,null,null,"","",null,3]
["",null,null,"00:00:00",null,"","",null,"","",null,null,null,null,"","",null,3]
["",null,null,"00:00:00",null,"","",null,"","",null,null,null,null,"","",null,3]
["",null,null,"00:00:00",null,"","",null,"","",null,null,null,null,"","",null,3]
["",null,null,"00:00:00",null,"","",null,"","",null,null,null,null,"","",null,3]
["",null,null,"00:00:00",null,"","",null,"","",null,null,null,null,"","",null,3]
["",null,null,"00:00:00",null,"","",null,"","",null,null,null,null,"","",null,3]
["",null,null,"00:00:00",null,"","",null,"","",null,null,null,null,"","",null,3]
["",null,null,"00:00:00",null,"","",null,"","",null,null,null,null,"","",null,3]
["",null,null,"00:00:00",null,"","",null,"","",null,null,null,null,"","",null,3]
["",null,null,"00:00:00",null,"","",null,"","",null,null,null,null,"","",null,3]
["",null,null,"00:00:00",null,"","",null,"","",null,null,null,null,"","",null,3]
["",null,null,"00:00:00",null,"","",null,"","",null,null,null,null,"","",null,3]
["",null,null,"00:00:00",null,"","",null,"","",null,null,null,null,"","",null,3]
["",null,null,"00:00:00",null,"","",null,"","",null,null,null,null,"","",null,3]
["",null,null,"00:00:00",null,"","",null,"","",null,null,null,null,"","",null,3]
["",null,null,"00:00:00",null,"","",null,"","",null,null,null,null,"","",null,3]
["",null,null,"00:00:00",null,"","",null,"","",null,null,null,null,"","",null,3]
["",null,null,"00:00:00",null,"","",null,"","",null,null,null,null,"","",null,3]
["",null,null,"00:00:00",null,"","",null,"","",null,null,null,null,"","",null,3]
["",null,null,"00:00:00",null,"","",null,"","",null,null,null,null,"","",null,3]
["",null,null,"00:00:00",null,"","",null,"","",null,null,null,null,"","",null,3]
["",null,null,"00:00:00",null,"","",null,"","",null,null,null,null,"","",null,3]
["",null,null,"00:00:00",null,"","",null,"","",null,null,null,null,"","",null,3]
["",null,null,"00:00:00",null,"","",null,"","",null,null,null,null,"","",null,3]
["",null,null,"00:00:00",null,"","",null,"","",null,null,null,null,"","",null,3]
["",null,null,"00:00:00",null,"","",null,"","",null,null,null,null,"","",null,3]
["",null,null,"00:00:00",null,"","",null,"","",null,null,null,null,"","",null,3]
["",null,null,"00:00:00",null,"","",null,"","",null,null,null,null,"","",null,3]
["",null,null,"00:00:00",null,"","",null,"","",null,null,null,null,"","",null,3]
["",null,null,"00:00:00",null,"","",null,"","",null,null,null,null,"","",null,3]
["",null,null,"00:00:00",null,"","",null,"","",null,null,null,null,"","",null,3]
["",null,null,"00:00:00",null,"","",null,"","",null,null,null,null,"","",null,3]
["",null,null,"00:00:00",null,"","",null,"","",null,null,null,null,"","",null,3]
["",null,null,"00:00:00",null,"","",null,"","",null,null,null,null,"","",null,3]
["",null,null,"00:00:00",null,"","",null,"","",null,null,null,null,"","",null,3]
["",null,null,"00:00:00",null,"","",null,"","",null,null,null,null,"","",null,3]
["",null,null,"00:00:00",null,"","",null,"","",null,null,null,null,"","",null,3]
["",null,null,"00:00:00",null,"","",null,"","",null,null,null,null,"","",null,3]
["",null,null,"00:00:00",null,"","",null,"","",null,null,null,null,"","",null,3]
["",null,null,"00:00:00",null,"","",null,"","",null,null,null,null,"","",null,3]
["",null,null,"00:00:00",null,"","",null,"","",null,null,null,null,"","",null,3]
["",null,null,"00:00:00",null,"","",null,"","",null,null,null,null,"","",null,3]
["",null,null,"00:00:00",null,"","",null,"","",null,null,null,null,"","",null,3]
["",null,null,"00:00:00",null,"","",null,"","",null,null,null,null,"","",null,3]
["",null,null,"00:00:00",null,"","",null,"","",null,null,null,null,"","",null,3]
["",null,null,"00:00:00",null,"","",null,"","",null,null,null,null,"","",null,3]
["",null,null,"00:00:00",null,"","",null,"","",null,null,null,null,"","",null,3]
[{"$f":"IF(E1476=\"\",\"\",IF(A1476=\"\",TODAY(),A1476))","v":""},null,null,{"$f":"C1476-B1476+IF(B1476>C1476,1)","v":"00:00:00"},null,{"$f":"IFERROR(VLOOKUP(E1476,$AJ$2:$AL$3155,2,FALSE),\"\")","v":""},{"$f":"IFERROR(VLOOKUP(E1476,$AJ$2:$AL$3155,3,FALSE),\"\")","v":""},null,{"$f":"IFERROR(SUM(G1476/7),\"\")","v":""},{"$f":"IFERROR(SUM(N1476/C1476),\"\")","v":""},null,null,null,null,{"$f":"IFERROR(ROUND(SUM(1000/K1476),2),\"\")","v":""},{"$f":"IFERROR(ROUND(SUM(N1476*O1476),2),\"\")","v":""},null,3]
["",null,null,"00:00:00",null,"","",null,"","",null,null,null,null,"","",null,3]
["",null,null,"00:00:00",null,"","",null,"","",null,null,null,null,"","",null,3]
["",null,null,"00:00:00",null,"","",null,"","",null,null,null,null,"","",null,3]
["",null,null,"00:00:00",null,"","",null,"","",null,null,null,null,"","",null,3]
["",null,null,"00:00:00",null,"","",null,"","",null,null,null,null,"","",null,3]
["",null,null,"00:00:00",null,"","",null,"","",null,null,null,null,"","",null,3]
["",null,null,"00:00:00",null,"","",null,"","",null,null,null,null,"","",null,3]
["",null,null,"00:00:00",null,"","",null,"","",null,null,null,null,"","",null,3]
["",null,null,"00:00:00",null,"","",null,"","",null,null,null,null,"","",null,3]
["",null,null,"00:00:00",null,"","",null,"","",null,null,null,null,"","",null,3]
["",null,null,"00:00:00",null,"","",null,"","",null,null,null,null,"","",null,3]
["",null,null,"00:00:00",null,"","",null,"","",null,null,null,null,"","",null,3]
["",null,null,"00:00:00",null,"","",null,"","",null,null,null,null,"","",null,3]
["",null,null,"00:00:00",null,"","",null,"","",null,null,null,null,"","",null,3]
["",null,null,"00:00:00",null,"","",null,"","",null,null,null,null,"","",null,3]
["",null,null,"00:00:00",null,"","",null,"","",null,null,null,null,"","",null,3]
["",null,null,"00:00:00",null,"","",null,"","",null,null,null,null,"","",null,3]
["",null,null,"00:00:00",null,"","",null,"","",null,null,null,null,"","",null,3]
["",null,null,"00:00:00",null,"","",null,"","",null,null,null,null,"","",null,3]
["",null,null,"00:00:00",null,"","",null,"","",null,null,null,null,"","",null,3]
["",null,null,"00:00:00",null,"","",null,"","",null,null,null,null,"","",null,3]
["",null,null,"00:00:00",null,"","",null,"","",null,null,null,null,"","",null,3]
["",null,null,"00:00:00",null,"","",null,"","",null,null,null,null,"","",null,3]
["",null,null,"00:00:00",null,"","",null,"","",null,null,null,null,"","",null,3]
["",null,null,"00:00:00",null,"","",null,"","",null,null,null,null,"","",null,3]
["",null,null,"00:00:00",null,"","",null,"","",null,null,null,null,"","",null,3]
["",null,null,"00:00:00",null,"","",null,"","",null,null,null,null,"","",null,3]
["",null,null,"00:00:00",null,"","",null,"","",null,null,null,null,"","",null,3]
["",null,null,"00:00:00",null,"","",null,"","",null,null,null,null,"","",null,3]
["",null,null,"00:00:00",null,"","",null,"","",null,null,null,null,"","",null,3]
["",null,null,"00:00:00",null,"","",null,"","",null,null,null,null,"","",null,3]
["",null,null,"00:00:00",null,"","",null,"","",null,null,null,null,"","",null,3]
["",null,null,"00:00:00",null,"","",null,"","",null,null,null,null,"","",null,3]
["",null,null,"00:00:00",null,"","",null,"","",null,null,null,null,"","",null,3]
["",null,null,"00:00:00",null,"","",null,"","",null,null,null,null,"","",null,3]
["",null,null,"00:00:00",null,"","",null,"","",null,null,null,null,"","",null,3]
["",null,null,"00:00:00",null,"","",null,"","",null,null,null,null,"","",null,3]
["",null,null,"00:00:00",null,"","",null,"","",null,null,null,null,"","",null,3]
["",null,null,"00:00:00",null,"","",null,"","",null,null,null,null,"","",null,3]
["",null,null,"00:00:00",null,"","",null,"","",null,null,null,null,"","",null,3]
["",null,null,"00:00:00",null,"","",null,"","",null,null,null,null,"","",null,3]
["",null,null,"00:00:00",null,"","",null,"","",null,null,null,null,"","",null,3]
["",null,null,"00:00:00",null,"","",null,"","",null,null,null,null,"","",null,3]
["",null,null,"00:00:00",null,"","",null,"","",null,null,null,null,"","",null,3]
["",null,null,"00:00:00",null,"","",null,"","",null,null,null,null,"","",null,3]
["",null,null,"00:00:00",null,"","",null,"","",null,null,null,null,"","",null,3]
["",null,null,"00:00:00",null,"","",null,"","",null,null,null,null,"","",null,3]
["",null,null,"00:00:00",null,"","",null,"","",null,null,null,null,"","",null,3]
["",null,null,"00:00:00",null,"","",null,"","",null,null,null,null,"","",null,3]
["",null,null,"00:00:00",null,"","",null,"","",null,null,null,null,"","",null,3]
["",null,null,"00:00:00",null,"","",null,"","",null,null,null,null,"","",null,3]
["",null,null,"00:00:00",null,"","",null,"","",null,null,null,null,"","",null,3]
["",null,null,"00:00:00",null,"","",null,"","",null,null,null,null,"","",null,3]
["",null,null,"00:00:00",null,"","",null,"","",null,null,null,null,"","",null,3]
["",null,null,"00:00:00",null,"","",null,"","",null,null,null,null,"","",null,3]
["",null,null,"00:00:00",null,"","",null,"","",null,null,null,null,"","",null,3]
["",null,null,"00:00:00",null,"","",null,"","",null,null,null,null,"","",null,3]
["",null,null,"00:00:00",null,"","",null,"","",null,null,null,null,"","",null,3]
["",null,null,"00:00:00",null,"","",null,"","",null,null,null,null,"","",null,3]
["",null,null,"00:00:00",null,"","",null,"","",null,null,null,null,"","",null,3]
["",null,null,"00:00:00",null,"","",null,"","",null,null,null,null,"","",null,3]
["",null,null,"00:00:00",null,"","",null,"","",null,null,null,null,"","",null,3]
["",null,null,"00:00:00",null,"","",null,"","",null,null,null,null,"","",null,3]
[{"$f":"IF(E1540=\"\",\"\",IF(A1540=\"\",TODAY(),A1540))","v":""},null,null,{"$f":"C1540-B1540+IF(B1540>C1540,1)","v":"00:00:00"},null,{"$f":"IFERROR(VLOOKUP(E1540,$AJ$2:$AL$3155,2,FALSE),\"\")","v":""},{"$f":"IFERROR(VLOOKUP(E1540,$AJ$2:$AL$3155,3,FALSE),\"\")","v":""},null,{"$f":"IFERROR(SUM(G1540/7),\"\")","v":""},{"$f":"IFERROR(SUM(N1540/C1540),\"\")","v":""},null,null,null,null,{"$f":"IFERROR(ROUND(SUM(1000/K1540),2),\"\")","v":""},{"$f":"IFERROR(ROUND(SUM(N1540*O1540),2),\"\")","v":""},null,3]
["",null,null,"00:00:00",null,"","",null,"","",null,null,null,null,"","",null,3]
["",null,null,"00:00:00",null,"","",null,"","",null,null,null,null,"","",null,3]
["",null,null,"00:00:00",null,"","",null,"","",null,null,null,null,"","",null,3]
["",null,null,"00:00:00",null,"","",null,"","",null,null,null,null,"","",null,3]
["",null,null,"00:00:00",null,"","",null,"","",null,null,null,null,"","",null,3]
["",null,null,"00:00:00",null,"","",null,"","",null,null,null,null,"","",null,3]
["",null,null,"00:00:00",null,"","",null,"","",null,null,null,null,"","",null,3]
["",null,null,"00:00:00",null,"","",null,"","",null,null,null,null,"","",null,3]
["",null,null,"00:00:00",null,"","",null,"","",null,null,null,null,"","",null,3]
["",null,null,"00:00:00",null,"","",null,"","",null,null,null,null,"","",null,3]
["",null,null,"00:00:00",null,"","",null,"","",null,null,null,null,"","",null,3]
["",null,null,"00:00:00",null,"","",null,"","",null,null,null,null,"","",null,3]
["",null,null,"00:00:00",null,"","",null,"","",null,null,null,null,"","",null,3]
["",null,null,"00:00:00",null,"","",null,"","",null,null,null,null,"","",null,3]
["",null,null,"00:00:00",null,"","",null,"","",null,null,null,null,"","",null,3]
["",null,null,"00:00:00",null,"","",null,"","",null,null,null,null,"","",null,3]
["",null,null,"00:00:00",null,"","",null,"","",null,null,null,null,"","",null,3]
["",null,null,"00:00:00",null,"","",null,"","",null,null,null,null,"","",null,3]
["",null,null,"00:00:00",null,"","",null,"","",null,null,null,null,"","",null,3]
["",null,null,"00:00:00",null,"","",null,"","",null,null,null,null,"","",null,3]
["",null,null,"00:00:00",null,"","",null,"","",null,null,null,null,"","",null,3]
["",null,null,"00:00:00",null,"","",null,"","",null,null,null,null,"","",null,3]
["",null,null,"00:00:00",null,"","",null,"","",null,null,null,null,"","",null,3]
["",null,null,"00:00:00",null,"","",null,"","",null,null,null,null,"","",null,3]
["",null,null,"00:00:00",null,"","",null,"","",null,null,null,null,"","",null,3]
["",null,null,"00:00:00",null,"","",null,"","",null,null,null,null,"","",null,3]
["",null,null,"00:00:00",null,"","",null,"","",null,null,null,null,"","",null,3]
["",null,null,"00:00:00",null,"","",null,"","",null,null,null,null,"","",null,3]
["",null,null,"00:00:00",null,"","",null,"","",null,null,null,null,"","",null,3]
["",null,null,"00:00:00",null,"","",null,"","",null,null,null,null,"","",null,3]
["",null,null,"00:00:00",null,"","",null,"","",null,null,null,null,"","",null,3]
["",null,null,"00:00:00",null,"","",null,"","",null,null,null,null,"","",null,3]
["",null,null,"00:00:00",null,"","",null,"","",null,null,null,null,"","",null,3]
["",null,null,"00:00:00",null,"","",null,"","",null,null,null,null,"","",null,3]
["",null,null,"00:00:00",null,"","",null,"","",null,null,null,null,"","",null,3]
["",null,null,"00:00:00",null,"","",null,"","",null,null,null,null,"","",null,3]
["",null,null,"00:00:00",null,"","",null,"","",null,null,null,null,"","",null,3]
["",null,null,"00:00:00",null,"","",null,"","",null,null,null,null,"","",null,3]
["",null,null,"00:00:00",null,"","",null,"","",null,null,null,null,"","",null,3]
["",null,null,"00:00:00",null,"","",null,"","",null,null,null,null,"","",null,3]
["",null,null,"00:00:00",null,"","",null,"","",null,null,null,null,"","",null,3]
["",null,null,"00:00:00",null,"","",null,"","",null,null,null,null,"","",null,3]
["",null,null,"00:00:00",null,"","",null,"","",null,null,null,null,"","",null,3]
["",null,null,"00:00:00",null,"","",null,"","",null,null,null,null,"","",null,3]
["",null,null,"00:00:00",null,"","",null,"","",null,null,null,null,"","",null,3]
["",null,null,"00:00:00",null,"","",null,"","",null,null,null,null,"","",null,3]
["",null,null,"00:00:00",null,"","",null,"","",null,null,null,null,"","",null,3]
["",null,null,"00:00:00",null,"","",null,"","",null,null,null,null,"","",null,3]
["",null,null,"00:00:00",null,"","",null,"","",null,null,null,null,"","",null,3]
["",null,null,"00:00:00",null,"","",null,"","",null,null,null,null,"","",null,3]
["",null,null,"00:00:00",null,"","",null,"","",null,null,null,null,"","",null,3]
["",null,null,"00:00:00",null,"","",null,"","",null,null,null,null,"","",null,3]
["",null,null,"00:00:00",null,"","",null,"","",null,null,null,null,"","",null,3]
["",null,null,"00:00:00",null,"","",null,"","",null,null,null,null,"","",null,3]
["",null,null,"00:00:00",null,"","",null,"","",null,null,null,null,"","",null,3]
["",null,null,"00:00:00",null,"","",null,"","",null,null,null,null,"","",null,3]
["",null,null,"00:00:00",null,"","",null,"","",null,null,null,null,"","",null,3]
["",null,null,"00:00:00",null,"","",null,"","",null,null,null,null,"","",null,3]
["",null,null,"00:00:00",null,"","",null,"","",null,null,null,null,"","",null,3]
["",null,null,"00:00:00",null,"","",null,"","",null,null,null,null,"","",null,3]
["",null,null,"00:00:00",null,"","",null,"","",null,null,null,null,"","",null,3]
["",null,null,"00:00:00",null,"","",null,"","",null,null,null,null,"","",null,3]
["",null,null,"00:00:00",null,"","",null,"","",null,null,null,null,"","",null,3]
[{"$f":"IF(E1604=\"\",\"\",IF(A1604=\"\",TODAY(),A1604))","v":""},null,null,{"$f":"C1604-B1604+IF(B1604>C1604,1)","v":"00:00:00"},null,{"$f":"IFERROR(VLOOKUP(E1604,$AJ$2:$AL$3155,2,FALSE),\"\")","v":""},{"$f":"IFERROR(VLOOKUP(E1604,$AJ$2:$AL$3155,3,FALSE),\"\")","v":""},null,{"$f":"IFERROR(SUM(G1604/7),\"\")","v":""},{"$f":"IFERROR(SUM(N1604/C1604),\"\")","v":""},null,null,null,null,{"$f":"IFERROR(ROUND(SUM(1000/K1604),2),\"\")","v":""},{"$f":"IFERROR(ROUND(SUM(N1604*O1604),2),\"\")","v":""},null,3]
["",null,null,"00:00:00",null,"","",null,"","",null,null,null,null,"","",null,3]
["",null,null,"00:00:00",null,"","",null,"","",null,null,null,null,"","",null,3]
["",null,null,"00:00:00",null,"","",null,"","",null,null,null,null,"","",null,3]
["",null,null,"00:00:00",null,"","",null,"","",null,null,null,null,"","",null,3]
["",null,null,"00:00:00",null,"","",null,"","",null,null,null,null,"","",null,3]
["",null,null,"00:00:00",null,"","",null,"","",null,null,null,null,"","",null,3]
["",null,null,"00:00:00",null,"","",null,"","",null,null,null,null,"","",null,3]
["",null,null,"00:00:00",null,"","",null,"","",null,null,null,null,"","",null,3]
["",null,null,"00:00:00",null,"","",null,"","",null,null,null,null,"","",null,3]
["",null,null,"00:00:00",null,"","",null,"","",null,null,null,null,"","",null,3]
["",null,null,"00:00:00",null,"","",null,"","",null,null,null,null,"","",null,3]
["",null,null,"00:00:00",null,"","",null,"","",null,null,null,null,"","",null,3]
["",null,null,"00:00:00",null,"","",null,"","",null,null,null,null,"","",null,3]
["",null,null,"00:00:00",null,"","",null,"","",null,null,null,null,"","",null,3]
["",null,null,"00:00:00",null,"","",null,"","",null,null,null,null,"","",null,3]
["",null,null,"00:00:00",null,"","",null,"","",null,null,null,null,"","",null,3]
["",null,null,"00:00:00",null,"","",null,"","",null,null,null,null,"","",null,3]
["",null,null,"00:00:00",null,"","",null,"","",null,null,null,null,"","",null,3]
["",null,null,"00:00:00",null,"","",null,"","",null,null,null,null,"","",null,3]
["",null,null,"00:00:00",null,"","",null,"","",null,null,null,null,"","",null,3]
["",null,null,"00:00:00",null,"","",null,"","",null,null,null,null,"","",null,3]
["",null,null,"00:00:00",null,"","",null,"","",null,null,null,null,"","",null,3]
["",null,null,"00:00:00",null,"","",null,"","",null,null,null,null,"","",null,3]
["",null,null,"00:00:00",null,"","",null,"","",null,null,null,null,"","",null,3]
["",null,null,"00:00:00",null,"","",null,"","",null,null,null,null,"","",null,3]
["",null,null,"00:00:00",null,"","",null,"","",null,null,null,null,"","",null,3]
["",null,null,"00:00:00",null,"","",null,"","",null,null,null,null,"","",null,3]
["",null,null,"00:00:00",null,"","",null,"","",null,null,null,null,"","",null,3]
["",null,null,"00:00:00",null,"","",null,"","",null,null,null,null,"","",null,3]
["",null,null,"00:00:00",null,"","",null,"","",null,null,null,null,"","",null,3]
["",null,null,"00:00:00",null,"","",null,"","",null,null,null,null,"","",null,3]
["",null,null,"00:00:00",null,"","",null,"","",null,null,null,null,"","",null,3]
["",null,null,"00:00:00",null,"","",null,"","",null,null,null,null,"","",null,3]
["",null,null,"00:00:00",null,"","",null,"","",null,null,null,null,"","",null,3]
["",null,null,"00:00:00",null,"","",null,"","",null,null,null,null,"","",null,3]
["",null,null,"00:00:00",null,"","",null,"","",null,null,null,null,"","",null,3]
["",null,null,"00:00:00",null,"","",null,"","",null,null,null,null,"","",null,3]
["",null,null,"00:00:00",null,"","",null,"","",null,null,null,null,"","",null,3]
["",null,null,"00:00:00",null,"","",null,"","",null,null,null,null,"","",null,3]
["",null,null,"00:00:00",null,"","",null,"","",null,null,null,null,"","",null,3]
["",null,null,"00:00:00",null,"","",null,"","",null,null,null,null,"","",null,3]
["",null,null,"00:00:00",null,"","",null,"","",null,null,null,null,"","",null,3]
["",null,null,"00:00:00",null,"","",null,"","",null,null,null,null,"","",null,3]
["",null,null,"00:00:00",null,"","",null,"","",null,null,null,null,"","",null,3]
["",null,null,"00:00:00",null,"","",null,"","",null,null,null,null,"","",null,3]
["",null,null,"00:00:00",null,"","",null,"","",null,null,null,null,"","",null,3]
["",null,null,"00:00:00",null,"","",null,"","",null,null,null,null,"","",null,3]
["",null,null,"00:00:00",null,"","",null,"","",null,null,null,null,"","",null,3]
["",null,null,"00:00:00",null,"","",null,"","",null,null,null,null,"","",null,3]
["",null,null,"00:00:00",null,"","",null,"","",null,null,null,null,"","",null,3]
["",null,null,"00:00:00",null,"","",null,"","",null,null,null,null,"","",null,3]
["",null,null,"00:00:00",null,"","",null,"","",null,null,null,null,"","",null,3]
["",null,null,"00:00:00",null,"","",null,"","",null,null,null,null,"","",null,3]
["",null,null,"00:00:00",null,"","",null,"","",null,null,null,null,"","",null,3]
["",null,null,"00:00:00",null,"","",null,"","",null,null,null,null,"","",null,3]
["",null,null,"00:00:00",null,"","",null,"","",null,null,null,null,"","",null,3]
["",null,null,"00:00:00",null,"","",null,"","",null,null,null,null,"","",null,3]
["",null,null,"00:00:00",null,"","",null,"","",null,null,null,null,"","",null,3]
["",null,null,"00:00:00",null,"","",null,"","",null,null,null,null,"","",null,3]
["",null,null,"00:00:00",null,"","",null,"","",null,null,null,null,"","",null,3]
["",null,null,"00:00:00",null,"","",null,"","",null,null,null,null,"","",null,3]
["",null,null,"00:00:00",null,"","",null,"","",null,null,null,null,"","",null,3]
["",null,null,"00:00:00",null,"","",null,"","",null,null,null,null,"","",null,3]
[{"$f":"IF(E1668=\"\",\"\",IF(A1668=\"\",TODAY(),A1668))","v":""},null,null,{"$f":"C1668-B1668+IF(B1668>C1668,1)","v":"00:00:00"},null,{"$f":"IFERROR(VLOOKUP(E1668,$AJ$2:$AL$3155,2,FALSE),\"\")","v":""},{"$f":"IFERROR(VLOOKUP(E1668,$AJ$2:$AL$3155,3,FALSE),\"\")","v":""},null,{"$f":"IFERROR(SUM(G1668/7),\"\")","v":""},{"$f":"IFERROR(SUM(N1668/C1668),\"\")","v":""},null,null,null,null,{"$f":"IFERROR(ROUND(SUM(1000/K1668),2),\"\")","v":""},{"$f":"IFERROR(ROUND(SUM(N1668*O1668),2),\"\")","v":""},null,3]
["",null,null,"00:00:00",null,"","",null,"","",null,null,null,null,"","",null,3]
["",null,null,"00:00:00",null,"","",null,"","",null,null,null,null,"","",null,3]
["",null,null,"00:00:00",null,"","",null,"","",null,null,null,null,"","",null,3]
["",null,null,"00:00:00",null,"","",null,"","",null,null,null,null,"","",null,3]
["",null,null,"00:00:00",null,"","",null,"","",null,null,null,null,"","",null,3]
["",null,null,"00:00:00",null,"","",null,"","",null,null,null,null,"","",null,3]
["",null,null,"00:00:00",null,"","",null,"","",null,null,null,null,"","",null,3]
["",null,null,"00:00:00",null,"","",null,"","",null,null,null,null,"","",null,3]
["",null,null,"00:00:00",null,"","",null,"","",null,null,null,null,"","",null,3]
["",null,null,"00:00:00",null,"","",null,"","",null,null,null,null,"","",null,3]
["",null,null,"00:00:00",null,"","",null,"","",null,null,null,null,"","",null,3]
["",null,null,"00:00:00",null,"","",null,"","",null,null,null,null,"","",null,3]
["",null,null,"00:00:00",null,"","",null,"","",null,null,null,null,"","",null,3]
["",null,null,"00:00:00",null,"","",null,"","",null,null,null,null,"","",null,3]
["",null,null,"00:00:00",null,"","",null,"","",null,null,null,null,"","",null,3]
["",null,null,"00:00:00",null,"","",null,"","",null,null,null,null,"","",null,3]
["",null,null,"00:00:00",null,"","",null,"","",null,null,null,null,"","",null,3]
["",null,null,"00:00:00",null,"","",null,"","",null,null,null,null,"","",null,3]
["",null,null,"00:00:00",null,"","",null,"","",null,null,null,null,"","",null,3]
["",null,null,"00:00:00",null,"","",null,"","",null,null,null,null,"","",null,3]
["",null,null,"00:00:00",null,"","",null,"","",null,null,null,null,"","",null,3]
["",null,null,"00:00:00",null,"","",null,"","",null,null,null,null,"","",null,3]
["",null,null,"00:00:00",null,"","",null,"","",null,null,null,null,"","",null,3]
["",null,null,"00:00:00",null,"","",null,"","",null,null,null,null,"","",null,3]
["",null,null,"00:00:00",null,"","",null,"","",null,null,null,null,"","",null,3]
["",null,null,"00:00:00",null,"","",null,"","",null,null,null,null,"","",null,3]
["",null,null,"00:00:00",null,"","",null,"","",null,null,null,null,"","",null,3]
["",null,null,"00:00:00",null,"","",null,"","",null,null,null,null,"","",null,3]
["",null,null,"00:00:00",null,"","",null,"","",null,null,null,null,"","",null,3]
["",null,null,"00:00:00",null,"","",null,"","",null,null,null,null,"","",null,3]
["",null,null,"00:00:00",null,"","",null,"","",null,null,null,null,"","",null,3]
["",null,null,"00:00:00",null,"","",null,"","",null,null,null,null,"","",null,3]
["",null,null,"00:00:00",null,"","",null,"","",null,null,null,null,"","",null,3]
["",null,null,"00:00:00",null,"","",null,"","",null,null,null,null,"","",null,3]
["",null,null,"00:00:00",null,"","",null,"","",null,null,null,null,"","",null,3]
["",null,null,"00:00:00",null,"","",null,"","",null,null,null,null,"","",null,3]
["",null,null,"00:00:00",null,"","",null,"","",null,null,null,null,"","",null,3]
["",null,null,"00:00:00",null,"","",null,"","",null,null,null,null,"","",null,3]
["",null,null,"00:00:00",null,"","",null,"","",null,null,null,null,"","",null,3]
["",null,null,"00:00:00",null,"","",null,"","",null,null,null,null,"","",null,3]
["",null,null,"00:00:00",null,"","",null,"","",null,null,null,null,"","",null,3]
["",null,null,"00:00:00",null,"","",null,"","",null,null,null,null,"","",null,3]
["",null,null,"00:00:00",null,"","",null,"","",null,null,null,null,"","",null,3]
["",null,null,"00:00:00",null,"","",null,"","",null,null,null,null,"","",null,3]
["",null,null,"00:00:00",null,"","",null,"","",null,null,null,null,"","",null,3]
["",null,null,"00:00:00",null,"","",null,"","",null,null,null,null,"","",null,3]
["",null,null,"00:00:00",null,"","",null,"","",null,null,null,null,"","",null,3]
["",null,null,"00:00:00",null,"","",null,"","",null,null,null,null,"","",null,3]
["",null,null,"00:00:00",null,"","",null,"","",null,null,null,null,"","",null,3]
["",null,null,"00:00:00",null,"","",null,"","",null,null,null,null,"","",null,3]
["",null,null,"00:00:00",null,"","",null,"","",null,null,null,null,"","",null,3]
["",null,null,"00:00:00",null,"","",null,"","",null,null,null,null,"","",null,3]
["",null,null,"00:00:00",null,"","",null,"","",null,null,null,null,"","",null,3]
["",null,null,"00:00:00",null,"","",null,"","",null,null,null,null,"","",null,3]
["",null,null,"00:00:00",null,"","",null,"","",null,null,null,null,"","",null,3]
["",null,null,"00:00:00",null,"","",null,"","",null,null,null,null,"","",null,3]
["",null,null,"00:00:00",null,"","",null,"","",null,null,null,null,"","",null,3]
["",null,null,"00:00:00",null,"","",null,"","",null,null,null,null,"","",null,3]
["",null,null,"00:00:00",null,"","",null,"","",null,null,null,null,"","",null,3]
["",null,null,"00:00:00",null,"","",null,"","",null,null,null,null,"","",null,3]
["",null,null,"00:00:00",null,"","",null,"","",null,null,null,null,"","",null,3]
["",null,null,"00:00:00",null,"","",null,"","",null,null,null,null,"","",null,3]
["",null,null,"00:00:00",null,"","",null,"","",null,null,null,null,"","",null,3]
[{"$f":"IF(E1732=\"\",\"\",IF(A1732=\"\",TODAY(),A1732))","v":""},null,null,{"$f":"C1732-B1732+IF(B1732>C1732,1)","v":"00:00:00"},null,{"$f":"IFERROR(VLOOKUP(E1732,$AJ$2:$AL$3155,2,FALSE),\"\")","v":""},{"$f":"IFERROR(VLOOKUP(E1732,$AJ$2:$AL$3155,3,FALSE),\"\")","v":""},null,{"$f":"IFERROR(SUM(G1732/7),\"\")","v":""},{"$f":"IFERROR(SUM(N1732/C1732),\"\")","v":""},null,null,null,null,{"$f":"IFERROR(ROUND(SUM(1000/K1732),2),\"\")","v":""},{"$f":"IFERROR(ROUND(SUM(N1732*O1732),2),\"\")","v":""},null,3]
["",null,null,"00:00:00",null,"","",null,"","",null,null,null,null,"","",null,3]
["",null,null,"00:00:00",null,"","",null,"","",null,null,null,null,"","",null,3]
["",null,null,"00:00:00",null,"","",null,"","",null,null,null,null,"","",null,3]
["",null,null,"00:00:00",null,"","",null,"","",null,null,null,null,"","",null,3]
["",null,null,"00:00:00",null,"","",null,"","",null,null,null,null,"","",null,3]
["",null,null,"00:00:00",null,"","",null,"","",null,null,null,null,"","",null,3]
["",null,null,"00:00:00",null,"","",null,"","",null,null,null,null,"","",null,3]
["",null,null,"00:00:00",null,"","",null,"","",null,null,null,null,"","",null,3]
["",null,null,"00:00:00",null,"","",null,"","",null,null,null,null,"","",null,3]
["",null,null,"00:00:00",null,"","",null,"","",null,null,null,null,"","",null,3]
["",null,null,"00:00:00",null,"","",null,"","",null,null,null,null,"","",null,3]
["",null,null,"00:00:00",null,"","",null,"","",null,null,null,null,"","",null,3]
["",null,null,"00:00:00",null,"","",null,"","",null,null,null,null,"","",null,3]
["",null,null,"00:00:00",null,"","",null,"","",null,null,null,null,"","",null,3]
["",null,null,"00:00:00",null,"","",null,"","",null,null,null,null,"","",null,3]
["",null,null,"00:00:00",null,"","",null,"","",null,null,null,null,"","",null,3]
["",null,null,"00:00:00",null,"","",null,"","",null,null,null,null,"","",null,3]
["",null,null,"00:00:00",null,"","",null,"","",null,null,null,null,"","",null,3]
["",null,null,"00:00:00",null,"","",null,"","",null,null,null,null,"","",null,3]
["",null,null,"00:00:00",null,"","",null,"","",null,null,null,null,"","",null,3]
["",null,null,"00:00:00",null,"","",null,"","",null,null,null,null,"","",null,3]
["",null,null,"00:00:00",null,"","",null,"","",null,null,null,null,"","",null,3]
["",null,null,"00:00:00",null,"","",null,"","",null,null,null,null,"","",null,3]
["",null,null,"00:00:00",null,"","",null,"","",null,null,null,null,"","",null,3]
["",null,null,"00:00:00",null,"","",null,"","",null,null,null,null,"","",null,3]
["",null,null,"00:00:00",null,"","",null,"","",null,null,null,null,"","",null,3]
["",null,null,"00:00:00",null,"","",null,"","",null,null,null,null,"","",null,3]
["",null,null,"00:00:00",null,"","",null,"","",null,null,null,null,"","",null,3]
["",null,null,"00:00:00",null,"","",null,"","",null,null,null,null,"","",null,3]
["",null,null,"00:00:00",null,"","",null,"","",null,null,null,null,"","",null,3]
["",null,null,"00:00:00",null,"","",null,"","",null,null,null,null,"","",null,3]
["",null,null,"00:00:00",null,"","",null,"","",null,null,null,null,"","",null,3]
["",null,null,"00:00:00",null,"","",null,"","",null,null,null,null,"","",null,3]
["",null,null,"00:00:00",null,"","",null,"","",null,null,null,null,"","",null,3]
["",null,null,"00:00:00",null,"","",null,"","",null,null,null,null,"","",null,3]
["",null,null,"00:00:00",null,"","",null,"","",null,null,null,null,"","",null,3]
["",null,null,"00:00:00",null,"","",null,"","",null,null,null,null,"","",null,3]
["",null,null,"00:00:00",null,"","",null,"","",null,null,null,null,"","",null,3]
["",null,null,"00:00:00",null,"","",null,"","",null,null,null,null,"","",null,3]
["",null,null,"00:00:00",null,"","",null,"","",null,null,null,null,"","",null,3]
["",null,null,"00:00:00",null,"","",null,"","",null,null,null,null,"","",null,3]
["",null,null,"00:00:00",null,"","",null,"","",null,null,null,null,"","",null,3]
["",null,null,"00:00:00",null,"","",null,"","",null,null,null,null,"","",null,3]
["",null,null,"00:00:00",null,"","",null,"","",null,null,null,null,"","",null,3]
["",null,null,"00:00:00",null,"","",null,"","",null,null,null,null,"","",null,3]
["",null,null,"00:00:00",null,"","",null,"","",null,null,null,null,"","",null,3]
["",null,null,"00:00:00",null,"","",null,"","",null,null,null,null,"","",null,3]
["",null,null,"00:00:00",null,"","",null,"","",null,null,null,null,"","",null,3]
["",null,null,"00:00:00",null,"","",null,"","",null,null,null,null,"","",null,3]
["",null,null,"00:00:00",null,"","",null,"","",null,null,null,null,"","",null,3]
["",null,null,"00:00:00",null,"","",null,"","",null,null,null,null,"","",null,3]
["",null,null,"00:00:00",null,"","",null,"","",null,null,null,null,"","",null,3]
["",null,null,"00:00:00",null,"","",null,"","",null,null,null,null,"","",null,3]
["",null,null,"00:00:00",null,"","",null,"","",null,null,null,null,"","",null,3]
["",null,null,"00:00:00",null,"","",null,"","",null,null,null,null,"","",null,3]
["",null,null,"00:00:00",null,"","",null,"","",null,null,null,null,"","",null,3]
["",null,null,"00:00:00",null,"","",null,"","",null,null,null,null,"","",null,3]
["",null,null,"00:00:00",null,"","",null,"","",null,null,null,null,"","",null,3]
["",null,null,"00:00:00",null,"","",null,"","",null,null,null,null,"","",null,3]
["",null,null,"00:00:00",null,"","",null,"","",null,null,null,null,"","",null,3]
["",null,null,"00:00:00",null,"","",null,"","",null,null,null,null,"","",null,3]
["",null,null,"00:00:00",null,"","",null,"","",null,null,null,null,"","",null,3]
["",null,null,"00:00:00",null,"","",null,"","",null,null,null,null,"","",null,3]
[{"$f":"IF(E1796=\"\",\"\",IF(A1796=\"\",TODAY(),A1796))","v":""},null,null,{"$f":"C1796-B1796+IF(B1796>C1796,1)","v":"00:00:00"},null,{"$f":"IFERROR(VLOOKUP(E1796,$AJ$2:$AL$3155,2,FALSE),\"\")","v":""},{"$f":"IFERROR(VLOOKUP(E1796,$AJ$2:$AL$3155,3,FALSE),\"\")","v":""},null,{"$f":"IFERROR(SUM(G1796/7),\"\")","v":""},{"$f":"IFERROR(SUM(N1796/C1796),\"\")","v":""},null,null,null,null,{"$f":"IFERROR(ROUND(SUM(1000/K1796),2),\"\")","v":""},{"$f":"IFERROR(ROUND(SUM(N1796*O1796),2),\"\")","v":""},null,3]
["",null,null,"00:00:00",null,"","",null,"","",null,null,null,null,"","",null,3]
["",null,null,"00:00:00",null,"","",null,"","",null,null,null,null,"","",null,3]
["",null,null,"00:00:00",null,"","",null,"","",null,null,null,null,"","",null,3]
["",null,null,"00:00:00",null,"","",null,"","",null,null,null,null,"","",null,3]
["",null,null,"00:00:00",null,"","",null,"","",null,null,null,null,"","",null,3]
["",null,null,"00:00:00",null,"","",null,"","",null,null,null,null,"","",null,3]
["",null,null,"00:00:00",null,"","",null,"","",null,null,null,null,"","",null,3]
["",null,null,"00:00:00",null,"","",null,"","",null,null,null,null,"","",null,3]
["",null,null,"00:00:00",null,"","",null,"","",null,null,null,null,"","",null,3]
["",null,null,"00:00:00",null,"","",null,"","",null,null,null,null,"","",null,3]
["",null,null,"00:00:00",null,"","",null,"","",null,null,null,null,"","",null,3]
["",null,null,"00:00:00",null,"","",null,"","",null,null,null,null,"","",null,3]
["",null,null,"00:00:00",null,"","",null,"","",null,null,null,null,"","",null,3]
["",null,null,"00:00:00",null,"","",null,"","",null,null,null,null,"","",null,3]
["",null,null,"00:00:00",null,"","",null,"","",null,null,null,null,"","",null,3]
["",null,null,"00:00:00",null,"","",null,"","",null,null,null,null,"","",null,3]
["",null,null,"00:00:00",null,"","",null,"","",null,null,null,null,"","",null,3]
["",null,null,"00:00:00",null,"","",null,"","",null,null,null,null,"","",null,3]
["",null,null,"00:00:00",null,"","",null,"","",null,null,null,null,"","",null,3]
["",null,null,"00:00:00",null,"","",null,"","",null,null,null,null,"","",null,3]
["",null,null,"00:00:00",null,"","",null,"","",null,null,null,null,"","",null,3]
["",null,null,"00:00:00",null,"","",null,"","",null,null,null,null,"","",null,3]
["",null,null,"00:00:00",null,"","",null,"","",null,null,null,null,"","",null,3]
["",null,null,"00:00:00",null,"","",null,"","",null,null,null,null,"","",null,3]
["",null,null,"00:00:00",null,"","",null,"","",null,null,null,null,"","",null,3]
["",null,null,"00:00:00",null,"","",null,"","",null,null,null,null,"","",null,3]
["",null,null,"00:00:00",null,"","",null,"","",null,null,null,null,"","",null,3]
["",null,null,"00:00:00",null,"","",null,"","",null,null,null,null,"","",null,3]
["",null,null,"00:00:00",null,"","",null,"","",null,null,null,null,"","",null,3]
["",null,null,"00:00:00",null,"","",null,"","",null,null,null,null,"","",null,3]
["",null,null,"00:00:00",null,"","",null,"","",null,null,null,null,"","",null,3]
["",null,null,"00:00:00",null,"","",null,"","",null,null,null,null,"","",null,3]
["",null,null,"00:00:00",null,"","",null,"","",null,null,null,null,"","",null,3]
["",null,null,"00:00:00",null,"","",null,"","",null,null,null,null,"","",null,3]
["",null,null,"00:00:00",null,"","",null,"","",null,null,null,null,"","",null,3]
["",null,null,"00:00:00",null,"","",null,"","",null,null,null,null,"","",null,3]
["",null,null,"00:00:00",null,"","",null,"","",null,null,null,null,"","",null,3]
["",null,null,"00:00:00",null,"","",null,"","",null,null,null,null,"","",null,3]
["",null,null,"00:00:00",null,"","",null,"","",null,null,null,null,"","",null,3]
["",null,null,"00:00:00",null,"","",null,"","",null,null,null,null,"","",null,3]
["",null,null,"00:00:00",null,"","",null,"","",null,null,null,null,"","",null,3]
["",null,null,"00:00:00",null,"","",null,"","",null,null,null,null,"","",null,3]
["",null,null,"00:00:00",null,"","",null,"","",null,null,null,null,"","",null,3]
["",null,null,"00:00:00",null,"","",null,"","",null,null,null,null,"","",null,3]
["",null,null,"00:00:00",null,"","",null,"","",null,null,null,null,"","",null,3]
["",null,null,"00:00:00",null,"","",null,"","",null,null,null,null,"","",null,3]
["",null,null,"00:00:00",null,"","",null,"","",null,null,null,null,"","",null,3]
["",null,null,"00:00:00",null,"","",null,"","",null,null,null,null,"","",null,3]
["",null,null,"00:00:00",null,"","",null,"","",null,null,null,null,"","",null,3]
["",null,null,"00:00:00",null,"","",null,"","",null,null,null,null,"","",null,3]
["",null,null,"00:00:00",null,"","",null,"","",null,null,null,null,"","",null,3]
["",null,null,"00:00:00",null,"","",null,"","",null,null,null,null,"","",null,3]
["",null,null,"00:00:00",null,"","",null,"","",null,null,null,null,"","",null,3]
["",null,null,"00:00:00",null,"","",null,"","",null,null,null,null,"","",null,3]
["",null,null,"00:00:00",null,"","",null,"","",null,null,null,null,"","",null,3]
["",null,null,"00:00:00",null,"","",null,"","",null,null,null,null,"","",null,3]
["",null,null,"00:00:00",null,"","",null,"","",null,null,null,null,"","",null,3]
["",null,null,"00:00:00",null,"","",null,"","",null,null,null,null,"","",null,3]
["",null,null,"00:00:00",null,"","",null,"","",null,null,null,null,"","",null,3]
["",null,null,"00:00:00",null,"","",null,"","",null,null,null,null,"","",null,3]
["",null,null,"00:00:00",null,"","",null,"","",null,null,null,null,"","",null,3]
["",null,null,"00:00:00",null,"","",null,"","",null,null,null,null,"","",null,3]
["",null,null,"00:00:00",null,"","",null,"","",null,null,null,null,"","",null,3]
[{"$f":"IF(E1860=\"\",\"\",IF(A1860=\"\",TODAY(),A1860))","v":""},null,null,{"$f":"C1860-B1860+IF(B1860>C1860,1)","v":"00:00:00"},null,{"$f":"IFERROR(VLOOKUP(E1860,$AJ$2:$AL$3155,2,FALSE),\"\")","v":""},{"$f":"IFERROR(VLOOKUP(E1860,$AJ$2:$AL$3155,3,FALSE),\"\")","v":""},null,{"$f":"IFERROR(SUM(G1860/7),\"\")","v":""},{"$f":"IFERROR(SUM(N1860/C1860),\"\")","v":""},null,null,null,null,{"$f":"IFERROR(ROUND(SUM(1000/K1860),2),\"\")","v":""},{"$f":"IFERROR(ROUND(SUM(N1860*O1860),2),\"\")","v":""},null,3]
["",null,null,"00:00:00",null,"","",null,"","",null,null,null,null,"","",null,3]
["",null,null,"00:00:00",null,"","",null,"","",null,null,null,null,"","",null,3]
["",null,null,"00:00:00",null,"","",null,"","",null,null,null,null,"","",null,3]
["",null,null,"00:00:00",null,"","",null,"","",null,null,null,null,"","",null,3]
["",null,null,"00:00:00",null,"","",null,"","",null,null,null,null,"","",null,3]
["",null,null,"00:00:00",null,"","",null,"","",null,null,null,null,"","",null,3]
["",null,null,"00:00:00",null,"","",null,"","",null,null,null,null,"","",null,3]
["",null,null,"00:00:00",null,"","",null,"","",null,null,null,null,"","",null,3]
["",null,null,"00:00:00",null,"","",null,"","",null,null,null,null,"","",null,3]
["",null,null,"00:00:00",null,"","",null,"","",null,null,null,null,"","",null,3]
["",null,null,"00:00:00",null,"","",null,"","",null,null,null,null,"","",null,3]
["",null,null,"00:00:00",null,"","",null,"","",null,null,null,null,"","",null,3]
["",null,null,"00:00:00",null,"","",null,"","",null,null,null,null,"","",null,3]
["",null,null,"00:00:00",null,"","",null,"","",null,null,null,null,"","",null,3]
["",null,null,"00:00:00",null,"","",null,"","",null,null,null,null,"","",null,3]
["",null,null,"00:00:00",null,"","",null,"","",null,null,null,null,"","",null,3]
["",null,null,"00:00:00",null,"","",null,"","",null,null,null,null,"","",null,3]
["",null,null,"00:00:00",null,"","",null,"","",null,null,null,null,"","",null,3]
["",null,null,"00:00:00",null,"","",null,"","",null,null,null,null,"","",null,3]
["",null,null,"00:00:00",null,"","",null,"","",null,null,null,null,"","",null,3]
["",null,null,"00:00:00",null,"","",null,"","",null,null,null,null,"","",null,3]
["",null,null,"00:00:00",null,"","",null,"","",null,null,null,null,"","",null,3]
["",null,null,"00:00:00",null,"","",null,"","",null,null,null,null,"","",null,3]
["",null,null,"00:00:00",null,"","",null,"","",null,null,null,null,"","",null,3]
["",null,null,"00:00:00",null,"","",null,"","",null,null,null,null,"","",null,3]
["",null,null,"00:00:00",null,"","",null,"","",null,null,null,null,"","",null,3]
["",null,null,"00:00:00",null,"","",null,"","",null,null,null,null,"","",null,3]
["",null,null,"00:00:00",null,"","",null,"","",null,null,null,null,"","",null,3]
["",null,null,"00:00:00",null,"","",null,"","",null,null,null,null,"","",null,3]
["",null,null,"00:00:00",null,"","",null,"","",null,null,null,null,"","",null,3]
["",null,null,"00:00:00",null,"","",null,"","",null,null,null,null,"","",null,3]
["",null,null,"00:00:00",null,"","",null,"","",null,null,null,null,"","",null,3]
["",null,null,"00:00:00",null,"","",null,"","",null,null,null,null,"","",null,3]
["",null,null,"00:00:00",null,"","",null,"","",null,null,null,null,"","",null,3]
["",null,null,"00:00:00",null,"","",null,"","",null,null,null,null,"","",null,3]
["",null,null,"00:00:00",null,"","",null,"","",null,null,null,null,"","",null,3]
["",null,null,"00:00:00",null,"","",null,"","",null,null,null,null,"","",null,3]
["",null,null,"00:00:00",null,"","",null,"","",null,null,null,null,"","",null,3]
["",null,null,"00:00:00",null,"","",null,"","",null,null,null,null,"","",null,3]
["",null,null,"00:00:00",null,"","",null,"","",null,null,null,null,"","",null,3]
["",null,null,"00:00:00",null,"","",null,"","",null,null,null,null,"","",null,3]
["",null,null,"00:00:00",null,"","",null,"","",null,null,null,null,"","",null,3]
["",null,null,"00:00:00",null,"","",null,"","",null,null,null,null,"","",null,3]
["",null,null,"00:00:00",null,"","",null,"","",null,null,null,null,"","",null,3]
["",null,null,"00:00:00",null,"","",null,"","",null,null,null,null,"","",null,3]
["",null,null,"00:00:00",null,"","",null,"","",null,null,null,null,"","",null,3]
["",null,null,"00:00:00",null,"","",null,"","",null,null,null,null,"","",null,3]
["",null,null,"00:00:00",null,"","",null,"","",null,null,null,null,"","",null,3]
["",null,null,"00:00:00",null,"","",null,"","",null,null,null,null,"","",null,3]
["",null,null,"00:00:00",null,"","",null,"","",null,null,null,null,"","",null,3]
["",null,null,"00:00:00",null,"","",null,"","",null,null,null,null,"","",null,3]
["",null,null,"00:00:00",null,"","",null,"","",null,null,null,null,"","",null,3]
["",null,null,"00:00:00",null,"","",null,"","",null,null,null,null,"","",null,3]
["",null,null,"00:00:00",null,"","",null,"","",null,null,null,null,"","",null,3]
["",null,null,"00:00:00",null,"","",null,"","",null,null,null,null,"","",null,3]
["",null,null,"00:00:00",null,"","",null,"","",null,null,null,null,"","",null,3]
["",null,null,"00:00:00",null,"","",null,"","",null,null,null,null,"","",null,3]
["",null,null,"00:00:00",null,"","",null,"","",null,null,null,null,"","",null,3]
["",null,null,"00:00:00",null,"","",null,"","",null,null,null,null,"","",null,3]
["",null,null,"00:00:00",null,"","",null,"","",null,null,null,null,"","",null,3]
["",null,null,"00:00:00",null,"","",null,"","",null,null,null,null,"","",null,3]
["",null,null,"00:00:00",null,"","",null,"","",null,null,null,null,"","",null,3]
["",null,null,"00:00:00",null,"","",null,"","",null,null,null,null,"","",null,3]
[{"$f":"IF(E1924=\"\",\"\",IF(A1924=\"\",TODAY(),A1924))","v":""},null,null,{"$f":"C1924-B1924+IF(B1924>C1924,1)","v":"00:00:00"},null,{"$f":"IFERROR(VLOOKUP(E1924,$AJ$2:$AL$3155,2,FALSE),\"\")","v":""},{"$f":"IFERROR(VLOOKUP(E1924,$AJ$2:$AL$3155,3,FALSE),\"\")","v":""},null,{"$f":"IFERROR(SUM(G1924/7),\"\")","v":""},{"$f":"IFERROR(SUM(N1924/C1924),\"\")","v":""},null,null,null,null,{"$f":"IFERROR(ROUND(SUM(1000/K1924),2),\"\")","v":""},{"$f":"IFERROR(ROUND(SUM(N1924*O1924),2),\"\")","v":""},null,3]
["",null,null,"00:00:00",null,"","",null,"","",null,null,null,null,"","",null,3]
["",null,null,"00:00:00",null,"","",null,"","",null,null,null,null,"","",null,3]
["",null,null,"00:00:00",null,"","",null,"","",null,null,null,null,"","",null,3]
["",null,null,"00:00:00",null,"","",null,"","",null,null,null,null,"","",null,3]
["",null,null,"00:00:00",null,"","",null,"","",null,null,null,null,"","",null,3]
["",null,null,"00:00:00",null,"","",null,"","",null,null,null,null,"","",null,3]
["",null,null,"00:00:00",null,"","",null,"","",null,null,null,null,"","",null,3]
["",null,null,"00:00:00",null,"","",null,"","",null,null,null,null,"","",null,3]
["",null,null,"00:00:00",null,"","",null,"","",null,null,null,null,"","",null,3]
["",null,null,"00:00:00",null,"","",null,"","",null,null,null,null,"","",null,3]
["",null,null,"00:00:00",null,"","",null,"","",null,null,null,null,"","",null,3]
["",null,null,"00:00:00",null,"","",null,"","",null,null,null,null,"","",null,3]
["",null,null,"00:00:00",null,"","",null,"","",null,null,null,null,"","",null,3]
["",null,null,"00:00:00",null,"","",null,"","",null,null,null,null,"","",null,3]
["",null,null,"00:00:00",null,"","",null,"","",null,null,null,null,"","",null,3]
["",null,null,"00:00:00",null,"","",null,"","",null,null,null,null,"","",null,3]
["",null,null,"00:00:00",null,"","",null,"","",null,null,null,null,"","",null,3]
["",null,null,"00:00:00",null,"","",null,"","",null,null,null,null,"","",null,3]
["",null,null,"00:00:00",null,"","",null,"","",null,null,null,null,"","",null,3]
["",null,null,"00:00:00",null,"","",null,"","",null,null,null,null,"","",null,3]
["",null,null,"00:00:00",null,"","",null,"","",null,null,null,null,"","",null,3]
["",null,null,"00:00:00",null,"","",null,"","",null,null,null,null,"","",null,3]
["",null,null,"00:00:00",null,"","",null,"","",null,null,null,null,"","",null,3]
["",null,null,"00:00:00",null,"","",null,"","",null,null,null,null,"","",null,3]
["",null,null,"00:00:00",null,"","",null,"","",null,null,null,null,"","",null,3]
["",null,null,"00:00:00",null,"","",null,"","",null,null,null,null,"","",null,3]
["",null,null,"00:00:00",null,"","",null,"","",null,null,null,null,"","",null,3]
["",null,null,"00:00:00",null,"","",null,"","",null,null,null,null,"","",null,3]
["",null,null,"00:00:00",null,"","",null,"","",null,null,null,null,"","",null,3]
["",null,null,"00:00:00",null,"","",null,"","",null,null,null,null,"","",null,3]
["",null,null,"00:00:00",null,"","",null,"","",null,null,null,null,"","",null,3]
["",null,null,"00:00:00",null,"","",null,"","",null,null,null,null,"","",null,3]
["",null,null,"00:00:00",null,"","",null,"","",null,null,null,null,"","",null,3]
["",null,null,"00:00:00",null,"","",null,"","",null,null,null,null,"","",null,3]
["",null,null,"00:00:00",null,"","",null,"","",null,null,null,null,"","",null,3]
["",null,null,"00:00:00",null,"","",null,"","",null,null,null,null,"","",null,3]
["",null,null,"00:00:00",null,"","",null,"","",null,null,null,null,"","",null,3]
["",null,null,"00:00:00",null,"","",null,"","",null,null,null,null,"","",null,3]
["",null,null,"00:00:00",null,"","",null,"","",null,null,null,null,"","",null,3]
["",null,null,"00:00:00",null,"","",null,"","",null,null,null,null,"","",null,3]
["",null,null,"00:00:00",null,"","",null,"","",null,null,null,null,"","",null,3]
["",null,null,"00:00:00",null,"","",null,"","",null,null,null,null,"","",null,3]
["",null,null,"00:00:00",null,"","",null,"","",null,null,null,null,"","",null,3]
["",null,null,"00:00:00",null,"","",null,"","",null,null,null,null,"","",null,3]
["",null,null,"00:00:00",null,"","",null,"","",null,null,null,null,"","",null,3]
["",null,null,"00:00:00",null,"","",null,"","",null,null,null,null,"","",null,3]
["",null,null,"00:00:00",null,"","",null,"","",null,null,null,null,"","",null,3]
["",null,null,"00:00:00",null,"","",null,"","",null,null,null,null,"","",null,3]
["",null,null,"00:00:00",null,"","",null,"","",null,null,null,null,"","",null,3]
["",null,null,"00:00:00",null,"","",null,"","",null,null,null,null,"","",null,3]
["",null,null,"00:00:00",null,"","",null,"","",null,null,null,null,"","",null,3]
["",null,null,"00:00:00",null,"","",null,"","",null,null,null,null,"","",null,3]
["",null,null,"00:00:00",null,"","",null,"","",null,null,null,null,"","",null,3]
["",null,null,"00:00:00",null,"","",null,"","",null,null,null,null,"","",null,3]
["",null,null,"00:00:00",null,"","",null,"","",null,null,null,null,"","",null,3]
["",null,null,"00:00:00",null,"","",null,"","",null,null,null,null,"","",null,3]
["",null,null,"00:00:00",null,"","",null,"","",null,null,null,null,"","",null,3]
["",null,null,"00:00:00",null,"","",null,"","",null,null,null,null,"","",null,3]
["",null,null,"00:00:00",null,"","",null,"","",null,null,null,null,"","",null,3]
["",null,null,"00:00:00",null,"","",null,"","",null,null,null,null,"","",null,3]
["",null,null,"00:00:00",null,"","",null,"","",null,null,null,null,"","",null,3]
["",null,null,"00:00:00",null,"","",null,"","",null,null,null,null,"","",null,3]
["",null,null,"00:00:00",null,"","",null,"","",null,null,null,null,"","",null,3]
[{"$f":"IF(E1988=\"\",\"\",IF(A1988=\"\",TODAY(),A1988))","v":""},null,null,{"$f":"C1988-B1988+IF(B1988>C1988,1)","v":"00:00:00"},null,{"$f":"IFERROR(VLOOKUP(E1988,$AJ$2:$AL$3155,2,FALSE),\"\")","v":""},{"$f":"IFERROR(VLOOKUP(E1988,$AJ$2:$AL$3155,3,FALSE),\"\")","v":""},null,{"$f":"IFERROR(SUM(G1988/7),\"\")","v":""},{"$f":"IFERROR(SUM(N1988/C1988),\"\")","v":""},null,null,null,null,{"$f":"IFERROR(ROUND(SUM(1000/K1988),2),\"\")","v":""},{"$f":"IFERROR(ROUND(SUM(N1988*O1988),2),\"\")","v":""},null,3]
["",null,null,"00:00:00",null,"","",null,"","",null,null,null,null,"","",null,3]
["",null,null,"00:00:00",null,"","",null,"","",null,null,null,null,"","",null,3]
["",null,null,"00:00:00",null,"","",null,"","",null,null,null,null,"","",null,3]
["",null,null,"00:00:00",null,"","",null,"","",null,null,null,null,"","",null,3]
["",null,null,"00:00:00",null,"","",null,"","",null,null,null,null,"","",null,3]
["",null,null,"00:00:00",null,"","",null,"","",null,null,null,null,"","",null,3]
["",null,null,"00:00:00",null,"","",null,"","",null,null,null,null,"","",null,3]
["",null,null,"00:00:00",null,"","",null,"","",null,null,null,null,"","",null,3]
["",null,null,"00:00:00",null,"","",null,"","",null,null,null,null,"","",null,3]
["",null,null,"00:00:00",null,"","",null,"","",null,null,null,null,"","",null,3]
["",null,null,"00:00:00",null,"","",null,"","",null,null,null,null,"","",null,3]
["",null,null,"00:00:00",null,"","",null,"","",null,null,null,null,"","",null,3]
["",null,null,"00:00:00",null,"","",null,"","",null,null,null,null,"","",null,3]

{"sheet":"Total Prodaction By shift","index":3,"n_rows":16,"n_cols":86,"rows_kept":16,"cut":false,"hidden":false,"merged":[[1,0,1,11],[1,12,1,21],[1,23,1,34],[1,35,1,44],[1,46,1,57],[1,58,1,67],[0,31,0,33],[0,35,0,44],[0,47,0,48],[0,50,0,51],[0,54,0,56],[0,58,0,67],[0,27,0,28],[0,1,0,2],[0,4,0,5],[0,8,0,10],[0,12,0,21],[0,24,0,25]]}
["From Date","2019-02-18",null,"To Date","2019-02-18",null,"Machine No.",1,"Name of the employee",null,null,"منصور محمد منصور",null,null,null,null,null,null,null,null,null,null,null,"From Date","2019-02-18",null,"To Date","2019-02-18",null,"Machine No.",5,"Name of the employee",null,null,"علي مراد حسن",null,null,null,null,null,null,null,null,null,null,null,"From Date","2019-02-18",null,"To Date","2019-02-18",null,"Machine No.",3,"Name of the employee",null,null,"صبحي محمد محمود",null,null,null,null,null,null,null,null,null,null,null,1,"Date","Date","Machine No.","Name of the Employee",2,"Date","Date","Machine No.","Name of the Employee",3,"Date","Date","Machine No.","Name of the Employee",null,"منصور محمد منصور"]
[null,null,null,null,null,null,null,null,null,null,null,null,null,null,null,null,null,null,null,null,null,null,null,null,null,null,null,null,null,null,null,null,null,null,null,null,null,null,null,null,null,null,null,null,null,null,null,null,null,null,null,null,null,null,null,null,null,null,null,null,null,null,null,null,null,null,null,null,null,null,{"$f":"\">=\"&B1","v":">=43514"},{"$f":"\"<=\"&E1","v":"<=43514"},{"$f":"H1","v":1},{"$f":"L1","v":"منصور محمد منصور"},null,{"$f":"\">=\"&Y1","v":">=43514"},{"$f":"\"<=\"&AB1","v":"<=43514"},{"$f":"AE1","v":5},{"$f":"AI1","v":"علي مراد حسن"},null,{"$f":"\">=\"&AV1","v":">=43514"},{"$f":"\"<=\"&AY1","v":"<=43514"},{"$f":"BB1","v":3},{"$f":"BF1","v":"صبحي محمد محمود"},null,"علي مراد حسن"]
["Date","Start Time","End Time","Total","Machine No.","Machine Name","Maximum power","Production rate per Shift","Average hourly output","Average hourly output","Gm/ML","Size MM"," Drawing  "," KG.\\ day","ML X KG."," ML.\\ day","Color","Shift","Name of the Employee","Name of Supervisor","OR No.","Comment",null,"Date","Start Time","End Time","Total","Machine No.","Machine Name","Maximum power","Production rate per Shift","Average hourly output","Average hourly output","Gm/ML","Size MM"," Drawing  "," KG.\\ day","ML X KG."," ML.\\ day","Color","Shift","Name of the Employee","Name of Supervisor","OR No.","Comment",null,"Date","Start Time","End Time","Total","Machine No.","Machine Name","Maximum power","Production rate per Shift","Average hourly output","Average hourly output","Gm/ML","Size MM"," Drawing  "," KG.\\ day","ML X KG."," ML.\\ day","Color","Shift","Name of the Employee","Name of Supervisor","OR No.","Comment",null,1,"Date","Date","Name of the Employee",null,null,null,null,null,null,null,null,null,null,null,null,"ابراهيم محمود ابراهيم"]
["2019-02-18","08:00:00","09:00:00","01:00:00",1,"Crosha COMEZ 2017",17.5,15,2.5,2.5,20,0.06,"eeee",15,50,750,"Black ",1,"منصور محمد منصور","محمود",2211,"hhh",null,"2019-02-18","08:30:00","16:30:00","08:00:00",5,"Crosha F.COLLIC 1996",7.8,5,1.1142857142857143,1.1142857142857143,20,7.0000000000000007E-2,"uuu",5,50,250,"A prominent White",2,"علي مراد حسن","اسامة",6666,null,null,"2019-02-18","11:30:00","15:30:00","04:00:00",3,"Crosha F.COLLIC 1996",12,13,1.7142857142857142,1.7142857142857142,5,0.08,"gfd",13,200,2600,"White",3,"صبحي محمد محمود","محمود",1000,null,null,null,{"$f":"\">=\"&B1","v":">=43514"},{"$f":"\"<=\"&E1","v":"<=43514"},{"$f":"L1","v":"منصور محمد منصور"},null,null,null,null,null,null,null,null,null,null,null,null,"مسعد رمزي مسعد"]
[null,null,null,null,null,null,null,null,null,null,null,null,null,null,null,null,null,null,null,null,null,null,null,null,null,null,null,null,null,null,null,null,null,null,null,null,null,null,null,null,null,null,null,null,null,null,"2019-02-18","09:00:00","16:00:00","07:00:00",5,"Crosha F.COLLIC 1996",10.4,11,1.4857142857142858,1.4857142857142858,6,7.0000000000000007E-2,"erer",11,166.67,1833.37,"Black ",3,"السيد محمد عبد العال","محمود",2000,null,null,2,"Date","Date","Name of the Employee",null,null,null,null,null,null,null,null,null,null,null,null,"عادل عزمي شنودة"]
[null,null,null,null,null,null,null,null,null,null,null,null,null,null,null,null,null,null,null,null,null,null,null,null,null,null,null,null,null,null,null,null,null,null,null,null,null,null,null,null,null,null,null,null,null,null,null,null,null,null,null,null,null,null,null,null,null,null,null,null,null,null,null,null,null,null,null,null,null,null,{"$f":"\">=\"&Y1","v":">=43514"},{"$f":"\"<=\"&AB1","v":"<=43514"},{"$f":"AI1","v":"علي مراد حسن"},null,null,null,null,null,null,null,null,null,null,null,null,"صبحي محمد محمود"]
[null,null,null,null,null,null,null,null,null,null,null,null,null,null,null,null,null,null,null,null,null,null,null,null,null,null,null,null,null,null,null,null,null,null,null,null,null,null,null,null,null,null,null,null,null,null,null,null,null,null,null,null,null,null,null,null,null,null,null,null,null,null,null,null,null,null,null,null,null,3,"Date","Date","Name of the Employee",null,null,null,null,null,null,null,null,null,null,null,null,"السيد محمد عبد العال"]
[null,null,null,null,null,null,null,null,null,null,null,null,null,null,null,null,null,null,null,null,null,null,null,null,null,null,null,null,null,null,null,null,null,null,null,null,null,null,null,null,null,null,null,null,null,null,null,null,null,null,null,null,null,null,null,null,null,null,null,null,null,null,null,null,null,null,null,null,null,null,{"$f":"\">=\"&AV1","v":">=43514"},{"$f":"\"<=\"&AY1","v":"<=43514"},{"$f":"BF1","v":"صبحي محمد محمود"},null,null,null,null,null,null,null,null,null,null,null,null,"عادل سيف الله السيد"]
[null,null,null,null,null,null,null,null,null,null,null,null,null,null,null,null,null,null,null,null,null,null,null,null,null,null,null,null,null,null,null,null,null,null,null,null,null,null,null,null,null,null,null,null,null,null,null,null,null,null,null,null,null,null,null,null,null,null,null,null,null,null,null,null,null,null,null,null,null,null,null,null,null,null,null,null,null,null,null,null,null,null,null,null,null,"خالد السيد عبد القادر"]
[null,null,null,null,null,null,null,null,null,null,null,null,null,null,null,null,null,null,null,null,null,null,null,null,null,null,null,null,null,null,null,null,null,null,null,null,null,null,null,null,null,null,null,null,null,null,null,null,null,null,null,null,null,null,null,null,null,null,null,null,null,null,null,null,null,null,null,null,null,null,null,null,null,null,null,null,null,null,null,null,null,null,null,null,null,"عادل صادق بشير"]
[null,null,null,null,null,null,null,null,null,null,null,null,null,null,null,null,null,null,null,null,null,null,null,null,null,null,null,null,null,null,null,null,null,null,null,null,null,null,null,null,null,null,null,null,null,null,null,null,null,null,null,null,null,null,null,null,null,null,null,null,null,null,null,null,null,null,null,null,null,null,null,null,null,null,null,null,null,null,null,null,null,null,null,null,null,"روماني عطية حبشي"]
[null,null,null,null,null,null,null,null,null,null,null,null,null,null,null,null,null,null,null,null,null,null,null,null,null,null,null,null,null,null,null,null,null,null,null,null,null,null,null,null,null,null,null,null,null,null,null,null,null,null,null,null,null,null,null,null,null,null,null,null,null,null,null,null,null,null,null,null,null,null,null,null,null,null,null,null,null,null,null,null,null,null,null,null,null,"احمد صادق توفيق"]
[null,null,null,null,null,null,null,null,null,null,null,null,null,null,null,null,null,null,null,null,null,null,null,null,null,null,null,null,null,null,null,null,null,null,null,null,null,null,null,null,null,null,null,null,null,null,null,null,null,null,null,null,null,null,null,null,null,null,null,null,null,null,null,null,null,null,null,null,null,null,null,null,null,null,null,null,null,null,null,null,null,null,null,null,null,"دينا مجدي ابراهيم"]
[null,null,null,null,null,null,null,null,null,null,null,null,null,null,null,null,null,null,null,null,null,null,null,null,null,null,null,null,null,null,null,null,null,null,null,null,null,null,null,null,null,null,null,null,null,null,null,null,null,null,null,null,null,null,null,null,null,null,null,null,null,null,null,null,null,null,null,null,null,null,null,null,null,null,null,null,null,null,null,null,null,null,null,null,null,"علي فرج على محمد"]
[null,null,null,null,null,null,null,null,null,null,null,null,null,null,null,null,null,null,null,null,null,null,null,null,null,null,null,null,null,null,null,null,null,null,null,null,null,null,null,null,null,null,null,null,null,null,null,null,null,null,null,null,null,null,null,null,null,null,null,null,null,null,null,null,null,null,null,null,null,null,null,null,null,null,null,null,null,null,null,null,null,null,null,null,null,"بوسي السيد عبد المنعم"]
[null,null,null,null,null,null,null,null,null,null,null,null,null,null,null,null,null,null,null,null,null,null,null,null,null,null,null,null,null,null,null,null,null,null,null,null,null,null,null,null,null,null,null,null,null,null,null,null,null,null,null,null,null,null,null,null,null,null,null,null,null,null,null,null,null,null,null,null,null,null,null,null,null,null,null,null,null,null,null,null,null,null,null,null,null,"محمد محمد عبد الوهاب"]

{"sheet":"Sheet1","index":4,"n_rows":0,"n_cols":0,"rows_kept":0,"cut":false,"hidden":false,"merged":[]}

{"sheet":"Sheet2","index":5,"n_rows":0,"n_cols":0,"rows_kept":0,"cut":false,"hidden":false,"merged":[]}