{"text_format":"1","workbook":"xlsx","n_sheets":6,"sheets":["Shift_1","Shift_2","Shift_3","Total Prodaction By shift","Sheet1","Sheet2"],"not_rendered":{"charts":0,"images":0,"macros":1,"external_links":0,"defined_names":14,"comments":0,"pivot_tables":0},"unopened":[],"bounds":{"document_bytes":16777216,"sheet_cells":100000,"rows_first":2000,"rows_last":500,"rows_between":2000,"halvings":0,"cell_chars":16384,"cell_head_chars":4096},"cells_cut":0,"cells_raw":0,"read":"whole","date_system":"1900"}

{"sheet":"Shift_1","index":0,"n_rows":2001,"n_cols":39,"rows_kept":2001,"cut":false,"hidden":false,"merged":[]}
[null,"T","T",null,"T",null,null,null,"T",null,null,"T","T","T","T",null,null,"T",null,"T","T","T","T"]
["Date","Start Time","End Time","Total","Machine No.","Machine Name","Capisty Power (Kgs / Shift )","Capisty Power Rate  (KGS / 1 HRS)","Minmum Power     ( Kgs / Shift )","Minimum Power Rate  (KGS / 1 HRS)","Acual Production (KGS / 1 HRS)","Production rate per Shift   ","Gm/ML","Size MM"," Drawing  "," Mtrs \\ KILO"," MTRS \\ SHIFT","Color","Shift","Machine Operator","Supervisor","Po. No.","Comment",null,null,null,null,null,null,null,null,null,0.05,"Black ","منصور محمد منصور","محمد","Machine number","Machine Name","Machine Type"]
[{"$f":"IF(E3=\"\",\"\",IF(A3=\"\",TODAY(),A3))","v":"2019-02-20"},"09:00:00","16:00:00",{"$f":"IF(B3=\"\",\"\",(C3-B3))","v":"07:00:00"},1,{"$f":"IFERROR(VLOOKUP(E3,$AK$3:$AM$317,2,FALSE),\"\")","v":"Crosha COMEZ 2017"},null,{"$f":"IFERROR(G3/D3/24,\"\")","v":0},8.5,{"$f":"IFERROR(I3/D3/24,\"\")","v":1.2142857142857144},{"$f":"IFERROR(L3/D3/24,\"\")","v":2.1428571428571432},15,3,0.06,"yyyyy",{"$f":"IFERROR(ROUND(SUM(1000/M3),2),\"\")","v":333.33},{"$f":"IFERROR(ROUND(SUM(L3*P3),2),\"\")","v":4999.95},"Black ",1,"علي مراد حسن","محمود",1111,"eeeee",null,null,null,null,null,null,null,null,null,0.06,"White","علي مراد حسن","محمود",1,"Crosha COMEZ 2017",17.5]
[{"$f":"IF(E4=\"\",\"\",IF(A4=\"\",TODAY(),A4))","v":"2019-02-20"},"08:00:00","15:45:00",{"$f":"IF(B4=\"\",\"\",(C4-B4))","v":"07:45:00"},2,{"$f":"IFERROR(VLOOKUP(E4,$AK$3:$AM$317,2,FALSE),\"\")","v":"Crosha COMEZ 2017"},null,{"$f":"IFERROR(G4/D4/24,\"\")","v":0},10,{"$f":"IFERROR(I4/D4/24,\"\")","v":1.2903225806451613},{"$f":"IFERROR(L4/D4/24,\"\")","v":2.3225806451612905},18,3,0.06,"hhh",{"$f":"IFERROR(ROUND(SUM(1000/M4),2),\"\")","v":333.33},{"$f":"IFERROR(ROUND(SUM(L4*P4),2),\"\")","v":5999.94},"White",1,"ابراهيم محمود ابراهيم","محمود",2222,null,null,null,null,null,null,null,null,null,null,7.0000000000000007E-2,"Black&White","ابراهيم محمود ابراهيم","اسامة",2,"Crosha COMEZ 2017",13.5]
["",null,null,"",null,"",null,"",null,"","",null,null,null,null,"","",null,1,null,null,null,null,null,null,null,null,null,null,null,null,null,0.08,"A prominent Black","مسعد رمزي مسعد",null,3,"Crosha F.COLLIC 1996",10.5]
["",null,null,"",null,"",null,"",null,"","",null,null,null,null,"","",null,1,null,null,null,null,null,null,null,null,null,null,null,null,null,0.09,"A prominent White","عادل عزمي شنودة",null,4,"Crosha F.COLLIC 1997",9.4499999999999993]
["",null,null,"",null,"",null,"",null,"","",null,null,null,null,"","",null,1,null,null,null,null,null,null,null,null,null,null,null,null,null,0.1,null,"صبحي محمد محمود",null,5,"Crosha F.COLLIC 1996",9.1]
["",null,null,"",null,"",null,"",null,"","",null,null,null,null,"","",null,1,null,null,null,null,null,null,null,null,null,null,null,null,null,0.11,null,"السيد محمد عبد العال",null,6,"Crosha"]
["",null,null,"",null,"",null,"",null,"","",null,null,null,null,"","",null,1,null,null,null,null,null,null,null,null,null,null,null,null,null,0.12,null,"عادل سيف الله السيد",null,7,"Crosha"]
["",null,null,"",null,"",null,"",null,"","",null,null,null,null,"","",null,1,null,null,null,null,null,null,null,null,null,null,null,null,null,0.13,null,"خالد السيد عبد القادر",null,8,"Crosha"]
["",null,null,"",null,"",null,"",null,"","",null,null,null,null,"","",null,1,null,null,null,null,null,null,null,null,null,null,null,null,null,0.14000000000000001,null,"عادل صادق بشير",null,9,"Crosha"]
["",null,null,"",null,"",null,"",null,"","",null,null,null,null,"","",null,1,null,null,null,null,null,null,null,null,null,null,null,null,null,0.15,null,"روماني عطية حبشي",null,10,"Crosha"]
["",null,null,"",null,"",null,"",null,"","",null,null,null,null,"","",null,1,null,null,null,null,null,null,null,null,null,null,null,null,null,0.16,null,"احمد صادق توفيق",null,11,"Crosha"]
["",null,null,"",null,"",null,"",null,"","",null,null,null,null,"","",null,1,null,null,null,null,null,null,null,null,null,null,null,null,null,0.17,null,"دينا مجدي ابراهيم",null,12,"Crosha"]
["",null,null,"",null,"",null,"",null,"","",null,null,null,null,"","",null,1,null,null,null,null,null,null,null,null,null,null,null,null,null,0.18,null,"علي فرج على محمد",null,13,"Crosha"]
["",null,null,"",null,"",null,"",null,"","",null,null,null,null,"","",null,1,null,null,null,null,null,null,null,null,null,null,null,null,null,0.19,null,"بوسي السيد عبد المنعم",null,14,"Crosha"]
["",null,null,"",null,"",null,"",null,"","",null,null,null,null,"","",null,1,null,null,null,null,null,null,null,null,null,null,null,null,null,0.2,null,"محمد محمد عبد الوهاب",null,15,"Crosha"]
["",null,null,"",null,"",null,"",null,"","",null,null,null,null,"","",null,1,null,null,null,null,null,null,null,null,null,null,null,null,null,0.21,null,"سعيد الليثي جاب الله",null,16,"Crosha"]
["",null,null,"",null,"",null,"",null,"","",null,null,null,null,"","",null,1,null,null,null,null,null,null,null,null,null,null,null,null,null,0.22,null,"احمد عبد الظاهر",null,17,"Crosha"]
["",null,null,"",null,"",null,"",null,"","",null,null,null,null,"","",null,1,null,null,null,null,null,null,null,null,null,null,null,null,null,0.23,null,"مصطفى عبد النبي مصطفى",null,18,"Crosha"]
["",null,null,"",null,"",null,"",null,"","",null,null,null,null,"","",null,1,null,null,null,null,null,null,null,null,null,null,null,null,null,0.24,null,"ابراهيم صبحي محمد السيد",null,19,"Crosha"]
["",null,null,"",null,"",null,"",null,"","",null,null,null,null,"","",null,1,null,null,null,null,null,null,null,null,null,null,null,null,null,0.25,null,"خميس حسن حسنين",null,20,"Crosha"]
["",null,null,"",null,"",null,"",null,"","",null,null,null,null,"","",null,1,null,null,null,null,null,null,null,null,null,null,null,null,null,0.26,null,"محمد حسني حسن",null,21,"Crosha"]
["",null,null,"",null,"",null,"",null,"","",null,null,null,null,"","",null,1,null,null,null,null,null,null,null,null,null,null,null,null,null,0.27,null,"محمد عادل محمد محمد",null,22,"Crosha"]
["",null,null,"",null,"",null,"",null,"","",null,null,null,null,"","",null,1,null,null,null,null,null,null,null,null,null,null,null,null,null,0.28000000000000003,null,"السيد عبد الحميد اسماعيل",null,23,"Crosha"]
["",null,null,"",null,"",null,"",null,"","",null,null,null,null,{"$f":"IFERROR(ROUND(SUM(1000/M26),2),\"\")","v":""},"",null,1,null,null,null,null,null,null,null,null,null,null,null,null,null,0.28999999999999998,null,"ابراهيم محمد فتوح",null,24,"Crosha"]
["",null,null,"",null,"",null,"",null,"","",null,null,null,null,"","",null,1,null,null,null,null,null,null,null,null,null,null,null,null,null,0.3,null,"عمرو محمد عبد الجليل",null,25,"Crosha"]
["",null,null,"",null,"",null,"",null,"","",null,null,null,null,"","",null,1,null,null,null,null,null,null,null,null,null,null,null,null,null,0.31,null,"خالد مصطفى العوضي",null,26,"Crosha"]
["",null,null,"",null,"",null,"",null,"","",null,null,null,null,"","",null,1,null,null,null,null,null,null,null,null,null,null,null,null,null,0.32,null,"حمادة احمد على النجار",null,27,"Crosha"]
["",null,null,"",null,"",null,"",null,"","",null,null,null,null,"","",null,1,null,null,null,null,null,null,null,null,null,null,null,null,null,0.33,null,"عاطف وليم لبيب",null,28,"Crosha"]
["",null,null,"",null,"",null,"",null,"","",null,null,null,null,"","",null,1,null,null,null,null,null,null,null,null,null,null,null,null,null,0.34,null,"عادل وليم نبيل",null,29,"Crosha"]
["",null,null,"",null,"",null,"",null,"","",null,null,null,null,"","",null,1,null,null,null,null,null,null,null,null,null,null,null,null,null,0.35,null,"بيشوي عزت شفيق",null,30,"Crosha"]
["",null,null,"",null,"",null,"",null,"","",null,null,null,null,"","",null,1,null,null,null,null,null,null,null,null,null,null,null,null,null,0.36,null,"محمد يحيى محمود",null,31,"Crosha"]
["",null,null,"",null,"",null,"",null,"","",null,null,null,null,"","",null,1,null,null,null,null,null,null,null,null,null,null,null,null,null,0.37,null,"احمد رمضان احمد",null,32,"Crosha"]
["",null,null,"",null,"",null,"",null,"","",null,null,null,null,"","",null,1,null,null,null,null,null,null,null,null,null,null,null,null,null,0.38,null,null,null,33,"Crosha"]
["",null,null,"",null,"",null,"",null,"","",null,null,null,null,"","",null,1,null,null,null,null,null,null,null,null,null,null,null,null,null,0.39,null,null,null,34,"Crosha"]
["",null,null,"",null,"",null,"",null,"","",null,null,null,null,"","",null,1,null,null,null,null,null,null,null,null,null,null,null,null,null,0.4,null,null,null,35,"Crosha"]
["",null,null,"",null,"",null,"",null,"","",null,null,null,null,"","",null,1,null,null,null,null,null,null,null,null,null,null,null,null,null,0.41,null,null,null,36,"Crosha"]
["",null,null,"",null,"",null,"",null,"","",null,null,null,null,"","",null,1,null,null,null,null,null,null,null,null,null,null,null,null,null,0.42,null,null,null,37,"Crosha"]
["",null,null,"",null,"",null,"",null,"","",null,null,null,null,"","",null,1,null,null,null,null,null,null,null,null,null,null,null,null,null,0.43,null,null,null,38,"Crosha"]
["",null,null,"",null,"",null,"",null,"","",null,null,null,null,"","",null,1,null,null,null,null,null,null,null,null,null,null,null,null,null,0.44,null,null,null,39,"Crosha"]
["",null,null,"",null,"",null,"",null,"","",null,null,null,null,"","",null,1,null,null,null,null,null,null,null,null,null,null,null,null,null,0.45,null,null,null,40,"Crosha"]
["",null,null,"",null,"",null,"",null,"","",null,null,null,null,"","",null,1,null,null,null,null,null,null,null,null,null,null,null,null,null,0.46,null,null,null,41,"Crosha"]
["",null,null,"",null,"",null,"",null,"","",null,null,null,null,"","",null,1,null,null,null,null,null,null,null,null,null,null,null,null,null,0.47,null,null,null,42,"Crosha"]
["",null,null,"",null,"",null,"",null,"","",null,null,null,null,"","",null,1,null,null,null,null,null,null,null,null,null,null,null,null,null,0.48,null,null,null,43,"Crosha"]
["",null,null,"",null,"",null,"",null,"","",null,null,null,null,"","",null,1,null,null,null,null,null,null,null,null,null,null,null,null,null,0.49,null,null,null,44,"Crosha"]
["",null,null,"",null,"",null,"",null,"","",null,null,null,null,"","",null,1,null,null,null,null,null,null,null,null,null,null,null,null,null,0.5,null,null,null,45,"Crosha"]
["",null,null,"",null,"",null,"",null,"","",null,null,null,null,"","",null,1,null,null,null,null,null,null,null,null,null,null,null,null,null,0.51,null,null,null,46,"Crosha"]
["",null,null,"",null,"",null,"",null,"","",null,null,null,null,"","",null,1,null,null,null,null,null,null,null,null,null,null,null,null,null,0.52,null,null,null,47,"Crosha"]
["",null,null,"",null,"",null,"",null,"","",null,null,null,null,"","",null,1,null,null,null,null,null,null,null,null,null,null,null,null,null,0.53,null,null,null,48,"Crosha"]
["",null,null,"",null,"",null,"",null,"","",null,null,null,null,"","",null,1,null,null,null,null,null,null,null,null,null,null,null,null,null,0.54,null,null,null,49,"Crosha"]
["",null,null,"",null,"",null,"",null,"","",null,null,null,null,"","",null,1,null,null,null,null,null,null,null,null,null,null,null,null,null,0.55000000000000004,null,null,null,50,"Crosha"]
["",null,null,"",null,"",null,"",null,"","",null,null,null,null,"","",null,1,null,null,null,null,null,null,null,null,null,null,null,null,null,0.56000000000000005,null,null,null,51,"Crosha"]
["",null,null,"",null,"",null,"",null,"","",null,null,null,null,"","",null,1,null,null,null,null,null,null,null,null,null,null,null,null,null,0.56999999999999995,null,null,null,52,"Crosha"]
["",null,null,"",null,"",null,"",null,"","",null,null,null,null,"","",null,1,null,null,null,null,null,null,null,null,null,null,null,null,null,0.57999999999999996,null,null,null,53,"Crosha"]
["",null,null,"",null,"",null,"",null,"","",null,null,null,null,"","",null,1,null,null,null,null,null,null,null,null,null,null,null,null,null,0.59,null,null,null,54,"Crosha"]
["",null,null,"",null,"",null,"",null,"","",null,null,null,null,"","",null,1,null,null,null,null,null,null,null,null,null,null,null,null,null,0.6,null,null,null,55,"Crosha"]
["",null,null,"",null,"",null,"",null,"","",null,null,null,null,"","",null,1,null,null,null,null,null,null,null,null,null,null,null,null,null,0.61,null,null,null,56,"Crosha"]
["",null,null,"",null,"",null,"",null,"","",null,null,null,null,"","",null,1,null,null,null,null,null,null,null,null,null,null,null,null,null,0.62,null,null,null,57,"Crosha"]
["",null,null,"",null,"",null,"",null,"","",null,null,null,null,"","",null,1,null,null,null,null,null,null,null,null,null,null,null,null,null,0.63,null,null,null,58,"Crosha"]
["",null,null,"",null,"",null,"",null,"","",null,null,null,null,"","",null,1,null,null,null,null,null,null,null,null,null,null,null,null,null,0.64,null,null,null,59,"Crosha"]
["",null,null,"",null,"",null,"",null,"","",null,null,null,null,"","",null,1,null,null,null,null,null,null,null,null,null,null,null,null,null,0.65,null,null,null,60,"Crosha"]
["",null,null,"",null,"",null,"",null,"","",null,null,null,null,"","",null,1,null,null,null,null,null,null,null,null,null,null,null,null,null,0.66,null,null,null,61,"Crosha"]
["",null,null,"",null,"",null,"",null,"","",null,null,null,null,"","",null,1,null,null,null,null,null,null,null,null,null,null,null,null,null,0.67,null,null,null,62,"Crosha"]
["",null,null,"",null,"",null,"",null,"","",null,null,null,null,"","",null,1,null,null,null,null,null,null,null,null,null,null,null,null,null,0.68,null,null,null,63,"Crosha"]
["",null,null,"",null,"",null,"",null,"","",null,null,null,null,"","",null,1,null,null,null,null,null,null,null,null,null,null,null,null,null,0.69,null,null,null,64,"Crosha"]
["",null,null,"",null,"",null,"",null,"","",null,null,null,null,"","",null,1,null,null,null,null,null,null,null,null,null,null,null,null,null,0.7,null,null,null,65,"Crosha"]
[{"$f":"IF(E68=\"\",\"\",IF(A68=\"\",TODAY(),A68))","v":""},null,null,{"$f":"IF(B68=\"\",\"\",(C68-B68))","v":""},null,{"$f":"IFERROR(VLOOKUP(E68,$AK$3:$AM$317,2,FALSE),\"\")","v":""},null,{"$f":"IFERROR(G68/D68/24,\"\")","v":""},null,{"$f":"IFERROR(I68/D68/24,\"\")","v":""},{"$f":"IFERROR(L68/D68/24,\"\")","v":""},null,null,null,null,"",{"$f":"IFERROR(ROUND(SUM(L68*P68),2),\"\")","v":""},null,1,null,null,null,null,null,null,null,null,null,null,null,null,null,0.71,null,null,null,66,"Crosha"]
["",null,null,"",null,"",null,"",null,"","",null,null,null,null,"","",null,1,null,null,null,null,null,null,null,null,null,null,null,null,null,0.72,null,null,null,67,"Crosha"]
["",null,null,"",null,"",null,"",null,"","",null,null,null,null,"","",null,1,null,null,null,null,null,null,null,null,null,null,null,null,null,0.73,null,null,null,68,"Crosha"]
["",null,null,"",null,"",null,"",null,"","",null,null,null,null,"","",null,1,null,null,null,null,null,null,null,null,null,null,null,null,null,0.74,null,null,null,69,"Crosha"]
["",null,null,"",null,"",null,"",null,"","",null,null,null,null,"","",null,1,null,null,null,null,null,null,null,null,null,null,null,null,null,0.75,null,null,null,70,"Crosha"]
["",null,null,"",null,"",null,"",null,"","",null,null,null,null,"","",null,1,null,null,null,null,null,null,null,null,null,null,null,null,null,0.76,null,null,null,71,"Crosha"]
["",null,null,"",null,"",null,"",null,"","",null,null,null,null,"","",null,1,null,null,null,null,null,null,null,null,null,null,null,null,null,0.77,null,null,null,72,"Crosha"]
["",null,null,"",null,"",null,"",null,"","",null,null,null,null,"","",null,1,null,null,null,null,null,null,null,null,null,null,null,null,null,0.78,null,null,null,73,"Crosha"]
["",null,null,"",null,"",null,"",null,"","",null,null,null,null,"","",null,1,null,null,null,null,null,null,null,null,null,null,null,null,null,0.79,null,null,null,74,"Crosha"]
["",null,null,"",null,"",null,"",null,"","",null,null,null,null,"","",null,1,null,null,null,null,null,null,null,null,null,null,null,null,null,0.8,null,null,null,75,"Crosha"]
["",null,null,"",null,"",null,"",null,"","",null,null,null,null,"","",null,1,null,null,null,null,null,null,null,null,null,null,null,null,null,0.81,null,null,null,76,"Crosha"]
["",null,null,"",null,"",null,"",null,"","",null,null,null,null,"","",null,1,null,null,null,null,null,null,null,null,null,null,null,null,null,0.82,null,null,null,77,"Crosha"]
["",null,null,"",null,"",null,"",null,"","",null,null,null,null,"","",null,1,null,null,null,null,null,null,null,null,null,null,null,null,null,0.83,null,null,null,78,"Crosha"]
["",null,null,"",null,"",null,"",null,"","",null,null,null,null,"","",null,1,null,null,null,null,null,null,null,null,null,null,null,null,null,0.84,null,null,null,79,"Crosha"]
["",null,null,"",null,"",null,"",null,"","",null,null,null,null,"","",null,1,null,null,null,null,null,null,null,null,null,null,null,null,null,0.85,null,null,null,80,"Crosha"]
["",null,null,"",null,"",null,"",null,"","",null,null,null,null,"","",null,1,null,null,null,null,null,null,null,null,null,null,null,null,null,0.86,null,null,null,81,"Crosha"]
["",null,null,"",null,"",null,"",null,"","",null,null,null,null,"","",null,1,null,null,null,null,null,null,null,null,null,null,null,null,null,0.87,null,null,null,82,"Crosha"]
["",null,null,"",null,"",null,"",null,"","",null,null,null,null,"","",null,1,null,null,null,null,null,null,null,null,null,null,null,null,null,0.88,null,null,null,83,"Crosha"]
["",null,null,"",null,"",null,"",null,"","",null,null,null,null,"","",null,1,null,null,null,null,null,null,null,null,null,null,null,null,null,0.89,null,null,null,84,"Crosha"]
["",null,null,"",null,"",null,"",null,"","",null,null,null,null,"","",null,1,null,null,null,null,null,null,null,null,null,null,null,null,null,0.9,null,null,null,85,"Crosha"]
["",null,null,"",null,"",null,"",null,"","",null,null,null,null,"","",null,1,null,null,null,null,null,null,null,null,null,null,null,null,null,0.91,null,null,null,86,"Crosha"]
["",null,null,"",null,"",null,"",null,"","",null,null,null,null,"","",null,1,null,null,null,null,null,null,null,null,null,null,null,null,null,0.92,null,null,null,87,"Crosha"]
["",null,null,"",null,"",null,"",null,"","",null,null,null,null,{"$f":"IFERROR(ROUND(SUM(1000/M90),2),\"\")","v":""},"",null,1,null,null,null,null,null,null,null,null,null,null,null,null,null,0.93,null,null,null,88,"Crosha"]
["",null,null,"",null,"",null,"",null,"","",null,null,null,null,"","",null,1,null,null,null,null,null,null,null,null,null,null,null,null,null,0.94,null,null,null,89,"Crosha"]
["",null,null,"",null,"",null,"",null,"","",null,null,null,null,"","",null,1,null,null,null,null,null,null,null,null,null,null,null,null,null,0.95,null,null,null,90,"Crosha"]
["",null,null,"",null,"",null,"",null,"","",null,null,null,null,"","",null,1,null,null,null,null,null,null,null,null,null,null,null,null,null,0.96,null,null,null,91,"Crosha"]
["",null,null,"",null,"",null,"",null,"","",null,null,null,null,"","",null,1,null,null,null,null,null,null,null,null,null,null,null,null,null,0.97,null,null,null,92,"Crosha"]
["",null,null,"",null,"",null,"",null,"","",null,null,null,null,"","",null,1,null,null,null,null,null,null,null,null,null,null,null,null,null,0.98,null,null,null,93,"Crosha"]
["",null,null,"",null,"",null,"",null,"","",null,null,null,null,"","",null,1,null,null,null,null,null,null,null,null,null,null,null,null,null,0.99,null,null,null,94,"Crosha"]
["",null,null,"",null,"",null,"",null,"","",null,null,null,null,"","",null,1,null,null,null,null,null,null,null,null,null,null,null,null,null,1,null,null,null,95,"Crosha"]
["",null,null,"",null,"",null,"",null,"","",null,null,null,null,"","",null,1,null,null,null,null,null,null,null,null,null,null,null,null,null,1.01,null,null,null,96,"Crosha"]
["",null,null,"",null,"",null,"",null,"","",null,null,null,null,"","",null,1,null,null,null,null,null,null,null,null,null,null,null,null,null,1.02,null,null,null,97,"Crosha"]
["",null,null,"",null,"",null,"",null,"","",null,null,null,null,"","",null,1,null,null,null,null,null,null,null,null,null,null,null,null,null,1.03,null,null,null,98,"Crosha"]
["",null,null,"",null,"",null,"",null,"","",null,null,null,null,"","",null,1,null,null,null,null,null,null,null,null,null,null,null,null,null,1.04,null,null,null,99,"Crosha"]
["",null,null,"",null,"",null,"",null,"","",null,null,null,null,"","",null,1,null,null,null,null,null,null,null,null,null,null,null,null,null,1.05,null,null,null,100,"Crosha"]
["",null,null,"",null,"",null,"",null,"","",null,null,null,null,"","",null,1,null,null,null,null,null,null,null,null,null,null,null,null,null,1.06,null,null,null,101,"Jakar - MULLER 2017",3.91]
["",null,null,"",null,"",null,"",null,"","",null,null,null,null,"","",null,1,null,null,null,null,null,null,null,null,null,null,null,null,null,1.07,null,null,null,102,"Jakar - MULLER 2017",5.94]
["",null,null,"",null,"",null,"",null,"","",null,null,null,null,"","",null,1,null,null,null,null,null,null,null,null,null,null,null,null,null,1.08,null,null,null,103,"Jakar"]
["",null,null,"",null,"",null,"",null,"","",null,null,null,null,"","",null,1,null,null,null,null,null,null,null,null,null,null,null,null,null,1.0900000000000001,null,null,null,104,"Jakar"]
["",null,null,"",null,"",null,"",null,"","",null,null,null,null,"","",null,1,null,null,null,null,null,null,null,null,null,null,null,null,null,1.1000000000000001,null,null,null,105,"Jakar"]
["",null,null,"",null,"",null,"",null,"","",null,null,null,null,"","",null,1,null,null,null,null,null,null,null,null,null,null,null,null,null,1.1100000000000001,null,null,null,106,"Jakar"]
["",null,null,"",null,"",null,"",null,"","",null,null,null,null,"","",null,1,null,null,null,null,null,null,null,null,null,null,null,null,null,1.1200000000000001,null,null,null,107,"Jakar"]
["",null,null,"",null,"",null,"",null,"","",null,null,null,null,"","",null,1,null,null,null,null,null,null,null,null,null,null,null,null,null,1.1299999999999999,null,null,null,108,"Jakar"]
["",null,null,"",null,"",null,"",null,"","",null,null,null,null,"","",null,1,null,null,null,null,null,null,null,null,null,null,null,null,null,1.1399999999999999,null,null,null,109,"Jakar"]
["",null,null,"",null,"",null,"",null,"","",null,null,null,null,"","",null,1,null,null,null,null,null,null,null,null,null,null,null,null,null,1.1499999999999999,null,null,null,110,"Jakar"]
["",null,null,"",null,"",null,"",null,"","",null,null,null,null,"","",null,1,null,null,null,null,null,null,null,null,null,null,null,null,null,1.1599999999999999,null,null,null,111,"Jakar"]
["",null,null,"",null,"",null,"",null,"","",null,null,null,null,"","",null,1,null,null,null,null,null,null,null,null,null,null,null,null,null,1.17,null,null,null,112,"Jakar"]
["",null,null,"",null,"",null,"",null,"","",null,null,null,null,"","",null,1,null,null,null,null,null,null,null,null,null,null,null,null,null,1.18,null,null,null,113,"Jakar"]
["",null,null,"",null,"",null,"",null,"","",null,null,null,null,"","",null,1,null,null,null,null,null,null,null,null,null,null,null,null,null,1.19,null,null,null,114,"Jakar"]
["",null,null,"",null,"",null,"",null,"","",null,null,null,null,"","",null,1,null,null,null,null,null,null,null,null,null,null,null,null,null,1.2,null,null,null,115,"Jakar"]
["",null,null,"",null,"",null,"",null,"","",null,null,null,null,"","",null,1,null,null,null,null,null,null,null,null,null,null,null,null,null,1.21,null,null,null,116,"Jakar"]
["",null,null,"",null,"",null,"",null,"","",null,null,null,null,"","",null,1,null,null,null,null,null,null,null,null,null,null,null,null,null,1.22,null,null,null,117,"Jakar"]
["",null,null,"",null,"",null,"",null,"","",null,null,null,null,"","",null,1,null,null,null,null,null,null,null,null,null,null,null,null,null,1.23,null,null,null,118,"Jakar"]
["",null,null,"",null,"",null,"",null,"","",null,null,null,null,"","",null,1,null,null,null,null,null,null,null,null,null,null,null,null,null,1.24,null,null,null,119,"Jakar"]
["",null,null,"",null,"",null,"",null,"","",null,null,null,null,"","",null,1,null,null,null,null,null,null,null,null,null,null,null,null,null,1.25,null,null,null,120,"Jakar"]
["",null,null,"",null,"",null,"",null,"","",null,null,null,null,"","",null,1,null,null,null,null,null,null,null,null,null,null,null,null,null,1.26,null,null,null,121,"Jakar"]
["",null,null,"",null,"",null,"",null,"","",null,null,null,null,"","",null,1,null,null,null,null,null,null,null,null,null,null,null,null,null,1.27,null,null,null,122,"Jakar"]
["",null,null,"",null,"",null,"",null,"","",null,null,null,null,"","",null,1,null,null,null,null,null,null,null,null,null,null,null,null,null,1.28,null,null,null,123,"Jakar"]
["",null,null,"",null,"",null,"",null,"","",null,null,null,null,"","",null,1,null,null,null,null,null,null,null,null,null,null,null,null,null,1.29,null,null,null,124,"Jakar"]
["",null,null,"",null,"",null,"",null,"","",null,null,null,null,"","",null,1,null,null,null,null,null,null,null,null,null,null,null,null,null,1.3,null,null,null,125,"Jakar"]
["",null,null,"",null,"",null,"",null,"","",null,null,null,null,"","",null,1,null,null,null,null,null,null,null,null,null,null,null,null,null,1.31,null,null,null,126,"Jakar"]
["",null,null,"",null,"",null,"",null,"","",null,null,null,null,"","",null,1,null,null,null,null,null,null,null,null,null,null,null,null,null,1.32,null,null,null,127,"Jakar"]
["",null,null,"",null,"",null,"",null,"","",null,null,null,null,"","",null,1,null,null,null,null,null,null,null,null,null,null,null,null,null,1.33,null,null,null,128,"Jakar"]
["",null,null,"",null,"",null,"",null,"","",null,null,null,null,"","",null,1,null,null,null,null,null,null,null,null,null,null,null,null,null,1.34,null,null,null,129,"Jakar"]
[{"$f":"IF(E132=\"\",\"\",IF(A132=\"\",TODAY(),A132))","v":""},null,null,{"$f":"IF(B132=\"\",\"\",(C132-B132))","v":""},null,{"$f":"IFERROR(VLOOKUP(E132,$AK$3:$AM$317,2,FALSE),\"\")","v":""},null,{"$f":"IFERROR(G132/D132/24,\"\")","v":""},null,{"$f":"IFERROR(I132/D132/24,\"\")","v":""},{"$f":"IFERROR(L132/D132/24,\"\")","v":""},null,null,null,null,"",{"$f":"IFERROR(ROUND(SUM(L132*P132),2),\"\")","v":""},null,1,null,null,null,null,null,null,null,null,null,null,null,null,null,1.35,null,null,null,130,"Jakar"]
["",null,null,"",null,"",null,"",null,"","",null,null,null,null,"","",null,1,null,null,null,null,null,null,null,null,null,null,null,null,null,1.36,null,null,null,131,"Jakar"]
["",null,null,"",null,"",null,"",null,"","",null,null,null,null,"","",null,1,null,null,null,null,null,null,null,null,null,null,null,null,null,1.37,null,null,null,132,"Jakar"]
["",null,null,"",null,"",null,"",null,"","",null,null,null,null,"","",null,1,null,null,null,null,null,null,null,null,null,null,null,null,null,1.38,null,null,null,133,"Jakar"]
["",null,null,"",null,"",null,"",null,"","",null,null,null,null,"","",null,1,null,null,null,null,null,null,null,null,null,null,null,null,null,1.39,null,null,null,134,"Jakar"]
["",null,null,"",null,"",null,"",null,"","",null,null,null,null,"","",null,1,null,null,null,null,null,null,null,null,null,null,null,null,null,1.4,null,null,null,135,"Jakar"]
["",null,null,"",null,"",null,"",null,"","",null,null,null,null,"","",null,1,null,null,null,null,null,null,null,null,null,null,null,null,null,1.41,null,null,null,136,"Jakar"]
["",null,null,"",null,"",null,"",null,"","",null,null,null,null,"","",null,1,null,null,null,null,null,null,null,null,null,null,null,null,null,1.42,null,null,null,137,"Jakar"]
["",null,null,"",null,"",null,"",null,"","",null,null,null,null,"","",null,1,null,null,null,null,null,null,null,null,null,null,null,null,null,1.43,null,null,null,138,"Jakar"]
["",null,null,"",null,"",null,"",null,"","",null,null,null,null,"","",null,1,null,null,null,null,null,null,null,null,null,null,null,null,null,1.44,null,null,null,139,"Jakar"]
["",null,null,"",null,"",null,"",null,"","",null,null,null,null,"","",null,1,null,null,null,null,null,null,null,null,null,null,null,null,null,1.45,null,null,null,140,"Jakar"]
["",null,null,"",null,"",null,"",null,"","",null,null,null,null,"","",null,1,null,null,null,null,null,null,null,null,null,null,null,null,null,1.46,null,null,null,141,"Jakar"]
["",null,null,"",null,"",null,"",null,"","",null,null,null,null,"","",null,1,null,null,null,null,null,null,null,null,null,null,null,null,null,1.47,null,null,null,142,"Jakar"]
["",null,null,"",null,"",null,"",null,"","",null,null,null,null,"","",null,1,null,null,null,null,null,null,null,null,null,null,null,null,null,1.48,null,null,null,143,"Jakar"]
["",null,null,"",null,"",null,"",null,"","",null,null,null,null,"","",null,1,null,null,null,null,null,null,null,null,null,null,null,null,null,1.49,null,null,null,144,"Jakar"]
["",null,null,"",null,"",null,"",null,"","",null,null,null,null,"","",null,1,null,null,null,null,null,null,null,null,null,null,null,null,null,1.5,null,null,null,145,"Jakar"]
["",null,null,"",null,"",null,"",null,"","",null,null,null,null,"","",null,1,null,null,null,null,null,null,null,null,null,null,null,null,null,1.51,null,null,null,146,"Jakar"]
["",null,null,"",null,"",null,"",null,"","",null,null,null,null,"","",null,1,null,null,null,null,null,null,null,null,null,null,null,null,null,1.52,null,null,null,147,"Jakar"]
["",null,null,"",null,"",null,"",null,"","",null,null,null,null,"","",null,1,null,null,null,null,null,null,null,null,null,null,null,null,null,1.53,null,null,null,148,"Jakar"]
["",null,null,"",null,"",null,"",null,"","",null,null,null,null,"","",null,1,null,null,null,null,null,null,null,null,null,null,null,null,null,1.54,null,null,null,149,"Jakar"]
["",null,null,"",null,"",null,"",null,"","",null,null,null,null,"","",null,1,null,null,null,null,null,null,null,null,null,null,null,null,null,1.55,null,null,null,150,"Jakar"]
["",null,null,"",null,"",null,"",null,"","",null,null,null,null,"","",null,1,null,null,null,null,null,null,null,null,null,null,null,null,null,1.56,null,null,null,151,"Jakar"]
["",null,null,"",null,"",null,"",null,"","",null,null,null,null,{"$f":"IFERROR(ROUND(SUM(1000/M154),2),\"\")","v":""},"",null,1,null,null,null,null,null,null,null,null,null,null,null,null,null,1.57,null,null,null,152,"Jakar"]
["",null,null,"",null,"",null,"",null,"","",null,null,null,null,"","",null,1,null,null,null,null,null,null,null,null,null,null,null,null,null,1.58,null,null,null,153,"Jakar"]
["",null,null,"",null,"",null,"",null,"","",null,null,null,null,"","",null,1,null,null,null,null,null,null,null,null,null,null,null,null,null,1.59,null,null,null,154,"Jakar"]
["",null,null,"",null,"",null,"",null,"","",null,null,null,null,"","",null,1,null,null,null,null,null,null,null,null,null,null,null,null,null,1.6,null,null,null,155,"Jakar"]
["",null,null,"",null,"",null,"",null,"","",null,null,null,null,"","",null,1,null,null,null,null,null,null,null,null,null,null,null,null,null,1.61,null,null,null,156,"Jakar"]
["",null,null,"",null,"",null,"",null,"","",null,null,null,null,"","",null,1,null,null,null,null,null,null,null,null,null,null,null,null,null,1.62,null,null,null,157,"Jakar"]
["",null,null,"",null,"",null,"",null,"","",null,null,null,null,"","",null,1,null,null,null,null,null,null,null,null,null,null,null,null,null,1.63,null,null,null,158,"Jakar"]
["",null,null,"",null,"",null,"",null,"","",null,null,null,null,"","",null,1,null,null,null,null,null,null,null,null,null,null,null,null,null,1.64,null,null,null,159,"Jakar"]
["",null,null,"",null,"",null,"",null,"","",null,null,null,null,"","",null,1,null,null,null,null,null,null,null,null,null,null,null,null,null,1.65,null,null,null,160,"Jakar"]
["",null,null,"",null,"",null,"",null,"","",null,null,null,null,"","",null,1,null,null,null,null,null,null,null,null,null,null,null,null,null,1.66,null,null,null,161,"Jakar"]
["",null,null,"",null,"",null,"",null,"","",null,null,null,null,"","",null,1,null,null,null,null,null,null,null,null,null,null,null,null,null,1.67,null,null,null,162,"Jakar"]
["",null,null,"",null,"",null,"",null,"","",null,null,null,null,"","",null,1,null,null,null,null,null,null,null,null,null,null,null,null,null,1.68,null,null,null,163,"Jakar"]
["",null,null,"",null,"",null,"",null,"","",null,null,null,null,"","",null,1,null,null,null,null,null,null,null,null,null,null,null,null,null,1.69,null,null,null,164,"Jakar"]
["",null,null,"",null,"",null,"",null,"","",null,null,null,null,"","",null,1,null,null,null,null,null,null,null,null,null,null,null,null,null,1.7,null,null,null,165,"Jakar"]
["",null,null,"",null,"",null,"",null,"","",null,null,null,null,"","",null,1,null,null,null,null,null,null,null,null,null,null,null,null,null,1.71,null,null,null,166,"Jakar"]
["",null,null,"",null,"",null,"",null,"","",null,null,null,null,"","",null,1,null,null,null,null,null,null,null,null,null,null,null,null,null,1.72,null,null,null,167,"Jakar"]
["",null,null,"",null,"",null,"",null,"","",null,null,null,null,"","",null,1,null,null,null,null,null,null,null,null,null,null,null,null,null,1.73,null,null,null,168,"Jakar"]
["",null,null,"",null,"",null,"",null,"","",null,null,null,null,"","",null,1,null,null,null,null,null,null,null,null,null,null,null,null,null,1.74,null,null,null,169,"Jakar"]
["",null,null,"",null,"",null,"",null,"","",null,null,null,null,"","",null,1,null,null,null,null,null,null,null,null,null,null,null,null,null,1.75,null,null,null,170,"Jakar"]
["",null,null,"",null,"",null,"",null,"","",null,null,null,null,"","",null,1,null,null,null,null,null,null,null,null,null,null,null,null,null,1.76,null,null,null,171,"Jakar"]
["",null,null,"",null,"",null,"",null,"","",null,null,null,null,"","",null,1,null,null,null,null,null,null,null,null,null,null,null,null,null,1.77,null,null,null,172,"Jakar"]
["",null,null,"",null,"",null,"",null,"","",null,null,null,null,"","",null,1,null,null,null,null,null,null,null,null,null,null,null,null,null,1.78,null,null,null,173,"Jakar"]
["",null,null,"",null,"",null,"",null,"","",null,null,null,null,"","",null,1,null,null,null,null,null,null,null,null,null,null,null,null,null,1.79,null,null,null,174,"Jakar"]
["",null,null,"",null,"",null,"",null,"","",null,null,null,null,"","",null,1,null,null,null,null,null,null,null,null,null,null,null,null,null,1.8,null,null,null,175,"Jakar"]
["",null,null,"",null,"",null,"",null,"","",null,null,null,null,"","",null,1,null,null,null,null,null,null,null,null,null,null,null,null,null,1.81,null,null,null,176,"Jakar"]
["",null,null,"",null,"",null,"",null,"","",null,null,null,null,"","",null,1,null,null,null,null,null,null,null,null,null,null,null,null,null,1.82,null,null,null,177,"Jakar"]
["",null,null,"",null,"",null,"",null,"","",null,null,null,null,"","",null,1,null,null,null,null,null,null,null,null,null,null,null,null,null,1.83,null,null,null,178,"Jakar"]
["",null,null,"",null,"",null,"",null,"","",null,null,null,null,"","",null,1,null,null,null,null,null,null,null,null,null,null,null,null,null,1.84,null,null,null,179,"Jakar"]
["",null,null,"",null,"",null,"",null,"","",null,null,null,null,"","",null,1,null,null,null,null,null,null,null,null,null,null,null,null,null,1.85,null,null,null,180,"Jakar"]
["",null,null,"",null,"",null,"",null,"","",null,null,null,null,"","",null,1,null,null,null,null,null,null,null,null,null,null,null,null,null,1.86,null,null,null,181,"Jakar"]
["",null,null,"",null,"",null,"",null,"","",null,null,null,null,"","",null,1,null,null,null,null,null,null,null,null,null,null,null,null,null,1.87,null,null,null,182,"Jakar"]
["",null,null,"",null,"",null,"",null,"","",null,null,null,null,"","",null,1,null,null,null,null,null,null,null,null,null,null,null,null,null,1.88,null,null,null,183,"Jakar"]
["",null,null,"",null,"",null,"",null,"","",null,null,null,null,"","",null,1,null,null,null,null,null,null,null,null,null,null,null,null,null,1.89,null,null,null,184,"Jakar"]
["",null,null,"",null,"",null,"",null,"","",null,null,null,null,"","",null,1,null,null,null,null,null,null,null,null,null,null,null,null,null,1.9,null,null,null,185,"Jakar"]
["",null,null,"",null,"",null,"",null,"","",null,null,null,null,"","",null,1,null,null,null,null,null,null,null,null,null,null,null,null,null,1.91,null,null,null,186,"Jakar"]
["",null,null,"",null,"",null,"",null,"","",null,null,null,null,"","",null,1,null,null,null,null,null,null,null,null,null,null,null,null,null,1.92,null,null,null,187,"Jakar"]
["",null,null,"",null,"",null,"",null,"","",null,null,null,null,"","",null,1,null,null,null,null,null,null,null,null,null,null,null,null,null,1.93,null,null,null,188,"Jakar"]
["",null,null,"",null,"",null,"",null,"","",null,null,null,null,"","",null,1,null,null,null,null,null,null,null,null,null,null,null,null,null,1.94,null,null,null,189,"Jakar"]
["",null,null,"",null,"",null,"",null,"","",null,null,null,null,"","",null,1,null,null,null,null,null,null,null,null,null,null,null,null,null,1.95,null,null,null,190,"Jakar"]
["",null,null,"",null,"",null,"",null,"","",null,null,null,null,"","",null,1,null,null,null,null,null,null,null,null,null,null,null,null,null,1.96,null,null,null,191,"Jakar"]
["",null,null,"",null,"",null,"",null,"","",null,null,null,null,"","",null,1,null,null,null,null,null,null,null,null,null,null,null,null,null,1.97,null,null,null,192,"Jakar"]
["",null,null,"",null,"",null,"",null,"","",null,null,null,null,"","",null,1,null,null,null,null,null,null,null,null,null,null,null,null,null,1.98,null,null,null,193,"Jakar"]
[{"$f":"IF(E196=\"\",\"\",IF(A196=\"\",TODAY(),A196))","v":""},null,null,{"$f":"IF(B196=\"\",\"\",(C196-B196))","v":""},null,{"$f":"IFERROR(VLOOKUP(E196,$AK$3:$AM$317,2,FALSE),\"\")","v":""},null,{"$f":"IFERROR(G196/D196/24,\"\")","v":""},null,{"$f":"IFERROR(I196/D196/24,\"\")","v":""},{"$f":"IFERROR(L196/D196/24,\"\")","v":""},null,null,null,null,"",{"$f":"IFERROR(ROUND(SUM(L196*P196),2),\"\")","v":""},null,1,null,null,null,null,null,null,null,null,null,null,null,null,null,1.99,null,null,null,194,"Jakar"]
["",null,null,"",null,"",null,"",null,"","",null,null,null,null,"","",null,1,null,null,null,null,null,null,null,null,null,null,null,null,null,2,null,null,null,195,"Jakar"]
["",null,null,"",null,"",null,"",null,"","",null,null,null,null,"","",null,1,null,null,null,null,null,null,null,null,null,null,null,null,null,2.0099999999999998,null,null,null,196,"Jakar"]
["",null,null,"",null,"",null,"",null,"","",null,null,null,null,"","",null,1,null,null,null,null,null,null,null,null,null,null,null,null,null,2.02,null,null,null,197,"Jakar"]
["",null,null,"",null,"",null,"",null,"","",null,null,null,null,"","",null,1,null,null,null,null,null,null,null,null,null,null,null,null,null,2.0299999999999998,null,null,null,198,"Jakar"]
["",null,null,"",null,"",null,"",null,"","",null,null,null,null,"","",null,1,null,null,null,null,null,null,null,null,null,null,null,null,null,2.04,null,null,null,199,"Jakar"]
["",null,null,"",null,"",null,"",null,"","",null,null,null,null,"","",null,1,null,null,null,null,null,null,null,null,null,null,null,null,null,2.0499999999999998,null,null,null,200,"Jakar"]
["",null,null,"",null,"",null,"",null,"","",null,null,null,null,"","",null,1,null,null,null,null,null,null,null,null,null,null,null,null,null,2.06,null,null,null,201,"Jakar"]
["",null,null,"",null,"",null,"",null,"","",null,null,null,null,"","",null,1,null,null,null,null,null,null,null,null,null,null,null,null,null,2.0699999999999998,null,null,null,202,"Jakar"]
["",null,null,"",null,"",null,"",null,"","",null,null,null,null,"","",null,1,null,null,null,null,null,null,null,null,null,null,null,null,null,2.08,null,null,null,203,"Jakar"]
["",null,null,"",null,"",null,"",null,"","",null,null,null,null,"","",null,1,null,null,null,null,null,null,null,null,null,null,null,null,null,2.09,null,null,null,204,"Jakar"]
["",null,null,"",null,"",null,"",null,"","",null,null,null,null,"","",null,1,null,null,null,null,null,null,null,null,null,null,null,null,null,2.1,null,null,null,205,"Jakar"]
["",null,null,"",null,"",null,"",null,"","",null,null,null,null,"","",null,1,null,null,null,null,null,null,null,null,null,null,null,null,null,2.11,null,null,null,206,"Jakar"]
["",null,null,"",null,"",null,"",null,"","",null,null,null,null,"","",null,1,null,null,null,null,null,null,null,null,null,null,null,null,null,2.12,null,null,null,207,"Jakar"]
["",null,null,"",null,"",null,"",null,"","",null,null,null,null,"","",null,1,null,null,null,null,null,null,null,null,null,null,null,null,null,2.13,null,null,null,208,"Jakar"]
["",null,null,"",null,"",null,"",null,"","",null,null,null,null,"","",null,1,null,null,null,null,null,null,null,null,null,null,null,null,null,2.14,null,null,null,209,"Jakar"]
["",null,null,"",null,"",null,"",null,"","",null,null,null,null,"","",null,1,null,null,null,null,null,null,null,null,null,null,null,null,null,2.15,null,null,null,210,"Jakar"]
["",null,null,"",null,"",null,"",null,"","",null,null,null,null,"","",null,1,null,null,null,null,null,null,null,null,null,null,null,null,null,2.16,null,null,null,211,"Jakar"]
["",null,null,"",null,"",null,"",null,"","",null,null,null,null,"","",null,1,null,null,null,null,null,null,null,null,null,null,null,null,null,2.17,null,null,null,212,"Jakar"]
["",null,null,"",null,"",null,"",null,"","",null,null,null,null,"","",null,1,null,null,null,null,null,null,null,null,null,null,null,null,null,2.1800000000000002,null,null,null,213,"Jakar"]
["",null,null,"",null,"",null,"",null,"","",null,null,null,null,"","",null,1,null,null,null,null,null,null,null,null,null,null,null,null,null,2.19,null,null,null,214,"Jakar"]
["",null,null,"",null,"",null,"",null,"","",null,null,null,null,"","",null,1,null,null,null,null,null,null,null,null,null,null,null,null,null,2.2000000000000002,null,null,null,215,"Jakar"]
["",null,null,"",null,"",null,"",null,"","",null,null,null,null,{"$f":"IFERROR(ROUND(SUM(1000/M218),2),\"\")","v":""},"",null,1,null,null,null,null,null,null,null,null,null,null,null,null,null,2.21,null,null,null,216,"Jakar"]
["",null,null,"",null,"",null,"",null,"","",null,null,null,null,"","",null,1,null,null,null,null,null,null,null,null,null,null,null,null,null,2.2200000000000002,null,null,null,217,"Jakar"]
["",null,null,"",null,"",null,"",null,"","",null,null,null,null,"","",null,1,null,null,null,null,null,null,null,null,null,null,null,null,null,2.23,null,null,null,218,"Jakar"]
["",null,null,"",null,"",null,"",null,"","",null,null,null,null,"","",null,1,null,null,null,null,null,null,null,null,null,null,null,null,null,2.2400000000000002,null,null,null,219,"Jakar"]
["",null,null,"",null,"",null,"",null,"","",null,null,null,null,"","",null,1,null,null,null,null,null,null,null,null,null,null,null,null,null,2.25,null,null,null,220,"Jakar"]
["",null,null,"",null,"",null,"",null,"","",null,null,null,null,"","",null,1,null,null,null,null,null,null,null,null,null,null,null,null,null,2.2599999999999998,null,null,null,221,"Jakar"]
["",null,null,"",null,"",null,"",null,"","",null,null,null,null,"","",null,1,null,null,null,null,null,null,null,null,null,null,null,null,null,2.27,null,null,null,222,"Jakar"]
["",null,null,"",null,"",null,"",null,"","",null,null,null,null,"","",null,1,null,null,null,null,null,null,null,null,null,null,null,null,null,2.2799999999999998,null,null,null,223,"Jakar"]
["",null,null,"",null,"",null,"",null,"","",null,null,null,null,"","",null,1,null,null,null,null,null,null,null,null,null,null,null,null,null,2.29,null,null,null,224,"Jakar"]
["",null,null,"",null,"",null,"",null,"","",null,null,null,null,"","",null,1,null,null,null,null,null,null,null,null,null,null,null,null,null,2.2999999999999998,null,null,null,225,"Jakar"]
["",null,null,"",null,"",null,"",null,"","",null,null,null,null,"","",null,1,null,null,null,null,null,null,null,null,null,null,null,null,null,2.31,null,null,null,226,"Jakar"]
["",null,null,"",null,"",null,"",null,"","",null,null,null,null,"","",null,1,null,null,null,null,null,null,null,null,null,null,null,null,null,2.3199999999999998,null,null,null,227,"Jakar"]
["",null,null,"",null,"",null,"",null,"","",null,null,null,null,"","",null,1,null,null,null,null,null,null,null,null,null,null,null,null,null,2.33,null,null,null,228,"Jakar"]
["",null,null,"",null,"",null,"",null,"","",null,null,null,null,"","",null,1,null,null,null,null,null,null,null,null,null,null,null,null,null,2.34,null,null,null,229,"Jakar"]
["",null,null,"",null,"",null,"",null,"","",null,null,null,null,"","",null,1,null,null,null,null,null,null,null,null,null,null,null,null,null,2.35,null,null,null,230,"Jakar"]
["",null,null,"",null,"",null,"",null,"","",null,null,null,null,"","",null,1,null,null,null,null,null,null,null,null,null,null,null,null,null,2.36,null,null,null,231,"Jakar"]
["",null,null,"",null,"",null,"",null,"","",null,null,null,null,"","",null,1,null,null,null,null,null,null,null,null,null,null,null,null,null,2.37,null,null,null,232,"Jakar"]
["",null,null,"",null,"",null,"",null,"","",null,null,null,null,"","",null,1,null,null,null,null,null,null,null,null,null,null,null,null,null,2.38,null,null,null,233,"Jakar"]
["",null,null,"",null,"",null,"",null,"","",null,null,null,null,"","",null,1,null,null,null,null,null,null,null,null,null,null,null,null,null,2.39,null,null,null,234,"Jakar"]
["",null,null,"",null,"",null,"",null,"","",null,null,null,null,"","",null,1,null,null,null,null,null,null,null,null,null,null,null,null,null,2.4,null,null,null,235,"Jakar"]
["",null,null,"",null,"",null,"",null,"","",null,null,null,null,"","",null,1,null,null,null,null,null,null,null,null,null,null,null,null,null,2.41,null,null,null,236,"Jakar"]
["",null,null,"",null,"",null,"",null,"","",null,null,null,null,"","",null,1,null,null,null,null,null,null,null,null,null,null,null,null,null,2.42,null,null,null,237,"Jakar"]
["",null,null,"",null,"",null,"",null,"","",null,null,null,null,"","",null,1,null,null,null,null,null,null,null,null,null,null,null,null,null,2.4300000000000002,null,null,null,238,"Jakar"]
["",null,null,"",null,"",null,"",null,"","",null,null,null,null,"","",null,1,null,null,null,null,null,null,null,null,null,null,null,null,null,2.44,null,null,null,239,"Jakar"]
["",null,null,"",null,"",null,"",null,"","",null,null,null,null,"","",null,1,null,null,null,null,null,null,null,null,null,null,null,null,null,2.4500000000000002,null,null,null,240,"Jakar"]
["",null,null,"",null,"",null,"",null,"","",null,null,null,null,"","",null,1,null,null,null,null,null,null,null,null,null,null,null,null,null,2.46,null,null,null,241,"Jakar"]
["",null,null,"",null,"",null,"",null,"","",null,null,null,null,"","",null,1,null,null,null,null,null,null,null,null,null,null,null,null,null,2.4700000000000002,null,null,null,242,"Jakar"]
["",null,null,"",null,"",null,"",null,"","",null,null,null,null,"","",null,1,null,null,null,null,null,null,null,null,null,null,null,null,null,2.48,null,null,null,243,"Jakar"]
["",null,null,"",null,"",null,"",null,"","",null,null,null,null,"","",null,1,null,null,null,null,null,null,null,null,null,null,null,null,null,2.4900000000000002,null,null,null,244,"Jakar"]
["",null,null,"",null,"",null,"",null,"","",null,null,null,null,"","",null,1,null,null,null,null,null,null,null,null,null,null,null,null,null,2.5,null,null,null,245,"Jakar"]
["",null,null,"",null,"",null,"",null,"","",null,null,null,null,"","",null,1,null,null,null,null,null,null,null,null,null,null,null,null,null,2.5099999999999998,null,null,null,246,"Jakar"]
["",null,null,"",null,"",null,"",null,"","",null,null,null,null,"","",null,1,null,null,null,null,null,null,null,null,null,null,null,null,null,2.52,null,null,null,247,"Jakar"]
["",null,null,"",null,"",null,"",null,"","",null,null,null,null,"","",null,1,null,null,null,null,null,null,null,null,null,null,null,null,null,2.5299999999999998,null,null,null,248,"Jakar"]
["",null,null,"",null,"",null,"",null,"","",null,null,null,null,"","",null,1,null,null,null,null,null,null,null,null,null,null,null,null,null,2.54,null,null,null,249,"Jakar"]
["",null,null,"",null,"",null,"",null,"","",null,null,null,null,"","",null,1,null,null,null,null,null,null,null,null,null,null,null,null,null,2.5499999999999998,null,null,null,250,"Jakar"]
["",null,null,"",null,"",null,"",null,"","",null,null,null,null,"","",null,1,null,null,null,null,null,null,null,null,null,null,null,null,null,2.56,null,null,null,251,"Jakar"]
["",null,null,"",null,"",null,"",null,"","",null,null,null,null,"","",null,1,null,null,null,null,null,null,null,null,null,null,null,null,null,2.57,null,null,null,252,"Jakar"]
["",null,null,"",null,"",null,"",null,"","",null,null,null,null,"","",null,1,null,null,null,null,null,null,null,null,null,null,null,null,null,2.58,null,null,null,253,"Jakar"]
["",null,null,"",null,"",null,"",null,"","",null,null,null,null,"","",null,1,null,null,null,null,null,null,null,null,null,null,null,null,null,2.59,null,null,null,254,"Jakar"]
["",null,null,"",null,"",null,"",null,"","",null,null,null,null,"","",null,1,null,null,null,null,null,null,null,null,null,null,null,null,null,2.6,null,null,null,255,"Jakar"]
["",null,null,"",null,"",null,"",null,"","",null,null,null,null,"","",null,1,null,null,null,null,null,null,null,null,null,null,null,null,null,2.61,null,null,null,256,"Jakar"]
["",null,null,"",null,"",null,"",null,"","",null,null,null,null,"","",null,1,null,null,null,null,null,null,null,null,null,null,null,null,null,2.62,null,null,null,257,"Jakar"]
[{"$f":"IF(E260=\"\",\"\",IF(A260=\"\",TODAY(),A260))","v":""},null,null,{"$f":"IF(B260=\"\",\"\",(C260-B260))","v":""},null,{"$f":"IFERROR(VLOOKUP(E260,$AK$3:$AM$317,2,FALSE),\"\")","v":""},null,{"$f":"IFERROR(G260/D260/24,\"\")","v":""},null,{"$f":"IFERROR(I260/D260/24,\"\")","v":""},{"$f":"IFERROR(L260/D260/24,\"\")","v":""},null,null,null,null,"",{"$f":"IFERROR(ROUND(SUM(L260*P260),2),\"\")","v":""},null,1,null,null,null,null,null,null,null,null,null,null,null,null,null,2.63,null,null,null,258,"Jakar"]
["",null,null,"",null,"",null,"",null,"","",null,null,null,null,"","",null,1,null,null,null,null,null,null,null,null,null,null,null,null,null,2.64,null,null,null,259,"Jakar"]
["",null,null,"",null,"",null,"",null,"","",null,null,null,null,"","",null,1,null,null,null,null,null,null,null,null,null,null,null,null,null,2.65,null,null,null,260,"Jakar"]
["",null,null,"",null,"",null,"",null,"","",null,null,null,null,"","",null,1,null,null,null,null,null,null,null,null,null,null,null,null,null,2.66,null,null,null,261,"Jakar"]
["",null,null,"",null,"",null,"",null,"","",null,null,null,null,"","",null,1,null,null,null,null,null,null,null,null,null,null,null,null,null,2.67,null,null,null,262,"Jakar"]
["",null,null,"",null,"",null,"",null,"","",null,null,null,null,"","",null,1,null,null,null,null,null,null,null,null,null,null,null,null,null,2.68,null,null,null,263,"Jakar"]
["",null,null,"",null,"",null,"",null,"","",null,null,null,null,"","",null,1,null,null,null,null,null,null,null,null,null,null,null,null,null,2.69,null,null,null,264,"Jakar"]
["",null,null,"",null,"",null,"",null,"","",null,null,null,null,"","",null,1,null,null,null,null,null,null,null,null,null,null,null,null,null,2.7,null,null,null,265,"Jakar"]
["",null,null,"",null,"",null,"",null,"","",null,null,null,null,"","",null,1,null,null,null,null,null,null,null,null,null,null,null,null,null,2.71,null,null,null,266,"Jakar"]
["",null,null,"",null,"",null,"",null,"","",null,null,null,null,"","",null,1,null,null,null,null,null,null,null,null,null,null,null,null,null,2.72,null,null,null,267,"Jakar"]
["",null,null,"",null,"",null,"",null,"","",null,null,null,null,"","",null,1,null,null,null,null,null,null,null,null,null,null,null,null,null,2.73,null,null,null,268,"Jakar"]
["",null,null,"",null,"",null,"",null,"","",null,null,null,null,"","",null,1,null,null,null,null,null,null,null,null,null,null,null,null,null,2.74,null,null,null,269,"Jakar"]
["",null,null,"",null,"",null,"",null,"","",null,null,null,null,"","",null,1,null,null,null,null,null,null,null,null,null,null,null,null,null,2.75,null,null,null,270,"Jakar"]
["",null,null,"",null,"",null,"",null,"","",null,null,null,null,"","",null,1,null,null,null,null,null,null,null,null,null,null,null,null,null,2.76,null,null,null,271,"Jakar"]
["",null,null,"",null,"",null,"",null,"","",null,null,null,null,"","",null,1,null,null,null,null,null,null,null,null,null,null,null,null,null,2.77,null,null,null,272,"Jakar"]
["",null,null,"",null,"",null,"",null,"","",null,null,null,null,"","",null,1,null,null,null,null,null,null,null,null,null,null,null,null,null,2.78,null,null,null,273,"Jakar"]
["",null,null,"",null,"",null,"",null,"","",null,null,null,null,"","",null,1,null,null,null,null,null,null,null,null,null,null,null,null,null,2.79,null,null,null,274,"Jakar"]
["",null,null,"",null,"",null,"",null,"","",null,null,null,null,"","",null,1,null,null,null,null,null,null,null,null,null,null,null,null,null,2.8,null,null,null,275,"Jakar"]
["",null,null,"",null,"",null,"",null,"","",null,null,null,null,"","",null,1,null,null,null,null,null,null,null,null,null,null,null,null,null,2.81,null,null,null,276,"Jakar"]
["",null,null,"",null,"",null,"",null,"","",null,null,null,null,"","",null,1,null,null,null,null,null,null,null,null,null,null,null,null,null,2.82,null,null,null,277,"Jakar"]
["",null,null,"",null,"",null,"",null,"","",null,null,null,null,"","",null,1,null,null,null,null,null,null,null,null,null,null,null,null,null,2.83,null,null,null,278,"Jakar"]
["",null,null,"",null,"",null,"",null,"","",null,null,null,null,"","",null,1,null,null,null,null,null,null,null,null,null,null,null,null,null,2.84,null,null,null,279,"Jakar"]
["",null,null,"",null,"",null,"",null,"","",null,null,null,null,{"$f":"IFERROR(ROUND(SUM(1000/M282),2),\"\")","v":""},"",null,1,null,null,null,null,null,null,null,null,null,null,null,null,null,2.85,null,null,null,280,"Jakar"]
["",null,null,"",null,"",null,"",null,"","",null,null,null,null,"","",null,1,null,null,null,null,null,null,null,null,null,null,null,null,null,2.86,null,null,null,281,"Jakar"]
["",null,null,"",null,"",null,"",null,"","",null,null,null,null,"","",null,1,null,null,null,null,null,null,null,null,null,null,null,null,null,2.87,null,null,null,282,"Jakar"]
["",null,null,"",null,"",null,"",null,"","",null,null,null,null,"","",null,1,null,null,null,null,null,null,null,null,null,null,null,null,null,2.88,null,null,null,283,"Jakar"]
["",null,null,"",null,"",null,"",null,"","",null,null,null,null,"","",null,1,null,null,null,null,null,null,null,null,null,null,null,null,null,2.89,null,null,null,284,"Jakar"]
["",null,null,"",null,"",null,"",null,"","",null,null,null,null,"","",null,1,null,null,null,null,null,null,null,null,null,null,null,null,null,2.9,null,null,null,285,"Jakar"]
["",null,null,"",null,"",null,"",null,"","",null,null,null,null,"","",null,1,null,null,null,null,null,null,null,null,null,null,null,null,null,2.91,null,null,null,286,"Jakar"]
["",null,null,"",null,"",null,"",null,"","",null,null,null,null,"","",null,1,null,null,null,null,null,null,null,null,null,null,null,null,null,2.92,null,null,null,287,"Jakar"]
["",null,null,"",null,"",null,"",null,"","",null,null,null,null,"","",null,1,null,null,null,null,null,null,null,null,null,null,null,null,null,2.93,null,null,null,288,"Jakar"]
["",null,null,"",null,"",null,"",null,"","",null,null,null,null,"","",null,1,null,null,null,null,null,null,null,null,null,null,null,null,null,2.94,null,null,null,289,"Jakar"]
["",null,null,"",null,"",null,"",null,"","",null,null,null,null,"","",null,1,null,null,null,null,null,null,null,null,null,null,null,null,null,2.95,null,null,null,290,"Jakar"]
["",null,null,"",null,"",null,"",null,"","",null,null,null,null,"","",null,1,null,null,null,null,null,null,null,null,null,null,null,null,null,2.96,null,null,null,291,"Jakar"]
["",null,null,"",null,"",null,"",null,"","",null,null,null,null,"","",null,1,null,null,null,null,null,null,null,null,null,null,null,null,null,2.97,null,null,null,292,"Jakar"]
["",null,null,"",null,"",null,"",null,"","",null,null,null,null,"","",null,1,null,null,null,null,null,null,null,null,null,null,null,null,null,2.98,null,null,null,293,"Jakar"]
["",null,null,"",null,"",null,"",null,"","",null,null,null,null,"","",null,1,null,null,null,null,null,null,null,null,null,null,null,null,null,2.99,null,null,null,294,"Jakar"]
["",null,null,"",null,"",null,"",null,"","",null,null,null,null,"","",null,1,null,null,null,null,null,null,null,null,null,null,null,null,null,3,null,null,null,295,"Jakar"]
["",null,null,"",null,"",null,"",null,"","",null,null,null,null,"","",null,1,null,null,null,null,null,null,null,null,null,null,null,null,null,3.01,null,null,null,296,"Jakar"]
["",null,null,"",null,"",null,"",null,"","",null,null,null,null,"","",null,1,null,null,null,null,null,null,null,null,null,null,null,null,null,3.02,null,null,null,297,"Jakar"]
["",null,null,"",null,"",null,"",null,"","",null,null,null,null,"","",null,1,null,null,null,null,null,null,null,null,null,null,null,null,null,3.03,null,null,null,298,"Jakar"]
["",null,null,"",null,"",null,"",null,"","",null,null,null,null,"","",null,1,null,null,null,null,null,null,null,null,null,null,null,null,null,3.04,null,null,null,299,"Jakar"]
["",null,null,"",null,"",null,"",null,"","",null,null,null,null,"","",null,1,null,null,null,null,null,null,null,null,null,null,null,null,null,3.05,null,null,null,300,"Jakar"]
["",null,null,"",null,"",null,"",null,"","",null,null,null,null,"","",null,1,null,null,null,null,null,null,null,null,null,null,null,null,null,3.06,null,null,null,301,"Electric iron"]
["",null,null,"",null,"",null,"",null,"","",null,null,null,null,"","",null,1,null,null,null,null,null,null,null,null,null,null,null,null,null,3.07,null,null,null,302,"Electric iron"]
["",null,null,"",null,"",null,"",null,"","",null,null,null,null,"","",null,1,null,null,null,null,null,null,null,null,null,null,null,null,null,3.08,null,null,null,303,"Electric iron"]
["",null,null,"",null,"",null,"",null,"","",null,null,null,null,"","",null,1,null,null,null,null,null,null,null,null,null,null,null,null,null,3.09,null,null,null,304,"Electric iron"]
["",null,null,"",null,"",null,"",null,"","",null,null,null,null,"","",null,1,null,null,null,null,null,null,null,null,null,null,null,null,null,3.1,null,null,null,305,"Electric iron"]
["",null,null,"",null,"",null,"",null,"","",null,null,null,null,"","",null,1,null,null,null,null,null,null,null,null,null,null,null,null,null,3.11,null,null,null,306,"Electric iron"]
["",null,null,"",null,"",null,"",null,"","",null,null,null,null,"","",null,1,null,null,null,null,null,null,null,null,null,null,null,null,null,3.12,null,null,null,307,"Electric iron"]
["",null,null,"",null,"",null,"",null,"","",null,null,null,null,"","",null,1,null,null,null,null,null,null,null,null,null,null,null,null,null,3.13,null,null,null,308,"Electric iron"]
["",null,null,"",null,"",null,"",null,"","",null,null,null,null,"","",null,1,null,null,null,null,null,null,null,null,null,null,null,null,null,3.14,null,null,null,309,"Electric iron"]
["",null,null,"",null,"",null,"",null,"","",null,null,null,null,"","",null,1,null,null,null,null,null,null,null,null,null,null,null,null,null,3.15,null,null,null,310,"Electric iron"]
["",null,null,"",null,"",null,"",null,"","",null,null,null,null,"","",null,1,null,null,null,null,null,null,null,null,null,null,null,null,null,3.16,null,null,null,311,"Electric iron"]
["",null,null,"",null,"",null,"",null,"","",null,null,null,null,"","",null,1,null,null,null,null,null,null,null,null,null,null,null,null,null,3.17,null,null,null,312,"Electric iron"]
["",null,null,"",null,"",null,"",null,"","",null,null,null,null,"","",null,1,null,null,null,null,null,null,null,null,null,null,null,null,null,3.18,null,null,null,313,"Electric iron"]
["",null,null,"",null,"",null,"",null,"","",null,null,null,null,"","",null,1,null,null,null,null,null,null,null,null,null,null,null,null,null,3.19,null,null,null,314,"Electric iron"]
["",null,null,"",null,"",null,"",null,"","",null,null,null,null,"","",null,1,null,null,null,null,null,null,null,null,null,null,null,null,null,3.2,null,null,null,315,"Electric iron"]
["",null,null,"",null,"",null,"",null,"","",null,null,null,null,"","",null,1,null,null,null,null,null,null,null,null,null,null,null,null,null,3.21]
["",null,null,"",null,"",null,"",null,"","",null,null,null,null,"","",null,1,null,null,null,null,null,null,null,null,null,null,null,null,null,3.22]
["",null,null,"",null,"",null,"",null,"","",null,null,null,null,"","",null,1,null,null,null,null,null,null,null,null,null,null,null,null,null,3.23]
["",null,null,"",null,"",null,"",null,"","",null,null,null,null,"","",null,1,null,null,null,null,null,null,null,null,null,null,null,null,null,3.24]
["",null,null,"",null,"",null,"",null,"","",null,null,null,null,"","",null,1,null,null,null,null,null,null,null,null,null,null,null,null,null,3.25]
["",null,null,"",null,"",null,"",null,"","",null,null,null,null,"","",null,1,null,null,null,null,null,null,null,null,null,null,null,null,null,3.26]
[{"$f":"IF(E324=\"\",\"\",IF(A324=\"\",TODAY(),A324))","v":""},null,null,{"$f":"IF(B324=\"\",\"\",(C324-B324))","v":""},null,{"$f":"IFERROR(VLOOKUP(E324,$AK$3:$AM$317,2,FALSE),\"\")","v":""},null,{"$f":"IFERROR(G324/D324/24,\"\")","v":""},null,{"$f":"IFERROR(I324/D324/24,\"\")","v":""},{"$f":"IFERROR(L324/D324/24,\"\")","v":""},null,null,null,null,"",{"$f":"IFERROR(ROUND(SUM(L324*P324),2),\"\")","v":""},null,1,null,null,null,null,null,null,null,null,null,null,null,null,null,3.27]
["",null,null,"",null,"",null,"",null,"","",null,null,null,null,"","",null,1,null,null,null,null,null,null,null,null,null,null,null,null,null,3.28]
["",null,null,"",null,"",null,"",null,"","",null,null,null,null,"","",null,1,null,null,null,null,null,null,null,null,null,null,null,null,null,3.29]
["",null,null,"",null,"",null,"",null,"","",null,null,null,null,"","",null,1,null,null,null,null,null,null,null,null,null,null,null,null,null,3.3]
["",null,null,"",null,"",null,"",null,"","",null,null,null,null,"","",null,1,null,null,null,null,null,null,null,null,null,null,null,null,null,3.31]
["",null,null,"",null,"",null,"",null,"","",null,null,null,null,"","",null,1,null,null,null,null,null,null,null,null,null,null,null,null,null,3.32]
["",null,null,"",null,"",null,"",null,"","",null,null,null,null,"","",null,1,null,null,null,null,null,null,null,null,null,null,null,null,null,3.33]
["",null,null,"",null,"",null,"",null,"","",null,null,null,null,"","",null,1,null,null,null,null,null,null,null,null,null,null,null,null,null,3.34]
["",null,null,"",null,"",null,"",null,"","",null,null,null,null,"","",null,1,null,null,null,null,null,null,null,null,null,null,null,null,null,3.35]
["",null,null,"",null,"",null,"",null,"","",null,null,null,null,"","",null,1,null,null,null,null,null,null,null,null,null,null,null,null,null,3.36]
["",null,null,"",null,"",null,"",null,"","",null,null,null,null,"","",null,1,null,null,null,null,null,null,null,null,null,null,null,null,null,3.37]
["",null,null,"",null,"",null,"",null,"","",null,null,null,null,"","",null,1,null,null,null,null,null,null,null,null,null,null,null,null,null,3.38]
["",null,null,"",null,"",null,"",null,"","",null,null,null,null,"","",null,1,null,null,null,null,null,null,null,null,null,null,null,null,null,3.39]
["",null,null,"",null,"",null,"",null,"","",null,null,null,null,"","",null,1,null,null,null,null,null,null,null,null,null,null,null,null,null,3.4]
["",null,null,"",null,"",null,"",null,"","",null,null,null,null,"","",null,1,null,null,null,null,null,null,null,null,null,null,null,null,null,3.41]
["",null,null,"",null,"",null,"",null,"","",null,null,null,null,"","",null,1,null,null,null,null,null,null,null,null,null,null,null,null,null,3.42]
["",null,null,"",null,"",null,"",null,"","",null,null,null,null,"","",null,1,null,null,null,null,null,null,null,null,null,null,null,null,null,3.43]
["",null,null,"",null,"",null,"",null,"","",null,null,null,null,"","",null,1,null,null,null,null,null,null,null,null,null,null,null,null,null,3.44]
["",null,null,"",null,"",null,"",null,"","",null,null,null,null,"","",null,1,null,null,null,null,null,null,null,null,null,null,null,null,null,3.45]
["",null,null,"",null,"",null,"",null,"","",null,null,null,null,"","",null,1,null,null,null,null,null,null,null,null,null,null,null,null,null,3.46]
["",null,null,"",null,"",null,"",null,"","",null,null,null,null,"","",null,1,null,null,null,null,null,null,null,null,null,null,null,null,null,3.47]
["",null,null,"",null,"",null,"",null,"","",null,null,null,null,"","",null,1,null,null,null,null,null,null,null,null,null,null,null,null,null,3.48]
["",null,null,"",null,"",null,"",null,"","",null,null,null,null,{"$f":"IFERROR(ROUND(SUM(1000/M346),2),\"\")","v":""},"",null,1,null,null,null,null,null,null,null,null,null,null,null,null,null,3.49]
["",null,null,"",null,"",null,"",null,"","",null,null,null,null,"","",null,1,null,null,null,null,null,null,null,null,null,null,null,null,null,3.5]
["",null,null,"",null,"",null,"",null,"","",null,null,null,null,"","",null,1,null,null,null,null,null,null,null,null,null,null,null,null,null,3.51]
["",null,null,"",null,"",null,"",null,"","",null,null,null,null,"","",null,1,null,null,null,null,null,null,null,null,null,null,null,null,null,3.52]
["",null,null,"",null,"",null,"",null,"","",null,null,null,null,"","",null,1,null,null,null,null,null,null,null,null,null,null,null,null,null,3.53]
["",null,null,"",null,"",null,"",null,"","",null,null,null,null,"","",null,1,null,null,null,null,null,null,null,null,null,null,null,null,null,3.54]
["",null,null,"",null,"",null,"",null,"","",null,null,null,null,"","",null,1,null,null,null,null,null,null,null,null,null,null,null,null,null,3.55]
["",null,null,"",null,"",null,"",null,"","",null,null,null,null,"","",null,1,null,null,null,null,null,null,null,null,null,null,null,null,null,3.56]
["",null,null,"",null,"",null,"",null,"","",null,null,null,null,"","",null,1,null,null,null,null,null,null,null,null,null,null,null,null,null,3.57]
["",null,null,"",null,"",null,"",null,"","",null,null,null,null,"","",null,1,null,null,null,null,null,null,null,null,null,null,null,null,null,3.58]
["",null,null,"",null,"",null,"",null,"","",null,null,null,null,"","",null,1,null,null,null,null,null,null,null,null,null,null,null,null,null,3.59]
["",null,null,"",null,"",null,"",null,"","",null,null,null,null,"","",null,1,null,null,null,null,null,null,null,null,null,null,null,null,null,3.6]
["",null,null,"",null,"",null,"",null,"","",null,null,null,null,"","",null,1,null,null,null,null,null,null,null,null,null,null,null,null,null,3.61]
["",null,null,"",null,"",null,"",null,"","",null,null,null,null,"","",null,1,null,null,null,null,null,null,null,null,null,null,null,null,null,3.62]
["",null,null,"",null,"",null,"",null,"","",null,null,null,null,"","",null,1,null,null,null,null,null,null,null,null,null,null,null,null,null,3.63]
["",null,null,"",null,"",null,"",null,"","",null,null,null,null,"","",null,1,null,null,null,null,null,null,null,null,null,null,null,null,null,3.64]
["",null,null,"",null,"",null,"",null,"","",null,null,null,null,"","",null,1,null,null,null,null,null,null,null,null,null,null,null,null,null,3.65]
["",null,null,"",null,"",null,"",null,"","",null,null,null,null,"","",null,1,null,null,null,null,null,null,null,null,null,null,null,null,null,3.66]
["",null,null,"",null,"",null,"",null,"","",null,null,null,null,"","",null,1,null,null,null,null,null,null,null,null,null,null,null,null,null,3.67]
["",null,null,"",null,"",null,"",null,"","",null,null,null,null,"","",null,1,null,null,null,null,null,null,null,null,null,null,null,null,null,3.68]
["",null,null,"",null,"",null,"",null,"","",null,null,null,null,"","",null,1,null,null,null,null,null,null,null,null,null,null,null,null,null,3.69]
["",null,null,"",null,"",null,"",null,"","",null,null,null,null,"","",null,1,null,null,null,null,null,null,null,null,null,null,null,null,null,3.7]
["",null,null,"",null,"",null,"",null,"","",null,null,null,null,"","",null,1,null,null,null,null,null,null,null,null,null,null,null,null,null,3.71]
["",null,null,"",null,"",null,"",null,"","",null,null,null,null,"","",null,1,null,null,null,null,null,null,null,null,null,null,null,null,null,3.72]
["",null,null,"",null,"",null,"",null,"","",null,null,null,null,"","",null,1,null,null,null,null,null,null,null,null,null,null,null,null,null,3.73]
["",null,null,"",null,"",null,"",null,"","",null,null,null,null,"","",null,1,null,null,null,null,null,null,null,null,null,null,null,null,null,3.74]
["",null,null,"",null,"",null,"",null,"","",null,null,null,null,"","",null,1,null,null,null,null,null,null,null,null,null,null,null,null,null,3.75]
["",null,null,"",null,"",null,"",null,"","",null,null,null,null,"","",null,1,null,null,null,null,null,null,null,null,null,null,null,null,null,3.76]
["",null,null,"",null,"",null,"",null,"","",null,null,null,null,"","",null,1,null,null,null,null,null,null,null,null,null,null,null,null,null,3.77]
["",null,null,"",null,"",null,"",null,"","",null,null,null,null,"","",null,1,null,null,null,null,null,null,null,null,null,null,null,null,null,3.78]
["",null,null,"",null,"",null,"",null,"","",null,null,null,null,"","",null,1,null,null,null,null,null,null,null,null,null,null,null,null,null,3.79]
["",null,null,"",null,"",null,"",null,"","",null,null,null,null,"","",null,1,null,null,null,null,null,null,null,null,null,null,null,null,null,3.8]
["",null,null,"",null,"",null,"",null,"","",null,null,null,null,"","",null,1,null,null,null,null,null,null,null,null,null,null,null,null,null,3.81]
["",null,null,"",null,"",null,"",null,"","",null,null,null,null,"","",null,1,null,null,null,null,null,null,null,null,null,null,null,null,null,3.82]
["",null,null,"",null,"",null,"",null,"","",null,null,null,null,"","",null,1,null,null,null,null,null,null,null,null,null,null,null,null,null,3.83]
["",null,null,"",null,"",null,"",null,"","",null,null,null,null,"","",null,1,null,null,null,null,null,null,null,null,null,null,null,null,null,3.84]
["",null,null,"",null,"",null,"",null,"","",null,null,null,null,"","",null,1,null,null,null,null,null,null,null,null,null,null,null,null,null,3.85]
["",null,null,"",null,"",null,"",null,"","",null,null,null,null,"","",null,1,null,null,null,null,null,null,null,null,null,null,null,null,null,3.86]
["",null,null,"",null,"",null,"",null,"","",null,null,null,null,"","",null,1,null,null,null,null,null,null,null,null,null,null,null,null,null,3.87]
["",null,null,"",null,"",null,"",null,"","",null,null,null,null,"","",null,1,null,null,null,null,null,null,null,null,null,null,null,null,null,3.88]
["",null,null,"",null,"",null,"",null,"","",null,null,null,null,"","",null,1,null,null,null,null,null,null,null,null,null,null,null,null,null,3.89]
["",null,null,"",null,"",null,"",null,"","",null,null,null,null,"","",null,1,null,null,null,null,null,null,null,null,null,null,null,null,null,3.9]
[{"$f":"IF(E388=\"\",\"\",IF(A388=\"\",TODAY(),A388))","v":""},null,null,{"$f":"IF(B388=\"\",\"\",(C388-B388))","v":""},null,{"$f":"IFERROR(VLOOKUP(E388,$AK$3:$AM$317,2,FALSE),\"\")","v":""},null,{"$f":"IFERROR(G388/D388/24,\"\")","v":""},null,{"$f":"IFERROR(I388/D388/24,\"\")","v":""},{"$f":"IFERROR(L388/D388/24,\"\")","v":""},null,null,null,null,"",{"$f":"IFERROR(ROUND(SUM(L388*P388),2),\"\")","v":""},null,1,null,null,null,null,null,null,null,null,null,null,null,null,null,3.91]
["",null,null,"",null,"",null,"",null,"","",null,null,null,null,"","",null,1,null,null,null,null,null,null,null,null,null,null,null,null,null,3.92]
["",null,null,"",null,"",null,"",null,"","",null,null,null,null,"","",null,1,null,null,null,null,null,null,null,null,null,null,null,null,null,3.93]
["",null,null,"",null,"",null,"",null,"","",null,null,null,null,"","",null,1,null,null,null,null,null,null,null,null,null,null,null,null,null,3.94]
["",null,null,"",null,"",null,"",null,"","",null,null,null,null,"","",null,1,null,null,null,null,null,null,null,null,null,null,null,null,null,3.95]
["",null,null,"",null,"",null,"",null,"","",null,null,null,null,"","",null,1,null,null,null,null,null,null,null,null,null,null,null,null,null,3.96]
["",null,null,"",null,"",null,"",null,"","",null,null,null,null,"","",null,1,null,null,null,null,null,null,null,null,null,null,null,null,null,3.97]
["",null,null,"",null,"",null,"",null,"","",null,null,null,null,"","",null,1,null,null,null,null,null,null,null,null,null,null,null,null,null,3.98]
["",null,null,"",null,"",null,"",null,"","",null,null,null,null,"","",null,1,null,null,null,null,null,null,null,null,null,null,null,null,null,3.99]
["",null,null,"",null,"",null,"",null,"","",null,null,null,null,"","",null,1,null,null,null,null,null,null,null,null,null,null,null,null,null,4]
["",null,null,"",null,"",null,"",null,"","",null,null,null,null,"","",null,1,null,null,null,null,null,null,null,null,null,null,null,null,null,4.01]
["",null,null,"",null,"",null,"",null,"","",null,null,null,null,"","",null,1,null,null,null,null,null,null,null,null,null,null,null,null,null,4.0199999999999996]
["",null,null,"",null,"",null,"",null,"","",null,null,null,null,"","",null,1,null,null,null,null,null,null,null,null,null,null,null,null,null,4.03]
["",null,null,"",null,"",null,"",null,"","",null,null,null,null,"","",null,1,null,null,null,null,null,null,null,null,null,null,null,null,null,4.04]
["",null,null,"",null,"",null,"",null,"","",null,null,null,null,"","",null,1,null,null,null,null,null,null,null,null,null,null,null,null,null,4.05]
["",null,null,"",null,"",null,"",null,"","",null,null,null,null,"","",null,1,null,null,null,null,null,null,null,null,null,null,null,null,null,4.0599999999999996]
["",null,null,"",null,"",null,"",null,"","",null,null,null,null,"","",null,1,null,null,null,null,null,null,null,null,null,null,null,null,null,4.07]
["",null,null,"",null,"",null,"",null,"","",null,null,null,null,"","",null,1,null,null,null,null,null,null,null,null,null,null,null,null,null,4.08]
["",null,null,"",null,"",null,"",null,"","",null,null,null,null,"","",null,1,null,null,null,null,null,null,null,null,null,null,null,null,null,4.09]
["",null,null,"",null,"",null,"",null,"","",null,null,null,null,"","",null,1,null,null,null,null,null,null,null,null,null,null,null,null,null,4.0999999999999996]
["",null,null,"",null,"",null,"",null,"","",null,null,null,null,"","",null,1,null,null,null,null,null,null,null,null,null,null,null,null,null,4.1100000000000003]
["",null,null,"",null,"",null,"",null,"","",null,null,null,null,"","",null,1,null,null,null,null,null,null,null,null,null,null,null,null,null,4.12]
["",null,null,"",null,"",null,"",null,"","",null,null,null,null,{"$f":"IFERROR(ROUND(SUM(1000/M410),2),\"\")","v":""},"",null,1,null,null,null,null,null,null,null,null,null,null,null,null,null,4.13]
["",null,null,"",null,"",null,"",null,"","",null,null,null,null,"","",null,1,null,null,null,null,null,null,null,null,null,null,null,null,null,4.1399999999999997]
["",null,null,"",null,"",null,"",null,"","",null,null,null,null,"","",null,1,null,null,null,null,null,null,null,null,null,null,null,null,null,4.1500000000000004]
["",null,null,"",null,"",null,"",null,"","",null,null,null,null,"","",null,1,null,null,null,null,null,null,null,null,null,null,null,null,null,4.16]
["",null,null,"",null,"",null,"",null,"","",null,null,null,null,"","",null,1,null,null,null,null,null,null,null,null,null,null,null,null,null,4.17]
["",null,null,"",null,"",null,"",null,"","",null,null,null,null,"","",null,1,null,null,null,null,null,null,null,null,null,null,null,null,null,4.18]
["",null,null,"",null,"",null,"",null,"","",null,null,null,null,"","",null,1,null,null,null,null,null,null,null,null,null,null,null,null,null,4.1900000000000004]
["",null,null,"",null,"",null,"",null,"","",null,null,null,null,"","",null,1,null,null,null,null,null,null,null,null,null,null,null,null,null,4.2]
["",null,null,"",null,"",null,"",null,"","",null,null,null,null,"","",null,1,null,null,null,null,null,null,null,null,null,null,null,null,null,4.21]
["",null,null,"",null,"",null,"",null,"","",null,null,null,null,"","",null,1,null,null,null,null,null,null,null,null,null,null,null,null,null,4.22]
["",null,null,"",null,"",null,"",null,"","",null,null,null,null,"","",null,1,null,null,null,null,null,null,null,null,null,null,null,null,null,4.2300000000000004]
["",null,null,"",null,"",null,"",null,"","",null,null,null,null,"","",null,1,null,null,null,null,null,null,null,null,null,null,null,null,null,4.24]
["",null,null,"",null,"",null,"",null,"","",null,null,null,null,"","",null,1,null,null,null,null,null,null,null,null,null,null,null,null,null,4.25]
["",null,null,"",null,"",null,"",null,"","",null,null,null,null,"","",null,1,null,null,null,null,null,null,null,null,null,null,null,null,null,4.26]
["",null,null,"",null,"",null,"",null,"","",null,null,null,null,"","",null,1,null,null,null,null,null,null,null,null,null,null,null,null,null,4.2699999999999996]
["",null,null,"",null,"",null,"",null,"","",null,null,null,null,"","",null,1,null,null,null,null,null,null,null,null,null,null,null,null,null,4.28]
["",null,null,"",null,"",null,"",null,"","",null,null,null,null,"","",null,1,null,null,null,null,null,null,null,null,null,null,null,null,null,4.29]
["",null,null,"",null,"",null,"",null,"","",null,null,null,null,"","",null,1,null,null,null,null,null,null,null,null,null,null,null,null,null,4.3]
["",null,null,"",null,"",null,"",null,"","",null,null,null,null,"","",null,1,null,null,null,null,null,null,null,null,null,null,null,null,null,4.3099999999999996]
["",null,null,"",null,"",null,"",null,"","",null,null,null,null,"","",null,1,null,null,null,null,null,null,null,null,null,null,null,null,null,4.32]
["",null,null,"",null,"",null,"",null,"","",null,null,null,null,"","",null,1,null,null,null,null,null,null,null,null,null,null,null,null,null,4.33]
["",null,null,"",null,"",null,"",null,"","",null,null,null,null,"","",null,1,null,null,null,null,null,null,null,null,null,null,null,null,null,4.34]
["",null,null,"",null,"",null,"",null,"","",null,null,null,null,"","",null,1,null,null,null,null,null,null,null,null,null,null,null,null,null,4.3499999999999996]
["",null,null,"",null,"",null,"",null,"","",null,null,null,null,"","",null,1,null,null,null,null,null,null,null,null,null,null,null,null,null,4.3600000000000003]
["",null,null,"",null,"",null,"",null,"","",null,null,null,null,"","",null,1,null,null,null,null,null,null,null,null,null,null,null,null,null,4.37]
["",null,null,"",null,"",null,"",null,"","",null,null,null,null,"","",null,1,null,null,null,null,null,null,null,null,null,null,null,null,null,4.38]
["",null,null,"",null,"",null,"",null,"","",null,null,null,null,"","",null,1,null,null,null,null,null,null,null,null,null,null,null,null,null,4.3899999999999997]
["",null,null,"",null,"",null,"",null,"","",null,null,null,null,"","",null,1,null,null,null,null,null,null,null,null,null,null,null,null,null,4.4000000000000004]
["",null,null,"",null,"",null,"",null,"","",null,null,null,null,"","",null,1,null,null,null,null,null,null,null,null,null,null,null,null,null,4.41]
["",null,null,"",null,"",null,"",null,"","",null,null,null,null,"","",null,1,null,null,null,null,null,null,null,null,null,null,null,null,null,4.42]
["",null,null,"",null,"",null,"",null,"","",null,null,null,null,"","",null,1,null,null,null,null,null,null,null,null,null,null,null,null,null,4.43]
["",null,null,"",null,"",null,"",null,"","",null,null,null,null,"","",null,1,null,null,null,null,null,null,null,null,null,null,null,null,null,4.4400000000000004]
["",null,null,"",null,"",null,"",null,"","",null,null,null,null,"","",null,1,null,null,null,null,null,null,null,null,null,null,null,null,null,4.45]
["",null,null,"",null,"",null,"",null,"","",null,null,null,null,"","",null,1,null,null,null,null,null,null,null,null,null,null,null,null,null,4.46]
["",null,null,"",null,"",null,"",null,"","",null,null,null,null,"","",null,1,null,null,null,null,null,null,null,null,null,null,null,null,null,4.47]
["",null,null,"",null,"",null,"",null,"","",null,null,null,null,"","",null,1,null,null,null,null,null,null,null,null,null,null,null,null,null,4.4800000000000004]
["",null,null,"",null,"",null,"",null,"","",null,null,null,null,"","",null,1,null,null,null,null,null,null,null,null,null,null,null,null,null,4.49]
["",null,null,"",null,"",null,"",null,"","",null,null,null,null,"","",null,1,null,null,null,null,null,null,null,null,null,null,null,null,null,4.5]
["",null,null,"",null,"",null,"",null,"","",null,null,null,null,"","",null,1,null,null,null,null,null,null,null,null,null,null,null,null,null,4.51]
["",null,null,"",null,"",null,"",null,"","",null,null,null,null,"","",null,1,null,null,null,null,null,null,null,null,null,null,null,null,null,4.5199999999999996]
["",null,null,"",null,"",null,"",null,"","",null,null,null,null,"","",null,1,null,null,null,null,null,null,null,null,null,null,null,null,null,4.53]
["",null,null,"",null,"",null,"",null,"","",null,null,null,null,"","",null,1,null,null,null,null,null,null,null,null,null,null,null,null,null,4.54]
[{"$f":"IF(E452=\"\",\"\",IF(A452=\"\",TODAY(),A452))","v":""},null,null,{"$f":"IF(B452=\"\",\"\",(C452-B452))","v":""},null,{"$f":"IFERROR(VLOOKUP(E452,$AK$3:$AM$317,2,FALSE),\"\")","v":""},null,{"$f":"IFERROR(G452/D452/24,\"\")","v":""},null,{"$f":"IFERROR(I452/D452/24,\"\")","v":""},{"$f":"IFERROR(L452/D452/24,\"\")","v":""},null,null,null,null,"",{"$f":"IFERROR(ROUND(SUM(L452*P452),2),\"\")","v":""},null,1,null,null,null,null,null,null,null,null,null,null,null,null,null,4.55]
["",null,null,"",null,"",null,"",null,"","",null,null,null,null,"","",null,1,null,null,null,null,null,null,null,null,null,null,null,null,null,4.5599999999999996]
["",null,null,"",null,"",null,"",null,"","",null,null,null,null,"","",null,1,null,null,null,null,null,null,null,null,null,null,null,null,null,4.57]
["",null,null,"",null,"",null,"",null,"","",null,null,null,null,"","",null,1,null,null,null,null,null,null,null,null,null,null,null,null,null,4.58]
["",null,null,"",null,"",null,"",null,"","",null,null,null,null,"","",null,1,null,null,null,null,null,null,null,null,null,null,null,null,null,4.59]
["",null,null,"",null,"",null,"",null,"","",null,null,null,null,"","",null,1,null,null,null,null,null,null,null,null,null,null,null,null,null,4.5999999999999996]
["",null,null,"",null,"",null,"",null,"","",null,null,null,null,"","",null,1,null,null,null,null,null,null,null,null,null,null,null,null,null,4.6100000000000003]
["",null,null,"",null,"",null,"",null,"","",null,null,null,null,"","",null,1,null,null,null,null,null,null,null,null,null,null,null,null,null,4.62]
["",null,null,"",null,"",null,"",null,"","",null,null,null,null,"","",null,1,null,null,null,null,null,null,null,null,null,null,null,null,null,4.63]
["",null,null,"",null,"",null,"",null,"","",null,null,null,null,"","",null,1,null,null,null,null,null,null,null,null,null,null,null,null,null,4.6399999999999997]
["",null,null,"",null,"",null,"",null,"","",null,null,null,null,"","",null,1,null,null,null,null,null,null,null,null,null,null,null,null,null,4.6500000000000004]
["",null,null,"",null,"",null,"",null,"","",null,null,null,null,"","",null,1,null,null,null,null,null,null,null,null,null,null,null,null,null,4.66]
["",null,null,"",null,"",null,"",null,"","",null,null,null,null,"","",null,1,null,null,null,null,null,null,null,null,null,null,null,null,null,4.67]
["",null,null,"",null,"",null,"",null,"","",null,null,null,null,"","",null,1,null,null,null,null,null,null,null,null,null,null,null,null,null,4.68]
["",null,null,"",null,"",null,"",null,"","",null,null,null,null,"","",null,1,null,null,null,null,null,null,null,null,null,null,null,null,null,4.6900000000000004]
["",null,null,"",null,"",null,"",null,"","",null,null,null,null,"","",null,1,null,null,null,null,null,null,null,null,null,null,null,null,null,4.7]
["",null,null,"",null,"",null,"",null,"","",null,null,null,null,"","",null,1,null,null,null,null,null,null,null,null,null,null,null,null,null,4.71]
["",null,null,"",null,"",null,"",null,"","",null,null,null,null,"","",null,1,null,null,null,null,null,null,null,null,null,null,null,null,null,4.72]
["",null,null,"",null,"",null,"",null,"","",null,null,null,null,"","",null,1,null,null,null,null,null,null,null,null,null,null,null,null,null,4.7300000000000004]
["",null,null,"",null,"",null,"",null,"","",null,null,null,null,"","",null,1,null,null,null,null,null,null,null,null,null,null,null,null,null,4.74]
["",null,null,"",null,"",null,"",null,"","",null,null,null,null,"","",null,1,null,null,null,null,null,null,null,null,null,null,null,null,null,4.75]
["",null,null,"",null,"",null,"",null,"","",null,null,null,null,"","",null,1,null,null,null,null,null,null,null,null,null,null,null,null,null,4.76]
["",null,null,"",null,"",null,"",null,"","",null,null,null,null,{"$f":"IFERROR(ROUND(SUM(1000/M474),2),\"\")","v":""},"",null,1,null,null,null,null,null,null,null,null,null,null,null,null,null,4.7699999999999996]
["",null,null,"",null,"",null,"",null,"","",null,null,null,null,"","",null,1,null,null,null,null,null,null,null,null,null,null,null,null,null,4.78]
["",null,null,"",null,"",null,"",null,"","",null,null,null,null,"","",null,1,null,null,null,null,null,null,null,null,null,null,null,null,null,4.79]
["",null,null,"",null,"",null,"",null,"","",null,null,null,null,"","",null,1,null,null,null,null,null,null,null,null,null,null,null,null,null,4.8]
["",null,null,"",null,"",null,"",null,"","",null,null,null,null,"","",null,1,null,null,null,null,null,null,null,null,null,null,null,null,null,4.8099999999999996]
["",null,null,"",null,"",null,"",null,"","",null,null,null,null,"","",null,1,null,null,null,null,null,null,null,null,null,null,null,null,null,4.82]
["",null,null,"",null,"",null,"",null,"","",null,null,null,null,"","",null,1,null,null,null,null,null,null,null,null,null,null,null,null,null,4.83]
["",null,null,"",null,"",null,"",null,"","",null,null,null,null,"","",null,1,null,null,null,null,null,null,null,null,null,null,null,null,null,4.84]
["",null,null,"",null,"",null,"",null,"","",null,null,null,null,"","",null,1,null,null,null,null,null,null,null,null,null,null,null,null,null,4.8499999999999996]
["",null,null,"",null,"",null,"",null,"","",null,null,null,null,"","",null,1,null,null,null,null,null,null,null,null,null,null,null,null,null,4.8600000000000003]
["",null,null,"",null,"",null,"",null,"","",null,null,null,null,"","",null,1,null,null,null,null,null,null,null,null,null,null,null,null,null,4.87]
["",null,null,"",null,"",null,"",null,"","",null,null,null,null,"","",null,1,null,null,null,null,null,null,null,null,null,null,null,null,null,4.88]
["",null,null,"",null,"",null,"",null,"","",null,null,null,null,"","",null,1,null,null,null,null,null,null,null,null,null,null,null,null,null,4.8899999999999997]
["",null,null,"",null,"",null,"",null,"","",null,null,null,null,"","",null,1,null,null,null,null,null,null,null,null,null,null,null,null,null,4.9000000000000004]
["",null,null,"",null,"",null,"",null,"","",null,null,null,null,"","",null,1,null,null,null,null,null,null,null,null,null,null,null,null,null,4.91]
["",null,null,"",null,"",null,"",null,"","",null,null,null,null,"","",null,1,null,null,null,null,null,null,null,null,null,null,null,null,null,4.92]
["",null,null,"",null,"",null,"",null,"","",null,null,null,null,"","",null,1,null,null,null,null,null,null,null,null,null,null,null,null,null,4.93]
["",null,null,"",null,"",null,"",null,"","",null,null,null,null,"","",null,1,null,null,null,null,null,null,null,null,null,null,null,null,null,4.9400000000000004]
["",null,null,"",null,"",null,"",null,"","",null,null,null,null,"","",null,1,null,null,null,null,null,null,null,null,null,null,null,null,null,4.95]
["",null,null,"",null,"",null,"",null,"","",null,null,null,null,"","",null,1,null,null,null,null,null,null,null,null,null,null,null,null,null,4.96]
["",null,null,"",null,"",null,"",null,"","",null,null,null,null,"","",null,1,null,null,null,null,null,null,null,null,null,null,null,null,null,4.97]
["",null,null,"",null,"",null,"",null,"","",null,null,null,null,"","",null,1,null,null,null,null,null,null,null,null,null,null,null,null,null,4.9800000000000004]
["",null,null,"",null,"",null,"",null,"","",null,null,null,null,"","",null,1,null,null,null,null,null,null,null,null,null,null,null,null,null,4.99]
["",null,null,"",null,"",null,"",null,"","",null,null,null,null,"","",null,1,null,null,null,null,null,null,null,null,null,null,null,null,null,5]
["",null,null,"",null,"",null,"",null,"","",null,null,null,null,"","",null,1,null,null,null,null,null,null,null,null,null,null,null,null,null,5.01]
["",null,null,"",null,"",null,"",null,"","",null,null,null,null,"","",null,1,null,null,null,null,null,null,null,null,null,null,null,null,null,5.0199999999999996]
["",null,null,"",null,"",null,"",null,"","",null,null,null,null,"","",null,1,null,null,null,null,null,null,null,null,null,null,null,null,null,5.03]
["",null,null,"",null,"",null,"",null,"","",null,null,null,null,"","",null,1,null,null,null,null,null,null,null,null,null,null,null,null,null,5.04]
["",null,null,"",null,"",null,"",null,"","",null,null,null,null,"","",null,1,null,null,null,null,null,null,null,null,null,null,null,null,null,5.05]
["",null,null,"",null,"",null,"",null,"","",null,null,null,null,"","",null,1,null,null,null,null,null,null,null,null,null,null,null,null,null,5.0599999999999996]
["",null,null,"",null,"",null,"",null,"","",null,null,null,null,"","",null,1,null,null,null,null,null,null,null,null,null,null,null,null,null,5.07]
["",null,null,"",null,"",null,"",null,"","",null,null,null,null,"","",null,1,null,null,null,null,null,null,null,null,null,null,null,null,null,5.08]
["",null,null,"",null,"",null,"",null,"","",null,null,null,null,"","",null,1,null,null,null,null,null,null,null,null,null,null,null,null,null,5.09]
["",null,null,"",null,"",null,"",null,"","",null,null,null,null,"","",null,1,null,null,null,null,null,null,null,null,null,null,null,null,null,5.0999999999999996]
["",null,null,"",null,"",null,"",null,"","",null,null,null,null,"","",null,1,null,null,null,null,null,null,null,null,null,null,null,null,null,5.1100000000000003]
["",null,null,"",null,"",null,"",null,"","",null,null,null,null,"","",null,1,null,null,null,null,null,null,null,null,null,null,null,null,null,5.12]
["",null,null,"",null,"",null,"",null,"","",null,null,null,null,"","",null,1,null,null,null,null,null,null,null,null,null,null,null,null,null,5.13]
["",null,null,"",null,"",null,"",null,"","",null,null,null,null,"","",null,1,null,null,null,null,null,null,null,null,null,null,null,null,null,5.14]
["",null,null,"",null,"",null,"",null,"","",null,null,null,null,"","",null,1,null,null,null,null,null,null,null,null,null,null,null,null,null,5.15]
["",null,null,"",null,"",null,"",null,"","",null,null,null,null,"","",null,1,null,null,null,null,null,null,null,null,null,null,null,null,null,5.16]
["",null,null,"",null,"",null,"",null,"","",null,null,null,null,"","",null,1,null,null,null,null,null,null,null,null,null,null,null,null,null,5.17]
["",null,null,"",null,"",null,"",null,"","",null,null,null,null,"","",null,1,null,null,null,null,null,null,null,null,null,null,null,null,null,5.18]
[{"$f":"IF(E516=\"\",\"\",IF(A516=\"\",TODAY(),A516))","v":""},null,null,{"$f":"IF(B516=\"\",\"\",(C516-B516))","v":""},null,{"$f":"IFERROR(VLOOKUP(E516,$AK$3:$AM$317,2,FALSE),\"\")","v":""},null,{"$f":"IFERROR(G516/D516/24,\"\")","v":""},null,{"$f":"IFERROR(I516/D516/24,\"\")","v":""},{"$f":"IFERROR(L516/D516/24,\"\")","v":""},null,null,null,null,"",{"$f":"IFERROR(ROUND(SUM(L516*P516),2),\"\")","v":""},null,1,null,null,null,null,null,null,null,null,null,null,null,null,null,5.19]
["",null,null,"",null,"",null,"",null,"","",null,null,null,null,"","",null,1,null,null,null,null,null,null,null,null,null,null,null,null,null,5.2]
["",null,null,"",null,"",null,"",null,"","",null,null,null,null,"","",null,1,null,null,null,null,null,null,null,null,null,null,null,null,null,5.21]
["",null,null,"",null,"",null,"",null,"","",null,null,null,null,"","",null,1,null,null,null,null,null,null,null,null,null,null,null,null,null,5.22]
["",null,null,"",null,"",null,"",null,"","",null,null,null,null,"","",null,1,null,null,null,null,null,null,null,null,null,null,null,null,null,5.23]
["",null,null,"",null,"",null,"",null,"","",null,null,null,null,"","",null,1,null,null,null,null,null,null,null,null,null,null,null,null,null,5.24]
["",null,null,"",null,"",null,"",null,"","",null,null,null,null,"","",null,1,null,null,null,null,null,null,null,null,null,null,null,null,null,5.25]
["",null,null,"",null,"",null,"",null,"","",null,null,null,null,"","",null,1,null,null,null,null,null,null,null,null,null,null,null,null,null,5.26]
["",null,null,"",null,"",null,"",null,"","",null,null,null,null,"","",null,1,null,null,null,null,null,null,null,null,null,null,null,null,null,5.27]
["",null,null,"",null,"",null,"",null,"","",null,null,null,null,"","",null,1,null,null,null,null,null,null,null,null,null,null,null,null,null,5.28]
["",null,null,"",null,"",null,"",null,"","",null,null,null,null,"","",null,1,null,null,null,null,null,null,null,null,null,null,null,null,null,5.29]
["",null,null,"",null,"",null,"",null,"","",null,null,null,null,"","",null,1,null,null,null,null,null,null,null,null,null,null,null,null,null,5.3]
["",null,null,"",null,"",null,"",null,"","",null,null,null,null,"","",null,1,null,null,null,null,null,null,null,null,null,null,null,null,null,5.31]
["",null,null,"",null,"",null,"",null,"","",null,null,null,null,"","",null,1,null,null,null,null,null,null,null,null,null,null,null,null,null,5.32]
["",null,null,"",null,"",null,"",null,"","",null,null,null,null,"","",null,1,null,null,null,null,null,null,null,null,null,null,null,null,null,5.33]
["",null,null,"",null,"",null,"",null,"","",null,null,null,null,"","",null,1,null,null,null,null,null,null,null,null,null,null,null,null,null,5.34]
["",null,null,"",null,"",null,"",null,"","",null,null,null,null,"","",null,1,null,null,null,null,null,null,null,null,null,null,null,null,null,5.35]
["",null,null,"",null,"",null,"",null,"","",null,null,null,null,"","",null,1,null,null,null,null,null,null,null,null,null,null,null,null,null,5.36]
["",null,null,"",null,"",null,"",null,"","",null,null,null,null,"","",null,1,null,null,null,null,null,null,null,null,null,null,null,null,null,5.37]
["",null,null,"",null,"",null,"",null,"","",null,null,null,null,"","",null,1,null,null,null,null,null,null,null,null,null,null,null,null,null,5.38]
["",null,null,"",null,"",null,"",null,"","",null,null,null,null,"","",null,1,null,null,null,null,null,null,null,null,null,null,null,null,null,5.39]
["",null,null,"",null,"",null,"",null,"","",null,null,null,null,"","",null,1,null,null,null,null,null,null,null,null,null,null,null,null,null,5.4]
["",null,null,"",null,"",null,"",null,"","",null,null,null,null,{"$f":"IFERROR(ROUND(SUM(1000/M538),2),\"\")","v":""},"",null,1,null,null,null,null,null,null,null,null,null,null,null,null,null,5.41]
["",null,null,"",null,"",null,"",null,"","",null,null,null,null,"","",null,1,null,null,null,null,null,null,null,null,null,null,null,null,null,5.42]
["",null,null,"",null,"",null,"",null,"","",null,null,null,null,"","",null,1,null,null,null,null,null,null,null,null,null,null,null,null,null,5.43]
["",null,null,"",null,"",null,"",null,"","",null,null,null,null,"","",null,1,null,null,null,null,null,null,null,null,null,null,null,null,null,5.44]
["",null,null,"",null,"",null,"",null,"","",null,null,null,null,"","",null,1,null,null,null,null,null,null,null,null,null,null,null,null,null,5.45]
["",null,null,"",null,"",null,"",null,"","",null,null,null,null,"","",null,1,null,null,null,null,null,null,null,null,null,null,null,null,null,5.46]
["",null,null,"",null,"",null,"",null,"","",null,null,null,null,"","",null,1,null,null,null,null,null,null,null,null,null,null,null,null,null,5.47]
["",null,null,"",null,"",null,"",null,"","",null,null,null,null,"","",null,1,null,null,null,null,null,null,null,null,null,null,null,null,null,5.48]
["",null,null,"",null,"",null,"",null,"","",null,null,null,null,"","",null,1,null,null,null,null,null,null,null,null,null,null,null,null,null,5.49]
["",null,null,"",null,"",null,"",null,"","",null,null,null,null,"","",null,1,null,null,null,null,null,null,null,null,null,null,null,null,null,5.5]
["",null,null,"",null,"",null,"",null,"","",null,null,null,null,"","",null,1,null,null,null,null,null,null,null,null,null,null,null,null,null,5.51]
["",null,null,"",null,"",null,"",null,"","",null,null,null,null,"","",null,1,null,null,null,null,null,null,null,null,null,null,null,null,null,5.52]
["",null,null,"",null,"",null,"",null,"","",null,null,null,null,"","",null,1,null,null,null,null,null,null,null,null,null,null,null,null,null,5.53]
["",null,null,"",null,"",null,"",null,"","",null,null,null,null,"","",null,1,null,null,null,null,null,null,null,null,null,null,null,null,null,5.54]
["",null,null,"",null,"",null,"",null,"","",null,null,null,null,"","",null,1,null,null,null,null,null,null,null,null,null,null,null,null,null,5.55]
["",null,null,"",null,"",null,"",null,"","",null,null,null,null,"","",null,1,null,null,null,null,null,null,null,null,null,null,null,null,null,5.56]
["",null,null,"",null,"",null,"",null,"","",null,null,null,null,"","",null,1,null,null,null,null,null,null,null,null,null,null,null,null,null,5.57]
["",null,null,"",null,"",null,"",null,"","",null,null,null,null,"","",null,1,null,null,null,null,null,null,null,null,null,null,null,null,null,5.58]
["",null,null,"",null,"",null,"",null,"","",null,null,null,null,"","",null,1,null,null,null,null,null,null,null,null,null,null,null,null,null,5.59]
["",null,null,"",null,"",null,"",null,"","",null,null,null,null,"","",null,1,null,null,null,null,null,null,null,null,null,null,null,null,null,5.6]
["",null,null,"",null,"",null,"",null,"","",null,null,null,null,"","",null,1,null,null,null,null,null,null,null,null,null,null,null,null,null,5.61]
["",null,null,"",null,"",null,"",null,"","",null,null,null,null,"","",null,1,null,null,null,null,null,null,null,null,null,null,null,null,null,5.62]
["",null,null,"",null,"",null,"",null,"","",null,null,null,null,"","",null,1,null,null,null,null,null,null,null,null,null,null,null,null,null,5.63]
["",null,null,"",null,"",null,"",null,"","",null,null,null,null,"","",null,1,null,null,null,null,null,null,null,null,null,null,null,null,null,5.64]
["",null,null,"",null,"",null,"",null,"","",null,null,null,null,"","",null,1,null,null,null,null,null,null,null,null,null,null,null,null,null,5.65]
["",null,null,"",null,"",null,"",null,"","",null,null,null,null,"","",null,1,null,null,null,null,null,null,null,null,null,null,null,null,null,5.66]
["",null,null,"",null,"",null,"",null,"","",null,null,null,null,"","",null,1,null,null,null,null,null,null,null,null,null,null,null,null,null,5.67]
["",null,null,"",null,"",null,"",null,"","",null,null,null,null,"","",null,1,null,null,null,null,null,null,null,null,null,null,null,null,null,5.68]
["",null,null,"",null,"",null,"",null,"","",null,null,null,null,"","",null,1,null,null,null,null,null,null,null,null,null,null,null,null,null,5.69]
["",null,null,"",null,"",null,"",null,"","",null,null,null,null,"","",null,1,null,null,null,null,null,null,null,null,null,null,null,null,null,5.7]
["",null,null,"",null,"",null,"",null,"","",null,null,null,null,"","",null,1,null,null,null,null,null,null,null,null,null,null,null,null,null,5.71]
["",null,null,"",null,"",null,"",null,"","",null,null,null,null,"","",null,1,null,null,null,null,null,null,null,null,null,null,null,null,null,5.72]
["",null,null,"",null,"",null,"",null,"","",null,null,null,null,"","",null,1,null,null,null,null,null,null,null,null,null,null,null,null,null,5.73]
["",null,null,"",null,"",null,"",null,"","",null,null,null,null,"","",null,1,null,null,null,null,null,null,null,null,null,null,null,null,null,5.74]
["",null,null,"",null,"",null,"",null,"","",null,null,null,null,"","",null,1,null,null,null,null,null,null,null,null,null,null,null,null,null,5.75]
["",null,null,"",null,"",null,"",null,"","",null,null,null,null,"","",null,1,null,null,null,null,null,null,null,null,null,null,null,null,null,5.76]
["",null,null,"",null,"",null,"",null,"","",null,null,null,null,"","",null,1,null,null,null,null,null,null,null,null,null,null,null,null,null,5.77]
["",null,null,"",null,"",null,"",null,"","",null,null,null,null,"","",null,1,null,null,null,null,null,null,null,null,null,null,null,null,null,5.78]
["",null,null,"",null,"",null,"",null,"","",null,null,null,null,"","",null,1,null,null,null,null,null,null,null,null,null,null,null,null,null,5.79]
["",null,null,"",null,"",null,"",null,"","",null,null,null,null,"","",null,1,null,null,null,null,null,null,null,null,null,null,null,null,null,5.8]
["",null,null,"",null,"",null,"",null,"","",null,null,null,null,"","",null,1,null,null,null,null,null,null,null,null,null,null,null,null,null,5.81]
["",null,null,"",null,"",null,"",null,"","",null,null,null,null,"","",null,1,null,null,null,null,null,null,null,null,null,null,null,null,null,5.82]
[{"$f":"IF(E580=\"\",\"\",IF(A580=\"\",TODAY(),A580))","v":""},null,null,{"$f":"IF(B580=\"\",\"\",(C580-B580))","v":""},null,{"$f":"IFERROR(VLOOKUP(E580,$AK$3:$AM$317,2,FALSE),\"\")","v":""},null,{"$f":"IFERROR(G580/D580/24,\"\")","v":""},null,{"$f":"IFERROR(I580/D580/24,\"\")","v":""},{"$f":"IFERROR(L580/D580/24,\"\")","v":""},null,null,null,null,"",{"$f":"IFERROR(ROUND(SUM(L580*P580),2),\"\")","v":""},null,1,null,null,null,null,null,null,null,null,null,null,null,null,null,5.83]
["",null,null,"",null,"",null,"",null,"","",null,null,null,null,"","",null,1,null,null,null,null,null,null,null,null,null,null,null,null,null,5.84]
["",null,null,"",null,"",null,"",null,"","",null,null,null,null,"","",null,1,null,null,null,null,null,null,null,null,null,null,null,null,null,5.85]
["",null,null,"",null,"",null,"",null,"","",null,null,null,null,"","",null,1,null,null,null,null,null,null,null,null,null,null,null,null,null,5.86]
["",null,null,"",null,"",null,"",null,"","",null,null,null,null,"","",null,1,null,null,null,null,null,null,null,null,null,null,null,null,null,5.87]
["",null,null,"",null,"",null,"",null,"","",null,null,null,null,"","",null,1,null,null,null,null,null,null,null,null,null,null,null,null,null,5.88]
["",null,null,"",null,"",null,"",null,"","",null,null,null,null,"","",null,1,null,null,null,null,null,null,null,null,null,null,null,null,null,5.89]
["",null,null,"",null,"",null,"",null,"","",null,null,null,null,"","",null,1,null,null,null,null,null,null,null,null,null,null,null,null,null,5.9]
["",null,null,"",null,"",null,"",null,"","",null,null,null,null,"","",null,1,null,null,null,null,null,null,null,null,null,null,null,null,null,5.91]
["",null,null,"",null,"",null,"",null,"","",null,null,null,null,"","",null,1,null,null,null,null,null,null,null,null,null,null,null,null,null,5.92]
["",null,null,"",null,"",null,"",null,"","",null,null,null,null,"","",null,1,null,null,null,null,null,null,null,null,null,null,null,null,null,5.93]
["",null,null,"",null,"",null,"",null,"","",null,null,null,null,"","",null,1,null,null,null,null,null,null,null,null,null,null,null,null,null,5.94]
["",null,null,"",null,"",null,"",null,"","",null,null,null,null,"","",null,1,null,null,null,null,null,null,null,null,null,null,null,null,null,5.95]
["",null,null,"",null,"",null,"",null,"","",null,null,null,null,"","",null,1,null,null,null,null,null,null,null,null,null,null,null,null,null,5.96]
["",null,null,"",null,"",null,"",null,"","",null,null,null,null,"","",null,1,null,null,null,null,null,null,null,null,null,null,null,null,null,5.97]
["",null,null,"",null,"",null,"",null,"","",null,null,null,null,"","",null,1,null,null,null,null,null,null,null,null,null,null,null,null,null,5.98]
["",null,null,"",null,"",null,"",null,"","",null,null,null,null,"","",null,1,null,null,null,null,null,null,null,null,null,null,null,null,null,5.99]
["",null,null,"",null,"",null,"",null,"","",null,null,null,null,"","",null,1,null,null,null,null,null,null,null,null,null,null,null,null,null,6]
["",null,null,"",null,"",null,"",null,"","",null,null,null,null,"","",null,1]
["",null,null,"",null,"",null,"",null,"","",null,null,null,null,"","",null,1]
["",null,null,"",null,"",null,"",null,"","",null,null,null,null,"","",null,1]
["",null,null,"",null,"",null,"",null,"","",null,null,null,null,"","",null,1]
["",null,null,"",null,"",null,"",null,"","",null,null,null,null,{"$f":"IFERROR(ROUND(SUM(1000/M602),2),\"\")","v":""},"",null,1]
["",null,null,"",null,"",null,"",null,"","",null,null,null,null,"","",null,1]
["",null,null,"",null,"",null,"",null,"","",null,null,null,null,"","",null,1]
["",null,null,"",null,"",null,"",null,"","",null,null,null,null,"","",null,1]
["",null,null,"",null,"",null,"",null,"","",null,null,null,null,"","",null,1]
["",null,null,"",null,"",null,"",null,"","",null,null,null,null,"","",null,1]
["",null,null,"",null,"",null,"",null,"","",null,null,null,null,"","",null,1]
["",null,null,"",null,"",null,"",null,"","",null,null,null,null,"","",null,1]
["",null,null,"",null,"",null,"",null,"","",null,null,null,null,"","",null,1]
["",null,null,"",null,"",null,"",null,"","",null,null,null,null,"","",null,1]
["",null,null,"",null,"",null,"",null,"","",null,null,null,null,"","",null,1]
["",null,null,"",null,"",null,"",null,"","",null,null,null,null,"","",null,1]
["",null,null,"",null,"",null,"",null,"","",null,null,null,null,"","",null,1]
["",null,null,"",null,"",null,"",null,"","",null,null,null,null,"","",null,1]
["",null,null,"",null,"",null,"",null,"","",null,null,null,null,"","",null,1]
["",null,null,"",null,"",null,"",null,"","",null,null,null,null,"","",null,1]
["",null,null,"",null,"",null,"",null,"","",null,null,null,null,"","",null,1]
["",null,null,"",null,"",null,"",null,"","",null,null,null,null,"","",null,1]
["",null,null,"",null,"",null,"",null,"","",null,null,null,null,"","",null,1]
["",null,null,"",null,"",null,"",null,"","",null,null,null,null,"","",null,1]
["",null,null,"",null,"",null,"",null,"","",null,null,null,null,"","",null,1]
["",null,null,"",null,"",null,"",null,"","",null,null,null,null,"","",null,1]
["",null,null,"",null,"",null,"",null,"","",null,null,null,null,"","",null,1]
["",null,null,"",null,"",null,"",null,"","",null,null,null,null,"","",null,1]
["",null,null,"",null,"",null,"",null,"","",null,null,null,null,"","",null,1]
["",null,null,"",null,"",null,"",null,"","",null,null,null,null,"","",null,1]
["",null,null,"",null,"",null,"",null,"","",null,null,null,null,"","",null,1]
["",null,null,"",null,"",null,"",null,"","",null,null,null,null,"","",null,1]
["",null,null,"",null,"",null,"",null,"","",null,null,null,null,"","",null,1]
["",null,null,"",null,"",null,"",null,"","",null,null,null,null,"","",null,1]
["",null,null,"",null,"",null,"",null,"","",null,null,null,null,"","",null,1]
["",null,null,"",null,"",null,"",null,"","",null,null,null,null,"","",null,1]
["",null,null,"",null,"",null,"",null,"","",null,null,null,null,"","",null,1]
["",null,null,"",null,"",null,"",null,"","",null,null,null,null,"","",null,1]
["",null,null,"",null,"",null,"",null,"","",null,null,null,null,"","",null,1]
["",null,null,"",null,"",null,"",null,"","",null,null,null,null,"","",null,1]
["",null,null,"",null,"",null,"",null,"","",null,null,null,null,"","",null,1]
["",null,null,"",null,"",null,"",null,"","",null,null,null,null,"","",null,1]
["",null,null,"",null,"",null,"",null,"","",null,null,null,null,"","",null,1]
["",null,null,"",null,"",null,"",null,"","",null,null,null,null,"","",null,1]
["",null,null,"",null,"",null,"",null,"","",null,null,null,null,"","",null,1]
["",null,null,"",null,"",null,"",null,"","",null,null,null,null,"","",null,1]
[{"$f":"IF(E644=\"\",\"\",IF(A644=\"\",TODAY(),A644))","v":""},null,null,{"$f":"IF(B644=\"\",\"\",(C644-B644))","v":""},null,{"$f":"IFERROR(VLOOKUP(E644,$AK$3:$AM$317,2,FALSE),\"\")","v":""},null,{"$f":"IFERROR(G644/D644/24,\"\")","v":""},null,{"$f":"IFERROR(I644/D644/24,\"\")","v":""},{"$f":"IFERROR(L644/D644/24,\"\")","v":""},null,null,null,null,"",{"$f":"IFERROR(ROUND(SUM(L644*P644),2),\"\")","v":""},null,1]
["",null,null,"",null,"",null,"",null,"","",null,null,null,null,"","",null,1]
["",null,null,"",null,"",null,"",null,"","",null,null,null,null,"","",null,1]
["",null,null,"",null,"",null,"",null,"","",null,null,null,null,"","",null,1]
["",null,null,"",null,"",null,"",null,"","",null,null,null,null,"","",null,1]
["",null,null,"",null,"",null,"",null,"","",null,null,null,null,"","",null,1]
["",null,null,"",null,"",null,"",null,"","",null,null,null,null,"","",null,1]
["",null,null,"",null,"",null,"",null,"","",null,null,null,null,"","",null,1]
["",null,null,"",null,"",null,"",null,"","",null,null,null,null,"","",null,1]
["",null,null,"",null,"",null,"",null,"","",null,null,null,null,"","",null,1]
["",null,null,"",null,"",null,"",null,"","",null,null,null,null,"","",null,1]
["",null,null,"",null,"",null,"",null,"","",null,null,null,null,"","",null,1]
["",null,null,"",null,"",null,"",null,"","",null,null,null,null,"","",null,1]
["",null,null,"",null,"",null,"",null,"","",null,null,null,null,"","",null,1]
["",null,null,"",null,"",null,"",null,"","",null,null,null,null,"","",null,1]
["",null,null,"",null,"",null,"",null,"","",null,null,null,null,"","",null,1]
["",null,null,"",null,"",null,"",null,"","",null,null,null,null,"","",null,1]
["",null,null,"",null,"",null,"",null,"","",null,null,null,null,"","",null,1]
["",null,null,"",null,"",null,"",null,"","",null,null,null,null,"","",null,1]
["",null,null,"",null,"",null,"",null,"","",null,null,null,null,"","",null,1]
["",null,null,"",null,"",null,"",null,"","",null,null,null,null,"","",null,1]
["",null,null,"",null,"",null,"",null,"","",null,null,null,null,"","",null,1]
["",null,null,"",null,"",null,"",null,"","",null,null,null,null,{"$f":"IFERROR(ROUND(SUM(1000/M666),2),\"\")","v":""},"",null,1]
["",null,null,"",null,"",null,"",null,"","",null,null,null,null,"","",null,1]
["",null,null,"",null,"",null,"",null,"","",null,null,null,null,"","",null,1]
["",null,null,"",null,"",null,"",null,"","",null,null,null,null,"","",null,1]
["",null,null,"",null,"",null,"",null,"","",null,null,null,null,"","",null,1]
["",null,null,"",null,"",null,"",null,"","",null,null,null,null,"","",null,1]
["",null,null,"",null,"",null,"",null,"","",null,null,null,null,"","",null,1]
["",null,null,"",null,"",null,"",null,"","",null,null,null,null,"","",null,1]
["",null,null,"",null,"",null,"",null,"","",null,null,null,null,"","",null,1]
["",null,null,"",null,"",null,"",null,"","",null,null,null,null,"","",null,1]
["",null,null,"",null,"",null,"",null,"","",null,null,null,null,"","",null,1]
["",null,null,"",null,"",null,"",null,"","",null,null,null,null,"","",null,1]
["",null,null,"",null,"",null,"",null,"","",null,null,null,null,"","",null,1]
["",null,null,"",null,"",null,"",null,"","",null,null,null,null,"","",null,1]
["",null,null,"",null,"",null,"",null,"","",null,null,null,null,"","",null,1]
["",null,null,"",null,"",null,"",null,"","",null,null,null,null,"","",null,1]
["",null,null,"",null,"",null,"",null,"","",null,null,null,null,"","",null,1]
["",null,null,"",null,"",null,"",null,"","",null,null,null,null,"","",null,1]
["",null,null,"",null,"",null,"",null,"","",null,null,null,null,"","",null,1]
["",null,null,"",null,"",null,"",null,"","",null,null,null,null,"","",null,1]
["",null,null,"",null,"",null,"",null,"","",null,null,null,null,"","",null,1]
["",null,null,"",null,"",null,"",null,"","",null,null,null,null,"","",null,1]
["",null,null,"",null,"",null,"",null,"","",null,null,null,null,"","",null,1]
["",null,null,"",null,"",null,"",null,"","",null,null,null,null,"","",null,1]
["",null,null,"",null,"",null,"",null,"","",null,null,null,null,"","",null,1]
["",null,null,"",null,"",null,"",null,"","",null,null,null,null,"","",null,1]
["",null,null,"",null,"",null,"",null,"","",null,null,null,null,"","",null,1]
["",null,null,"",null,"",null,"",null,"","",null,null,null,null,"","",null,1]
["",null,null,"",null,"",null,"",null,"","",null,null,null,null,"","",null,1]
["",null,null,"",null,"",null,"",null,"","",null,null,null,null,"","",null,1]
["",null,null,"",null,"",null,"",null,"","",null,null,null,null,"","",null,1]
["",null,null,"",null,"",null,"",null,"","",null,null,null,null,"","",null,1]
["",null,null,"",null,"",null,"",null,"","",null,null,null,null,"","",null,1]
["",null,null,"",null,"",null,"",null,"","",null,null,null,null,"","",null,1]
["",null,null,"",null,"",null,"",null,"","",null,null,null,null,"","",null,1]
["",null,null,"",null,"",null,"",null,"","",null,null,null,null,"","",null,1]
["",null,null,"",null,"",null,"",null,"","",null,null,null,null,"","",null,1]
["",null,null,"",null,"",null,"",null,"","",null,null,null,null,"","",null,1]
["",null,null,"",null,"",null,"",null,"","",null,null,null,null,"","",null,1]
["",null,null,"",null,"",null,"",null,"","",null,null,null,null,"","",null,1]
["",null,null,"",null,"",null,"",null,"","",null,null,null,null,"","",null,1]
["",null,null,"",null,"",null,"",null,"","",null,null,null,null,"","",null,1]
[{"$f":"IF(E708=\"\",\"\",IF(A708=\"\",TODAY(),A708))","v":""},null,null,{"$f":"IF(B708=\"\",\"\",(C708-B708))","v":""},null,{"$f":"IFERROR(VLOOKUP(E708,$AK$3:$AM$317,2,FALSE),\"\")","v":""},null,{"$f":"IFERROR(G708/D708/24,\"\")","v":""},null,{"$f":"IFERROR(I708/D708/24,\"\")","v":""},{"$f":"IFERROR(L708/D708/24,\"\")","v":""},null,null,null,null,"",{"$f":"IFERROR(ROUND(SUM(L708*P708),2),\"\")","v":""},null,1]
["",null,null,"",null,"",null,"",null,"","",null,null,null,null,"","",null,1]
["",null,null,"",null,"",null,"",null,"","",null,null,null,null,"","",null,1]
["",null,null,"",null,"",null,"",null,"","",null,null,null,null,"","",null,1]
["",null,null,"",null,"",null,"",null,"","",null,null,null,null,"","",null,1]
["",null,null,"",null,"",null,"",null,"","",null,null,null,null,"","",null,1]
["",null,null,"",null,"",null,"",null,"","",null,null,null,null,"","",null,1]
["",null,null,"",null,"",null,"",null,"","",null,null,null,null,"","",null,1]
["",null,null,"",null,"",null,"",null,"","",null,null,null,null,"","",null,1]
["",null,null,"",null,"",null,"",null,"","",null,null,null,null,"","",null,1]
["",null,null,"",null,"",null,"",null,"","",null,null,null,null,"","",null,1]
["",null,null,"",null,"",null,"",null,"","",null,null,null,null,"","",null,1]
["",null,null,"",null,"",null,"",null,"","",null,null,null,null,"","",null,1]
["",null,null,"",null,"",null,"",null,"","",null,null,null,null,"","",null,1]
["",null,null,"",null,"",null,"",null,"","",null,null,null,null,"","",null,1]
["",null,null,"",null,"",null,"",null,"","",null,null,null,null,"","",null,1]
["",null,null,"",null,"",null,"",null,"","",null,null,null,null,"","",null,1]
["",null,null,"",null,"",null,"",null,"","",null,null,null,null,"","",null,1]
["",null,null,"",null,"",null,"",null,"","",null,null,null,null,"","",null,1]
["",null,null,"",null,"",null,"",null,"","",null,null,null,null,"","",null,1]
["",null,null,"",null,"",null,"",null,"","",null,null,null,null,"","",null,1]
["",null,null,"",null,"",null,"",null,"","",null,null,null,null,"","",null,1]
["",null,null,"",null,"",null,"",null,"","",null,null,null,null,{"$f":"IFERROR(ROUND(SUM(1000/M730),2),\"\")","v":""},"",null,1]
["",null,null,"",null,"",null,"",null,"","",null,null,null,null,"","",null,1]
["",null,null,"",null,"",null,"",null,"","",null,null,null,null,"","",null,1]
["",null,null,"",null,"",null,"",null,"","",null,null,null,null,"","",null,1]
["",null,null,"",null,"",null,"",null,"","",null,null,null,null,"","",null,1]
["",null,null,"",null,"",null,"",null,"","",null,null,null,null,"","",null,1]
["",null,null,"",null,"",null,"",null,"","",null,null,null,null,"","",null,1]
["",null,null,"",null,"",null,"",null,"","",null,null,null,null,"","",null,1]
["",null,null,"",null,"",null,"",null,"","",null,null,null,null,"","",null,1]
["",null,null,"",null,"",null,"",null,"","",null,null,null,null,"","",null,1]
["",null,null,"",null,"",null,"",null,"","",null,null,null,null,"","",null,1]
["",null,null,"",null,"",null,"",null,"","",null,null,null,null,"","",null,1]
["",null,null,"",null,"",null,"",null,"","",null,null,null,null,"","",null,1]
["",null,null,"",null,"",null,"",null,"","",null,null,null,null,"","",null,1]
["",null,null,"",null,"",null,"",null,"","",null,null,null,null,"","",null,1]
["",null,null,"",null,"",null,"",null,"","",null,null,null,null,"","",null,1]
["",null,null,"",null,"",null,"",null,"","",null,null,null,null,"","",null,1]
["",null,null,"",null,"",null,"",null,"","",null,null,null,null,"","",null,1]
["",null,null,"",null,"",null,"",null,"","",null,null,null,null,"","",null,1]
["",null,null,"",null,"",null,"",null,"","",null,null,null,null,"","",null,1]
["",null,null,"",null,"",null,"",null,"","",null,null,null,null,"","",null,1]
["",null,null,"",null,"",null,"",null,"","",null,null,null,null,"","",null,1]
["",null,null,"",null,"",null,"",null,"","",null,null,null,null,"","",null,1]
["",null,null,"",null,"",null,"",null,"","",null,null,null,null,"","",null,1]
["",null,null,"",null,"",null,"",null,"","",null,null,null,null,"","",null,1]
["",null,null,"",null,"",null,"",null,"","",null,null,null,null,"","",null,1]
["",null,null,"",null,"",null,"",null,"","",null,null,null,null,"","",null,1]
["",null,null,"",null,"",null,"",null,"","",null,null,null,null,"","",null,1]
["",null,null,"",null,"",null,"",null,"","",null,null,null,null,"","",null,1]
["",null,null,"",null,"",null,"",null,"","",null,null,null,null,"","",null,1]
["",null,null,"",null,"",null,"",null,"","",null,null,null,null,"","",null,1]
["",null,null,"",null,"",null,"",null,"","",null,null,null,null,"","",null,1]
["",null,null,"",null,"",null,"",null,"","",null,null,null,null,"","",null,1]
["",null,null,"",null,"",null,"",null,"","",null,null,null,null,"","",null,1]
["",null,null,"",null,"",null,"",null,"","",null,null,null,null,"","",null,1]
["",null,null,"",null,"",null,"",null,"","",null,null,null,null,"","",null,1]
["",null,null,"",null,"",null,"",null,"","",null,null,null,null,"","",null,1]
["",null,null,"",null,"",null,"",null,"","",null,null,null,null,"","",null,1]
["",null,null,"",null,"",null,"",null,"","",null,null,null,null,"","",null,1]
["",null,null,"",null,"",null,"",null,"","",null,null,null,null,"","",null,1]
["",null,null,"",null,"",null,"",null,"","",null,null,null,null,"","",null,1]
["",null,null,"",null,"",null,"",null,"","",null,null,null,null,"","",null,1]
[{"$f":"IF(E772=\"\",\"\",IF(A772=\"\",TODAY(),A772))","v":""},null,null,{"$f":"IF(B772=\"\",\"\",(C772-B772))","v":""},null,{"$f":"IFERROR(VLOOKUP(E772,$AK$3:$AM$317,2,FALSE),\"\")","v":""},null,{"$f":"IFERROR(G772/D772/24,\"\")","v":""},null,{"$f":"IFERROR(I772/D772/24,\"\")","v":""},{"$f":"IFERROR(L772/D772/24,\"\")","v":""},null,null,null,null,"",{"$f":"IFERROR(ROUND(SUM(L772*P772),2),\"\")","v":""},null,1]
["",null,null,"",null,"",null,"",null,"","",null,null,null,null,"","",null,1]
["",null,null,"",null,"",null,"",null,"","",null,null,null,null,"","",null,1]
["",null,null,"",null,"",null,"",null,"","",null,null,null,null,"","",null,1]
["",null,null,"",null,"",null,"",null,"","",null,null,null,null,"","",null,1]
["",null,null,"",null,"",null,"",null,"","",null,null,null,null,"","",null,1]
["",null,null,"",null,"",null,"",null,"","",null,null,null,null,"","",null,1]
["",null,null,"",null,"",null,"",null,"","",null,null,null,null,"","",null,1]
["",null,null,"",null,"",null,"",null,"","",null,null,null,null,"","",null,1]
["",null,null,"",null,"",null,"",null,"","",null,null,null,null,"","",null,1]
["",null,null,"",null,"",null,"",null,"","",null,null,null,null,"","",null,1]
["",null,null,"",null,"",null,"",null,"","",null,null,null,null,"","",null,1]
["",null,null,"",null,"",null,"",null,"","",null,null,null,null,"","",null,1]
["",null,null,"",null,"",null,"",null,"","",null,null,null,null,"","",null,1]
["",null,null,"",null,"",null,"",null,"","",null,null,null,null,"","",null,1]
["",null,null,"",null,"",null,"",null,"","",null,null,null,null,"","",null,1]
["",null,null,"",null,"",null,"",null,"","",null,null,null,null,"","",null,1]
["",null,null,"",null,"",null,"",null,"","",null,null,null,null,"","",null,1]
["",null,null,"",null,"",null,"",null,"","",null,null,null,null,"","",null,1]
["",null,null,"",null,"",null,"",null,"","",null,null,null,null,"","",null,1]
["",null,null,"",null,"",null,"",null,"","",null,null,null,null,"","",null,1]
["",null,null,"",null,"",null,"",null,"","",null,null,null,null,"","",null,1]
["",null,null,"",null,"",null,"",null,"","",null,null,null,null,{"$f":"IFERROR(ROUND(SUM(1000/M794),2),\"\")","v":""},"",null,1]
["",null,null,"",null,"",null,"",null,"","",null,null,null,null,"","",null,1]
["",null,null,"",null,"",null,"",null,"","",null,null,null,null,"","",null,1]
["",null,null,"",null,"",null,"",null,"","",null,null,null,null,"","",null,1]
["",null,null,"",null,"",null,"",null,"","",null,null,null,null,"","",null,1]
["",null,null,"",null,"",null,"",null,"","",null,null,null,null,"","",null,1]
["",null,null,"",null,"",null,"",null,"","",null,null,null,null,"","",null,1]
["",null,null,"",null,"",null,"",null,"","",null,null,null,null,"","",null,1]
["",null,null,"",null,"",null,"",null,"","",null,null,null,null,"","",null,1]
["",null,null,"",null,"",null,"",null,"","",null,null,null,null,"","",null,1]
["",null,null,"",null,"",null,"",null,"","",null,null,null,null,"","",null,1]
["",null,null,"",null,"",null,"",null,"","",null,null,null,null,"","",null,1]
["",null,null,"",null,"",null,"",null,"","",null,null,null,null,"","",null,1]
["",null,null,"",null,"",null,"",null,"","",null,null,null,null,"","",null,1]
["",null,null,"",null,"",null,"",null,"","",null,null,null,null,"","",null,1]
["",null,null,"",null,"",null,"",null,"","",null,null,null,null,"","",null,1]
["",null,null,"",null,"",null,"",null,"","",null,null,null,null,"","",null,1]
["",null,null,"",null,"",null,"",null,"","",null,null,null,null,"","",null,1]
["",null,null,"",null,"",null,"",null,"","",null,null,null,null,"","",null,1]
["",null,null,"",null,"",null,"",null,"","",null,null,null,null,"","",null,1]
["",null,null,"",null,"",null,"",null,"","",null,null,null,null,"","",null,1]
["",null,null,"",null,"",null,"",null,"","",null,null,null,null,"","",null,1]
["",null,null,"",null,"",null,"",null,"","",null,null,null,null,"","",null,1]
["",null,null,"",null,"",null,"",null,"","",null,null,null,null,"","",null,1]
["",null,null,"",null,"",null,"",null,"","",null,null,null,null,"","",null,1]
["",null,null,"",null,"",null,"",null,"","",null,null,null,null,"","",null,1]
["",null,null,"",null,"",null,"",null,"","",null,null,null,null,"","",null,1]
["",null,null,"",null,"",null,"",null,"","",null,null,null,null,"","",null,1]
["",null,null,"",null,"",null,"",null,"","",null,null,null,null,"","",null,1]
["",null,null,"",null,"",null,"",null,"","",null,null,null,null,"","",null,1]
["",null,null,"",null,"",null,"",null,"","",null,null,null,null,"","",null,1]
["",null,null,"",null,"",null,"",null,"","",null,null,null,null,"","",null,1]
["",null,null,"",null,"",null,"",null,"","",null,null,null,null,"","",null,1]
["",null,null,"",null,"",null,"",null,"","",null,null,null,null,"","",null,1]
["",null,null,"",null,"",null,"",null,"","",null,null,null,null,"","",null,1]
["",null,null,"",null,"",null,"",null,"","",null,null,null,null,"","",null,1]
["",null,null,"",null,"",null,"",null,"","",null,null,null,null,"","",null,1]
["",null,null,"",null,"",null,"",null,"","",null,null,null,null,"","",null,1]
["",null,null,"",null,"",null,"",null,"","",null,null,null,null,"","",null,1]
["",null,null,"",null,"",null,"",null,"","",null,null,null,null,"","",null,1]
["",null,null,"",null,"",null,"",null,"","",null,null,null,null,"","",null,1]
["",null,null,"",null,"",null,"",null,"","",null,null,null,null,"","",null,1]
[{"$f":"IF(E836=\"\",\"\",IF(A836=\"\",TODAY(),A836))","v":""},null,null,{"$f":"IF(B836=\"\",\"\",(C836-B836))","v":""},null,{"$f":"IFERROR(VLOOKUP(E836,$AK$3:$AM$317,2,FALSE),\"\")","v":""},null,{"$f":"IFERROR(G836/D836/24,\"\")","v":""},null,{"$f":"IFERROR(I836/D836/24,\"\")","v":""},{"$f":"IFERROR(L836/D836/24,\"\")","v":""},null,null,null,null,"",{"$f":"IFERROR(ROUND(SUM(L836*P836),2),\"\")","v":""},null,1]
["",null,null,"",null,"",null,"",null,"","",null,null,null,null,"","",null,1]
["",null,null,"",null,"",null,"",null,"","",null,null,null,null,"","",null,1]
["",null,null,"",null,"",null,"",null,"","",null,null,null,null,"","",null,1]
["",null,null,"",null,"",null,"",null,"","",null,null,null,null,"","",null,1]
["",null,null,"",null,"",null,"",null,"","",null,null,null,null,"","",null,1]
["",null,null,"",null,"",null,"",null,"","",null,null,null,null,"","",null,1]
["",null,null,"",null,"",null,"",null,"","",null,null,null,null,"","",null,1]
["",null,null,"",null,"",null,"",null,"","",null,null,null,null,"","",null,1]
["",null,null,"",null,"",null,"",null,"","",null,null,null,null,"","",null,1]
["",null,null,"",null,"",null,"",null,"","",null,null,null,null,"","",null,1]
["",null,null,"",null,"",null,"",null,"","",null,null,null,null,"","",null,1]
["",null,null,"",null,"",null,"",null,"","",null,null,null,null,"","",null,1]
["",null,null,"",null,"",null,"",null,"","",null,null,null,null,"","",null,1]
["",null,null,"",null,"",null,"",null,"","",null,null,null,null,"","",null,1]
["",null,null,"",null,"",null,"",null,"","",null,null,null,null,"","",null,1]
["",null,null,"",null,"",null,"",null,"","",null,null,null,null,"","",null,1]
["",null,null,"",null,"",null,"",null,"","",null,null,null,null,"","",null,1]
["",null,null,"",null,"",null,"",null,"","",null,null,null,null,"","",null,1]
["",null,null,"",null,"",null,"",null,"","",null,null,null,null,"","",null,1]
["",null,null,"",null,"",null,"",null,"","",null,null,null,null,"","",null,1]
["",null,null,"",null,"",null,"",null,"","",null,null,null,null,"","",null,1]
["",null,null,"",null,"",null,"",null,"","",null,null,null,null,{"$f":"IFERROR(ROUND(SUM(1000/M858),2),\"\")","v":""},"",null,1]
["",null,null,"",null,"",null,"",null,"","",null,null,null,null,"","",null,1]
["",null,null,"",null,"",null,"",null,"","",null,null,null,null,"","",null,1]
["",null,null,"",null,"",null,"",null,"","",null,null,null,null,"","",null,1]
["",null,null,"",null,"",null,"",null,"","",null,null,null,null,"","",null,1]
["",null,null,"",null,"",null,"",null,"","",null,null,null,null,"","",null,1]
["",null,null,"",null,"",null,"",null,"","",null,null,null,null,"","",null,1]
["",null,null,"",null,"",null,"",null,"","",null,null,null,null,"","",null,1]
["",null,null,"",null,"",null,"",null,"","",null,null,null,null,"","",null,1]
["",null,null,"",null,"",null,"",null,"","",null,null,null,null,"","",null,1]
["",null,null,"",null,"",null,"",null,"","",null,null,null,null,"","",null,1]
["",null,null,"",null,"",null,"",null,"","",null,null,null,null,"","",null,1]
["",null,null,"",null,"",null,"",null,"","",null,null,null,null,"","",null,1]
["",null,null,"",null,"",null,"",null,"","",null,null,null,null,"","",null,1]
["",null,null,"",null,"",null,"",null,"","",null,null,null,null,"","",null,1]
["",null,null,"",null,"",null,"",null,"","",null,null,null,null,"","",null,1]
["",null,null,"",null,"",null,"",null,"","",null,null,null,null,"","",null,1]
["",null,null,"",null,"",null,"",null,"","",null,null,null,null,"","",null,1]
["",null,null,"",null,"",null,"",null,"","",null,null,null,null,"","",null,1]
["",null,null,"",null,"",null,"",null,"","",null,null,null,null,"","",null,1]
["",null,null,"",null,"",null,"",null,"","",null,null,null,null,"","",null,1]
["",null,null,"",null,"",null,"",null,"","",null,null,null,null,"","",null,1]
["",null,null,"",null,"",null,"",null,"","",null,null,null,null,"","",null,1]
["",null,null,"",null,"",null,"",null,"","",null,null,null,null,"","",null,1]
["",null,null,"",null,"",null,"",null,"","",null,null,null,null,"","",null,1]
["",null,null,"",null,"",null,"",null,"","",null,null,null,null,"","",null,1]
["",null,null,"",null,"",null,"",null,"","",null,null,null,null,"","",null,1]
["",null,null,"",null,"",null,"",null,"","",null,null,null,null,"","",null,1]
["",null,null,"",null,"",null,"",null,"","",null,null,null,null,"","",null,1]
["",null,null,"",null,"",null,"",null,"","",null,null,null,null,"","",null,1]
["",null,null,"",null,"",null,"",null,"","",null,null,null,null,"","",null,1]
["",null,null,"",null,"",null,"",null,"","",null,null,null,null,"","",null,1]
["",null,null,"",null,"",null,"",null,"","",null,null,null,null,"","",null,1]
["",null,null,"",null,"",null,"",null,"","",null,null,null,null,"","",null,1]
["",null,null,"",null,"",null,"",null,"","",null,null,null,null,"","",null,1]
["",null,null,"",null,"",null,"",null,"","",null,null,null,null,"","",null,1]
["",null,null,"",null,"",null,"",null,"","",null,null,null,null,"","",null,1]
["",null,null,"",null,"",null,"",null,"","",null,null,null,null,"","",null,1]
["",null,null,"",null,"",null,"",null,"","",null,null,null,null,"","",null,1]
["",null,null,"",null,"",null,"",null,"","",null,null,null,null,"","",null,1]
["",null,null,"",null,"",null,"",null,"","",null,null,null,null,"","",null,1]
["",null,null,"",null,"",null,"",null,"","",null,null,null,null,"","",null,1]
[{"$f":"IF(E900=\"\",\"\",IF(A900=\"\",TODAY(),A900))","v":""},null,null,{"$f":"IF(B900=\"\",\"\",(C900-B900))","v":""},null,{"$f":"IFERROR(VLOOKUP(E900,$AK$3:$AM$317,2,FALSE),\"\")","v":""},null,{"$f":"IFERROR(G900/D900/24,\"\")","v":""},null,{"$f":"IFERROR(I900/D900/24,\"\")","v":""},{"$f":"IFERROR(L900/D900/24,\"\")","v":""},null,null,null,null,"",{"$f":"IFERROR(ROUND(SUM(L900*P900),2),\"\")","v":""},null,1]
["",null,null,"",null,"",null,"",null,"","",null,null,null,null,"","",null,1]
["",null,null,"",null,"",null,"",null,"","",null,null,null,null,"","",null,1]
["",null,null,"",null,"",null,"",null,"","",null,null,null,null,"","",null,1]
["",null,null,"",null,"",null,"",null,"","",null,null,null,null,"","",null,1]
["",null,null,"",null,"",null,"",null,"","",null,null,null,null,"","",null,1]
["",null,null,"",null,"",null,"",null,"","",null,null,null,null,"","",null,1]
["",null,null,"",null,"",null,"",null,"","",null,null,null,null,"","",null,1]
["",null,null,"",null,"",null,"",null,"","",null,null,null,null,"","",null,1]
["",null,null,"",null,"",null,"",null,"","",null,null,null,null,"","",null,1]
["",null,null,"",null,"",null,"",null,"","",null,null,null,null,"","",null,1]
["",null,null,"",null,"",null,"",null,"","",null,null,null,null,"","",null,1]
["",null,null,"",null,"",null,"",null,"","",null,null,null,null,"","",null,1]
["",null,null,"",null,"",null,"",null,"","",null,null,null,null,"","",null,1]
["",null,null,"",null,"",null,"",null,"","",null,null,null,null,"","",null,1]
["",null,null,"",null,"",null,"",null,"","",null,null,null,null,"","",null,1]
["",null,null,"",null,"",null,"",null,"","",null,null,null,null,"","",null,1]
["",null,null,"",null,"",null,"",null,"","",null,null,null,null,"","",null,1]
["",null,null,"",null,"",null,"",null,"","",null,null,null,null,"","",null,1]
["",null,null,"",null,"",null,"",null,"","",null,null,null,null,"","",null,1]
["",null,null,"",null,"",null,"",null,"","",null,null,null,null,"","",null,1]
["",null,null,"",null,"",null,"",null,"","",null,null,null,null,"","",null,1]
["",null,null,"",null,"",null,"",null,"","",null,null,null,null,{"$f":"IFERROR(ROUND(SUM(1000/M922),2),\"\")","v":""},"",null,1]
["",null,null,"",null,"",null,"",null,"","",null,null,null,null,"","",null,1]
["",null,null,"",null,"",null,"",null,"","",null,null,null,null,"","",null,1]
["",null,null,"",null,"",null,"",null,"","",null,null,null,null,"","",null,1]
["",null,null,"",null,"",null,"",null,"","",null,null,null,null,"","",null,1]
["",null,null,"",null,"",null,"",null,"","",null,null,null,null,"","",null,1]
["",null,null,"",null,"",null,"",null,"","",null,null,null,null,"","",null,1]
["",null,null,"",null,"",null,"",null,"","",null,null,null,null,"","",null,1]
["",null,null,"",null,"",null,"",null,"","",null,null,null,null,"","",null,1]
["",null,null,"",null,"",null,"",null,"","",null,null,null,null,"","",null,1]
["",null,null,"",null,"",null,"",null,"","",null,null,null,null,"","",null,1]
["",null,null,"",null,"",null,"",null,"","",null,null,null,null,"","",null,1]
["",null,null,"",null,"",null,"",null,"","",null,null,null,null,"","",null,1]
["",null,null,"",null,"",null,"",null,"","",null,null,null,null,"","",null,1]
["",null,null,"",null,"",null,"",null,"","",null,null,null,null,"","",null,1]
["",null,null,"",null,"",null,"",null,"","",null,null,null,null,"","",null,1]
["",null,null,"",null,"",null,"",null,"","",null,null,null,null,"","",null,1]
["",null,null,"",null,"",null,"",null,"","",null,null,null,null,"","",null,1]
["",null,null,"",null,"",null,"",null,"","",null,null,null,null,"","",null,1]
["",null,null,"",null,"",null,"",null,"","",null,null,null,null,"","",null,1]
["",null,null,"",null,"",null,"",null,"","",null,null,null,null,"","",null,1]
["",null,null,"",null,"",null,"",null,"","",null,null,null,null,"","",null,1]
["",null,null,"",null,"",null,"",null,"","",null,null,null,null,"","",null,1]
["",null,null,"",null,"",null,"",null,"","",null,null,null,null,"","",null,1]
["",null,null,"",null,"",null,"",null,"","",null,null,null,null,"","",null,1]
["",null,null,"",null,"",null,"",null,"","",null,null,null,null,"","",null,1]
["",null,null,"",null,"",null,"",null,"","",null,null,null,null,"","",null,1]
["",null,null,"",null,"",null,"",null,"","",null,null,null,null,"","",null,1]
["",null,null,"",null,"",null,"",null,"","",null,null,null,null,"","",null,1]
["",null,null,"",null,"",null,"",null,"","",null,null,null,null,"","",null,1]
["",null,null,"",null,"",null,"",null,"","",null,null,null,null,"","",null,1]
["",null,null,"",null,"",null,"",null,"","",null,null,null,null,"","",null,1]
["",null,null,"",null,"",null,"",null,"","",null,null,null,null,"","",null,1]
["",null,null,"",null,"",null,"",null,"","",null,null,null,null,"","",null,1]
["",null,null,"",null,"",null,"",null,"","",null,null,null,null,"","",null,1]
["",null,null,"",null,"",null,"",null,"","",null,null,null,null,"","",null,1]
["",null,null,"",null,"",null,"",null,"","",null,null,null,null,"","",null,1]
["",null,null,"",null,"",null,"",null,"","",null,null,null,null,"","",null,1]
["",null,null,"",null,"",null,"",null,"","",null,null,null,null,"","",null,1]
["",null,null,"",null,"",null,"",null,"","",null,null,null,null,"","",null,1]
["",null,null,"",null,"",null,"",null,"","",null,null,null,null,"","",null,1]
["",null,null,"",null,"",null,"",null,"","",null,null,null,null,"","",null,1]
[{"$f":"IF(E964=\"\",\"\",IF(A964=\"\",TODAY(),A964))","v":""},null,null,{"$f":"IF(B964=\"\",\"\",(C964-B964))","v":""},null,{"$f":"IFERROR(VLOOKUP(E964,$AK$3:$AM$317,2,FALSE),\"\")","v":""},null,{"$f":"IFERROR(G964/D964/24,\"\")","v":""},null,{"$f":"IFERROR(I964/D964/24,\"\")","v":""},{"$f":"IFERROR(L964/D964/24,\"\")","v":""},null,null,null,null,"",{"$f":"IFERROR(ROUND(SUM(L964*P964),2),\"\")","v":""},null,1]
["",null,null,"",null,"",null,"",null,"","",null,null,null,null,"","",null,1]
["",null,null,"",null,"",null,"",null,"","",null,null,null,null,"","",null,1]
["",null,null,"",null,"",null,"",null,"","",null,null,null,null,"","",null,1]
["",null,null,"",null,"",null,"",null,"","",null,null,null,null,"","",null,1]
["",null,null,"",null,"",null,"",null,"","",null,null,null,null,"","",null,1]
["",null,null,"",null,"",null,"",null,"","",null,null,null,null,"","",null,1]
["",null,null,"",null,"",null,"",null,"","",null,null,null,null,"","",null,1]
["",null,null,"",null,"",null,"",null,"","",null,null,null,null,"","",null,1]
["",null,null,"",null,"",null,"",null,"","",null,null,null,null,"","",null,1]
["",null,null,"",null,"",null,"",null,"","",null,null,null,null,"","",null,1]
["",null,null,"",null,"",null,"",null,"","",null,null,null,null,"","",null,1]
["",null,null,"",null,"",null,"",null,"","",null,null,null,null,"","",null,1]
["",null,null,"",null,"",null,"",null,"","",null,null,null,null,"","",null,1]
["",null,null,"",null,"",null,"",null,"","",null,null,null,null,"","",null,1]
["",null,null,"",null,"",null,"",null,"","",null,null,null,null,"","",null,1]
["",null,null,"",null,"",null,"",null,"","",null,null,null,null,"","",null,1]
["",null,null,"",null,"",null,"",null,"","",null,null,null,null,"","",null,1]
["",null,null,"",null,"",null,"",null,"","",null,null,null,null,"","",null,1]
["",null,null,"",null,"",null,"",null,"","",null,null,null,null,"","",null,1]
["",null,null,"",null,"",null,"",null,"","",null,null,null,null,"","",null,1]
["",null,null,"",null,"",null,"",null,"","",null,null,null,null,"","",null,1]
["",null,null,"",null,"",null,"",null,"","",null,null,null,null,{"$f":"IFERROR(ROUND(SUM(1000/M986),2),\"\")","v":""},"",null,1]
["",null,null,"",null,"",null,"",null,"","",null,null,null,null,"","",null,1]
["",null,null,"",null,"",null,"",null,"","",null,null,null,null,"","",null,1]
["",null,null,"",null,"",null,"",null,"","",null,null,null,null,"","",null,1]
["",null,null,"",null,"",null,"",null,"","",null,null,null,null,"","",null,1]
["",null,null,"",null,"",null,"",null,"","",null,null,null,null,"","",null,1]
["",null,null,"",null,"",null,"",null,"","",null,null,null,null,"","",null,1]
["",null,null,"",null,"",null,"",null,"","",null,null,null,null,"","",null,1]
["",null,null,"",null,"",null,"",null,"","",null,null,null,null,"","",null,1]
["",null,null,"",null,"",null,"",null,"","",null,null,null,null,"","",null,1]
["",null,null,"",null,"",null,"",null,"","",null,null,null,null,"","",null,1]
["",null,null,"",null,"",null,"",null,"","",null,null,null,null,"","",null,1]
["",null,null,"",null,"",null,"",null,"","",null,null,null,null,"","",null,1]
["",null,null,"",null,"",null,"",null,"","",null,null,null,null,"","",null,1]
["",null,null,"",null,"",null,"",null,"","",null,null,null,null,"","",null,1]
["",null,null,"",null,"",null,"",null,"","",null,null,null,null,"","",null,1]
["",null,null,"",null,"",null,"",null,"","",null,null,null,null,"","",null,1]
["",null,null,"",null,"",null,"",null,"","",null,null,null,null,"","",null,1]
["",null,null,"",null,"",null,"",null,"","",null,null,null,null,"","",null,1]
["",null,null,"",null,"",null,"",null,"","",null,null,null,null,"","",null,1]
["",null,null,"",null,"",null,"",null,"","",null,null,null,null,"","",null,1]
["",null,null,"",null,"",null,"",null,"","",null,null,null,null,"","",null,1]
["",null,null,"",null,"",null,"",null,"","",null,null,null,null,"","",null,1]
["",null,null,"",null,"",null,"",null,"","",null,null,null,null,"","",null,1]
["",null,null,"",null,"",null,"",null,"","",null,null,null,null,"","",null,1]
["",null,null,"",null,"",null,"",null,"","",null,null,null,null,"","",null,1]
["",null,null,"",null,"",null,"",null,"","",null,null,null,null,"","",null,1]
["",null,null,"",null,"",null,"",null,"","",null,null,null,null,"","",null,1]
["",null,null,"",null,"",null,"",null,"","",null,null,null,null,"","",null,1]
["",null,null,"",null,"",null,"",null,"","",null,null,null,null,"","",null,1]
["",null,null,"",null,"",null,"",null,"","",null,null,null,null,"","",null,1]
["",null,null,"",null,"",null,"",null,"","",null,null,null,null,"","",null,1]
["",null,null,"",null,"",null,"",null,"","",null,null,null,null,"","",null,1]
["",null,null,"",null,"",null,"",null,"","",null,null,null,null,"","",null,1]
["",null,null,"",null,"",null,"",null,"","",null,null,null,null,"","",null,1]
["",null,null,"",null,"",null,"",null,"","",null,null,null,null,"","",null,1]
["",null,null,"",null,"",null,"",null,"","",null,null,null,null,"","",null,1]
["",null,null,"",null,"",null,"",null,"","",null,null,null,null,"","",null,1]
["",null,null,"",null,"",null,"",null,"","",null,null,null,null,"","",null,1]
["",null,null,"",null,"",null,"",null,"","",null,null,null,null,"","",null,1]
["",null,null,"",null,"",null,"",null,"","",null,null,null,null,"","",null,1]
["",null,null,"",null,"",null,"",null,"","",null,null,null,null,"","",null,1]
[{"$f":"IF(E1028=\"\",\"\",IF(A1028=\"\",TODAY(),A1028))","v":""},null,null,{"$f":"IF(B1028=\"\",\"\",(C1028-B1028))","v":""},null,{"$f":"IFERROR(VLOOKUP(E1028,$AK$3:$AM$317,2,FALSE),\"\")","v":""},null,{"$f":"IFERROR(G1028/D1028/24,\"\")","v":""},null,{"$f":"IFERROR(I1028/D1028/24,\"\")","v":""},{"$f":"IFERROR(L1028/D1028/24,\"\")","v":""},null,null,null,null,"",{"$f":"IFERROR(ROUND(SUM(L1028*P1028),2),\"\")","v":""},null,1]
["",null,null,"",null,"",null,"",null,"","",null,null,null,null,"","",null,1]
["",null,null,"",null,"",null,"",null,"","",null,null,null,null,"","",null,1]
["",null,null,"",null,"",null,"",null,"","",null,null,null,null,"","",null,1]
["",null,null,"",null,"",null,"",null,"","",null,null,null,null,"","",null,1]
["",null,null,"",null,"",null,"",null,"","",null,null,null,null,"","",null,1]
["",null,null,"",null,"",null,"",null,"","",null,null,null,null,"","",null,1]
["",null,null,"",null,"",null,"",null,"","",null,null,null,null,"","",null,1]
["",null,null,"",null,"",null,"",null,"","",null,null,null,null,"","",null,1]
["",null,null,"",null,"",null,"",null,"","",null,null,null,null,"","",null,1]
["",null,null,"",null,"",null,"",null,"","",null,null,null,null,"","",null,1]
["",null,null,"",null,"",null,"",null,"","",null,null,null,null,"","",null,1]
["",null,null,"",null,"",null,"",null,"","",null,null,null,null,"","",null,1]
["",null,null,"",null,"",null,"",null,"","",null,null,null,null,"","",null,1]
["",null,null,"",null,"",null,"",null,"","",null,null,null,null,"","",null,1]
["",null,null,"",null,"",null,"",null,"","",null,null,null,null,"","",null,1]
["",null,null,"",null,"",null,"",null,"","",null,null,null,null,"","",null,1]
["",null,null,"",null,"",null,"",null,"","",null,null,null,null,"","",null,1]
["",null,null,"",null,"",null,"",null,"","",null,null,null,null,"","",null,1]
["",null,null,"",null,"",null,"",null,"","",null,null,null,null,"","",null,1]
["",null,null,"",null,"",null,"",null,"","",null,null,null,null,"","",null,1]
["",null,null,"",null,"",null,"",null,"","",null,null,null,null,"","",null,1]
["",null,null,"",null,"",null,"",null,"","",null,null,null,null,{"$f":"IFERROR(ROUND(SUM(1000/M1050),2),\"\")","v":""},"",null,1]
["",null,null,"",null,"",null,"",null,"","",null,null,null,null,"","",null,1]
["",null,null,"",null,"",null,"",null,"","",null,null,null,null,"","",null,1]
["",null,null,"",null,"",null,"",null,"","",null,null,null,null,"","",null,1]
["",null,null,"",null,"",null,"",null,"","",null,null,null,null,"","",null,1]
["",null,null,"",null,"",null,"",null,"","",null,null,null,null,"","",null,1]
["",null,null,"",null,"",null,"",null,"","",null,null,null,null,"","",null,1]
["",null,null,"",null,"",null,"",null,"","",null,null,null,null,"","",null,1]
["",null,null,"",null,"",null,"",null,"","",null,null,null,null,"","",null,1]
["",null,null,"",null,"",null,"",null,"","",null,null,null,null,"","",null,1]
["",null,null,"",null,"",null,"",null,"","",null,null,null,null,"","",null,1]
["",null,null,"",null,"",null,"",null,"","",null,null,null,null,"","",null,1]
["",null,null,"",null,"",null,"",null,"","",null,null,null,null,"","",null,1]
["",null,null,"",null,"",null,"",null,"","",null,null,null,null,"","",null,1]
["",null,null,"",null,"",null,"",null,"","",null,null,null,null,"","",null,1]
["",null,null,"",null,"",null,"",null,"","",null,null,null,null,"","",null,1]
["",null,null,"",null,"",null,"",null,"","",null,null,null,null,"","",null,1]
["",null,null,"",null,"",null,"",null,"","",null,null,null,null,"","",null,1]
["",null,null,"",null,"",null,"",null,"","",null,null,null,null,"","",null,1]
["",null,null,"",null,"",null,"",null,"","",null,null,null,null,"","",null,1]
["",null,null,"",null,"",null,"",null,"","",null,null,null,null,"","",null,1]
["",null,null,"",null,"",null,"",null,"","",null,null,null,null,"","",null,1]
["",null,null,"",null,"",null,"",null,"","",null,null,null,null,"","",null,1]
["",null,null,"",null,"",null,"",null,"","",null,null,null,null,"","",null,1]
["",null,null,"",null,"",null,"",null,"","",null,null,null,null,"","",null,1]
["",null,null,"",null,"",null,"",null,"","",null,null,null,null,"","",null,1]
["",null,null,"",null,"",null,"",null,"","",null,null,null,null,"","",null,1]
["",null,null,"",null,"",null,"",null,"","",null,null,null,null,"","",null,1]
["",null,null,"",null,"",null,"",null,"","",null,null,null,null,"","",null,1]
["",null,null,"",null,"",null,"",null,"","",null,null,null,null,"","",null,1]
["",null,null,"",null,"",null,"",null,"","",null,null,null,null,"","",null,1]
["",null,null,"",null,"",null,"",null,"","",null,null,null,null,"","",null,1]
["",null,null,"",null,"",null,"",null,"","",null,null,null,null,"","",null,1]
["",null,null,"",null,"",null,"",null,"","",null,null,null,null,"","",null,1]
["",null,null,"",null,"",null,"",null,"","",null,null,null,null,"","",null,1]
["",null,null,"",null,"",null,"",null,"","",null,null,null,null,"","",null,1]
["",null,null,"",null,"",null,"",null,"","",null,null,null,null,"","",null,1]
["",null,null,"",null,"",null,"",null,"","",null,null,null,null,"","",null,1]
["",null,null,"",null,"",null,"",null,"","",null,null,null,null,"","",null,1]
["",null,null,"",null,"",null,"",null,"","",null,null,null,null,"","",null,1]
["",null,null,"",null,"",null,"",null,"","",null,null,null,null,"","",null,1]
["",null,null,"",null,"",null,"",null,"","",null,null,null,null,"","",null,1]
[{"$f":"IF(E1092=\"\",\"\",IF(A1092=\"\",TODAY(),A1092))","v":""},null,null,{"$f":"IF(B1092=\"\",\"\",(C1092-B1092))","v":""},null,{"$f":"IFERROR(VLOOKUP(E1092,$AK$3:$AM$317,2,FALSE),\"\")","v":""},null,{"$f":"IFERROR(G1092/D1092/24,\"\")","v":""},null,{"$f":"IFERROR(I1092/D1092/24,\"\")","v":""},{"$f":"IFERROR(L1092/D1092/24,\"\")","v":""},null,null,null,null,"",{"$f":"IFERROR(ROUND(SUM(L1092*P1092),2),\"\")","v":""},null,1]
["",null,null,"",null,"",null,"",null,"","",null,null,null,null,"","",null,1]
["",null,null,"",null,"",null,"",null,"","",null,null,null,null,"","",null,1]
["",null,null,"",null,"",null,"",null,"","",null,null,null,null,"","",null,1]
["",null,null,"",null,"",null,"",null,"","",null,null,null,null,"","",null,1]
["",null,null,"",null,"",null,"",null,"","",null,null,null,null,"","",null,1]
["",null,null,"",null,"",null,"",null,"","",null,null,null,null,"","",null,1]
["",null,null,"",null,"",null,"",null,"","",null,null,null,null,"","",null,1]
["",null,null,"",null,"",null,"",null,"","",null,null,null,null,"","",null,1]
["",null,null,"",null,"",null,"",null,"","",null,null,null,null,"","",null,1]
["",null,null,"",null,"",null,"",null,"","",null,null,null,null,"","",null,1]
["",null,null,"",null,"",null,"",null,"","",null,null,null,null,"","",null,1]
["",null,null,"",null,"",null,"",null,"","",null,null,null,null,"","",null,1]
["",null,null,"",null,"",null,"",null,"","",null,null,null,null,"","",null,1]
["",null,null,"",null,"",null,"",null,"","",null,null,null,null,"","",null,1]
["",null,null,"",null,"",null,"",null,"","",null,null,null,null,"","",null,1]
["",null,null,"",null,"",null,"",null,"","",null,null,null,null,"","",null,1]
["",null,null,"",null,"",null,"",null,"","",null,null,null,null,"","",null,1]
["",null,null,"",null,"",null,"",null,"","",null,null,null,null,"","",null,1]
["",null,null,"",null,"",null,"",null,"","",null,null,null,null,"","",null,1]
["",null,null,"",null,"",null,"",null,"","",null,null,null,null,"","",null,1]
["",null,null,"",null,"",null,"",null,"","",null,null,null,null,"","",null,1]
["",null,null,"",null,"",null,"",null,"","",null,null,null,null,{"$f":"IFERROR(ROUND(SUM(1000/M1114),2),\"\")","v":""},"",null,1]
["",null,null,"",null,"",null,"",null,"","",null,null,null,null,"","",null,1]
["",null,null,"",null,"",null,"",null,"","",null,null,null,null,"","",null,1]
["",null,null,"",null,"",null,"",null,"","",null,null,null,null,"","",null,1]
["",null,null,"",null,"",null,"",null,"","",null,null,null,null,"","",null,1]
["",null,null,"",null,"",null,"",null,"","",null,null,null,null,"","",null,1]
["",null,null,"",null,"",null,"",null,"","",null,null,null,null,"","",null,1]
["",null,null,"",null,"",null,"",null,"","",null,null,null,null,"","",null,1]
["",null,null,"",null,"",null,"",null,"","",null,null,null,null,"","",null,1]
["",null,null,"",null,"",null,"",null,"","",null,null,null,null,"","",null,1]
["",null,null,"",null,"",null,"",null,"","",null,null,null,null,"","",null,1]
["",null,null,"",null,"",null,"",null,"","",null,null,null,null,"","",null,1]
["",null,null,"",null,"",null,"",null,"","",null,null,null,null,"","",null,1]
["",null,null,"",null,"",null,"",null,"","",null,null,null,null,"","",null,1]
["",null,null,"",null,"",null,"",null,"","",null,null,null,null,"","",null,1]
["",null,null,"",null,"",null,"",null,"","",null,null,null,null,"","",null,1]
["",null,null,"",null,"",null,"",null,"","",null,null,null,null,"","",null,1]
["",null,null,"",null,"",null,"",null,"","",null,null,null,null,"","",null,1]
["",null,null,"",null,"",null,"",null,"","",null,null,null,null,"","",null,1]
["",null,null,"",null,"",null,"",null,"","",null,null,null,null,"","",null,1]
["",null,null,"",null,"",null,"",null,"","",null,null,null,null,"","",null,1]
["",null,null,"",null,"",null,"",null,"","",null,null,null,null,"","",null,1]
["",null,null,"",null,"",null,"",null,"","",null,null,null,null,"","",null,1]
["",null,null,"",null,"",null,"",null,"","",null,null,null,null,"","",null,1]
["",null,null,"",null,"",null,"",null,"","",null,null,null,null,"","",null,1]
["",null,null,"",null,"",null,"",null,"","",null,null,null,null,"","",null,1]
["",null,null,"",null,"",null,"",null,"","",null,null,null,null,"","",null,1]
["",null,null,"",null,"",null,"",null,"","",null,null,null,null,"","",null,1]
["",null,null,"",null,"",null,"",null,"","",null,null,null,null,"","",null,1]
["",null,null,"",null,"",null,"",null,"","",null,null,null,null,"","",null,1]
["",null,null,"",null,"",null,"",null,"","",null,null,null,null,"","",null,1]
["",null,null,"",null,"",null,"",null,"","",null,null,null,null,"","",null,1]
["",null,null,"",null,"",null,"",null,"","",null,null,null,null,"","",null,1]
["",null,null,"",null,"",null,"",null,"","",null,null,null,null,"","",null,1]
["",null,null,"",null,"",null,"",null,"","",null,null,null,null,"","",null,1]
["",null,null,"",null,"",null,"",null,"","",null,null,null,null,"","",null,1]
["",null,null,"",null,"",null,"",null,"","",null,null,null,null,"","",null,1]
["",null,null,"",null,"",null,"",null,"","",null,null,null,null,"","",null,1]
["",null,null,"",null,"",null,"",null,"","",null,null,null,null,"","",null,1]
["",null,null,"",null,"",null,"",null,"","",null,null,null,null,"","",null,1]
["",null,null,"",null,"",null,"",null,"","",null,null,null,null,"","",null,1]
["",null,null,"",null,"",null,"",null,"","",null,null,null,null,"","",null,1]
[{"$f":"IF(E1156=\"\",\"\",IF(A1156=\"\",TODAY(),A1156))","v":""},null,null,{"$f":"IF(B1156=\"\",\"\",(C1156-B1156))","v":""},null,{"$f":"IFERROR(VLOOKUP(E1156,$AK$3:$AM$317,2,FALSE),\"\")","v":""},null,{"$f":"IFERROR(G1156/D1156/24,\"\")","v":""},null,{"$f":"IFERROR(I1156/D1156/24,\"\")","v":""},{"$f":"IFERROR(L1156/D1156/24,\"\")","v":""},null,null,null,null,"",{"$f":"IFERROR(ROUND(SUM(L1156*P1156),2),\"\")","v":""},null,1]
["",null,null,"",null,"",null,"",null,"","",null,null,null,null,"","",null,1]
["",null,null,"",null,"",null,"",null,"","",null,null,null,null,"","",null,1]
["",null,null,"",null,"",null,"",null,"","",null,null,null,null,"","",null,1]
["",null,null,"",null,"",null,"",null,"","",null,null,null,null,"","",null,1]
["",null,null,"",null,"",null,"",null,"","",null,null,null,null,"","",null,1]
["",null,null,"",null,"",null,"",null,"","",null,null,null,null,"","",null,1]
["",null,null,"",null,"",null,"",null,"","",null,null,null,null,"","",null,1]
["",null,null,"",null,"",null,"",null,"","",null,null,null,null,"","",null,1]
["",null,null,"",null,"",null,"",null,"","",null,null,null,null,"","",null,1]
["",null,null,"",null,"",null,"",null,"","",null,null,null,null,"","",null,1]
["",null,null,"",null,"",null,"",null,"","",null,null,null,null,"","",null,1]
["",null,null,"",null,"",null,"",null,"","",null,null,null,null,"","",null,1]
["",null,null,"",null,"",null,"",null,"","",null,null,null,null,"","",null,1]
["",null,null,"",null,"",null,"",null,"","",null,null,null,null,"","",null,1]
["",null,null,"",null,"",null,"",null,"","",null,null,null,null,"","",null,1]
["",null,null,"",null,"",null,"",null,"","",null,null,null,null,"","",null,1]
["",null,null,"",null,"",null,"",null,"","",null,null,null,null,"","",null,1]
["",null,null,"",null,"",null,"",null,"","",null,null,null,null,"","",null,1]
["",null,null,"",null,"",null,"",null,"","",null,null,null,null,"","",null,1]
["",null,null,"",null,"",null,"",null,"","",null,null,null,null,"","",null,1]
["",null,null,"",null,"",null,"",null,"","",null,null,null,null,"","",null,1]
["",null,null,"",null,"",null,"",null,"","",null,null,null,null,{"$f":"IFERROR(ROUND(SUM(1000/M1178),2),\"\")","v":""},"",null,1]
["",null,null,"",null,"",null,"",null,"","",null,null,null,null,"","",null,1]
["",null,null,"",null,"",null,"",null,"","",null,null,null,null,"","",null,1]
["",null,null,"",null,"",null,"",null,"","",null,null,null,null,"","",null,1]
["",null,null,"",null,"",null,"",null,"","",null,null,null,null,"","",null,1]
["",null,null,"",null,"",null,"",null,"","",null,null,null,null,"","",null,1]
["",null,null,"",null,"",null,"",null,"","",null,null,null,null,"","",null,1]
["",null,null,"",null,"",null,"",null,"","",null,null,null,null,"","",null,1]
["",null,null,"",null,"",null,"",null,"","",null,null,null,null,"","",null,1]
["",null,null,"",null,"",null,"",null,"","",null,null,null,null,"","",null,1]
["",null,null,"",null,"",null,"",null,"","",null,null,null,null,"","",null,1]
["",null,null,"",null,"",null,"",null,"","",null,null,null,null,"","",null,1]
["",null,null,"",null,"",null,"",null,"","",null,null,null,null,"","",null,1]
["",null,null,"",null,"",null,"",null,"","",null,null,null,null,"","",null,1]
["",null,null,"",null,"",null,"",null,"","",null,null,null,null,"","",null,1]
["",null,null,"",null,"",null,"",null,"","",null,null,null,null,"","",null,1]
["",null,null,"",null,"",null,"",null,"","",null,null,null,null,"","",null,1]
["",null,null,"",null,"",null,"",null,"","",null,null,null,null,"","",null,1]
["",null,null,"",null,"",null,"",null,"","",null,null,null,null,"","",null,1]
["",null,null,"",null,"",null,"",null,"","",null,null,null,null,"","",null,1]
["",null,null,"",null,"",null,"",null,"","",null,null,null,null,"","",null,1]
["",null,null,"",null,"",null,"",null,"","",null,null,null,null,"","",null,1]
["",null,null,"",null,"",null,"",null,"","",null,null,null,null,"","",null,1]
["",null,null,"",null,"",null,"",null,"","",null,null,null,null,"","",null,1]
["",null,null,"",null,"",null,"",null,"","",null,null,null,null,"","",null,1]
["",null,null,"",null,"",null,"",null,"","",null,null,null,null,"","",null,1]
["",null,null,"",null,"",null,"",null,"","",null,null,null,null,"","",null,1]
["",null,null,"",null,"",null,"",null,"","",null,null,null,null,"","",null,1]
["",null,null,"",null,"",null,"",null,"","",null,null,null,null,"","",null,1]
["",null,null,"",null,"",null,"",null,"","",null,null,null,null,"","",null,1]
["",null,null,"",null,"",null,"",null,"","",null,null,null,null,"","",null,1]
["",null,null,"",null,"",null,"",null,"","",null,null,null,null,"","",null,1]
["",null,null,"",null,"",null,"",null,"","",null,null,null,null,"","",null,1]
["",null,null,"",null,"",null,"",null,"","",null,null,null,null,"","",null,1]
["",null,null,"",null,"",null,"",null,"","",null,null,null,null,"","",null,1]
["",null,null,"",null,"",null,"",null,"","",null,null,null,null,"","",null,1]
["",null,null,"",null,"",null,"",null,"","",null,null,null,null,"","",null,1]
["",null,null,"",null,"",null,"",null,"","",null,null,null,null,"","",null,1]
["",null,null,"",null,"",null,"",null,"","",null,null,null,null,"","",null,1]
["",null,null,"",null,"",null,"",null,"","",null,null,null,null,"","",null,1]
["",null,null,"",null,"",null,"",null,"","",null,null,null,null,"","",null,1]
["",null,null,"",null,"",null,"",null,"","",null,null,null,null,"","",null,1]
[{"$f":"IF(E1220=\"\",\"\",IF(A1220=\"\",TODAY(),A1220))","v":""},null,null,{"$f":"IF(B1220=\"\",\"\",(C1220-B1220))","v":""},null,{"$f":"IFERROR(VLOOKUP(E1220,$AK$3:$AM$317,2,FALSE),\"\")","v":""},null,{"$f":"IFERROR(G1220/D1220/24,\"\")","v":""},null,{"$f":"IFERROR(I1220/D1220/24,\"\")","v":""},{"$f":"IFERROR(L1220/D1220/24,\"\")","v":""},null,null,null,null,"",{"$f":"IFERROR(ROUND(SUM(L1220*P1220),2),\"\")","v":""},null,1]
["",null,null,"",null,"",null,"",null,"","",null,null,null,null,"","",null,1]
["",null,null,"",null,"",null,"",null,"","",null,null,null,null,"","",null,1]
["",null,null,"",null,"",null,"",null,"","",null,null,null,null,"","",null,1]
["",null,null,"",null,"",null,"",null,"","",null,null,null,null,"","",null,1]
["",null,null,"",null,"",null,"",null,"","",null,null,null,null,"","",null,1]
["",null,null,"",null,"",null,"",null,"","",null,null,null,null,"","",null,1]
["",null,null,"",null,"",null,"",null,"","",null,null,null,null,"","",null,1]
["",null,null,"",null,"",null,"",null,"","",null,null,null,null,"","",null,1]
["",null,null,"",null,"",null,"",null,"","",null,null,null,null,"","",null,1]
["",null,null,"",null,"",null,"",null,"","",null,null,null,null,"","",null,1]
["",null,null,"",null,"",null,"",null,"","",null,null,null,null,"","",null,1]
["",null,null,"",null,"",null,"",null,"","",null,null,null,null,"","",null,1]
["",null,null,"",null,"",null,"",null,"","",null,null,null,null,"","",null,1]
["",null,null,"",null,"",null,"",null,"","",null,null,null,null,"","",null,1]
["",null,null,"",null,"",null,"",null,"","",null,null,null,null,"","",null,1]
["",null,null,"",null,"",null,"",null,"","",null,null,null,null,"","",null,1]
["",null,null,"",null,"",null,"",null,"","",null,null,null,null,"","",null,1]
["",null,null,"",null,"",null,"",null,"","",null,null,null,null,"","",null,1]
["",null,null,"",null,"",null,"",null,"","",null,null,null,null,"","",null,1]
["",null,null,"",null,"",null,"",null,"","",null,null,null,null,"","",null,1]
["",null,null,"",null,"",null,"",null,"","",null,null,null,null,"","",null,1]
["",null,null,"",null,"",null,"",null,"","",null,null,null,null,{"$f":"IFERROR(ROUND(SUM(1000/M1242),2),\"\")","v":""},"",null,1]
["",null,null,"",null,"",null,"",null,"","",null,null,null,null,"","",null,1]
["",null,null,"",null,"",null,"",null,"","",null,null,null,null,"","",null,1]
["",null,null,"",null,"",null,"",null,"","",null,null,null,null,"","",null,1]
["",null,null,"",null,"",null,"",null,"","",null,null,null,null,"","",null,1]
["",null,null,"",null,"",null,"",null,"","",null,null,null,null,"","",null,1]
["",null,null,"",null,"",null,"",null,"","",null,null,null,null,"","",null,1]
["",null,null,"",null,"",null,"",null,"","",null,null,null,null,"","",null,1]
["",null,null,"",null,"",null,"",null,"","",null,null,null,null,"","",null,1]
["",null,null,"",null,"",null,"",null,"","",null,null,null,null,"","",null,1]
["",null,null,"",null,"",null,"",null,"","",null,null,null,null,"","",null,1]
["",null,null,"",null,"",null,"",null,"","",null,null,null,null,"","",null,1]
["",null,null,"",null,"",null,"",null,"","",null,null,null,null,"","",null,1]
["",null,null,"",null,"",null,"",null,"","",null,null,null,null,"","",null,1]
["",null,null,"",null,"",null,"",null,"","",null,null,null,null,"","",null,1]
["",null,null,"",null,"",null,"",null,"","",null,null,null,null,"","",null,1]
["",null,null,"",null,"",null,"",null,"","",null,null,null,null,"","",null,1]
["",null,null,"",null,"",null,"",null,"","",null,null,null,null,"","",null,1]
["",null,null,"",null,"",null,"",null,"","",null,null,null,null,"","",null,1]
["",null,null,"",null,"",null,"",null,"","",null,null,null,null,"","",null,1]
["",null,null,"",null,"",null,"",null,"","",null,null,null,null,"","",null,1]
["",null,null,"",null,"",null,"",null,"","",null,null,null,null,"","",null,1]
["",null,null,"",null,"",null,"",null,"","",null,null,null,null,"","",null,1]
["",null,null,"",null,"",null,"",null,"","",null,null,null,null,"","",null,1]
["",null,null,"",null,"",null,"",null,"","",null,null,null,null,"","",null,1]
["",null,null,"",null,"",null,"",null,"","",null,null,null,null,"","",null,1]
["",null,null,"",null,"",null,"",null,"","",null,null,null,null,"","",null,1]
["",null,null,"",null,"",null,"",null,"","",null,null,null,null,"","",null,1]
["",null,null,"",null,"",null,"",null,"","",null,null,null,null,"","",null,1]
["",null,null,"",null,"",null,"",null,"","",null,null,null,null,"","",null,1]
["",null,null,"",null,"",null,"",null,"","",null,null,null,null,"","",null,1]
["",null,null,"",null,"",null,"",null,"","",null,null,null,null,"","",null,1]
["",null,null,"",null,"",null,"",null,"","",null,null,null,null,"","",null,1]
["",null,null,"",null,"",null,"",null,"","",null,null,null,null,"","",null,1]
["",null,null,"",null,"",null,"",null,"","",null,null,null,null,"","",null,1]
["",null,null,"",null,"",null,"",null,"","",null,null,null,null,"","",null,1]
["",null,null,"",null,"",null,"",null,"","",null,null,null,null,"","",null,1]
["",null,null,"",null,"",null,"",null,"","",null,null,null,null,"","",null,1]
["",null,null,"",null,"",null,"",null,"","",null,null,null,null,"","",null,1]
["",null,null,"",null,"",null,"",null,"","",null,null,null,null,"","",null,1]
["",null,null,"",null,"",null,"",null,"","",null,null,null,null,"","",null,1]
["",null,null,"",null,"",null,"",null,"","",null,null,null,null,"","",null,1]
[{"$f":"IF(E1284=\"\",\"\",IF(A1284=\"\",TODAY(),A1284))","v":""},null,null,{"$f":"IF(B1284=\"\",\"\",(C1284-B1284))","v":""},null,{"$f":"IFERROR(VLOOKUP(E1284,$AK$3:$AM$317,2,FALSE),\"\")","v":""},null,{"$f":"IFERROR(G1284/D1284/24,\"\")","v":""},null,{"$f":"IFERROR(I1284/D1284/24,\"\")","v":""},{"$f":"IFERROR(L1284/D1284/24,\"\")","v":""},null,null,null,null,"",{"$f":"IFERROR(ROUND(SUM(L1284*P1284),2),\"\")","v":""},null,1]
["",null,null,"",null,"",null,"",null,"","",null,null,null,null,"","",null,1]
["",null,null,"",null,"",null,"",null,"","",null,null,null,null,"","",null,1]
["",null,null,"",null,"",null,"",null,"","",null,null,null,null,"","",null,1]
["",null,null,"",null,"",null,"",null,"","",null,null,null,null,"","",null,1]
["",null,null,"",null,"",null,"",null,"","",null,null,null,null,"","",null,1]
["",null,null,"",null,"",null,"",null,"","",null,null,null,null,"","",null,1]
["",null,null,"",null,"",null,"",null,"","",null,null,null,null,"","",null,1]
["",null,null,"",null,"",null,"",null,"","",null,null,null,null,"","",null,1]
["",null,null,"",null,"",null,"",null,"","",null,null,null,null,"","",null,1]
["",null,null,"",null,"",null,"",null,"","",null,null,null,null,"","",null,1]
["",null,null,"",null,"",null,"",null,"","",null,null,null,null,"","",null,1]
["",null,null,"",null,"",null,"",null,"","",null,null,null,null,"","",null,1]
["",null,null,"",null,"",null,"",null,"","",null,null,null,null,"","",null,1]
["",null,null,"",null,"",null,"",null,"","",null,null,null,null,"","",null,1]
["",null,null,"",null,"",null,"",null,"","",null,null,null,null,"","",null,1]
["",null,null,"",null,"",null,"",null,"","",null,null,null,null,"","",null,1]
["",null,null,"",null,"",null,"",null,"","",null,null,null,null,"","",null,1]
["",null,null,"",null,"",null,"",null,"","",null,null,null,null,"","",null,1]
["",null,null,"",null,"",null,"",null,"","",null,null,null,null,"","",null,1]
["",null,null,"",null,"",null,"",null,"","",null,null,null,null,"","",null,1]
["",null,null,"",null,"",null,"",null,"","",null,null,null,null,"","",null,1]
["",null,null,"",null,"",null,"",null,"","",null,null,null,null,{"$f":"IFERROR(ROUND(SUM(1000/M1306),2),\"\")","v":""},"",null,1]
["",null,null,"",null,"",null,"",null,"","",null,null,null,null,"","",null,1]
["",null,null,"",null,"",null,"",null,"","",null,null,null,null,"","",null,1]
["",null,null,"",null,"",null,"",null,"","",null,null,null,null,"","",null,1]
["",null,null,"",null,"",null,"",null,"","",null,null,null,null,"","",null,1]
["",null,null,"",null,"",null,"",null,"","",null,null,null,null,"","",null,1]
["",null,null,"",null,"",null,"",null,"","",null,null,null,null,"","",null,1]
["",null,null,"",null,"",null,"",null,"","",null,null,null,null,"","",null,1]
["",null,null,"",null,"",null,"",null,"","",null,null,null,null,"","",null,1]
["",null,null,"",null,"",null,"",null,"","",null,null,null,null,"","",null,1]
["",null,null,"",null,"",null,"",null,"","",null,null,null,null,"","",null,1]
["",null,null,"",null,"",null,"",null,"","",null,null,null,null,"","",null,1]
["",null,null,"",null,"",null,"",null,"","",null,null,null,null,"","",null,1]
["",null,null,"",null,"",null,"",null,"","",null,null,null,null,"","",null,1]
["",null,null,"",null,"",null,"",null,"","",null,null,null,null,"","",null,1]
["",null,null,"",null,"",null,"",null,"","",null,null,null,null,"","",null,1]
["",null,null,"",null,"",null,"",null,"","",null,null,null,null,"","",null,1]
["",null,null,"",null,"",null,"",null,"","",null,null,null,null,"","",null,1]
["",null,null,"",null,"",null,"",null,"","",null,null,null,null,"","",null,1]
["",null,null,"",null,"",null,"",null,"","",null,null,null,null,"","",null,1]
["",null,null,"",null,"",null,"",null,"","",null,null,null,null,"","",null,1]
["",null,null,"",null,"",null,"",null,"","",null,null,null,null,"","",null,1]
["",null,null,"",null,"",null,"",null,"","",null,null,null,null,"","",null,1]
["",null,null,"",null,"",null,"",null,"","",null,null,null,null,"","",null,1]
["",null,null,"",null,"",null,"",null,"","",null,null,null,null,"","",null,1]
["",null,null,"",null,"",null,"",null,"","",null,null,null,null,"","",null,1]
["",null,null,"",null,"",null,"",null,"","",null,null,null,null,"","",null,1]
["",null,null,"",null,"",null,"",null,"","",null,null,null,null,"","",null,1]
["",null,null,"",null,"",null,"",null,"","",null,null,null,null,"","",null,1]
["",null,null,"",null,"",null,"",null,"","",null,null,null,null,"","",null,1]
["",null,null,"",null,"",null,"",null,"","",null,null,null,null,"","",null,1]
["",null,null,"",null,"",null,"",null,"","",null,null,null,null,"","",null,1]
["",null,null,"",null,"",null,"",null,"","",null,null,null,null,"","",null,1]
["",null,null,"",null,"",null,"",null,"","",null,null,null,null,"","",null,1]
["",null,null,"",null,"",null,"",null,"","",null,null,null,null,"","",null,1]
["",null,null,"",null,"",null,"",null,"","",null,null,null,null,"","",null,1]
["",null,null,"",null,"",null,"",null,"","",null,null,null,null,"","",null,1]
["",null,null,"",null,"",null,"",null,"","",null,null,null,null,"","",null,1]
["",null,null,"",null,"",null,"",null,"","",null,null,null,null,"","",null,1]
["",null,null,"",null,"",null,"",null,"","",null,null,null,null,"","",null,1]
["",null,null,"",null,"",null,"",null,"","",null,null,null,null,"","",null,1]
["",null,null,"",null,"",null,"",null,"","",null,null,null,null,"","",null,1]
[{"$f":"IF(E1348=\"\",\"\",IF(A1348=\"\",TODAY(),A1348))","v":""},null,null,{"$f":"IF(B1348=\"\",\"\",(C1348-B1348))","v":""},null,{"$f":"IFERROR(VLOOKUP(E1348,$AK$3:$AM$317,2,FALSE),\"\")","v":""},null,{"$f":"IFERROR(G1348/D1348/24,\"\")","v":""},null,{"$f":"IFERROR(I1348/D1348/24,\"\")","v":""},{"$f":"IFERROR(L1348/D1348/24,\"\")","v":""},null,null,null,null,"",{"$f":"IFERROR(ROUND(SUM(L1348*P1348),2),\"\")","v":""},null,1]
["",null,null,"",null,"",null,"",null,"","",null,null,null,null,"","",null,1]
["",null,null,"",null,"",null,"",null,"","",null,null,null,null,"","",null,1]
["",null,null,"",null,"",null,"",null,"","",null,null,null,null,"","",null,1]
["",null,null,"",null,"",null,"",null,"","",null,null,null,null,"","",null,1]
["",null,null,"",null,"",null,"",null,"","",null,null,null,null,"","",null,1]
["",null,null,"",null,"",null,"",null,"","",null,null,null,null,"","",null,1]
["",null,null,"",null,"",null,"",null,"","",null,null,null,null,"","",null,1]
["",null,null,"",null,"",null,"",null,"","",null,null,null,null,"","",null,1]
["",null,null,"",null,"",null,"",null,"","",null,null,null,null,"","",null,1]
["",null,null,"",null,"",null,"",null,"","",null,null,null,null,"","",null,1]
["",null,null,"",null,"",null,"",null,"","",null,null,null,null,"","",null,1]
["",null,null,"",null,"",null,"",null,"","",null,null,null,null,"","",null,1]
["",null,null,"",null,"",null,"",null,"","",null,null,null,null,"","",null,1]
["",null,null,"",null,"",null,"",null,"","",null,null,null,null,"","",null,1]
["",null,null,"",null,"",null,"",null,"","",null,null,null,null,"","",null,1]
["",null,null,"",null,"",null,"",null,"","",null,null,null,null,"","",null,1]
["",null,null,"",null,"",null,"",null,"","",null,null,null,null,"","",null,1]
["",null,null,"",null,"",null,"",null,"","",null,null,null,null,"","",null,1]
["",null,null,"",null,"",null,"",null,"","",null,null,null,null,"","",null,1]
["",null,null,"",null,"",null,"",null,"","",null,null,null,null,"","",null,1]
["",null,null,"",null,"",null,"",null,"","",null,null,null,null,"","",null,1]
["",null,null,"",null,"",null,"",null,"","",null,null,null,null,{"$f":"IFERROR(ROUND(SUM(1000/M1370),2),\"\")","v":""},"",null,1]
["",null,null,"",null,"",null,"",null,"","",null,null,null,null,"","",null,1]
["",null,null,"",null,"",null,"",null,"","",null,null,null,null,"","",null,1]
["",null,null,"",null,"",null,"",null,"","",null,null,null,null,"","",null,1]
["",null,null,"",null,"",null,"",null,"","",null,null,null,null,"","",null,1]
["",null,null,"",null,"",null,"",null,"","",null,null,null,null,"","",null,1]
["",null,null,"",null,"",null,"",null,"","",null,null,null,null,"","",null,1]
["",null,null,"",null,"",null,"",null,"","",null,null,null,null,"","",null,1]
["",null,null,"",null,"",null,"",null,"","",null,null,null,null,"","",null,1]
["",null,null,"",null,"",null,"",null,"","",null,null,null,null,"","",null,1]
["",null,null,"",null,"",null,"",null,"","",null,null,null,null,"","",null,1]
["",null,null,"",null,"",null,"",null,"","",null,null,null,null,"","",null,1]
["",null,null,"",null,"",null,"",null,"","",null,null,null,null,"","",null,1]
["",null,null,"",null,"",null,"",null,"","",null,null,null,null,"","",null,1]
["",null,null,"",null,"",null,"",null,"","",null,null,null,null,"","",null,1]
["",null,null,"",null,"",null,"",null,"","",null,null,null,null,"","",null,1]
["",null,null,"",null,"",null,"",null,"","",null,null,null,null,"","",null,1]
["",null,null,"",null,"",null,"",null,"","",null,null,null,null,"","",null,1]
["",null,null,"",null,"",null,"",null,"","",null,null,null,null,"","",null,1]
["",null,null,"",null,"",null,"",null,"","",null,null,null,null,"","",null,1]
["",null,null,"",null,"",null,"",null,"","",null,null,null,null,"","",null,1]
["",null,null,"",null,"",null,"",null,"","",null,null,null,null,"","",null,1]
["",null,null,"",null,"",null,"",null,"","",null,null,null,null,"","",null,1]
["",null,null,"",null,"",null,"",null,"","",null,null,null,null,"","",null,1]
["",null,null,"",null,"",null,"",null,"","",null,null,null,null,"","",null,1]
["",null,null,"",null,"",null,"",null,"","",null,null,null,null,"","",null,1]
["",null,null,"",null,"",null,"",null,"","",null,null,null,null,"","",null,1]
["",null,null,"",null,"",null,"",null,"","",null,null,null,null,"","",null,1]
["",null,null,"",null,"",null,"",null,"","",null,null,null,null,"","",null,1]
["",null,null,"",null,"",null,"",null,"","",null,null,null,null,"","",null,1]
["",null,null,"",null,"",null,"",null,"","",null,null,null,null,"","",null,1]
["",null,null,"",null,"",null,"",null,"","",null,null,null,null,"","",null,1]
["",null,null,"",null,"",null,"",null,"","",null,null,null,null,"","",null,1]
["",null,null,"",null,"",null,"",null,"","",null,null,null,null,"","",null,1]
["",null,null,"",null,"",null,"",null,"","",null,null,null,null,"","",null,1]
["",null,null,"",null,"",null,"",null,"","",null,null,null,null,"","",null,1]
["",null,null,"",null,"",null,"",null,"","",null,null,null,null,"","",null,1]
["",null,null,"",null,"",null,"",null,"","",null,null,null,null,"","",null,1]
["",null,null,"",null,"",null,"",null,"","",null,null,null,null,"","",null,1]
["",null,null,"",null,"",null,"",null,"","",null,null,null,null,"","",null,1]
["",null,null,"",null,"",null,"",null,"","",null,null,null,null,"","",null,1]
["",null,null,"",null,"",null,"",null,"","",null,null,null,null,"","",null,1]
[{"$f":"IF(E1412=\"\",\"\",IF(A1412=\"\",TODAY(),A1412))","v":""},null,null,{"$f":"IF(B1412=\"\",\"\",(C1412-B1412))","v":""},null,{"$f":"IFERROR(VLOOKUP(E1412,$AK$3:$AM$317,2,FALSE),\"\")","v":""},null,{"$f":"IFERROR(G1412/D1412/24,\"\")","v":""},null,{"$f":"IFERROR(I1412/D1412/24,\"\")","v":""},{"$f":"IFERROR(L1412/D1412/24,\"\")","v":""},null,null,null,null,"",{"$f":"IFERROR(ROUND(SUM(L1412*P1412),2),\"\")","v":""},null,1]
["",null,null,"",null,"",null,"",null,"","",null,null,null,null,"","",null,1]
["",null,null,"",null,"",null,"",null,"","",null,null,null,null,"","",null,1]
["",null,null,"",null,"",null,"",null,"","",null,null,null,null,"","",null,1]
["",null,null,"",null,"",null,"",null,"","",null,null,null,null,"","",null,1]
["",null,null,"",null,"",null,"",null,"","",null,null,null,null,"","",null,1]
["",null,null,"",null,"",null,"",null,"","",null,null,null,null,"","",null,1]
["",null,null,"",null,"",null,"",null,"","",null,null,null,null,"","",null,1]
["",null,null,"",null,"",null,"",null,"","",null,null,null,null,"","",null,1]
["",null,null,"",null,"",null,"",null,"","",null,null,null,null,"","",null,1]
["",null,null,"",null,"",null,"",null,"","",null,null,null,null,"","",null,1]
["",null,null,"",null,"",null,"",null,"","",null,null,null,null,"","",null,1]
["",null,null,"",null,"",null,"",null,"","",null,null,null,null,"","",null,1]
["",null,null,"",null,"",null,"",null,"","",null,null,null,null,"","",null,1]
["",null,null,"",null,"",null,"",null,"","",null,null,null,null,"","",null,1]
["",null,null,"",null,"",null,"",null,"","",null,null,null,null,"","",null,1]
["",null,null,"",null,"",null,"",null,"","",null,null,null,null,"","",null,1]
["",null,null,"",null,"",null,"",null,"","",null,null,null,null,"","",null,1]
["",null,null,"",null,"",null,"",null,"","",null,null,null,null,"","",null,1]
["",null,null,"",null,"",null,"",null,"","",null,null,null,null,"","",null,1]
["",null,null,"",null,"",null,"",null,"","",null,null,null,null,"","",null,1]
["",null,null,"",null,"",null,"",null,"","",null,null,null,null,"","",null,1]
["",null,null,"",null,"",null,"",null,"","",null,null,null,null,{"$f":"IFERROR(ROUND(SUM(1000/M1434),2),\"\")","v":""},"",null,1]
["",null,null,"",null,"",null,"",null,"","",null,null,null,null,"","",null,1]
["",null,null,"",null,"",null,"",null,"","",null,null,null,null,"","",null,1]
["",null,null,"",null,"",null,"",null,"","",null,null,null,null,"","",null,1]
["",null,null,"",null,"",null,"",null,"","",null,null,null,null,"","",null,1]
["",null,null,"",null,"",null,"",null,"","",null,null,null,null,"","",null,1]
["",null,null,"",null,"",null,"",null,"","",null,null,null,null,"","",null,1]
["",null,null,"",null,"",null,"",null,"","",null,null,null,null,"","",null,1]
["",null,null,"",null,"",null,"",null,"","",null,null,null,null,"","",null,1]
["",null,null,"",null,"",null,"",null,"","",null,null,null,null,"","",null,1]
["",null,null,"",null,"",null,"",null,"","",null,null,null,null,"","",null,1]
["",null,null,"",null,"",null,"",null,"","",null,null,null,null,"","",null,1]
["",null,null,"",null,"",null,"",null,"","",null,null,null,null,"","",null,1]
["",null,null,"",null,"",null,"",null,"","",null,null,null,null,"","",null,1]
["",null,null,"",null,"",null,"",null,"","",null,null,null,null,"","",null,1]
["",null,null,"",null,"",null,"",null,"","",null,null,null,null,"","",null,1]
["",null,null,"",null,"",null,"",null,"","",null,null,null,null,"","",null,1]
["",null,null,"",null,"",null,"",null,"","",null,null,null,null,"","",null,1]
["",null,null,"",null,"",null,"",null,"","",null,null,null,null,"","",null,1]
["",null,null,"",null,"",null,"",null,"","",null,null,null,null,"","",null,1]
["",null,null,"",null,"",null,"",null,"","",null,null,null,null,"","",null,1]
["",null,null,"",null,"",null,"",null,"","",null,null,null,null,"","",null,1]
["",null,null,"",null,"",null,"",null,"","",null,null,null,null,"","",null,1]
["",null,null,"",null,"",null,"",null,"","",null,null,null,null,"","",null,1]
["",null,null,"",null,"",null,"",null,"","",null,null,null,null,"","",null,1]
["",null,null,"",null,"",null,"",null,"","",null,null,null,null,"","",null,1]
["",null,null,"",null,"",null,"",null,"","",null,null,null,null,"","",null,1]
["",null,null,"",null,"",null,"",null,"","",null,null,null,null,"","",null,1]
["",null,null,"",null,"",null,"",null,"","",null,null,null,null,"","",null,1]
["",null,null,"",null,"",null,"",null,"","",null,null,null,null,"","",null,1]
["",null,null,"",null,"",null,"",null,"","",null,null,null,null,"","",null,1]
["",null,null,"",null,"",null,"",null,"","",null,null,null,null,"","",null,1]
["",null,null,"",null,"",null,"",null,"","",null,null,null,null,"","",null,1]
["",null,null,"",null,"",null,"",null,"","",null,null,null,null,"","",null,1]
["",null,null,"",null,"",null,"",null,"","",null,null,null,null,"","",null,1]
["",null,null,"",null,"",null,"",null,"","",null,null,null,null,"","",null,1]
["",null,null,"",null,"",null,"",null,"","",null,null,null,null,"","",null,1]
["",null,null,"",null,"",null,"",null,"","",null,null,null,null,"","",null,1]
["",null,null,"",null,"",null,"",null,"","",null,null,null,null,"","",null,1]
["",null,null,"",null,"",null,"",null,"","",null,null,null,null,"","",null,1]
["",null,null,"",null,"",null,"",null,"","",null,null,null,null,"","",null,1]
["",null,null,"",null,"",null,"",null,"","",null,null,null,null,"","",null,1]
[{"$f":"IF(E1476=\"\",\"\",IF(A1476=\"\",TODAY(),A1476))","v":""},null,null,{"$f":"IF(B1476=\"\",\"\",(C1476-B1476))","v":""},null,{"$f":"IFERROR(VLOOKUP(E1476,$AK$3:$AM$317,2,FALSE),\"\")","v":""},null,{"$f":"IFERROR(G1476/D1476/24,\"\")","v":""},null,{"$f":"IFERROR(I1476/D1476/24,\"\")","v":""},{"$f":"IFERROR(L1476/D1476/24,\"\")","v":""},null,null,null,null,"",{"$f":"IFERROR(ROUND(SUM(L1476*P1476),2),\"\")","v":""},null,1]
["",null,null,"",null,"",null,"",null,"","",null,null,null,null,"","",null,1]
["",null,null,"",null,"",null,"",null,"","",null,null,null,null,"","",null,1]
["",null,null,"",null,"",null,"",null,"","",null,null,null,null,"","",null,1]
["",null,null,"",null,"",null,"",null,"","",null,null,null,null,"","",null,1]
["",null,null,"",null,"",null,"",null,"","",null,null,null,null,"","",null,1]
["",null,null,"",null,"",null,"",null,"","",null,null,null,null,"","",null,1]
["",null,null,"",null,"",null,"",null,"","",null,null,null,null,"","",null,1]
["",null,null,"",null,"",null,"",null,"","",null,null,null,null,"","",null,1]
["",null,null,"",null,"",null,"",null,"","",null,null,null,null,"","",null,1]
["",null,null,"",null,"",null,"",null,"","",null,null,null,null,"","",null,1]
["",null,null,"",null,"",null,"",null,"","",null,null,null,null,"","",null,1]
["",null,null,"",null,"",null,"",null,"","",null,null,null,null,"","",null,1]
["",null,null,"",null,"",null,"",null,"","",null,null,null,null,"","",null,1]
["",null,null,"",null,"",null,"",null,"","",null,null,null,null,"","",null,1]
["",null,null,"",null,"",null,"",null,"","",null,null,null,null,"","",null,1]
["",null,null,"",null,"",null,"",null,"","",null,null,null,null,"","",null,1]
["",null,null,"",null,"",null,"",null,"","",null,null,null,null,"","",null,1]
["",null,null,"",null,"",null,"",null,"","",null,null,null,null,"","",null,1]
["",null,null,"",null,"",null,"",null,"","",null,null,null,null,"","",null,1]
["",null,null,"",null,"",null,"",null,"","",null,null,null,null,"","",null,1]
["",null,null,"",null,"",null,"",null,"","",null,null,null,null,"","",null,1]
["",null,null,"",null,"",null,"",null,"","",null,null,null,null,{"$f":"IFERROR(ROUND(SUM(1000/M1498),2),\"\")","v":""},"",null,1]
["",null,null,"",null,"",null,"",null,"","",null,null,null,null,"","",null,1]
["",null,null,"",null,"",null,"",null,"","",null,null,null,null,"","",null,1]
["",null,null,"",null,"",null,"",null,"","",null,null,null,null,"","",null,1]
["",null,null,"",null,"",null,"",null,"","",null,null,null,null,"","",null,1]
["",null,null,"",null,"",null,"",null,"","",null,null,null,null,"","",null,1]
["",null,null,"",null,"",null,"",null,"","",null,null,null,null,"","",null,1]
["",null,null,"",null,"",null,"",null,"","",null,null,null,null,"","",null,1]
["",null,null,"",null,"",null,"",null,"","",null,null,null,null,"","",null,1]
["",null,null,"",null,"",null,"",null,"","",null,null,null,null,"","",null,1]
["",null,null,"",null,"",null,"",null,"","",null,null,null,null,"","",null,1]
["",null,null,"",null,"",null,"",null,"","",null,null,null,null,"","",null,1]
["",null,null,"",null,"",null,"",null,"","",null,null,null,null,"","",null,1]
["",null,null,"",null,"",null,"",null,"","",null,null,null,null,"","",null,1]
["",null,null,"",null,"",null,"",null,"","",null,null,null,null,"","",null,1]
["",null,null,"",null,"",null,"",null,"","",null,null,null,null,"","",null,1]
["",null,null,"",null,"",null,"",null,"","",null,null,null,null,"","",null,1]
["",null,null,"",null,"",null,"",null,"","",null,null,null,null,"","",null,1]
["",null,null,"",null,"",null,"",null,"","",null,null,null,null,"","",null,1]
["",null,null,"",null,"",null,"",null,"","",null,null,null,null,"","",null,1]
["",null,null,"",null,"",null,"",null,"","",null,null,null,null,"","",null,1]
["",null,null,"",null,"",null,"",null,"","",null,null,null,null,"","",null,1]
["",null,null,"",null,"",null,"",null,"","",null,null,null,null,"","",null,1]
["",null,null,"",null,"",null,"",null,"","",null,null,null,null,"","",null,1]
["",null,null,"",null,"",null,"",null,"","",null,null,null,null,"","",null,1]
["",null,null,"",null,"",null,"",null,"","",null,null,null,null,"","",null,1]
["",null,null,"",null,"",null,"",null,"","",null,null,null,null,"","",null,1]
["",null,null,"",null,"",null,"",null,"","",null,null,null,null,"","",null,1]
["",null,null,"",null,"",null,"",null,"","",null,null,null,null,"","",null,1]
["",null,null,"",null,"",null,"",null,"","",null,null,null,null,"","",null,1]
["",null,null,"",null,"",null,"",null,"","",null,null,null,null,"","",null,1]
["",null,null,"",null,"",null,"",null,"","",null,null,null,null,"","",null,1]
["",null,null,"",null,"",null,"",null,"","",null,null,null,null,"","",null,1]
["",null,null,"",null,"",null,"",null,"","",null,null,null,null,"","",null,1]
["",null,null,"",null,"",null,"",null,"","",null,null,null,null,"","",null,1]
["",null,null,"",null,"",null,"",null,"","",null,null,null,null,"","",null,1]
["",null,null,"",null,"",null,"",null,"","",null,null,null,null,"","",null,1]
["",null,null,"",null,"",null,"",null,"","",null,null,null,null,"","",null,1]
["",null,null,"",null,"",null,"",null,"","",null,null,null,null,"","",null,1]
["",null,null,"",null,"",null,"",null,"","",null,null,null,null,"","",null,1]
["",null,null,"",null,"",null,"",null,"","",null,null,null,null,"","",null,1]
["",null,null,"",null,"",null,"",null,"","",null,null,null,null,"","",null,1]
[{"$f":"IF(E1540=\"\",\"\",IF(A1540=\"\",TODAY(),A1540))","v":""},null,null,{"$f":"IF(B1540=\"\",\"\",(C1540-B1540))","v":""},null,{"$f":"IFERROR(VLOOKUP(E1540,$AK$3:$AM$317,2,FALSE),\"\")","v":""},null,{"$f":"IFERROR(G1540/D1540/24,\"\")","v":""},null,{"$f":"IFERROR(I1540/D1540/24,\"\")","v":""},{"$f":"IFERROR(L1540/D1540/24,\"\")","v":""},null,null,null,null,"",{"$f":"IFERROR(ROUND(SUM(L1540*P1540),2),\"\")","v":""},null,1]
["",null,null,"",null,"",null,"",null,"","",null,null,null,null,"","",null,1]
["",null,null,"",null,"",null,"",null,"","",null,null,null,null,"","",null,1]
["",null,null,"",null,"",null,"",null,"","",null,null,null,null,"","",null,1]
["",null,null,"",null,"",null,"",null,"","",null,null,null,null,"","",null,1]
["",null,null,"",null,"",null,"",null,"","",null,null,null,null,"","",null,1]
["",null,null,"",null,"",null,"",null,"","",null,null,null,null,"","",null,1]
["",null,null,"",null,"",null,"",null,"","",null,null,null,null,"","",null,1]
["",null,null,"",null,"",null,"",null,"","",null,null,null,null,"","",null,1]
["",null,null,"",null,"",null,"",null,"","",null,null,null,null,"","",null,1]
["",null,null,"",null,"",null,"",null,"","",null,null,null,null,"","",null,1]
["",null,null,"",null,"",null,"",null,"","",null,null,null,null,"","",null,1]
["",null,null,"",null,"",null,"",null,"","",null,null,null,null,"","",null,1]
["",null,null,"",null,"",null,"",null,"","",null,null,null,null,"","",null,1]
["",null,null,"",null,"",null,"",null,"","",null,null,null,null,"","",null,1]
["",null,null,"",null,"",null,"",null,"","",null,null,null,null,"","",null,1]
["",null,null,"",null,"",null,"",null,"","",null,null,null,null,"","",null,1]
["",null,null,"",null,"",null,"",null,"","",null,null,null,null,"","",null,1]
["",null,null,"",null,"",null,"",null,"","",null,null,null,null,"","",null,1]
["",null,null,"",null,"",null,"",null,"","",null,null,null,null,"","",null,1]
["",null,null,"",null,"",null,"",null,"","",null,null,null,null,"","",null,1]
["",null,null,"",null,"",null,"",null,"","",null,null,null,null,"","",null,1]
["",null,null,"",null,"",null,"",null,"","",null,null,null,null,{"$f":"IFERROR(ROUND(SUM(1000/M1562),2),\"\")","v":""},"",null,1]
["",null,null,"",null,"",null,"",null,"","",null,null,null,null,"","",null,1]
["",null,null,"",null,"",null,"",null,"","",null,null,null,null,"","",null,1]
["",null,null,"",null,"",null,"",null,"","",null,null,null,null,"","",null,1]
["",null,null,"",null,"",null,"",null,"","",null,null,null,null,"","",null,1]
["",null,null,"",null,"",null,"",null,"","",null,null,null,null,"","",null,1]
["",null,null,"",null,"",null,"",null,"","",null,null,null,null,"","",null,1]
["",null,null,"",null,"",null,"",null,"","",null,null,null,null,"","",null,1]
["",null,null,"",null,"",null,"",null,"","",null,null,null,null,"","",null,1]
["",null,null,"",null,"",null,"",null,"","",null,null,null,null,"","",null,1]
["",null,null,"",null,"",null,"",null,"","",null,null,null,null,"","",null,1]
["",null,null,"",null,"",null,"",null,"","",null,null,null,null,"","",null,1]
["",null,null,"",null,"",null,"",null,"","",null,null,null,null,"","",null,1]
["",null,null,"",null,"",null,"",null,"","",null,null,null,null,"","",null,1]
["",null,null,"",null,"",null,"",null,"","",null,null,null,null,"","",null,1]
["",null,null,"",null,"",null,"",null,"","",null,null,null,null,"","",null,1]
["",null,null,"",null,"",null,"",null,"","",null,null,null,null,"","",null,1]
["",null,null,"",null,"",null,"",null,"","",null,null,null,null,"","",null,1]
["",null,null,"",null,"",null,"",null,"","",null,null,null,null,"","",null,1]
["",null,null,"",null,"",null,"",null,"","",null,null,null,null,"","",null,1]
["",null,null,"",null,"",null,"",null,"","",null,null,null,null,"","",null,1]
["",null,null,"",null,"",null,"",null,"","",null,null,null,null,"","",null,1]
["",null,null,"",null,"",null,"",null,"","",null,null,null,null,"","",null,1]
["",null,null,"",null,"",null,"",null,"","",null,null,null,null,"","",null,1]
["",null,null,"",null,"",null,"",null,"","",null,null,null,null,"","",null,1]
["",null,null,"",null,"",null,"",null,"","",null,null,null,null,"","",null,1]
["",null,null,"",null,"",null,"",null,"","",null,null,null,null,"","",null,1]
["",null,null,"",null,"",null,"",null,"","",null,null,null,null,"","",null,1]
["",null,null,"",null,"",null,"",null,"","",null,null,null,null,"","",null,1]
["",null,null,"",null,"",null,"",null,"","",null,null,null,null,"","",null,1]
["",null,null,"",null,"",null,"",null,"","",null,null,null,null,"","",null,1]
["",null,null,"",null,"",null,"",null,"","",null,null,null,null,"","",null,1]
["",null,null,"",null,"",null,"",null,"","",null,null,null,null,"","",null,1]
["",null,null,"",null,"",null,"",null,"","",null,null,null,null,"","",null,1]
["",null,null,"",null,"",null,"",null,"","",null,null,null,null,"","",null,1]
["",null,null,"",null,"",null,"",null,"","",null,null,null,null,"","",null,1]
["",null,null,"",null,"",null,"",null,"","",null,null,null,null,"","",null,1]
["",null,null,"",null,"",null,"",null,"","",null,null,null,null,"","",null,1]
["",null,null,"",null,"",null,"",null,"","",null,null,null,null,"","",null,1]
["",null,null,"",null,"",null,"",null,"","",null,null,null,null,"","",null,1]
["",null,null,"",null,"",null,"",null,"","",null,null,null,null,"","",null,1]
["",null,null,"",null,"",null,"",null,"","",null,null,null,null,"","",null,1]
[{"$f":"IF(E1604=\"\",\"\",IF(A1604=\"\",TODAY(),A1604))","v":""},null,null,{"$f":"IF(B1604=\"\",\"\",(C1604-B1604))","v":""},null,{"$f":"IFERROR(VLOOKUP(E1604,$AK$3:$AM$317,2,FALSE),\"\")","v":""},null,{"$f":"IFERROR(G1604/D1604/24,\"\")","v":""},null,{"$f":"IFERROR(I1604/D1604/24,\"\")","v":""},{"$f":"IFERROR(L1604/D1604/24,\"\")","v":""},null,null,null,null,"",{"$f":"IFERROR(ROUND(SUM(L1604*P1604),2),\"\")","v":""},null,1]
["",null,null,"",null,"",null,"",null,"","",null,null,null,null,"","",null,1]
["",null,null,"",null,"",null,"",null,"","",null,null,null,null,"","",null,1]
["",null,null,"",null,"",null,"",null,"","",null,null,null,null,"","",null,1]
["",null,null,"",null,"",null,"",null,"","",null,null,null,null,"","",null,1]
["",null,null,"",null,"",null,"",null,"","",null,null,null,null,"","",null,1]
["",null,null,"",null,"",null,"",null,"","",null,null,null,null,"","",null,1]
["",null,null,"",null,"",null,"",null,"","",null,null,null,null,"","",null,1]
["",null,null,"",null,"",null,"",null,"","",null,null,null,null,"","",null,1]
["",null,null,"",null,"",null,"",null,"","",null,null,null,null,"","",null,1]
["",null,null,"",null,"",null,"",null,"","",null,null,null,null,"","",null,1]
["",null,null,"",null,"",null,"",null,"","",null,null,null,null,"","",null,1]
["",null,null,"",null,"",null,"",null,"","",null,null,null,null,"","",null,1]
["",null,null,"",null,"",null,"",null,"","",null,null,null,null,"","",null,1]
["",null,null,"",null,"",null,"",null,"","",null,null,null,null,"","",null,1]
["",null,null,"",null,"",null,"",null,"","",null,null,null,null,"","",null,1]
["",null,null,"",null,"",null,"",null,"","",null,null,null,null,"","",null,1]
["",null,null,"",null,"",null,"",null,"","",null,null,null,null,"","",null,1]
["",null,null,"",null,"",null,"",null,"","",null,null,null,null,"","",null,1]
["",null,null,"",null,"",null,"",null,"","",null,null,null,null,"","",null,1]
["",null,null,"",null,"",null,"",null,"","",null,null,null,null,"","",null,1]
["",null,null,"",null,"",null,"",null,"","",null,null,null,null,"","",null,1]
["",null,null,"",null,"",null,"",null,"","",null,null,null,null,{"$f":"IFERROR(ROUND(SUM(1000/M1626),2),\"\")","v":""},"",null,1]
["",null,null,"",null,"",null,"",null,"","",null,null,null,null,"","",null,1]
["",null,null,"",null,"",null,"",null,"","",null,null,null,null,"","",null,1]
["",null,null,"",null,"",null,"",null,"","",null,null,null,null,"","",null,1]
["",null,null,"",null,"",null,"",null,"","",null,null,null,null,"","",null,1]
["",null,null,"",null,"",null,"",null,"","",null,null,null,null,"","",null,1]
["",null,null,"",null,"",null,"",null,"","",null,null,null,null,"","",null,1]
["",null,null,"",null,"",null,"",null,"","",null,null,null,null,"","",null,1]
["",null,null,"",null,"",null,"",null,"","",null,null,null,null,"","",null,1]
["",null,null,"",null,"",null,"",null,"","",null,null,null,null,"","",null,1]
["",null,null,"",null,"",null,"",null,"","",null,null,null,null,"","",null,1]
["",null,null,"",null,"",null,"",null,"","",null,null,null,null,"","",null,1]
["",null,null,"",null,"",null,"",null,"","",null,null,null,null,"","",null,1]
["",null,null,"",null,"",null,"",null,"","",null,null,null,null,"","",null,1]
["",null,null,"",null,"",null,"",null,"","",null,null,null,null,"","",null,1]
["",null,null,"",null,"",null,"",null,"","",null,null,null,null,"","",null,1]
["",null,null,"",null,"",null,"",null,"","",null,null,null,null,"","",null,1]
["",null,null,"",null,"",null,"",null,"","",null,null,null,null,"","",null,1]
["",null,null,"",null,"",null,"",null,"","",null,null,null,null,"","",null,1]
["",null,null,"",null,"",null,"",null,"","",null,null,null,null,"","",null,1]
["",null,null,"",null,"",null,"",null,"","",null,null,null,null,"","",null,1]
["",null,null,"",null,"",null,"",null,"","",null,null,null,null,"","",null,1]
["",null,null,"",null,"",null,"",null,"","",null,null,null,null,"","",null,1]
["",null,null,"",null,"",null,"",null,"","",null,null,null,null,"","",null,1]
["",null,null,"",null,"",null,"",null,"","",null,null,null,null,"","",null,1]
["",null,null,"",null,"",null,"",null,"","",null,null,null,null,"","",null,1]
["",null,null,"",null,"",null,"",null,"","",null,null,null,null,"","",null,1]
["",null,null,"",null,"",null,"",null,"","",null,null,null,null,"","",null,1]
["",null,null,"",null,"",null,"",null,"","",null,null,null,null,"","",null,1]
["",null,null,"",null,"",null,"",null,"","",null,null,null,null,"","",null,1]
["",null,null,"",null,"",null,"",null,"","",null,null,null,null,"","",null,1]
["",null,null,"",null,"",null,"",null,"","",null,null,null,null,"","",null,1]
["",null,null,"",null,"",null,"",null,"","",null,null,null,null,"","",null,1]
["",null,null,"",null,"",null,"",null,"","",null,null,null,null,"","",null,1]
["",null,null,"",null,"",null,"",null,"","",null,null,null,null,"","",null,1]
["",null,null,"",null,"",null,"",null,"","",null,null,null,null,"","",null,1]
["",null,null,"",null,"",null,"",null,"","",null,null,null,null,"","",null,1]
["",null,null,"",null,"",null,"",null,"","",null,null,null,null,"","",null,1]
["",null,null,"",null,"",null,"",null,"","",null,null,null,null,"","",null,1]
["",null,null,"",null,"",null,"",null,"","",null,null,null,null,"","",null,1]
["",null,null,"",null,"",null,"",null,"","",null,null,null,null,"","",null,1]
["",null,null,"",null,"",null,"",null,"","",null,null,null,null,"","",null,1]
[{"$f":"IF(E1668=\"\",\"\",IF(A1668=\"\",TODAY(),A1668))","v":""},null,null,{"$f":"IF(B1668=\"\",\"\",(C1668-B1668))","v":""},null,{"$f":"IFERROR(VLOOKUP(E1668,$AK$3:$AM$317,2,FALSE),\"\")","v":""},null,{"$f":"IFERROR(G1668/D1668/24,\"\")","v":""},null,{"$f":"IFERROR(I1668/D1668/24,\"\")","v":""},{"$f":"IFERROR(L1668/D1668/24,\"\")","v":""},null,null,null,null,"",{"$f":"IFERROR(ROUND(SUM(L1668*P1668),2),\"\")","v":""},null,1]
["",null,null,"",null,"",null,"",null,"","",null,null,null,null,"","",null,1]
["",null,null,"",null,"",null,"",null,"","",null,null,null,null,"","",null,1]
["",null,null,"",null,"",null,"",null,"","",null,null,null,null,"","",null,1]
["",null,null,"",null,"",null,"",null,"","",null,null,null,null,"","",null,1]
["",null,null,"",null,"",null,"",null,"","",null,null,null,null,"","",null,1]
["",null,null,"",null,"",null,"",null,"","",null,null,null,null,"","",null,1]
["",null,null,"",null,"",null,"",null,"","",null,null,null,null,"","",null,1]
["",null,null,"",null,"",null,"",null,"","",null,null,null,null,"","",null,1]
["",null,null,"",null,"",null,"",null,"","",null,null,null,null,"","",null,1]
["",null,null,"",null,"",null,"",null,"","",null,null,null,null,"","",null,1]
["",null,null,"",null,"",null,"",null,"","",null,null,null,null,"","",null,1]
["",null,null,"",null,"",null,"",null,"","",null,null,null,null,"","",null,1]
["",null,null,"",null,"",null,"",null,"","",null,null,null,null,"","",null,1]
["",null,null,"",null,"",null,"",null,"","",null,null,null,null,"","",null,1]
["",null,null,"",null,"",null,"",null,"","",null,null,null,null,"","",null,1]
["",null,null,"",null,"",null,"",null,"","",null,null,null,null,"","",null,1]
["",null,null,"",null,"",null,"",null,"","",null,null,null,null,"","",null,1]
["",null,null,"",null,"",null,"",null,"","",null,null,null,null,"","",null,1]
["",null,null,"",null,"",null,"",null,"","",null,null,null,null,"","",null,1]
["",null,null,"",null,"",null,"",null,"","",null,null,null,null,"","",null,1]
["",null,null,"",null,"",null,"",null,"","",null,null,null,null,"","",null,1]
["",null,null,"",null,"",null,"",null,"","",null,null,null,null,{"$f":"IFERROR(ROUND(SUM(1000/M1690),2),\"\")","v":""},"",null,1]
["",null,null,"",null,"",null,"",null,"","",null,null,null,null,"","",null,1]
["",null,null,"",null,"",null,"",null,"","",null,null,null,null,"","",null,1]
["",null,null,"",null,"",null,"",null,"","",null,null,null,null,"","",null,1]
["",null,null,"",null,"",null,"",null,"","",null,null,null,null,"","",null,1]
["",null,null,"",null,"",null,"",null,"","",null,null,null,null,"","",null,1]
["",null,null,"",null,"",null,"",null,"","",null,null,null,null,"","",null,1]
["",null,null,"",null,"",null,"",null,"","",null,null,null,null,"","",null,1]
["",null,null,"",null,"",null,"",null,"","",null,null,null,null,"","",null,1]
["",null,null,"",null,"",null,"",null,"","",null,null,null,null,"","",null,1]
["",null,null,"",null,"",null,"",null,"","",null,null,null,null,"","",null,1]
["",null,null,"",null,"",null,"",null,"","",null,null,null,null,"","",null,1]
["",null,null,"",null,"",null,"",null,"","",null,null,null,null,"","",null,1]
["",null,null,"",null,"",null,"",null,"","",null,null,null,null,"","",null,1]
["",null,null,"",null,"",null,"",null,"","",null,null,null,null,"","",null,1]
["",null,null,"",null,"",null,"",null,"","",null,null,null,null,"","",null,1]
["",null,null,"",null,"",null,"",null,"","",null,null,null,null,"","",null,1]
["",null,null,"",null,"",null,"",null,"","",null,null,null,null,"","",null,1]
["",null,null,"",null,"",null,"",null,"","",null,null,null,null,"","",null,1]
["",null,null,"",null,"",null,"",null,"","",null,null,null,null,"","",null,1]
["",null,null,"",null,"",null,"",null,"","",null,null,null,null,"","",null,1]
["",null,null,"",null,"",null,"",null,"","",null,null,null,null,"","",null,1]
["",null,null,"",null,"",null,"",null,"","",null,null,null,null,"","",null,1]
["",null,null,"",null,"",null,"",null,"","",null,null,null,null,"","",null,1]
["",null,null,"",null,"",null,"",null,"","",null,null,null,null,"","",null,1]
["",null,null,"",null,"",null,"",null,"","",null,null,null,null,"","",null,1]
["",null,null,"",null,"",null,"",null,"","",null,null,null,null,"","",null,1]
["",null,null,"",null,"",null,"",null,"","",null,null,null,null,"","",null,1]
["",null,null,"",null,"",null,"",null,"","",null,null,null,null,"","",null,1]
["",null,null,"",null,"",null,"",null,"","",null,null,null,null,"","",null,1]
["",null,null,"",null,"",null,"",null,"","",null,null,null,null,"","",null,1]
["",null,null,"",null,"",null,"",null,"","",null,null,null,null,"","",null,1]
["",null,null,"",null,"",null,"",null,"","",null,null,null,null,"","",null,1]
["",null,null,"",null,"",null,"",null,"","",null,null,null,null,"","",null,1]
["",null,null,"",null,"",null,"",null,"","",null,null,null,null,"","",null,1]
["",null,null,"",null,"",null,"",null,"","",null,null,null,null,"","",null,1]
["",null,null,"",null,"",null,"",null,"","",null,null,null,null,"","",null,1]
["",null,null,"",null,"",null,"",null,"","",null,null,null,null,"","",null,1]
["",null,null,"",null,"",null,"",null,"","",null,null,null,null,"","",null,1]
["",null,null,"",null,"",null,"",null,"","",null,null,null,null,"","",null,1]
["",null,null,"",null,"",null,"",null,"","",null,null,null,null,"","",null,1]
["",null,null,"",null,"",null,"",null,"","",null,null,null,null,"","",null,1]
[{"$f":"IF(E1732=\"\",\"\",IF(A1732=\"\",TODAY(),A1732))","v":""},null,null,{"$f":"IF(B1732=\"\",\"\",(C1732-B1732))","v":""},null,{"$f":"IFERROR(VLOOKUP(E1732,$AK$3:$AM$317,2,FALSE),\"\")","v":""},null,{"$f":"IFERROR(G1732/D1732/24,\"\")","v":""},null,{"$f":"IFERROR(I1732/D1732/24,\"\")","v":""},{"$f":"IFERROR(L1732/D1732/24,\"\")","v":""},null,null,null,null,"",{"$f":"IFERROR(ROUND(SUM(L1732*P1732),2),\"\")","v":""},null,1]
["",null,null,"",null,"",null,"",null,"","",null,null,null,null,"","",null,1]
["",null,null,"",null,"",null,"",null,"","",null,null,null,null,"","",null,1]
["",null,null,"",null,"",null,"",null,"","",null,null,null,null,"","",null,1]
["",null,null,"",null,"",null,"",null,"","",null,null,null,null,"","",null,1]
["",null,null,"",null,"",null,"",null,"","",null,null,null,null,"","",null,1]
["",null,null,"",null,"",null,"",null,"","",null,null,null,null,"","",null,1]
["",null,null,"",null,"",null,"",null,"","",null,null,null,null,"","",null,1]
["",null,null,"",null,"",null,"",null,"","",null,null,null,null,"","",null,1]
["",null,null,"",null,"",null,"",null,"","",null,null,null,null,"","",null,1]
["",null,null,"",null,"",null,"",null,"","",null,null,null,null,"","",null,1]
["",null,null,"",null,"",null,"",null,"","",null,null,null,null,"","",null,1]
["",null,null,"",null,"",null,"",null,"","",null,null,null,null,"","",null,1]
["",null,null,"",null,"",null,"",null,"","",null,null,null,null,"","",null,1]
["",null,null,"",null,"",null,"",null,"","",null,null,null,null,"","",null,1]
["",null,null,"",null,"",null,"",null,"","",null,null,null,null,"","",null,1]
["",null,null,"",null,"",null,"",null,"","",null,null,null,null,"","",null,1]
["",null,null,"",null,"",null,"",null,"","",null,null,null,null,"","",null,1]
["",null,null,"",null,"",null,"",null,"","",null,null,null,null,"","",null,1]
["",null,null,"",null,"",null,"",null,"","",null,null,null,null,"","",null,1]
["",null,null,"",null,"",null,"",null,"","",null,null,null,null,"","",null,1]
["",null,null,"",null,"",null,"",null,"","",null,null,null,null,"","",null,1]
["",null,null,"",null,"",null,"",null,"","",null,null,null,null,{"$f":"IFERROR(ROUND(SUM(1000/M1754),2),\"\")","v":""},"",null,1]
["",null,null,"",null,"",null,"",null,"","",null,null,null,null,"","",null,1]
["",null,null,"",null,"",null,"",null,"","",null,null,null,null,"","",null,1]
["",null,null,"",null,"",null,"",null,"","",null,null,null,null,"","",null,1]
["",null,null,"",null,"",null,"",null,"","",null,null,null,null,"","",null,1]
["",null,null,"",null,"",null,"",null,"","",null,null,null,null,"","",null,1]
["",null,null,"",null,"",null,"",null,"","",null,null,null,null,"","",null,1]
["",null,null,"",null,"",null,"",null,"","",null,null,null,null,"","",null,1]
["",null,null,"",null,"",null,"",null,"","",null,null,null,null,"","",null,1]
["",null,null,"",null,"",null,"",null,"","",null,null,null,null,"","",null,1]
["",null,null,"",null,"",null,"",null,"","",null,null,null,null,"","",null,1]
["",null,null,"",null,"",null,"",null,"","",null,null,null,null,"","",null,1]
["",null,null,"",null,"",null,"",null,"","",null,null,null,null,"","",null,1]
["",null,null,"",null,"",null,"",null,"","",null,null,null,null,"","",null,1]
["",null,null,"",null,"",null,"",null,"","",null,null,null,null,"","",null,1]
["",null,null,"",null,"",null,"",null,"","",null,null,null,null,"","",null,1]
["",null,null,"",null,"",null,"",null,"","",null,null,null,null,"","",null,1]
["",null,null,"",null,"",null,"",null,"","",null,null,null,null,"","",null,1]
["",null,null,"",null,"",null,"",null,"","",null,null,null,null,"","",null,1]
["",null,null,"",null,"",null,"",null,"","",null,null,null,null,"","",null,1]
["",null,null,"",null,"",null,"",null,"","",null,null,null,null,"","",null,1]
["",null,null,"",null,"",null,"",null,"","",null,null,null,null,"","",null,1]
["",null,null,"",null,"",null,"",null,"","",null,null,null,null,"","",null,1]
["",null,null,"",null,"",null,"",null,"","",null,null,null,null,"","",null,1]
["",null,null,"",null,"",null,"",null,"","",null,null,null,null,"","",null,1]
["",null,null,"",null,"",null,"",null,"","",null,null,null,null,"","",null,1]
["",null,null,"",null,"",null,"",null,"","",null,null,null,null,"","",null,1]
["",null,null,"",null,"",null,"",null,"","",null,null,null,null,"","",null,1]
["",null,null,"",null,"",null,"",null,"","",null,null,null,null,"","",null,1]
["",null,null,"",null,"",null,"",null,"","",null,null,null,null,"","",null,1]
["",null,null,"",null,"",null,"",null,"","",null,null,null,null,"","",null,1]
["",null,null,"",null,"",null,"",null,"","",null,null,null,null,"","",null,1]
["",null,null,"",null,"",null,"",null,"","",null,null,null,null,"","",null,1]
["",null,null,"",null,"",null,"",null,"","",null,null,null,null,"","",null,1]
["",null,null,"",null,"",null,"",null,"","",null,null,null,null,"","",null,1]
["",null,null,"",null,"",null,"",null,"","",null,null,null,null,"","",null,1]
["",null,null,"",null,"",null,"",null,"","",null,null,null,null,"","",null,1]
["",null,null,"",null,"",null,"",null,"","",null,null,null,null,"","",null,1]
["",null,null,"",null,"",null,"",null,"","",null,null,null,null,"","",null,1]
["",null,null,"",null,"",null,"",null,"","",null,null,null,null,"","",null,1]
["",null,null,"",null,"",null,"",null,"","",null,null,null,null,"","",null,1]
["",null,null,"",null,"",null,"",null,"","",null,null,null,null,"","",null,1]
[{"$f":"IF(E1796=\"\",\"\",IF(A1796=\"\",TODAY(),A1796))","v":""},null,null,{"$f":"IF(B1796=\"\",\"\",(C1796-B1796))","v":""},null,{"$f":"IFERROR(VLOOKUP(E1796,$AK$3:$AM$317,2,FALSE),\"\")","v":""},null,{"$f":"IFERROR(G1796/D1796/24,\"\")","v":""},null,{"$f":"IFERROR(I1796/D1796/24,\"\")","v":""},{"$f":"IFERROR(L1796/D1796/24,\"\")","v":""},null,null,null,null,"",{"$f":"IFERROR(ROUND(SUM(L1796*P1796),2),\"\")","v":""},null,1]
["",null,null,"",null,"",null,"",null,"","",null,null,null,null,"","",null,1]
["",null,null,"",null,"",null,"",null,"","",null,null,null,null,"","",null,1]
["",null,null,"",null,"",null,"",null,"","",null,null,null,null,"","",null,1]
["",null,null,"",null,"",null,"",null,"","",null,null,null,null,"","",null,1]
["",null,null,"",null,"",null,"",null,"","",null,null,null,null,"","",null,1]
["",null,null,"",null,"",null,"",null,"","",null,null,null,null,"","",null,1]
["",null,null,"",null,"",null,"",null,"","",null,null,null,null,"","",null,1]
["",null,null,"",null,"",null,"",null,"","",null,null,null,null,"","",null,1]
["",null,null,"",null,"",null,"",null,"","",null,null,null,null,"","",null,1]
["",null,null,"",null,"",null,"",null,"","",null,null,null,null,"","",null,1]
["",null,null,"",null,"",null,"",null,"","",null,null,null,null,"","",null,1]
["",null,null,"",null,"",null,"",null,"","",null,null,null,null,"","",null,1]
["",null,null,"",null,"",null,"",null,"","",null,null,null,null,"","",null,1]
["",null,null,"",null,"",null,"",null,"","",null,null,null,null,"","",null,1]
["",null,null,"",null,"",null,"",null,"","",null,null,null,null,"","",null,1]
["",null,null,"",null,"",null,"",null,"","",null,null,null,null,"","",null,1]
["",null,null,"",null,"",null,"",null,"","",null,null,null,null,"","",null,1]
["",null,null,"",null,"",null,"",null,"","",null,null,null,null,"","",null,1]
["",null,null,"",null,"",null,"",null,"","",null,null,null,null,"","",null,1]
["",null,null,"",null,"",null,"",null,"","",null,null,null,null,"","",null,1]
["",null,null,"",null,"",null,"",null,"","",null,null,null,null,"","",null,1]
["",null,null,"",null,"",null,"",null,"","",null,null,null,null,{"$f":"IFERROR(ROUND(SUM(1000/M1818),2),\"\")","v":""},"",null,1]
["",null,null,"",null,"",null,"",null,"","",null,null,null,null,"","",null,1]
["",null,null,"",null,"",null,"",null,"","",null,null,null,null,"","",null,1]
["",null,null,"",null,"",null,"",null,"","",null,null,null,null,"","",null,1]
["",null,null,"",null,"",null,"",null,"","",null,null,null,null,"","",null,1]
["",null,null,"",null,"",null,"",null,"","",null,null,null,null,"","",null,1]
["",null,null,"",null,"",null,"",null,"","",null,null,null,null,"","",null,1]
["",null,null,"",null,"",null,"",null,"","",null,null,null,null,"","",null,1]
["",null,null,"",null,"",null,"",null,"","",null,null,null,null,"","",null,1]
["",null,null,"",null,"",null,"",null,"","",null,null,null,null,"","",null,1]
["",null,null,"",null,"",null,"",null,"","",null,null,null,null,"","",null,1]
["",null,null,"",null,"",null,"",null,"","",null,null,null,null,"","",null,1]
["",null,null,"",null,"",null,"",null,"","",null,null,null,null,"","",null,1]
["",null,null,"",null,"",null,"",null,"","",null,null,null,null,"","",null,1]
["",null,null,"",null,"",null,"",null,"","",null,null,null,null,"","",null,1]
["",null,null,"",null,"",null,"",null,"","",null,null,null,null,"","",null,1]
["",null,null,"",null,"",null,"",null,"","",null,null,null,null,"","",null,1]
["",null,null,"",null,"",null,"",null,"","",null,null,null,null,"","",null,1]
["",null,null,"",null,"",null,"",null,"","",null,null,null,null,"","",null,1]
["",null,null,"",null,"",null,"",null,"","",null,null,null,null,"","",null,1]
["",null,null,"",null,"",null,"",null,"","",null,null,null,null,"","",null,1]
["",null,null,"",null,"",null,"",null,"","",null,null,null,null,"","",null,1]
["",null,null,"",null,"",null,"",null,"","",null,null,null,null,"","",null,1]
["",null,null,"",null,"",null,"",null,"","",null,null,null,null,"","",null,1]
["",null,null,"",null,"",null,"",null,"","",null,null,null,null,"","",null,1]
["",null,null,"",null,"",null,"",null,"","",null,null,null,null,"","",null,1]
["",null,null,"",null,"",null,"",null,"","",null,null,null,null,"","",null,1]
["",null,null,"",null,"",null,"",null,"","",null,null,null,null,"","",null,1]
["",null,null,"",null,"",null,"",null,"","",null,null,null,null,"","",null,1]
["",null,null,"",null,"",null,"",null,"","",null,null,null,null,"","",null,1]
["",null,null,"",null,"",null,"",null,"","",null,null,null,null,"","",null,1]
["",null,null,"",null,"",null,"",null,"","",null,null,null,null,"","",null,1]
["",null,null,"",null,"",null,"",null,"","",null,null,null,null,"","",null,1]
["",null,null,"",null,"",null,"",null,"","",null,null,null,null,"","",null,1]
["",null,null,"",null,"",null,"",null,"","",null,null,null,null,"","",null,1]
["",null,null,"",null,"",null,"",null,"","",null,null,null,null,"","",null,1]
["",null,null,"",null,"",null,"",null,"","",null,null,null,null,"","",null,1]
["",null,null,"",null,"",null,"",null,"","",null,null,null,null,"","",null,1]
["",null,null,"",null,"",null,"",null,"","",null,null,null,null,"","",null,1]
["",null,null,"",null,"",null,"",null,"","",null,null,null,null,"","",null,1]
["",null,null,"",null,"",null,"",null,"","",null,null,null,null,"","",null,1]
["",null,null,"",null,"",null,"",null,"","",null,null,null,null,"","",null,1]
[{"$f":"IF(E1860=\"\",\"\",IF(A1860=\"\",TODAY(),A1860))","v":""},null,null,{"$f":"IF(B1860=\"\",\"\",(C1860-B1860))","v":""},null,{"$f":"IFERROR(VLOOKUP(E1860,$AK$3:$AM$317,2,FALSE),\"\")","v":""},null,{"$f":"IFERROR(G1860/D1860/24,\"\")","v":""},null,{"$f":"IFERROR(I1860/D1860/24,\"\")","v":""},{"$f":"IFERROR(L1860/D1860/24,\"\")","v":""},null,null,null,null,"",{"$f":"IFERROR(ROUND(SUM(L1860*P1860),2),\"\")","v":""},null,1]
["",null,null,"",null,"",null,"",null,"","",null,null,null,null,"","",null,1]
["",null,null,"",null,"",null,"",null,"","",null,null,null,null,"","",null,1]
["",null,null,"",null,"",null,"",null,"","",null,null,null,null,"","",null,1]
["",null,null,"",null,"",null,"",null,"","",null,null,null,null,"","",null,1]
["",null,null,"",null,"",null,"",null,"","",null,null,null,null,"","",null,1]
["",null,null,"",null,"",null,"",null,"","",null,null,null,null,"","",null,1]
["",null,null,"",null,"",null,"",null,"","",null,null,null,null,"","",null,1]
["",null,null,"",null,"",null,"",null,"","",null,null,null,null,"","",null,1]
["",null,null,"",null,"",null,"",null,"","",null,null,null,null,"","",null,1]
["",null,null,"",null,"",null,"",null,"","",null,null,null,null,"","",null,1]
["",null,null,"",null,"",null,"",null,"","",null,null,null,null,"","",null,1]
["",null,null,"",null,"",null,"",null,"","",null,null,null,null,"","",null,1]
["",null,null,"",null,"",null,"",null,"","",null,null,null,null,"","",null,1]
["",null,null,"",null,"",null,"",null,"","",null,null,null,null,"","",null,1]
["",null,null,"",null,"",null,"",null,"","",null,null,null,null,"","",null,1]
["",null,null,"",null,"",null,"",null,"","",null,null,null,null,"","",null,1]
["",null,null,"",null,"",null,"",null,"","",null,null,null,null,"","",null,1]
["",null,null,"",null,"",null,"",null,"","",null,null,null,null,"","",null,1]
["",null,null,"",null,"",null,"",null,"","",null,null,null,null,"","",null,1]
["",null,null,"",null,"",null,"",null,"","",null,null,null,null,"","",null,1]
["",null,null,"",null,"",null,"",null,"","",null,null,null,null,"","",null,1]
["",null,null,"",null,"",null,"",null,"","",null,null,null,null,{"$f":"IFERROR(ROUND(SUM(1000/M1882),2),\"\")","v":""},"",null,1]
["",null,null,"",null,"",null,"",null,"","",null,null,null,null,"","",null,1]
["",null,null,"",null,"",null,"",null,"","",null,null,null,null,"","",null,1]
["",null,null,"",null,"",null,"",null,"","",null,null,null,null,"","",null,1]
["",null,null,"",null,"",null,"",null,"","",null,null,null,null,"","",null,1]
["",null,null,"",null,"",null,"",null,"","",null,null,null,null,"","",null,1]
["",null,null,"",null,"",null,"",null,"","",null,null,null,null,"","",null,1]
["",null,null,"",null,"",null,"",null,"","",null,null,null,null,"","",null,1]
["",null,null,"",null,"",null,"",null,"","",null,null,null,null,"","",null,1]
["",null,null,"",null,"",null,"",null,"","",null,null,null,null,"","",null,1]
["",null,null,"",null,"",null,"",null,"","",null,null,null,null,"","",null,1]
["",null,null,"",null,"",null,"",null,"","",null,null,null,null,"","",null,1]
["",null,null,"",null,"",null,"",null,"","",null,null,null,null,"","",null,1]
["",null,null,"",null,"",null,"",null,"","",null,null,null,null,"","",null,1]
["",null,null,"",null,"",null,"",null,"","",null,null,null,null,"","",null,1]
["",null,null,"",null,"",null,"",null,"","",null,null,null,null,"","",null,1]
["",null,null,"",null,"",null,"",null,"","",null,null,null,null,"","",null,1]
["",null,null,"",null,"",null,"",null,"","",null,null,null,null,"","",null,1]
["",null,null,"",null,"",null,"",null,"","",null,null,null,null,"","",null,1]
["",null,null,"",null,"",null,"",null,"","",null,null,null,null,"","",null,1]
["",null,null,"",null,"",null,"",null,"","",null,null,null,null,"","",null,1]
["",null,null,"",null,"",null,"",null,"","",null,null,null,null,"","",null,1]
["",null,null,"",null,"",null,"",null,"","",null,null,null,null,"","",null,1]
["",null,null,"",null,"",null,"",null,"","",null,null,null,null,"","",null,1]
["",null,null,"",null,"",null,"",null,"","",null,null,null,null,"","",null,1]
["",null,null,"",null,"",null,"",null,"","",null,null,null,null,"","",null,1]
["",null,null,"",null,"",null,"",null,"","",null,null,null,null,"","",null,1]
["",null,null,"",null,"",null,"",null,"","",null,null,null,null,"","",null,1]
["",null,null,"",null,"",null,"",null,"","",null,null,null,null,"","",null,1]
["",null,null,"",null,"",null,"",null,"","",null,null,null,null,"","",null,1]
["",null,null,"",null,"",null,"",null,"","",null,null,null,null,"","",null,1]
["",null,null,"",null,"",null,"",null,"","",null,null,null,null,"","",null,1]
["",null,null,"",null,"",null,"",null,"","",null,null,null,null,"","",null,1]
["",null,null,"",null,"",null,"",null,"","",null,null,null,null,"","",null,1]
["",null,null,"",null,"",null,"",null,"","",null,null,null,null,"","",null,1]
["",null,null,"",null,"",null,"",null,"","",null,null,null,null,"","",null,1]
["",null,null,"",null,"",null,"",null,"","",null,null,null,null,"","",null,1]
["",null,null,"",null,"",null,"",null,"","",null,null,null,null,"","",null,1]
["",null,null,"",null,"",null,"",null,"","",null,null,null,null,"","",null,1]
["",null,null,"",null,"",null,"",null,"","",null,null,null,null,"","",null,1]
["",null,null,"",null,"",null,"",null,"","",null,null,null,null,"","",null,1]
["",null,null,"",null,"",null,"",null,"","",null,null,null,null,"","",null,1]
[{"$f":"IF(E1924=\"\",\"\",IF(A1924=\"\",TODAY(),A1924))","v":""},null,null,{"$f":"IF(B1924=\"\",\"\",(C1924-B1924))","v":""},null,{"$f":"IFERROR(VLOOKUP(E1924,$AK$3:$AM$317,2,FALSE),\"\")","v":""},null,{"$f":"IFERROR(G1924/D1924/24,\"\")","v":""},null,{"$f":"IFERROR(I1924/D1924/24,\"\")","v":""},{"$f":"IFERROR(L1924/D1924/24,\"\")","v":""},null,null,null,null,"",{"$f":"IFERROR(ROUND(SUM(L1924*P1924),2),\"\")","v":""},null,1]
["",null,null,"",null,"",null,"",null,"","",null,null,null,null,"","",null,1]
["",null,null,"",null,"",null,"",null,"","",null,null,null,null,"","",null,1]
["",null,null,"",null,"",null,"",null,"","",null,null,null,null,"","",null,1]
["",null,null,"",null,"",null,"",null,"","",null,null,null,null,"","",null,1]
["",null,null,"",null,"",null,"",null,"","",null,null,null,null,"","",null,1]
["",null,null,"",null,"",null,"",null,"","",null,null,null,null,"","",null,1]
["",null,null,"",null,"",null,"",null,"","",null,null,null,null,"","",null,1]
["",null,null,"",null,"",null,"",null,"","",null,null,null,null,"","",null,1]
["",null,null,"",null,"",null,"",null,"","",null,null,null,null,"","",null,1]
["",null,null,"",null,"",null,"",null,"","",null,null,null,null,"","",null,1]
["",null,null,"",null,"",null,"",null,"","",null,null,null,null,"","",null,1]
["",null,null,"",null,"",null,"",null,"","",null,null,null,null,"","",null,1]
["",null,null,"",null,"",null,"",null,"","",null,null,null,null,"","",null,1]
["",null,null,"",null,"",null,"",null,"","",null,null,null,null,"","",null,1]
["",null,null,"",null,"",null,"",null,"","",null,null,null,null,"","",null,1]
["",null,null,"",null,"",null,"",null,"","",null,null,null,null,"","",null,1]
["",null,null,"",null,"",null,"",null,"","",null,null,null,null,"","",null,1]
["",null,null,"",null,"",null,"",null,"","",null,null,null,null,"","",null,1]
["",null,null,"",null,"",null,"",null,"","",null,null,null,null,"","",null,1]
["",null,null,"",null,"",null,"",null,"","",null,null,null,null,"","",null,1]
["",null,null,"",null,"",null,"",null,"","",null,null,null,null,"","",null,1]
["",null,null,"",null,"",null,"",null,"","",null,null,null,null,{"$f":"IFERROR(ROUND(SUM(1000/M1946),2),\"\")","v":""},"",null,1]
["",null,null,"",null,"",null,"",null,"","",null,null,null,null,"","",null,1]
["",null,null,"",null,"",null,"",null,"","",null,null,null,null,"","",null,1]
["",null,null,"",null,"",null,"",null,"","",null,null,null,null,"","",null,1]
["",null,null,"",null,"",null,"",null,"","",null,null,null,null,"","",null,1]
["",null,null,"",null,"",null,"",null,"","",null,null,null,null,"","",null,1]
["",null,null,"",null,"",null,"",null,"","",null,null,null,null,"","",null,1]
["",null,null,"",null,"",null,"",null,"","",null,null,null,null,"","",null,1]
["",null,null,"",null,"",null,"",null,"","",null,null,null,null,"","",null,1]
["",null,null,"",null,"",null,"",null,"","",null,null,null,null,"","",null,1]
["",null,null,"",null,"",null,"",null,"","",null,null,null,null,"","",null,1]
["",null,null,"",null,"",null,"",null,"","",null,null,null,null,"","",null,1]
["",null,null,"",null,"",null,"",null,"","",null,null,null,null,"","",null,1]
["",null,null,"",null,"",null,"",null,"","",null,null,null,null,"","",null,1]
["",null,null,"",null,"",null,"",null,"","",null,null,null,null,"","",null,1]
["",null,null,"",null,"",null,"",null,"","",null,null,null,null,"","",null,1]
["",null,null,"",null,"",null,"",null,"","",null,null,null,null,"","",null,1]
["",null,null,"",null,"",null,"",null,"","",null,null,null,null,"","",null,1]
["",null,null,"",null,"",null,"",null,"","",null,null,null,null,"","",null,1]
["",null,null,"",null,"",null,"",null,"","",null,null,null,null,"","",null,1]
["",null,null,"",null,"",null,"",null,"","",null,null,null,null,"","",null,1]
["",null,null,"",null,"",null,"",null,"","",null,null,null,null,"","",null,1]
["",null,null,"",null,"",null,"",null,"","",null,null,null,null,"","",null,1]
["",null,null,"",null,"",null,"",null,"","",null,null,null,null,"","",null,1]
["",null,null,"",null,"",null,"",null,"","",null,null,null,null,"","",null,1]
["",null,null,"",null,"",null,"",null,"","",null,null,null,null,"","",null,1]
["",null,null,"",null,"",null,"",null,"","",null,null,null,null,"","",null,1]
["",null,null,"",null,"",null,"",null,"","",null,null,null,null,"","",null,1]
["",null,null,"",null,"",null,"",null,"","",null,null,null,null,"","",null,1]
["",null,null,"",null,"",null,"",null,"","",null,null,null,null,"","",null,1]
["",null,null,"",null,"",null,"",null,"","",null,null,null,null,"","",null,1]
["",null,null,"",null,"",null,"",null,"","",null,null,null,null,"","",null,1]
["",null,null,"",null,"",null,"",null,"","",null,null,null,null,"","",null,1]
["",null,null,"",null,"",null,"",null,"","",null,null,null,null,"","",null,1]
["",null,null,"",null,"",null,"",null,"","",null,null,null,null,"","",null,1]
["",null,null,"",null,"",null,"",null,"","",null,null,null,null,"","",null,1]
["",null,null,"",null,"",null,"",null,"","",null,null,null,null,"","",null,1]
["",null,null,"",null,"",null,"",null,"","",null,null,null,null,"","",null,1]
["",null,null,"",null,"",null,"",null,"","",null,null,null,null,"","",null,1]
["",null,null,"",null,"",null,"",null,"","",null,null,null,null,"","",null,1]
["",null,null,"",null,"",null,"",null,"","",null,null,null,null,"","",null,1]
["",null,null,"",null,"",null,"",null,"","",null,null,null,null,"","",null,1]
[{"$f":"IF(E1988=\"\",\"\",IF(A1988=\"\",TODAY(),A1988))","v":""},null,null,{"$f":"IF(B1988=\"\",\"\",(C1988-B1988))","v":""},null,{"$f":"IFERROR(VLOOKUP(E1988,$AK$3:$AM$317,2,FALSE),\"\")","v":""},null,{"$f":"IFERROR(G1988/D1988/24,\"\")","v":""},null,{"$f":"IFERROR(I1988/D1988/24,\"\")","v":""},{"$f":"IFERROR(L1988/D1988/24,\"\")","v":""},null,null,null,null,"",{"$f":"IFERROR(ROUND(SUM(L1988*P1988),2),\"\")","v":""},null,1]
["",null,null,"",null,"",null,"",null,"","",null,null,null,null,"","",null,1]
["",null,null,"",null,"",null,"",null,"","",null,null,null,null,"","",null,1]
["",null,null,"",null,"",null,"",null,"","",null,null,null,null,"","",null,1]
["",null,null,"",null,"",null,"",null,"","",null,null,null,null,"","",null,1]
["",null,null,"",null,"",null,"",null,"","",null,null,null,null,"","",null,1]
["",null,null,"",null,"",null,"",null,"","",null,null,null,null,"","",null,1]
["",null,null,"",null,"",null,"",null,"","",null,null,null,null,"","",null,1]
["",null,null,"",null,"",null,"",null,"","",null,null,null,null,"","",null,1]
["",null,null,"",null,"",null,"",null,"","",null,null,null,null,"","",null,1]
["",null,null,"",null,"",null,"",null,"","",null,null,null,null,"","",null,1]
["",null,null,"",null,"",null,"",null,"","",null,null,null,null,"","",null,1]
["",null,null,"",null,"",null,"",null,"","",null,null,null,null,"","",null,1]
["",null,null,"",null,"",null,"",null,"","",null,null,null,null,"","",null,1]

{"sheet":"Shift_2","index":1,"n_rows":2001,"n_cols":39,"rows_kept":2001,"cut":false,"hidden":false,"merged":[]}
[null,"T","T",null,"T",null,null,null,"T",null,null,"T","T","T","T",null,null,"T",null,"T","T","T","T"]
["Date","Start Time","End Time","Total","Machine No.","Machine Name","Capisty Power (Kgs / Shift )","Capisty Power Rate  (KGS / 1 HRS)","Minmum Power     ( Kgs / Shift )","Minimum Power Rate  (KGS / 1 HRS)","Acual Production (KGS / 1 HRS)","Production rate per Shift   ","Gm/ML","Size MM"," Drawing  ","ML X KG."," ML.\\ day","Color","Shift","       Name of the Employee","       Name of Supervisor","OR No.","Comment",null,null,null,null,null,null,null,null,null,1,"Crosha COMEZ 2017",15,0.05,"Black ","منصور محمد منصور","محمد"]
[{"$f":"IF(E3=\"\",\"\",IF(A3=\"\",TODAY(),A3))","v":"2019-02-20"},"09:00:00","16:00:00",{"$f":"IF(B3=\"\",\"\",(C3-B3))","v":"07:00:00"},1,{"$f":"IFERROR(VLOOKUP(E3,AG2:AI316,2,FALSE),\"\")","v":"Crosha COMEZ 2017"},null,{"$f":"IFERROR(G3/D3/24,\"\")","v":0},null,{"$f":"IFERROR(I3/D3/24,\"\")","v":0},{"$f":"IFERROR(L3/D3/24,\"\")","v":1.7142857142857144},12,3,0.06,"ttttt",{"$f":"IFERROR(ROUND(SUM(1000/M3),2),\"\")","v":333.33},{"$f":"IFERROR(ROUND(SUM(L3*P3),2),\"\")","v":3999.96},"A prominent Black",2,"عادل عزمي شنودة","اسامة",3333,"yyyyyy",null,null,null,null,null,null,null,null,null,2,"Crosha COMEZ 2017",11.5,0.06,"White","علي مراد حسن","محمود"]
[{"$f":"IF(E4=\"\",\"\",IF(A4=\"\",TODAY(),A4))","v":"2019-02-21"},"18:30:00","22:15:00",{"$f":"IF(B4=\"\",\"\",(C4-B4))","v":"03:45:00"},2,{"$f":"IFERROR(VLOOKUP(E4,AG3:AI317,2,FALSE),\"\")","v":"Crosha COMEZ 2017"},null,{"$f":"IFERROR(G4/D4/24,\"\")","v":0},8,{"$f":"IFERROR(I4/D4/24,\"\")","v":2.1333333333333333},{"$f":"IFERROR(L4/D4/24,\"\")","v":3.4666666666666668},13,5,7.0000000000000007E-2,"mmmmm",{"$f":"IFERROR(ROUND(SUM(1000/M4),2),\"\")","v":200},{"$f":"IFERROR(ROUND(SUM(L4*P4),2),\"\")","v":2600},"White",2,"صبحي محمد محمود","اسامة",99999,null,null,null,null,null,null,null,null,null,null,3,"Crosha F.COLLIC 1996",9,7.0000000000000007E-2,"Black&White","ابراهيم محمود ابراهيم","اسامة"]
["",null,null,"",null,"",null,"",null,"","",null,null,null,null,"","",null,2,null,null,null,null,null,null,null,null,null,null,null,null,null,4,"Crosha F.COLLIC 1997",8.1,0.08,"A prominent Black","مسعد رمزي مسعد"]
["",null,null,"",null,"",null,"",null,"","",null,null,null,null,"","",null,2,null,null,null,null,null,null,null,null,null,null,null,null,null,5,"Crosha F.COLLIC 1996",7.8,0.09,"A prominent White","عادل عزمي شنودة"]
["",null,null,"",null,"",null,"",null,"","",null,null,null,null,"","",null,2,null,null,null,null,null,null,null,null,null,null,null,null,null,6,"Crosha",null,0.1,null,"صبحي محمد محمود"]
["",null,null,"",null,"",null,"",null,"","",null,null,null,null,"","",null,2,null,null,null,null,null,null,null,null,null,null,null,null,null,7,"Crosha",null,0.11,null,"السيد محمد عبد العال"]
["",null,null,"",null,"",null,"",null,"","",null,null,null,null,"","",null,2,null,null,null,null,null,null,null,null,null,null,null,null,null,8,"Crosha",null,0.12,null,"عادل سيف الله السيد"]
["",null,null,"",null,"",null,"",null,"","",null,null,null,null,"","",null,2,null,null,null,null,null,null,null,null,null,null,null,null,null,9,"Crosha",null,0.13,null,"خالد السيد عبد القادر"]
["",null,null,"",null,"",null,"",null,"","",null,null,null,null,"","",null,2,null,null,null,null,null,null,null,null,null,null,null,null,null,10,"Crosha",null,0.14000000000000001,null,"عادل صادق بشير"]
["",null,null,"",null,"",null,"",null,"","",null,null,null,null,"","",null,2,null,null,null,null,null,null,null,null,null,null,null,null,null,11,"Crosha",null,0.15,null,"روماني عطية حبشي"]
["",null,null,"",null,"",null,"",null,"","",null,null,null,null,"","",null,2,null,null,null,null,null,null,null,null,null,null,null,null,null,12,"Crosha",null,0.16,null,"احمد صادق توفيق"]
["",null,null,"",null,"",null,"",null,"","",null,null,null,null,"","",null,2,null,null,null,null,null,null,null,null,null,null,null,null,null,13,"Crosha",null,0.17,null,"دينا مجدي ابراهيم"]
["",null,null,"",null,"",null,"",null,"","",null,null,null,null,"","",null,2,null,null,null,null,null,null,null,null,null,null,null,null,null,14,"Crosha",null,0.18,null,"علي فرج على محمد"]
["",null,null,"",null,"",null,"",null,"","",null,null,null,null,"","",null,2,null,null,null,null,null,null,null,null,null,null,null,null,null,15,"Crosha",null,0.19,null,"بوسي السيد عبد المنعم"]
["",null,null,"",null,"",null,"",null,"","",null,null,null,null,"","",null,2,null,null,null,null,null,null,null,null,null,null,null,null,null,16,"Crosha",null,0.2,null,"محمد محمد عبد الوهاب"]
["",null,null,"",null,"",null,"",null,"","",null,null,null,null,"","",null,2,null,null,null,null,null,null,null,null,null,null,null,null,null,17,"Crosha",null,0.21,null,"سعيد الليثي جاب الله"]
["",null,null,"",null,"",null,"",null,"","",null,null,null,null,"","",null,2,null,null,null,null,null,null,null,null,null,null,null,null,null,18,"Crosha",null,0.22,null,"احمد عبد الظاهر"]
["",null,null,"",null,"",null,"",null,"","",null,null,null,null,"","",null,2,null,null,null,null,null,null,null,null,null,null,null,null,null,19,"Crosha",null,0.23,null,"مصطفى عبد النبي مصطفى"]
["",null,null,"",null,"",null,"",null,"","",null,null,null,null,"","",null,2,null,null,null,null,null,null,null,null,null,null,null,null,null,20,"Crosha",null,0.24,null,"ابراهيم صبحي محمد السيد"]
["",null,null,"",null,"",null,"",null,"","",null,null,null,null,"","",null,2,null,null,null,null,null,null,null,null,null,null,null,null,null,21,"Crosha",null,0.25,null,"خميس حسن حسنين"]
["",null,null,"",null,"",null,"",null,"","",null,null,null,null,"","",null,2,null,null,null,null,null,null,null,null,null,null,null,null,null,22,"Crosha",null,0.26,null,"محمد حسني حسن"]
["",null,null,"",null,"",null,"",null,"","",null,null,null,null,"","",null,2,null,null,null,null,null,null,null,null,null,null,null,null,null,23,"Crosha",null,0.27,null,"محمد عادل محمد محمد"]
["",null,null,"",null,"",null,"",null,"","",null,null,null,null,"","",null,2,null,null,null,null,null,null,null,null,null,null,null,null,null,24,"Crosha",null,0.28000000000000003,null,"السيد عبد الحميد اسماعيل"]
["",null,null,"",null,"",null,"",null,"","",null,null,null,null,{"$f":"IFERROR(ROUND(SUM(1000/M26),2),\"\")","v":""},"",null,2,null,null,null,null,null,null,null,null,null,null,null,null,null,25,"Crosha",null,0.28999999999999998,null,"ابراهيم محمد فتوح"]
["",null,null,"",null,"",null,"",null,"","",null,null,null,null,"","",null,2,null,null,null,null,null,null,null,null,null,null,null,null,null,26,"Crosha",null,0.3,null,"عمرو محمد عبد الجليل"]
["",null,null,"",null,"",null,"",null,"","",null,null,null,null,"","",null,2,null,null,null,null,null,null,null,null,null,null,null,null,null,27,"Crosha",null,0.31,null,"خالد مصطفى العوضي"]
["",null,null,"",null,"",null,"",null,"","",null,null,null,null,"","",null,2,null,null,null,null,null,null,null,null,null,null,null,null,null,28,"Crosha",null,0.32,null,"حمادة احمد على النجار"]
["",null,null,"",null,"",null,"",null,"","",null,null,null,null,"","",null,2,null,null,null,null,null,null,null,null,null,null,null,null,null,29,"Crosha",null,0.33,null,"عاطف وليم لبيب"]
["",null,null,"",null,"",null,"",null,"","",null,null,null,null,"","",null,2,null,null,null,null,null,null,null,null,null,null,null,null,null,30,"Crosha",null,0.34,null,"عادل وليم نبيل"]
["",null,null,"",null,"",null,"",null,"","",null,null,null,null,"","",null,2,null,null,null,null,null,null,null,null,null,null,null,null,null,31,"Crosha",null,0.35,null,"بيشوي عزت شفيق"]
["",null,null,"",null,"",null,"",null,"","",null,null,null,null,"","",null,2,null,null,null,null,null,null,null,null,null,null,null,null,null,32,"Crosha",null,0.36,null,"محمد يحيى محمود"]
["",null,null,"",null,"",null,"",null,"","",null,null,null,null,"","",null,2,null,null,null,null,null,null,null,null,null,null,null,null,null,33,"Crosha",null,0.37,null,"احمد رمضان احمد"]
["",null,null,"",null,"",null,"",null,"","",null,null,null,null,"","",null,2,null,null,null,null,null,null,null,null,null,null,null,null,null,34,"Crosha",null,0.38]
["",null,null,"",null,"",null,"",null,"","",null,null,null,null,"","",null,2,null,null,null,null,null,null,null,null,null,null,null,null,null,35,"Crosha",null,0.39]
["",null,null,"",null,"",null,"",null,"","",null,null,null,null,"","",null,2,null,null,null,null,null,null,null,null,null,null,null,null,null,36,"Crosha",null,0.4]
["",null,null,"",null,"",null,"",null,"","",null,null,null,null,"","",null,2,null,null,null,null,null,null,null,null,null,null,null,null,null,37,"Crosha",null,0.41]
["",null,null,"",null,"",null,"",null,"","",null,null,null,null,"","",null,2,null,null,null,null,null,null,null,null,null,null,null,null,null,38,"Crosha",null,0.42]
["",null,null,"",null,"",null,"",null,"","",null,null,null,null,"","",null,2,null,null,null,null,null,null,null,null,null,null,null,null,null,39,"Crosha",null,0.43]
["",null,null,"",null,"",null,"",null,"","",null,null,null,null,"","",null,2,null,null,null,null,null,null,null,null,null,null,null,null,null,40,"Crosha",null,0.44]
["",null,null,"",null,"",null,"",null,"","",null,null,null,null,"","",null,2,null,null,null,null,null,null,null,null,null,null,null,null,null,41,"Crosha",null,0.45]
["",null,null,"",null,"",null,"",null,"","",null,null,null,null,"","",null,2,null,null,null,null,null,null,null,null,null,null,null,null,null,42,"Crosha",null,0.46]
["",null,null,"",null,"",null,"",null,"","",null,null,null,null,"","",null,2,null,null,null,null,null,null,null,null,null,null,null,null,null,43,"Crosha",null,0.47]
["",null,null,"",null,"",null,"",null,"","",null,null,null,null,"","",null,2,null,null,null,null,null,null,null,null,null,null,null,null,null,44,"Crosha",null,0.48]
["",null,null,"",null,"",null,"",null,"","",null,null,null,null,"","",null,2,null,null,null,null,null,null,null,null,null,null,null,null,null,45,"Crosha",null,0.49]
["",null,null,"",null,"",null,"",null,"","",null,null,null,null,"","",null,2,null,null,null,null,null,null,null,null,null,null,null,null,null,46,"Crosha",null,0.5]
["",null,null,"",null,"",null,"",null,"","",null,null,null,null,"","",null,2,null,null,null,null,null,null,null,null,null,null,null,null,null,47,"Crosha",null,0.51]
["",null,null,"",null,"",null,"",null,"","",null,null,null,null,"","",null,2,null,null,null,null,null,null,null,null,null,null,null,null,null,48,"Crosha",null,0.52]
["",null,null,"",null,"",null,"",null,"","",null,null,null,null,"","",null,2,null,null,null,null,null,null,null,null,null,null,null,null,null,49,"Crosha",null,0.53]
["",null,null,"",null,"",null,"",null,"","",null,null,null,null,"","",null,2,null,null,null,null,null,null,null,null,null,null,null,null,null,50,"Crosha",null,0.54]
["",null,null,"",null,"",null,"",null,"","",null,null,null,null,"","",null,2,null,null,null,null,null,null,null,null,null,null,null,null,null,51,"Crosha",null,0.55000000000000004]
["",null,null,"",null,"",null,"",null,"","",null,null,null,null,"","",null,2,null,null,null,null,null,null,null,null,null,null,null,null,null,52,"Crosha",null,0.56000000000000005]
["",null,null,"",null,"",null,"",null,"","",null,null,null,null,"","",null,2,null,null,null,null,null,null,null,null,null,null,null,null,null,53,"Crosha",null,0.56999999999999995]
["",null,null,"",null,"",null,"",null,"","",null,null,null,null,"","",null,2,null,null,null,null,null,null,null,null,null,null,null,null,null,54,"Crosha",null,0.57999999999999996]
["",null,null,"",null,"",null,"",null,"","",null,null,null,null,"","",null,2,null,null,null,null,null,null,null,null,null,null,null,null,null,55,"Crosha",null,0.59]
["",null,null,"",null,"",null,"",null,"","",null,null,null,null,"","",null,2,null,null,null,null,null,null,null,null,null,null,null,null,null,56,"Crosha",null,0.6]
["",null,null,"",null,"",null,"",null,"","",null,null,null,null,"","",null,2,null,null,null,null,null,null,null,null,null,null,null,null,null,57,"Crosha",null,0.61]
["",null,null,"",null,"",null,"",null,"","",null,null,null,null,"","",null,2,null,null,null,null,null,null,null,null,null,null,null,null,null,58,"Crosha",null,0.62]
["",null,null,"",null,"",null,"",null,"","",null,null,null,null,"","",null,2,null,null,null,null,null,null,null,null,null,null,null,null,null,59,"Crosha",null,0.63]
["",null,null,"",null,"",null,"",null,"","",null,null,null,null,"","",null,2,null,null,null,null,null,null,null,null,null,null,null,null,null,60,"Crosha",null,0.64]
["",null,null,"",null,"",null,"",null,"","",null,null,null,null,"","",null,2,null,null,null,null,null,null,null,null,null,null,null,null,null,61,"Crosha",null,0.65]
["",null,null,"",null,"",null,"",null,"","",null,null,null,null,"","",null,2,null,null,null,null,null,null,null,null,null,null,null,null,null,62,"Crosha",null,0.66]
["",null,null,"",null,"",null,"",null,"","",null,null,null,null,"","",null,2,null,null,null,null,null,null,null,null,null,null,null,null,null,63,"Crosha",null,0.67]
["",null,null,"",null,"",null,"",null,"","",null,null,null,null,"","",null,2,null,null,null,null,null,null,null,null,null,null,null,null,null,64,"Crosha",null,0.68]
["",null,null,"",null,"",null,"",null,"","",null,null,null,null,"","",null,2,null,null,null,null,null,null,null,null,null,null,null,null,null,65,"Crosha",null,0.69]
["",null,null,"",null,"",null,"",null,"","",null,null,null,null,"","",null,2,null,null,null,null,null,null,null,null,null,null,null,null,null,66,"Crosha",null,0.7]
[{"$f":"IF(E68=\"\",\"\",IF(A68=\"\",TODAY(),A68))","v":""},null,null,{"$f":"IF(B68=\"\",\"\",(C68-B68))","v":""},null,{"$f":"IFERROR(VLOOKUP(E68,AG67:AI381,2,FALSE),\"\")","v":""},null,{"$f":"IFERROR(G68/D68/24,\"\")","v":""},null,{"$f":"IFERROR(I68/D68/24,\"\")","v":""},{"$f":"IFERROR(L68/D68/24,\"\")","v":""},null,null,null,null,"",{"$f":"IFERROR(ROUND(SUM(L68*P68),2),\"\")","v":""},null,2,null,null,null,null,null,null,null,null,null,null,null,null,null,67,"Crosha",null,0.71]
["",null,null,"",null,"",null,"",null,"","",null,null,null,null,"","",null,2,null,null,null,null,null,null,null,null,null,null,null,null,null,68,"Crosha",null,0.72]
["",null,null,"",null,"",null,"",null,"","",null,null,null,null,"","",null,2,null,null,null,null,null,null,null,null,null,null,null,null,null,69,"Crosha",null,0.73]
["",null,null,"",null,"",null,"",null,"","",null,null,null,null,"","",null,2,null,null,null,null,null,null,null,null,null,null,null,null,null,70,"Crosha",null,0.74]
["",null,null,"",null,"",null,"",null,"","",null,null,null,null,"","",null,2,null,null,null,null,null,null,null,null,null,null,null,null,null,71,"Crosha",null,0.75]
["",null,null,"",null,"",null,"",null,"","",null,null,null,null,"","",null,2,null,null,null,null,null,null,null,null,null,null,null,null,null,72,"Crosha",null,0.76]
["",null,null,"",null,"",null,"",null,"","",null,null,null,null,"","",null,2,null,null,null,null,null,null,null,null,null,null,null,null,null,73,"Crosha",null,0.77]
["",null,null,"",null,"",null,"",null,"","",null,null,null,null,"","",null,2,null,null,null,null,null,null,null,null,null,null,null,null,null,74,"Crosha",null,0.78]
["",null,null,"",null,"",null,"",null,"","",null,null,null,null,"","",null,2,null,null,null,null,null,null,null,null,null,null,null,null,null,75,"Crosha",null,0.79]
["",null,null,"",null,"",null,"",null,"","",null,null,null,null,"","",null,2,null,null,null,null,null,null,null,null,null,null,null,null,null,76,"Crosha",null,0.8]
["",null,null,"",null,"",null,"",null,"","",null,null,null,null,"","",null,2,null,null,null,null,null,null,null,null,null,null,null,null,null,77,"Crosha",null,0.81]
["",null,null,"",null,"",null,"",null,"","",null,null,null,null,"","",null,2,null,null,null,null,null,null,null,null,null,null,null,null,null,78,"Crosha",null,0.82]
["",null,null,"",null,"",null,"",null,"","",null,null,null,null,"","",null,2,null,null,null,null,null,null,null,null,null,null,null,null,null,79,"Crosha",null,0.83]
["",null,null,"",null,"",null,"",null,"","",null,null,null,null,"","",null,2,null,null,null,null,null,null,null,null,null,null,null,null,null,80,"Crosha",null,0.84]
["",null,null,"",null,"",null,"",null,"","",null,null,null,null,"","",null,2,null,null,null,null,null,null,null,null,null,null,null,null,null,81,"Crosha",null,0.85]
["",null,null,"",null,"",null,"",null,"","",null,null,null,null,"","",null,2,null,null,null,null,null,null,null,null,null,null,null,null,null,82,"Crosha",null,0.86]
["",null,null,"",null,"",null,"",null,"","",null,null,null,null,"","",null,2,null,null,null,null,null,null,null,null,null,null,null,null,null,83,"Crosha",null,0.87]
["",null,null,"",null,"",null,"",null,"","",null,null,null,null,"","",null,2,null,null,null,null,null,null,null,null,null,null,null,null,null,84,"Crosha",null,0.88]
["",null,null,"",null,"",null,"",null,"","",null,null,null,null,"","",null,2,null,null,null,null,null,null,null,null,null,null,null,null,null,85,"Crosha",null,0.89]
["",null,null,"",null,"",null,"",null,"","",null,null,null,null,"","",null,2,null,null,null,null,null,null,null,null,null,null,null,null,null,86,"Crosha",null,0.9]
["",null,null,"",null,"",null,"",null,"","",null,null,null,null,"","",null,2,null,null,null,null,null,null,null,null,null,null,null,null,null,87,"Crosha",null,0.91]
["",null,null,"",null,"",null,"",null,"","",null,null,null,null,"","",null,2,null,null,null,null,null,null,null,null,null,null,null,null,null,88,"Crosha",null,0.92]
["",null,null,"",null,"",null,"",null,"","",null,null,null,null,{"$f":"IFERROR(ROUND(SUM(1000/M90),2),\"\")","v":""},"",null,2,null,null,null,null,null,null,null,null,null,null,null,null,null,89,"Crosha",null,0.93]
["",null,null,"",null,"",null,"",null,"","",null,null,null,null,"","",null,2,null,null,null,null,null,null,null,null,null,null,null,null,null,90,"Crosha",null,0.94]
["",null,null,"",null,"",null,"",null,"","",null,null,null,null,"","",null,2,null,null,null,null,null,null,null,null,null,null,null,null,null,91,"Crosha",null,0.95]
["",null,null,"",null,"",null,"",null,"","",null,null,null,null,"","",null,2,null,null,null,null,null,null,null,null,null,null,null,null,null,92,"Crosha",null,0.96]
["",null,null,"",null,"",null,"",null,"","",null,null,null,null,"","",null,2,null,null,null,null,null,null,null,null,null,null,null,null,null,93,"Crosha",null,0.97]
["",null,null,"",null,"",null,"",null,"","",null,null,null,null,"","",null,2,null,null,null,null,null,null,null,null,null,null,null,null,null,94,"Crosha",null,0.98]
["",null,null,"",null,"",null,"",null,"","",null,null,null,null,"","",null,2,null,null,null,null,null,null,null,null,null,null,null,null,null,95,"Crosha",null,0.99]
["",null,null,"",null,"",null,"",null,"","",null,null,null,null,"","",null,2,null,null,null,null,null,null,null,null,null,null,null,null,null,96,"Crosha",null,1]
["",null,null,"",null,"",null,"",null,"","",null,null,null,null,"","",null,2,null,null,null,null,null,null,null,null,null,null,null,null,null,97,"Crosha",null,1.01]
["",null,null,"",null,"",null,"",null,"","",null,null,null,null,"","",null,2,null,null,null,null,null,null,null,null,null,null,null,null,null,98,"Crosha",null,1.02]
["",null,null,"",null,"",null,"",null,"","",null,null,null,null,"","",null,2,null,null,null,null,null,null,null,null,null,null,null,null,null,99,"Crosha",null,1.03]
["",null,null,"",null,"",null,"",null,"","",null,null,null,null,"","",null,2,null,null,null,null,null,null,null,null,null,null,null,null,null,100,"Crosha",null,1.04]
["",null,null,"",null,"",null,"",null,"","",null,null,null,null,"","",null,2,null,null,null,null,null,null,null,null,null,null,null,null,null,101,"Jakar - MULLER 2017",3.35,1.05]
["",null,null,"",null,"",null,"",null,"","",null,null,null,null,"","",null,2,null,null,null,null,null,null,null,null,null,null,null,null,null,102,"Jakar - MULLER 2017",5.01,1.06]
["",null,null,"",null,"",null,"",null,"","",null,null,null,null,"","",null,2,null,null,null,null,null,null,null,null,null,null,null,null,null,103,"Jakar",null,1.07]
["",null,null,"",null,"",null,"",null,"","",null,null,null,null,"","",null,2,null,null,null,null,null,null,null,null,null,null,null,null,null,104,"Jakar",null,1.08]
["",null,null,"",null,"",null,"",null,"","",null,null,null,null,"","",null,2,null,null,null,null,null,null,null,null,null,null,null,null,null,105,"Jakar",null,1.0900000000000001]
["",null,null,"",null,"",null,"",null,"","",null,null,null,null,"","",null,2,null,null,null,null,null,null,null,null,null,null,null,null,null,106,"Jakar",null,1.1000000000000001]
["",null,null,"",null,"",null,"",null,"","",null,null,null,null,"","",null,2,null,null,null,null,null,null,null,null,null,null,null,null,null,107,"Jakar",null,1.1100000000000001]
["",null,null,"",null,"",null,"",null,"","",null,null,null,null,"","",null,2,null,null,null,null,null,null,null,null,null,null,null,null,null,108,"Jakar",null,1.1200000000000001]
["",null,null,"",null,"",null,"",null,"","",null,null,null,null,"","",null,2,null,null,null,null,null,null,null,null,null,null,null,null,null,109,"Jakar",null,1.1299999999999999]
["",null,null,"",null,"",null,"",null,"","",null,null,null,null,"","",null,2,null,null,null,null,null,null,null,null,null,null,null,null,null,110,"Jakar",null,1.1399999999999999]
["",null,null,"",null,"",null,"",null,"","",null,null,null,null,"","",null,2,null,null,null,null,null,null,null,null,null,null,null,null,null,111,"Jakar",null,1.1499999999999999]
["",null,null,"",null,"",null,"",null,"","",null,null,null,null,"","",null,2,null,null,null,null,null,null,null,null,null,null,null,null,null,112,"Jakar",null,1.1599999999999999]
["",null,null,"",null,"",null,"",null,"","",null,null,null,null,"","",null,2,null,null,null,null,null,null,null,null,null,null,null,null,null,113,"Jakar",null,1.17]
["",null,null,"",null,"",null,"",null,"","",null,null,null,null,"","",null,2,null,null,null,null,null,null,null,null,null,null,null,null,null,114,"Jakar",null,1.18]
["",null,null,"",null,"",null,"",null,"","",null,null,null,null,"","",null,2,null,null,null,null,null,null,null,null,null,null,null,null,null,115,"Jakar",null,1.19]
["",null,null,"",null,"",null,"",null,"","",null,null,null,null,"","",null,2,null,null,null,null,null,null,null,null,null,null,null,null,null,116,"Jakar",null,1.2]
["",null,null,"",null,"",null,"",null,"","",null,null,null,null,"","",null,2,null,null,null,null,null,null,null,null,null,null,null,null,null,117,"Jakar",null,1.21]
["",null,null,"",null,"",null,"",null,"","",null,null,null,null,"","",null,2,null,null,null,null,null,null,null,null,null,null,null,null,null,118,"Jakar",null,1.22]
["",null,null,"",null,"",null,"",null,"","",null,null,null,null,"","",null,2,null,null,null,null,null,null,null,null,null,null,null,null,null,119,"Jakar",null,1.23]
["",null,null,"",null,"",null,"",null,"","",null,null,null,null,"","",null,2,null,null,null,null,null,null,null,null,null,null,null,null,null,120,"Jakar",null,1.24]
["",null,null,"",null,"",null,"",null,"","",null,null,null,null,"","",null,2,null,null,null,null,null,null,null,null,null,null,null,null,null,121,"Jakar",null,1.25]
["",null,null,"",null,"",null,"",null,"","",null,null,null,null,"","",null,2,null,null,null,null,null,null,null,null,null,null,null,null,null,122,"Jakar",null,1.26]
["",null,null,"",null,"",null,"",null,"","",null,null,null,null,"","",null,2,null,null,null,null,null,null,null,null,null,null,null,null,null,123,"Jakar",null,1.27]
["",null,null,"",null,"",null,"",null,"","",null,null,null,null,"","",null,2,null,null,null,null,null,null,null,null,null,null,null,null,null,124,"Jakar",null,1.28]
["",null,null,"",null,"",null,"",null,"","",null,null,null,null,"","",null,2,null,null,null,null,null,null,null,null,null,null,null,null,null,125,"Jakar",null,1.29]
["",null,null,"",null,"",null,"",null,"","",null,null,null,null,"","",null,2,null,null,null,null,null,null,null,null,null,null,null,null,null,126,"Jakar",null,1.3]
["",null,null,"",null,"",null,"",null,"","",null,null,null,null,"","",null,2,null,null,null,null,null,null,null,null,null,null,null,null,null,127,"Jakar",null,1.31]
["",null,null,"",null,"",null,"",null,"","",null,null,null,null,"","",null,2,null,null,null,null,null,null,null,null,null,null,null,null,null,128,"Jakar",null,1.32]
["",null,null,"",null,"",null,"",null,"","",null,null,null,null,"","",null,2,null,null,null,null,null,null,null,null,null,null,null,null,null,129,"Jakar",null,1.33]
["",null,null,"",null,"",null,"",null,"","",null,null,null,null,"","",null,2,null,null,null,null,null,null,null,null,null,null,null,null,null,130,"Jakar",null,1.34]
[{"$f":"IF(E132=\"\",\"\",IF(A132=\"\",TODAY(),A132))","v":""},null,null,{"$f":"IF(B132=\"\",\"\",(C132-B132))","v":""},null,{"$f":"IFERROR(VLOOKUP(E132,AG131:AI445,2,FALSE),\"\")","v":""},null,{"$f":"IFERROR(G132/D132/24,\"\")","v":""},null,{"$f":"IFERROR(I132/D132/24,\"\")","v":""},{"$f":"IFERROR(L132/D132/24,\"\")","v":""},null,null,null,null,"",{"$f":"IFERROR(ROUND(SUM(L132*P132),2),\"\")","v":""},null,2,null,null,null,null,null,null,null,null,null,null,null,null,null,131,"Jakar",null,1.35]
["",null,null,"",null,"",null,"",null,"","",null,null,null,null,"","",null,2,null,null,null,null,null,null,null,null,null,null,null,null,null,132,"Jakar",null,1.36]
["",null,null,"",null,"",null,"",null,"","",null,null,null,null,"","",null,2,null,null,null,null,null,null,null,null,null,null,null,null,null,133,"Jakar",null,1.37]
["",null,null,"",null,"",null,"",null,"","",null,null,null,null,"","",null,2,null,null,null,null,null,null,null,null,null,null,null,null,null,134,"Jakar",null,1.38]
["",null,null,"",null,"",null,"",null,"","",null,null,null,null,"","",null,2,null,null,null,null,null,null,null,null,null,null,null,null,null,135,"Jakar",null,1.39]
["",null,null,"",null,"",null,"",null,"","",null,null,null,null,"","",null,2,null,null,null,null,null,null,null,null,null,null,null,null,null,136,"Jakar",null,1.4]
["",null,null,"",null,"",null,"",null,"","",null,null,null,null,"","",null,2,null,null,null,null,null,null,null,null,null,null,null,null,null,137,"Jakar",null,1.41]
["",null,null,"",null,"",null,"",null,"","",null,null,null,null,"","",null,2,null,null,null,null,null,null,null,null,null,null,null,null,null,138,"Jakar",null,1.42]
["",null,null,"",null,"",null,"",null,"","",null,null,null,null,"","",null,2,null,null,null,null,null,null,null,null,null,null,null,null,null,139,"Jakar",null,1.43]
["",null,null,"",null,"",null,"",null,"","",null,null,null,null,"","",null,2,null,null,null,null,null,null,null,null,null,null,null,null,null,140,"Jakar",null,1.44]
["",null,null,"",null,"",null,"",null,"","",null,null,null,null,"","",null,2,null,null,null,null,null,null,null,null,null,null,null,null,null,141,"Jakar",null,1.45]
["",null,null,"",null,"",null,"",null,"","",null,null,null,null,"","",null,2,null,null,null,null,null,null,null,null,null,null,null,null,null,142,"Jakar",null,1.46]
["",null,null,"",null,"",null,"",null,"","",null,null,null,null,"","",null,2,null,null,null,null,null,null,null,null,null,null,null,null,null,143,"Jakar",null,1.47]
["",null,null,"",null,"",null,"",null,"","",null,null,null,null,"","",null,2,null,null,null,null,null,null,null,null,null,null,null,null,null,144,"Jakar",null,1.48]
["",null,null,"",null,"",null,"",null,"","",null,null,null,null,"","",null,2,null,null,null,null,null,null,null,null,null,null,null,null,null,145,"Jakar",null,1.49]
["",null,null,"",null,"",null,"",null,"","",null,null,null,null,"","",null,2,null,null,null,null,null,null,null,null,null,null,null,null,null,146,"Jakar",null,1.5]
["",null,null,"",null,"",null,"",null,"","",null,null,null,null,"","",null,2,null,null,null,null,null,null,null,null,null,null,null,null,null,147,"Jakar",null,1.51]
["",null,null,"",null,"",null,"",null,"","",null,null,null,null,"","",null,2,null,null,null,null,null,null,null,null,null,null,null,null,null,148,"Jakar",null,1.52]
["",null,null,"",null,"",null,"",null,"","",null,null,null,null,"","",null,2,null,null,null,null,null,null,null,null,null,null,null,null,null,149,"Jakar",null,1.53]
["",null,null,"",null,"",null,"",null,"","",null,null,null,null,"","",null,2,null,null,null,null,null,null,null,null,null,null,null,null,null,150,"Jakar",null,1.54]
["",null,null,"",null,"",null,"",null,"","",null,null,null,null,"","",null,2,null,null,null,null,null,null,null,null,null,null,null,null,null,151,"Jakar",null,1.55]
["",null,null,"",null,"",null,"",null,"","",null,null,null,null,"","",null,2,null,null,null,null,null,null,null,null,null,null,null,null,null,152,"Jakar",null,1.56]
["",null,null,"",null,"",null,"",null,"","",null,null,null,null,{"$f":"IFERROR(ROUND(SUM(1000/M154),2),\"\")","v":""},"",null,2,null,null,null,null,null,null,null,null,null,null,null,null,null,153,"Jakar",null,1.57]
["",null,null,"",null,"",null,"",null,"","",null,null,null,null,"","",null,2,null,null,null,null,null,null,null,null,null,null,null,null,null,154,"Jakar",null,1.58]
["",null,null,"",null,"",null,"",null,"","",null,null,null,null,"","",null,2,null,null,null,null,null,null,null,null,null,null,null,null,null,155,"Jakar",null,1.59]
["",null,null,"",null,"",null,"",null,"","",null,null,null,null,"","",null,2,null,null,null,null,null,null,null,null,null,null,null,null,null,156,"Jakar",null,1.6]
["",null,null,"",null,"",null,"",null,"","",null,null,null,null,"","",null,2,null,null,null,null,null,null,null,null,null,null,null,null,null,157,"Jakar",null,1.61]
["",null,null,"",null,"",null,"",null,"","",null,null,null,null,"","",null,2,null,null,null,null,null,null,null,null,null,null,null,null,null,158,"Jakar",null,1.62]
["",null,null,"",null,"",null,"",null,"","",null,null,null,null,"","",null,2,null,null,null,null,null,null,null,null,null,null,null,null,null,159,"Jakar",null,1.63]
["",null,null,"",null,"",null,"",null,"","",null,null,null,null,"","",null,2,null,null,null,null,null,null,null,null,null,null,null,null,null,160,"Jakar",null,1.64]
["",null,null,"",null,"",null,"",null,"","",null,null,null,null,"","",null,2,null,null,null,null,null,null,null,null,null,null,null,null,null,161,"Jakar",null,1.65]
["",null,null,"",null,"",null,"",null,"","",null,null,null,null,"","",null,2,null,null,null,null,null,null,null,null,null,null,null,null,null,162,"Jakar",null,1.66]
["",null,null,"",null,"",null,"",null,"","",null,null,null,null,"","",null,2,null,null,null,null,null,null,null,null,null,null,null,null,null,163,"Jakar",null,1.67]
["",null,null,"",null,"",null,"",null,"","",null,null,null,null,"","",null,2,null,null,null,null,null,null,null,null,null,null,null,null,null,164,"Jakar",null,1.68]
["",null,null,"",null,"",null,"",null,"","",null,null,null,null,"","",null,2,null,null,null,null,null,null,null,null,null,null,null,null,null,165,"Jakar",null,1.69]
["",null,null,"",null,"",null,"",null,"","",null,null,null,null,"","",null,2,null,null,null,null,null,null,null,null,null,null,null,null,null,166,"Jakar",null,1.7]
["",null,null,"",null,"",null,"",null,"","",null,null,null,null,"","",null,2,null,null,null,null,null,null,null,null,null,null,null,null,null,167,"Jakar",null,1.71]
["",null,null,"",null,"",null,"",null,"","",null,null,null,null,"","",null,2,null,null,null,null,null,null,null,null,null,null,null,null,null,168,"Jakar",null,1.72]
["",null,null,"",null,"",null,"",null,"","",null,null,null,null,"","",null,2,null,null,null,null,null,null,null,null,null,null,null,null,null,169,"Jakar",null,1.73]
["",null,null,"",null,"",null,"",null,"","",null,null,null,null,"","",null,2,null,null,null,null,null,null,null,null,null,null,null,null,null,170,"Jakar",null,1.74]
["",null,null,"",null,"",null,"",null,"","",null,null,null,null,"","",null,2,null,null,null,null,null,null,null,null,null,null,null,null,null,171,"Jakar",null,1.75]
["",null,null,"",null,"",null,"",null,"","",null,null,null,null,"","",null,2,null,null,null,null,null,null,null,null,null,null,null,null,null,172,"Jakar",null,1.76]
["",null,null,"",null,"",null,"",null,"","",null,null,null,null,"","",null,2,null,null,null,null,null,null,null,null,null,null,null,null,null,173,"Jakar",null,1.77]
["",null,null,"",null,"",null,"",null,"","",null,null,null,null,"","",null,2,null,null,null,null,null,null,null,null,null,null,null,null,null,174,"Jakar",null,1.78]
["",null,null,"",null,"",null,"",null,"","",null,null,null,null,"","",null,2,null,null,null,null,null,null,null,null,null,null,null,null,null,175,"Jakar",null,1.79]
["",null,null,"",null,"",null,"",null,"","",null,null,null,null,"","",null,2,null,null,null,null,null,null,null,null,null,null,null,null,null,176,"Jakar",null,1.8]
["",null,null,"",null,"",null,"",null,"","",null,null,null,null,"","",null,2,null,null,null,null,null,null,null,null,null,null,null,null,null,177,"Jakar",null,1.81]
["",null,null,"",null,"",null,"",null,"","",null,null,null,null,"","",null,2,null,null,null,null,null,null,null,null,null,null,null,null,null,178,"Jakar",null,1.82]
["",null,null,"",null,"",null,"",null,"","",null,null,null,null,"","",null,2,null,null,null,null,null,null,null,null,null,null,null,null,null,179,"Jakar",null,1.83]
["",null,null,"",null,"",null,"",null,"","",null,null,null,null,"","",null,2,null,null,null,null,null,null,null,null,null,null,null,null,null,180,"Jakar",null,1.84]
["",null,null,"",null,"",null,"",null,"","",null,null,null,null,"","",null,2,null,null,null,null,null,null,null,null,null,null,null,null,null,181,"Jakar",null,1.85]
["",null,null,"",null,"",null,"",null,"","",null,null,null,null,"","",null,2,null,null,null,null,null,null,null,null,null,null,null,null,null,182,"Jakar",null,1.86]
["",null,null,"",null,"",null,"",null,"","",null,null,null,null,"","",null,2,null,null,null,null,null,null,null,null,null,null,null,null,null,183,"Jakar",null,1.87]
["",null,null,"",null,"",null,"",null,"","",null,null,null,null,"","",null,2,null,null,null,null,null,null,null,null,null,null,null,null,null,184,"Jakar",null,1.88]
["",null,null,"",null,"",null,"",null,"","",null,null,null,null,"","",null,2,null,null,null,null,null,null,null,null,null,null,null,null,null,185,"Jakar",null,1.89]
["",null,null,"",null,"",null,"",null,"","",null,null,null,null,"","",null,2,null,null,null,null,null,null,null,null,null,null,null,null,null,186,"Jakar",null,1.9]
["",null,null,"",null,"",null,"",null,"","",null,null,null,null,"","",null,2,null,null,null,null,null,null,null,null,null,null,null,null,null,187,"Jakar",null,1.91]
["",null,null,"",null,"",null,"",null,"","",null,null,null,null,"","",null,2,null,null,null,null,null,null,null,null,null,null,null,null,null,188,"Jakar",null,1.92]
["",null,null,"",null,"",null,"",null,"","",null,null,null,null,"","",null,2,null,null,null,null,null,null,null,null,null,null,null,null,null,189,"Jakar",null,1.93]
["",null,null,"",null,"",null,"",null,"","",null,null,null,null,"","",null,2,null,null,null,null,null,null,null,null,null,null,null,null,null,190,"Jakar",null,1.94]
["",null,null,"",null,"",null,"",null,"","",null,null,null,null,"","",null,2,null,null,null,null,null,null,null,null,null,null,null,null,null,191,"Jakar",null,1.95]
["",null,null,"",null,"",null,"",null,"","",null,null,null,null,"","",null,2,null,null,null,null,null,null,null,null,null,null,null,null,null,192,"Jakar",null,1.96]
["",null,null,"",null,"",null,"",null,"","",null,null,null,null,"","",null,2,null,null,null,null,null,null,null,null,null,null,null,null,null,193,"Jakar",null,1.97]
["",null,null,"",null,"",null,"",null,"","",null,null,null,null,"","",null,2,null,null,null,null,null,null,null,null,null,null,null,null,null,194,"Jakar",null,1.98]
[{"$f":"IF(E196=\"\",\"\",IF(A196=\"\",TODAY(),A196))","v":""},null,null,{"$f":"IF(B196=\"\",\"\",(C196-B196))","v":""},null,{"$f":"IFERROR(VLOOKUP(E196,AG195:AI509,2,FALSE),\"\")","v":""},null,{"$f":"IFERROR(G196/D196/24,\"\")","v":""},null,{"$f":"IFERROR(I196/D196/24,\"\")","v":""},{"$f":"IFERROR(L196/D196/24,\"\")","v":""},null,null,null,null,"",{"$f":"IFERROR(ROUND(SUM(L196*P196),2),\"\")","v":""},null,2,null,null,null,null,null,null,null,null,null,null,null,null,null,195,"Jakar",null,1.99]
["",null,null,"",null,"",null,"",null,"","",null,null,null,null,"","",null,2,null,null,null,null,null,null,null,null,null,null,null,null,null,196,"Jakar",null,2]
["",null,null,"",null,"",null,"",null,"","",null,null,null,null,"","",null,2,null,null,null,null,null,null,null,null,null,null,null,null,null,197,"Jakar",null,2.0099999999999998]
["",null,null,"",null,"",null,"",null,"","",null,null,null,null,"","",null,2,null,null,null,null,null,null,null,null,null,null,null,null,null,198,"Jakar",null,2.02]
["",null,null,"",null,"",null,"",null,"","",null,null,null,null,"","",null,2,null,null,null,null,null,null,null,null,null,null,null,null,null,199,"Jakar",null,2.0299999999999998]
["",null,null,"",null,"",null,"",null,"","",null,null,null,null,"","",null,2,null,null,null,null,null,null,null,null,null,null,null,null,null,200,"Jakar",null,2.04]
["",null,null,"",null,"",null,"",null,"","",null,null,null,null,"","",null,2,null,null,null,null,null,null,null,null,null,null,null,null,null,201,"Jakar",null,2.0499999999999998]
["",null,null,"",null,"",null,"",null,"","",null,null,null,null,"","",null,2,null,null,null,null,null,null,null,null,null,null,null,null,null,202,"Jakar",null,2.06]
["",null,null,"",null,"",null,"",null,"","",null,null,null,null,"","",null,2,null,null,null,null,null,null,null,null,null,null,null,null,null,203,"Jakar",null,2.0699999999999998]
["",null,null,"",null,"",null,"",null,"","",null,null,null,null,"","",null,2,null,null,null,null,null,null,null,null,null,null,null,null,null,204,"Jakar",null,2.08]
["",null,null,"",null,"",null,"",null,"","",null,null,null,null,"","",null,2,null,null,null,null,null,null,null,null,null,null,null,null,null,205,"Jakar",null,2.09]
["",null,null,"",null,"",null,"",null,"","",null,null,null,null,"","",null,2,null,null,null,null,null,null,null,null,null,null,null,null,null,206,"Jakar",null,2.1]
["",null,null,"",null,"",null,"",null,"","",null,null,null,null,"","",null,2,null,null,null,null,null,null,null,null,null,null,null,null,null,207,"Jakar",null,2.11]
["",null,null,"",null,"",null,"",null,"","",null,null,null,null,"","",null,2,null,null,null,null,null,null,null,null,null,null,null,null,null,208,"Jakar",null,2.12]
["",null,null,"",null,"",null,"",null,"","",null,null,null,null,"","",null,2,null,null,null,null,null,null,null,null,null,null,null,null,null,209,"Jakar",null,2.13]
["",null,null,"",null,"",null,"",null,"","",null,null,null,null,"","",null,2,null,null,null,null,null,null,null,null,null,null,null,null,null,210,"Jakar",null,2.14]
["",null,null,"",null,"",null,"",null,"","",null,null,null,null,"","",null,2,null,null,null,null,null,null,null,null,null,null,null,null,null,211,"Jakar",null,2.15]
["",null,null,"",null,"",null,"",null,"","",null,null,null,null,"","",null,2,null,null,null,null,null,null,null,null,null,null,null,null,null,212,"Jakar",null,2.16]
["",null,null,"",null,"",null,"",null,"","",null,null,null,null,"","",null,2,null,null,null,null,null,null,null,null,null,null,null,null,null,213,"Jakar",null,2.17]
["",null,null,"",null,"",null,"",null,"","",null,null,null,null,"","",null,2,null,null,null,null,null,null,null,null,null,null,null,null,null,214,"Jakar",null,2.1800000000000002]
["",null,null,"",null,"",null,"",null,"","",null,null,null,null,"","",null,2,null,null,null,null,null,null,null,null,null,null,null,null,null,215,"Jakar",null,2.19]
["",null,null,"",null,"",null,"",null,"","",null,null,null,null,"","",null,2,null,null,null,null,null,null,null,null,null,null,null,null,null,216,"Jakar",null,2.2000000000000002]
["",null,null,"",null,"",null,"",null,"","",null,null,null,null,{"$f":"IFERROR(ROUND(SUM(1000/M218),2),\"\")","v":""},"",null,2,null,null,null,null,null,null,null,null,null,null,null,null,null,217,"Jakar",null,2.21]
["",null,null,"",null,"",null,"",null,"","",null,null,null,null,"","",null,2,null,null,null,null,null,null,null,null,null,null,null,null,null,218,"Jakar",null,2.2200000000000002]
["",null,null,"",null,"",null,"",null,"","",null,null,null,null,"","",null,2,null,null,null,null,null,null,null,null,null,null,null,null,null,219,"Jakar",null,2.23]
["",null,null,"",null,"",null,"",null,"","",null,null,null,null,"","",null,2,null,null,null,null,null,null,null,null,null,null,null,null,null,220,"Jakar",null,2.2400000000000002]
["",null,null,"",null,"",null,"",null,"","",null,null,null,null,"","",null,2,null,null,null,null,null,null,null,null,null,null,null,null,null,221,"Jakar",null,2.25]
["",null,null,"",null,"",null,"",null,"","",null,null,null,null,"","",null,2,null,null,null,null,null,null,null,null,null,null,null,null,null,222,"Jakar",null,2.2599999999999998]
["",null,null,"",null,"",null,"",null,"","",null,null,null,null,"","",null,2,null,null,null,null,null,null,null,null,null,null,null,null,null,223,"Jakar",null,2.27]
["",null,null,"",null,"",null,"",null,"","",null,null,null,null,"","",null,2,null,null,null,null,null,null,null,null,null,null,null,null,null,224,"Jakar",null,2.2799999999999998]
["",null,null,"",null,"",null,"",null,"","",null,null,null,null,"","",null,2,null,null,null,null,null,null,null,null,null,null,null,null,null,225,"Jakar",null,2.29]
["",null,null,"",null,"",null,"",null,"","",null,null,null,null,"","",null,2,null,null,null,null,null,null,null,null,null,null,null,null,null,226,"Jakar",null,2.2999999999999998]
["",null,null,"",null,"",null,"",null,"","",null,null,null,null,"","",null,2,null,null,null,null,null,null,null,null,null,null,null,null,null,227,"Jakar",null,2.31]
["",null,null,"",null,"",null,"",null,"","",null,null,null,null,"","",null,2,null,null,null,null,null,null,null,null,null,null,null,null,null,228,"Jakar",null,2.3199999999999998]
["",null,null,"",null,"",null,"",null,"","",null,null,null,null,"","",null,2,null,null,null,null,null,null,null,null,null,null,null,null,null,229,"Jakar",null,2.33]
["",null,null,"",null,"",null,"",null,"","",null,null,null,null,"","",null,2,null,null,null,null,null,null,null,null,null,null,null,null,null,230,"Jakar",null,2.34]
["",null,null,"",null,"",null,"",null,"","",null,null,null,null,"","",null,2,null,null,null,null,null,null,null,null,null,null,null,null,null,231,"Jakar",null,2.35]
["",null,null,"",null,"",null,"",null,"","",null,null,null,null,"","",null,2,null,null,null,null,null,null,null,null,null,null,null,null,null,232,"Jakar",null,2.36]
["",null,null,"",null,"",null,"",null,"","",null,null,null,null,"","",null,2,null,null,null,null,null,null,null,null,null,null,null,null,null,233,"Jakar",null,2.37]
["",null,null,"",null,"",null,"",null,"","",null,null,null,null,"","",null,2,null,null,null,null,null,null,null,null,null,null,null,null,null,234,"Jakar",null,2.38]
["",null,null,"",null,"",null,"",null,"","",null,null,null,null,"","",null,2,null,null,null,null,null,null,null,null,null,null,null,null,null,235,"Jakar",null,2.39]
["",null,null,"",null,"",null,"",null,"","",null,null,null,null,"","",null,2,null,null,null,null,null,null,null,null,null,null,null,null,null,236,"Jakar",null,2.4]
["",null,null,"",null,"",null,"",null,"","",null,null,null,null,"","",null,2,null,null,null,null,null,null,null,null,null,null,null,null,null,237,"Jakar",null,2.41]
["",null,null,"",null,"",null,"",null,"","",null,null,null,null,"","",null,2,null,null,null,null,null,null,null,null,null,null,null,null,null,238,"Jakar",null,2.42]
["",null,null,"",null,"",null,"",null,"","",null,null,null,null,"","",null,2,null,null,null,null,null,null,null,null,null,null,null,null,null,239,"Jakar",null,2.4300000000000002]
["",null,null,"",null,"",null,"",null,"","",null,null,null,null,"","",null,2,null,null,null,null,null,null,null,null,null,null,null,null,null,240,"Jakar",null,2.44]
["",null,null,"",null,"",null,"",null,"","",null,null,null,null,"","",null,2,null,null,null,null,null,null,null,null,null,null,null,null,null,241,"Jakar",null,2.4500000000000002]
["",null,null,"",null,"",null,"",null,"","",null,null,null,null,"","",null,2,null,null,null,null,null,null,null,null,null,null,null,null,null,242,"Jakar",null,2.46]
["",null,null,"",null,"",null,"",null,"","",null,null,null,null,"","",null,2,null,null,null,null,null,null,null,null,null,null,null,null,null,243,"Jakar",null,2.4700000000000002]
["",null,null,"",null,"",null,"",null,"","",null,null,null,null,"","",null,2,null,null,null,null,null,null,null,null,null,null,null,null,null,244,"Jakar",null,2.48]
["",null,null,"",null,"",null,"",null,"","",null,null,null,null,"","",null,2,null,null,null,null,null,null,null,null,null,null,null,null,null,245,"Jakar",null,2.4900000000000002]
["",null,null,"",null,"",null,"",null,"","",null,null,null,null,"","",null,2,null,null,null,null,null,null,null,null,null,null,null,null,null,246,"Jakar",null,2.5]
["",null,null,"",null,"",null,"",null,"","",null,null,null,null,"","",null,2,null,null,null,null,null,null,null,null,null,null,null,null,null,247,"Jakar",null,2.5099999999999998]
["",null,null,"",null,"",null,"",null,"","",null,null,null,null,"","",null,2,null,null,null,null,null,null,null,null,null,null,null,null,null,248,"Jakar",null,2.52]
["",null,null,"",null,"",null,"",null,"","",null,null,null,null,"","",null,2,null,null,null,null,null,null,null,null,null,null,null,null,null,249,"Jakar",null,2.5299999999999998]
["",null,null,"",null,"",null,"",null,"","",null,null,null,null,"","",null,2,null,null,null,null,null,null,null,null,null,null,null,null,null,250,"Jakar",null,2.54]
["",null,null,"",null,"",null,"",null,"","",null,null,null,null,"","",null,2,null,null,null,null,null,null,null,null,null,null,null,null,null,251,"Jakar",null,2.5499999999999998]
["",null,null,"",null,"",null,"",null,"","",null,null,null,null,"","",null,2,null,null,null,null,null,null,null,null,null,null,null,null,null,252,"Jakar",null,2.56]
["",null,null,"",null,"",null,"",null,"","",null,null,null,null,"","",null,2,null,null,null,null,null,null,null,null,null,null,null,null,null,253,"Jakar",null,2.57]
["",null,null,"",null,"",null,"",null,"","",null,null,null,null,"","",null,2,null,null,null,null,null,null,null,null,null,null,null,null,null,254,"Jakar",null,2.58]
["",null,null,"",null,"",null,"",null,"","",null,null,null,null,"","",null,2,null,null,null,null,null,null,null,null,null,null,null,null,null,255,"Jakar",null,2.59]
["",null,null,"",null,"",null,"",null,"","",null,null,null,null,"","",null,2,null,null,null,null,null,null,null,null,null,null,null,null,null,256,"Jakar",null,2.6]
["",null,null,"",null,"",null,"",null,"","",null,null,null,null,"","",null,2,null,null,null,null,null,null,null,null,null,null,null,null,null,257,"Jakar",null,2.61]
["",null,null,"",null,"",null,"",null,"","",null,null,null,null,"","",null,2,null,null,null,null,null,null,null,null,null,null,null,null,null,258,"Jakar",null,2.62]
[{"$f":"IF(E260=\"\",\"\",IF(A260=\"\",TODAY(),A260))","v":""},null,null,{"$f":"IF(B260=\"\",\"\",(C260-B260))","v":""},null,{"$f":"IFERROR(VLOOKUP(E260,AG259:AI573,2,FALSE),\"\")","v":""},null,{"$f":"IFERROR(G260/D260/24,\"\")","v":""},null,{"$f":"IFERROR(I260/D260/24,\"\")","v":""},{"$f":"IFERROR(L260/D260/24,\"\")","v":""},null,null,null,null,"",{"$f":"IFERROR(ROUND(SUM(L260*P260),2),\"\")","v":""},null,2,null,null,null,null,null,null,null,null,null,null,null,null,null,259,"Jakar",null,2.63]
["",null,null,"",null,"",null,"",null,"","",null,null,null,null,"","",null,2,null,null,null,null,null,null,null,null,null,null,null,null,null,260,"Jakar",null,2.64]
["",null,null,"",null,"",null,"",null,"","",null,null,null,null,"","",null,2,null,null,null,null,null,null,null,null,null,null,null,null,null,261,"Jakar",null,2.65]
["",null,null,"",null,"",null,"",null,"","",null,null,null,null,"","",null,2,null,null,null,null,null,null,null,null,null,null,null,null,null,262,"Jakar",null,2.66]
["",null,null,"",null,"",null,"",null,"","",null,null,null,null,"","",null,2,null,null,null,null,null,null,null,null,null,null,null,null,null,263,"Jakar",null,2.67]
["",null,null,"",null,"",null,"",null,"","",null,null,null,null,"","",null,2,null,null,null,null,null,null,null,null,null,null,null,null,null,264,"Jakar",null,2.68]
["",null,null,"",null,"",null,"",null,"","",null,null,null,null,"","",null,2,null,null,null,null,null,null,null,null,null,null,null,null,null,265,"Jakar",null,2.69]
["",null,null,"",null,"",null,"",null,"","",null,null,null,null,"","",null,2,null,null,null,null,null,null,null,null,null,null,null,null,null,266,"Jakar",null,2.7]
["",null,null,"",null,"",null,"",null,"","",null,null,null,null,"","",null,2,null,null,null,null,null,null,null,null,null,null,null,null,null,267,"Jakar",null,2.71]
["",null,null,"",null,"",null,"",null,"","",null,null,null,null,"","",null,2,null,null,null,null,null,null,null,null,null,null,null,null,null,268,"Jakar",null,2.72]
["",null,null,"",null,"",null,"",null,"","",null,null,null,null,"","",null,2,null,null,null,null,null,null,null,null,null,null,null,null,null,269,"Jakar",null,2.73]
["",null,null,"",null,"",null,"",null,"","",null,null,null,null,"","",null,2,null,null,null,null,null,null,null,null,null,null,null,null,null,270,"Jakar",null,2.74]
["",null,null,"",null,"",null,"",null,"","",null,null,null,null,"","",null,2,null,null,null,null,null,null,null,null,null,null,null,null,null,271,"Jakar",null,2.75]
["",null,null,"",null,"",null,"",null,"","",null,null,null,null,"","",null,2,null,null,null,null,null,null,null,null,null,null,null,null,null,272,"Jakar",null,2.76]
["",null,null,"",null,"",null,"",null,"","",null,null,null,null,"","",null,2,null,null,null,null,null,null,null,null,null,null,null,null,null,273,"Jakar",null,2.77]
["",null,null,"",null,"",null,"",null,"","",null,null,null,null,"","",null,2,null,null,null,null,null,null,null,null,null,null,null,null,null,274,"Jakar",null,2.78]
["",null,null,"",null,"",null,"",null,"","",null,null,null,null,"","",null,2,null,null,null,null,null,null,null,null,null,null,null,null,null,275,"Jakar",null,2.79]
["",null,null,"",null,"",null,"",null,"","",null,null,null,null,"","",null,2,null,null,null,null,null,null,null,null,null,null,null,null,null,276,"Jakar",null,2.8]
["",null,null,"",null,"",null,"",null,"","",null,null,null,null,"","",null,2,null,null,null,null,null,null,null,null,null,null,null,null,null,277,"Jakar",null,2.81]
["",null,null,"",null,"",null,"",null,"","",null,null,null,null,"","",null,2,null,null,null,null,null,null,null,null,null,null,null,null,null,278,"Jakar",null,2.82]
["",null,null,"",null,"",null,"",null,"","",null,null,null,null,"","",null,2,null,null,null,null,null,null,null,null,null,null,null,null,null,279,"Jakar",null,2.83]
["",null,null,"",null,"",null,"",null,"","",null,null,null,null,"","",null,2,null,null,null,null,null,null,null,null,null,null,null,null,null,280,"Jakar",null,2.84]
["",null,null,"",null,"",null,"",null,"","",null,null,null,null,{"$f":"IFERROR(ROUND(SUM(1000/M282),2),\"\")","v":""},"",null,2,null,null,null,null,null,null,null,null,null,null,null,null,null,281,"Jakar",null,2.85]
["",null,null,"",null,"",null,"",null,"","",null,null,null,null,"","",null,2,null,null,null,null,null,null,null,null,null,null,null,null,null,282,"Jakar",null,2.86]
["",null,null,"",null,"",null,"",null,"","",null,null,null,null,"","",null,2,null,null,null,null,null,null,null,null,null,null,null,null,null,283,"Jakar",null,2.87]
["",null,null,"",null,"",null,"",null,"","",null,null,null,null,"","",null,2,null,null,null,null,null,null,null,null,null,null,null,null,null,284,"Jakar",null,2.88]
["",null,null,"",null,"",null,"",null,"","",null,null,null,null,"","",null,2,null,null,null,null,null,null,null,null,null,null,null,null,null,285,"Jakar",null,2.89]
["",null,null,"",null,"",null,"",null,"","",null,null,null,null,"","",null,2,null,null,null,null,null,null,null,null,null,null,null,null,null,286,"Jakar",null,2.9]
["",null,null,"",null,"",null,"",null,"","",null,null,null,null,"","",null,2,null,null,null,null,null,null,null,null,null,null,null,null,null,287,"Jakar",null,2.91]
["",null,null,"",null,"",null,"",null,"","",null,null,null,null,"","",null,2,null,null,null,null,null,null,null,null,null,null,null,null,null,288,"Jakar",null,2.92]
["",null,null,"",null,"",null,"",null,"","",null,null,null,null,"","",null,2,null,null,null,null,null,null,null,null,null,null,null,null,null,289,"Jakar",null,2.93]
["",null,null,"",null,"",null,"",null,"","",null,null,null,null,"","",null,2,null,null,null,null,null,null,null,null,null,null,null,null,null,290,"Jakar",null,2.94]
["",null,null,"",null,"",null,"",null,"","",null,null,null,null,"","",null,2,null,null,null,null,null,null,null,null,null,null,null,null,null,291,"Jakar",null,2.95]
["",null,null,"",null,"",null,"",null,"","",null,null,null,null,"","",null,2,null,null,null,null,null,null,null,null,null,null,null,null,null,292,"Jakar",null,2.96]
["",null,null,"",null,"",null,"",null,"","",null,null,null,null,"","",null,2,null,null,null,null,null,null,null,null,null,null,null,null,null,293,"Jakar",null,2.97]
["",null,null,"",null,"",null,"",null,"","",null,null,null,null,"","",null,2,null,null,null,null,null,null,null,null,null,null,null,null,null,294,"Jakar",null,2.98]
["",null,null,"",null,"",null,"",null,"","",null,null,null,null,"","",null,2,null,null,null,null,null,null,null,null,null,null,null,null,null,295,"Jakar",null,2.99]
["",null,null,"",null,"",null,"",null,"","",null,null,null,null,"","",null,2,null,null,null,null,null,null,null,null,null,null,null,null,null,296,"Jakar",null,3]
["",null,null,"",null,"",null,"",null,"","",null,null,null,null,"","",null,2,null,null,null,null,null,null,null,null,null,null,null,null,null,297,"Jakar",null,3.01]
["",null,null,"",null,"",null,"",null,"","",null,null,null,null,"","",null,2,null,null,null,null,null,null,null,null,null,null,null,null,null,298,"Jakar",null,3.02]
["",null,null,"",null,"",null,"",null,"","",null,null,null,null,"","",null,2,null,null,null,null,null,null,null,null,null,null,null,null,null,299,"Jakar",null,3.03]
["",null,null,"",null,"",null,"",null,"","",null,null,null,null,"","",null,2,null,null,null,null,null,null,null,null,null,null,null,null,null,300,"Jakar",null,3.04]
["",null,null,"",null,"",null,"",null,"","",null,null,null,null,"","",null,2,null,null,null,null,null,null,null,null,null,null,null,null,null,301,"Electric iron",null,3.05]
["",null,null,"",null,"",null,"",null,"","",null,null,null,null,"","",null,2,null,null,null,null,null,null,null,null,null,null,null,null,null,302,"Electric iron",null,3.06]
["",null,null,"",null,"",null,"",null,"","",null,null,null,null,"","",null,2,null,null,null,null,null,null,null,null,null,null,null,null,null,303,"Electric iron",null,3.07]
["",null,null,"",null,"",null,"",null,"","",null,null,null,null,"","",null,2,null,null,null,null,null,null,null,null,null,null,null,null,null,304,"Electric iron",null,3.08]
["",null,null,"",null,"",null,"",null,"","",null,null,null,null,"","",null,2,null,null,null,null,null,null,null,null,null,null,null,null,null,305,"Electric iron",null,3.09]
["",null,null,"",null,"",null,"",null,"","",null,null,null,null,"","",null,2,null,null,null,null,null,null,null,null,null,null,null,null,null,306,"Electric iron",null,3.1]
["",null,null,"",null,"",null,"",null,"","",null,null,null,null,"","",null,2,null,null,null,null,null,null,null,null,null,null,null,null,null,307,"Electric iron",null,3.11]
["",null,null,"",null,"",null,"",null,"","",null,null,null,null,"","",null,2,null,null,null,null,null,null,null,null,null,null,null,null,null,308,"Electric iron",null,3.12]
["",null,null,"",null,"",null,"",null,"","",null,null,null,null,"","",null,2,null,null,null,null,null,null,null,null,null,null,null,null,null,309,"Electric iron",null,3.13]
["",null,null,"",null,"",null,"",null,"","",null,null,null,null,"","",null,2,null,null,null,null,null,null,null,null,null,null,null,null,null,310,"Electric iron",null,3.14]
["",null,null,"",null,"",null,"",null,"","",null,null,null,null,"","",null,2,null,null,null,null,null,null,null,null,null,null,null,null,null,311,"Electric iron",null,3.15]
["",null,null,"",null,"",null,"",null,"","",null,null,null,null,"","",null,2,null,null,null,null,null,null,null,null,null,null,null,null,null,312,"Electric iron",null,3.16]
["",null,null,"",null,"",null,"",null,"","",null,null,null,null,"","",null,2,null,null,null,null,null,null,null,null,null,null,null,null,null,313,"Electric iron",null,3.17]
["",null,null,"",null,"",null,"",null,"","",null,null,null,null,"","",null,2,null,null,null,null,null,null,null,null,null,null,null,null,null,314,"Electric iron",null,3.18]
["",null,null,"",null,"",null,"",null,"","",null,null,null,null,"","",null,2,null,null,null,null,null,null,null,null,null,null,null,null,null,315,"Electric iron",null,3.19]
["",null,null,"",null,"",null,"",null,"","",null,null,null,null,"","",null,2,null,null,null,null,null,null,null,null,null,null,null,null,null,null,null,null,3.2]
["",null,null,"",null,"",null,"",null,"","",null,null,null,null,"","",null,2,null,null,null,null,null,null,null,null,null,null,null,null,null,null,null,null,3.21]
["",null,null,"",null,"",null,"",null,"","",null,null,null,null,"","",null,2,null,null,null,null,null,null,null,null,null,null,null,null,null,null,null,null,3.22]
["",null,null,"",null,"",null,"",null,"","",null,null,null,null,"","",null,2,null,null,null,null,null,null,null,null,null,null,null,null,null,null,null,null,3.23]
["",null,null,"",null,"",null,"",null,"","",null,null,null,null,"","",null,2,null,null,null,null,null,null,null,null,null,null,null,null,null,null,null,null,3.24]
["",null,null,"",null,"",null,"",null,"","",null,null,null,null,"","",null,2,null,null,null,null,null,null,null,null,null,null,null,null,null,null,null,null,3.25]
["",null,null,"",null,"",null,"",null,"","",null,null,null,null,"","",null,2,null,null,null,null,null,null,null,null,null,null,null,null,null,null,null,null,3.26]
[{"$f":"IF(E324=\"\",\"\",IF(A324=\"\",TODAY(),A324))","v":""},null,null,{"$f":"IF(B324=\"\",\"\",(C324-B324))","v":""},null,{"$f":"IFERROR(VLOOKUP(E324,AG323:AI637,2,FALSE),\"\")","v":""},null,{"$f":"IFERROR(G324/D324/24,\"\")","v":""},null,{"$f":"IFERROR(I324/D324/24,\"\")","v":""},{"$f":"IFERROR(L324/D324/24,\"\")","v":""},null,null,null,null,"",{"$f":"IFERROR(ROUND(SUM(L324*P324),2),\"\")","v":""},null,2,null,null,null,null,null,null,null,null,null,null,null,null,null,null,null,null,3.27]
["",null,null,"",null,"",null,"",null,"","",null,null,null,null,"","",null,2,null,null,null,null,null,null,null,null,null,null,null,null,null,null,null,null,3.28]
["",null,null,"",null,"",null,"",null,"","",null,null,null,null,"","",null,2,null,null,null,null,null,null,null,null,null,null,null,null,null,null,null,null,3.29]
["",null,null,"",null,"",null,"",null,"","",null,null,null,null,"","",null,2,null,null,null,null,null,null,null,null,null,null,null,null,null,null,null,null,3.3]
["",null,null,"",null,"",null,"",null,"","",null,null,null,null,"","",null,2,null,null,null,null,null,null,null,null,null,null,null,null,null,null,null,null,3.31]
["",null,null,"",null,"",null,"",null,"","",null,null,null,null,"","",null,2,null,null,null,null,null,null,null,null,null,null,null,null,null,null,null,null,3.32]
["",null,null,"",null,"",null,"",null,"","",null,null,null,null,"","",null,2,null,null,null,null,null,null,null,null,null,null,null,null,null,null,null,null,3.33]
["",null,null,"",null,"",null,"",null,"","",null,null,null,null,"","",null,2,null,null,null,null,null,null,null,null,null,null,null,null,null,null,null,null,3.34]
["",null,null,"",null,"",null,"",null,"","",null,null,null,null,"","",null,2,null,null,null,null,null,null,null,null,null,null,null,null,null,null,null,null,3.35]
["",null,null,"",null,"",null,"",null,"","",null,null,null,null,"","",null,2,null,null,null,null,null,null,null,null,null,null,null,null,null,null,null,null,3.36]
["",null,null,"",null,"",null,"",null,"","",null,null,null,null,"","",null,2,null,null,null,null,null,null,null,null,null,null,null,null,null,null,null,null,3.37]
["",null,null,"",null,"",null,"",null,"","",null,null,null,null,"","",null,2,null,null,null,null,null,null,null,null,null,null,null,null,null,null,null,null,3.38]
["",null,null,"",null,"",null,"",null,"","",null,null,null,null,"","",null,2,null,null,null,null,null,null,null,null,null,null,null,null,null,null,null,null,3.39]
["",null,null,"",null,"",null,"",null,"","",null,null,null,null,"","",null,2,null,null,null,null,null,null,null,null,null,null,null,null,null,null,null,null,3.4]
["",null,null,"",null,"",null,"",null,"","",null,null,null,null,"","",null,2,null,null,null,null,null,null,null,null,null,null,null,null,null,null,null,null,3.41]
["",null,null,"",null,"",null,"",null,"","",null,null,null,null,"","",null,2,null,null,null,null,null,null,null,null,null,null,null,null,null,null,null,null,3.42]
["",null,null,"",null,"",null,"",null,"","",null,null,null,null,"","",null,2,null,null,null,null,null,null,null,null,null,null,null,null,null,null,null,null,3.43]
["",null,null,"",null,"",null,"",null,"","",null,null,null,null,"","",null,2,null,null,null,null,null,null,null,null,null,null,null,null,null,null,null,null,3.44]
["",null,null,"",null,"",null,"",null,"","",null,null,null,null,"","",null,2,null,null,null,null,null,null,null,null,null,null,null,null,null,null,null,null,3.45]
["",null,null,"",null,"",null,"",null,"","",null,null,null,null,"","",null,2,null,null,null,null,null,null,null,null,null,null,null,null,null,null,null,null,3.46]
["",null,null,"",null,"",null,"",null,"","",null,null,null,null,"","",null,2,null,null,null,null,null,null,null,null,null,null,null,null,null,null,null,null,3.47]
["",null,null,"",null,"",null,"",null,"","",null,null,null,null,"","",null,2,null,null,null,null,null,null,null,null,null,null,null,null,null,null,null,null,3.48]
["",null,null,"",null,"",null,"",null,"","",null,null,null,null,{"$f":"IFERROR(ROUND(SUM(1000/M346),2),\"\")","v":""},"",null,2,null,null,null,null,null,null,null,null,null,null,null,null,null,null,null,null,3.49]
["",null,null,"",null,"",null,"",null,"","",null,null,null,null,"","",null,2,null,null,null,null,null,null,null,null,null,null,null,null,null,null,null,null,3.5]
["",null,null,"",null,"",null,"",null,"","",null,null,null,null,"","",null,2,null,null,null,null,null,null,null,null,null,null,null,null,null,null,null,null,3.51]
["",null,null,"",null,"",null,"",null,"","",null,null,null,null,"","",null,2,null,null,null,null,null,null,null,null,null,null,null,null,null,null,null,null,3.52]
["",null,null,"",null,"",null,"",null,"","",null,null,null,null,"","",null,2,null,null,null,null,null,null,null,null,null,null,null,null,null,null,null,null,3.53]
["",null,null,"",null,"",null,"",null,"","",null,null,null,null,"","",null,2,null,null,null,null,null,null,null,null,null,null,null,null,null,null,null,null,3.54]
["",null,null,"",null,"",null,"",null,"","",null,null,null,null,"","",null,2,null,null,null,null,null,null,null,null,null,null,null,null,null,null,null,null,3.55]
["",null,null,"",null,"",null,"",null,"","",null,null,null,null,"","",null,2,null,null,null,null,null,null,null,null,null,null,null,null,null,null,null,null,3.56]
["",null,null,"",null,"",null,"",null,"","",null,null,null,null,"","",null,2,null,null,null,null,null,null,null,null,null,null,null,null,null,null,null,null,3.57]
["",null,null,"",null,"",null,"",null,"","",null,null,null,null,"","",null,2,null,null,null,null,null,null,null,null,null,null,null,null,null,null,null,null,3.58]
["",null,null,"",null,"",null,"",null,"","",null,null,null,null,"","",null,2,null,null,null,null,null,null,null,null,null,null,null,null,null,null,null,null,3.59]
["",null,null,"",null,"",null,"",null,"","",null,null,null,null,"","",null,2,null,null,null,null,null,null,null,null,null,null,null,null,null,null,null,null,3.6]
["",null,null,"",null,"",null,"",null,"","",null,null,null,null,"","",null,2,null,null,null,null,null,null,null,null,null,null,null,null,null,null,null,null,3.61]
["",null,null,"",null,"",null,"",null,"","",null,null,null,null,"","",null,2,null,null,null,null,null,null,null,null,null,null,null,null,null,null,null,null,3.62]
["",null,null,"",null,"",null,"",null,"","",null,null,null,null,"","",null,2,null,null,null,null,null,null,null,null,null,null,null,null,null,null,null,null,3.63]
["",null,null,"",null,"",null,"",null,"","",null,null,null,null,"","",null,2,null,null,null,null,null,null,null,null,null,null,null,null,null,null,null,null,3.64]
["",null,null,"",null,"",null,"",null,"","",null,null,null,null,"","",null,2,null,null,null,null,null,null,null,null,null,null,null,null,null,null,null,null,3.65]
["",null,null,"",null,"",null,"",null,"","",null,null,null,null,"","",null,2,null,null,null,null,null,null,null,null,null,null,null,null,null,null,null,null,3.66]
["",null,null,"",null,"",null,"",null,"","",null,null,null,null,"","",null,2,null,null,null,null,null,null,null,null,null,null,null,null,null,null,null,null,3.67]
["",null,null,"",null,"",null,"",null,"","",null,null,null,null,"","",null,2,null,null,null,null,null,null,null,null,null,null,null,null,null,null,null,null,3.68]
["",null,null,"",null,"",null,"",null,"","",null,null,null,null,"","",null,2,null,null,null,null,null,null,null,null,null,null,null,null,null,null,null,null,3.69]
["",null,null,"",null,"",null,"",null,"","",null,null,null,null,"","",null,2,null,null,null,null,null,null,null,null,null,null,null,null,null,null,null,null,3.7]
["",null,null,"",null,"",null,"",null,"","",null,null,null,null,"","",null,2,null,null,null,null,null,null,null,null,null,null,null,null,null,null,null,null,3.71]
["",null,null,"",null,"",null,"",null,"","",null,null,null,null,"","",null,2,null,null,null,null,null,null,null,null,null,null,null,null,null,null,null,null,3.72]
["",null,null,"",null,"",null,"",null,"","",null,null,null,null,"","",null,2,null,null,null,null,null,null,null,null,null,null,null,null,null,null,null,null,3.73]
["",null,null,"",null,"",null,"",null,"","",null,null,null,null,"","",null,2,null,null,null,null,null,null,null,null,null,null,null,null,null,null,null,null,3.74]
["",null,null,"",null,"",null,"",null,"","",null,null,null,null,"","",null,2,null,null,null,null,null,null,null,null,null,null,null,null,null,null,null,null,3.75]
["",null,null,"",null,"",null,"",null,"","",null,null,null,null,"","",null,2,null,null,null,null,null,null,null,null,null,null,null,null,null,null,null,null,3.76]
["",null,null,"",null,"",null,"",null,"","",null,null,null,null,"","",null,2,null,null,null,null,null,null,null,null,null,null,null,null,null,null,null,null,3.77]
["",null,null,"",null,"",null,"",null,"","",null,null,null,null,"","",null,2,null,null,null,null,null,null,null,null,null,null,null,null,null,null,null,null,3.78]
["",null,null,"",null,"",null,"",null,"","",null,null,null,null,"","",null,2,null,null,null,null,null,null,null,null,null,null,null,null,null,null,null,null,3.79]
["",null,null,"",null,"",null,"",null,"","",null,null,null,null,"","",null,2,null,null,null,null,null,null,null,null,null,null,null,null,null,null,null,null,3.8]
["",null,null,"",null,"",null,"",null,"","",null,null,null,null,"","",null,2,null,null,null,null,null,null,null,null,null,null,null,null,null,null,null,null,3.81]
["",null,null,"",null,"",null,"",null,"","",null,null,null,null,"","",null,2,null,null,null,null,null,null,null,null,null,null,null,null,null,null,null,null,3.82]
["",null,null,"",null,"",null,"",null,"","",null,null,null,null,"","",null,2,null,null,null,null,null,null,null,null,null,null,null,null,null,null,null,null,3.83]
["",null,null,"",null,"",null,"",null,"","",null,null,null,null,"","",null,2,null,null,null,null,null,null,null,null,null,null,null,null,null,null,null,null,3.84]
["",null,null,"",null,"",null,"",null,"","",null,null,null,null,"","",null,2,null,null,null,null,null,null,null,null,null,null,null,null,null,null,null,null,3.85]
["",null,null,"",null,"",null,"",null,"","",null,null,null,null,"","",null,2,null,null,null,null,null,null,null,null,null,null,null,null,null,null,null,null,3.86]
["",null,null,"",null,"",null,"",null,"","",null,null,null,null,"","",null,2,null,null,null,null,null,null,null,null,null,null,null,null,null,null,null,null,3.87]
["",null,null,"",null,"",null,"",null,"","",null,null,null,null,"","",null,2,null,null,null,null,null,null,null,null,null,null,null,null,null,null,null,null,3.88]
["",null,null,"",null,"",null,"",null,"","",null,null,null,null,"","",null,2,null,null,null,null,null,null,null,null,null,null,null,null,null,null,null,null,3.89]
["",null,null,"",null,"",null,"",null,"","",null,null,null,null,"","",null,2,null,null,null,null,null,null,null,null,null,null,null,null,null,null,null,null,3.9]
[{"$f":"IF(E388=\"\",\"\",IF(A388=\"\",TODAY(),A388))","v":""},null,null,{"$f":"IF(B388=\"\",\"\",(C388-B388))","v":""},null,{"$f":"IFERROR(VLOOKUP(E388,AG387:AI701,2,FALSE),\"\")","v":""},null,{"$f":"IFERROR(G388/D388/24,\"\")","v":""},null,{"$f":"IFERROR(I388/D388/24,\"\")","v":""},{"$f":"IFERROR(L388/D388/24,\"\")","v":""},null,null,null,null,"",{"$f":"IFERROR(ROUND(SUM(L388*P388),2),\"\")","v":""},null,2,null,null,null,null,null,null,null,null,null,null,null,null,null,null,null,null,3.91]
["",null,null,"",null,"",null,"",null,"","",null,null,null,null,"","",null,2,null,null,null,null,null,null,null,null,null,null,null,null,null,null,null,null,3.92]
["",null,null,"",null,"",null,"",null,"","",null,null,null,null,"","",null,2,null,null,null,null,null,null,null,null,null,null,null,null,null,null,null,null,3.93]
["",null,null,"",null,"",null,"",null,"","",null,null,null,null,"","",null,2,null,null,null,null,null,null,null,null,null,null,null,null,null,null,null,null,3.94]
["",null,null,"",null,"",null,"",null,"","",null,null,null,null,"","",null,2,null,null,null,null,null,null,null,null,null,null,null,null,null,null,null,null,3.95]
["",null,null,"",null,"",null,"",null,"","",null,null,null,null,"","",null,2,null,null,null,null,null,null,null,null,null,null,null,null,null,null,null,null,3.96]
["",null,null,"",null,"",null,"",null,"","",null,null,null,null,"","",null,2,null,null,null,null,null,null,null,null,null,null,null,null,null,null,null,null,3.97]
["",null,null,"",null,"",null,"",null,"","",null,null,null,null,"","",null,2,null,null,null,null,null,null,null,null,null,null,null,null,null,null,null,null,3.98]
["",null,null,"",null,"",null,"",null,"","",null,null,null,null,"","",null,2,null,null,null,null,null,null,null,null,null,null,null,null,null,null,null,null,3.99]
["",null,null,"",null,"",null,"",null,"","",null,null,null,null,"","",null,2,null,null,null,null,null,null,null,null,null,null,null,null,null,null,null,null,4]
["",null,null,"",null,"",null,"",null,"","",null,null,null,null,"","",null,2,null,null,null,null,null,null,null,null,null,null,null,null,null,null,null,null,4.01]
["",null,null,"",null,"",null,"",null,"","",null,null,null,null,"","",null,2,null,null,null,null,null,null,null,null,null,null,null,null,null,null,null,null,4.0199999999999996]
["",null,null,"",null,"",null,"",null,"","",null,null,null,null,"","",null,2,null,null,null,null,null,null,null,null,null,null,null,null,null,null,null,null,4.03]
["",null,null,"",null,"",null,"",null,"","",null,null,null,null,"","",null,2,null,null,null,null,null,null,null,null,null,null,null,null,null,null,null,null,4.04]
["",null,null,"",null,"",null,"",null,"","",null,null,null,null,"","",null,2,null,null,null,null,null,null,null,null,null,null,null,null,null,null,null,null,4.05]
["",null,null,"",null,"",null,"",null,"","",null,null,null,null,"","",null,2,null,null,null,null,null,null,null,null,null,null,null,null,null,null,null,null,4.0599999999999996]
["",null,null,"",null,"",null,"",null,"","",null,null,null,null,"","",null,2,null,null,null,null,null,null,null,null,null,null,null,null,null,null,null,null,4.07]
["",null,null,"",null,"",null,"",null,"","",null,null,null,null,"","",null,2,null,null,null,null,null,null,null,null,null,null,null,null,null,null,null,null,4.08]
["",null,null,"",null,"",null,"",null,"","",null,null,null,null,"","",null,2,null,null,null,null,null,null,null,null,null,null,null,null,null,null,null,null,4.09]
["",null,null,"",null,"",null,"",null,"","",null,null,null,null,"","",null,2,null,null,null,null,null,null,null,null,null,null,null,null,null,null,null,null,4.0999999999999996]
["",null,null,"",null,"",null,"",null,"","",null,null,null,null,"","",null,2,null,null,null,null,null,null,null,null,null,null,null,null,null,null,null,null,4.1100000000000003]
["",null,null,"",null,"",null,"",null,"","",null,null,null,null,"","",null,2,null,null,null,null,null,null,null,null,null,null,null,null,null,null,null,null,4.12]
["",null,null,"",null,"",null,"",null,"","",null,null,null,null,{"$f":"IFERROR(ROUND(SUM(1000/M410),2),\"\")","v":""},"",null,2,null,null,null,null,null,null,null,null,null,null,null,null,null,null,null,null,4.13]
["",null,null,"",null,"",null,"",null,"","",null,null,null,null,"","",null,2,null,null,null,null,null,null,null,null,null,null,null,null,null,null,null,null,4.1399999999999997]
["",null,null,"",null,"",null,"",null,"","",null,null,null,null,"","",null,2,null,null,null,null,null,null,null,null,null,null,null,null,null,null,null,null,4.1500000000000004]
["",null,null,"",null,"",null,"",null,"","",null,null,null,null,"","",null,2,null,null,null,null,null,null,null,null,null,null,null,null,null,null,null,null,4.16]
["",null,null,"",null,"",null,"",null,"","",null,null,null,null,"","",null,2,null,null,null,null,null,null,null,null,null,null,null,null,null,null,null,null,4.17]
["",null,null,"",null,"",null,"",null,"","",null,null,null,null,"","",null,2,null,null,null,null,null,null,null,null,null,null,null,null,null,null,null,null,4.18]
["",null,null,"",null,"",null,"",null,"","",null,null,null,null,"","",null,2,null,null,null,null,null,null,null,null,null,null,null,null,null,null,null,null,4.1900000000000004]
["",null,null,"",null,"",null,"",null,"","",null,null,null,null,"","",null,2,null,null,null,null,null,null,null,null,null,null,null,null,null,null,null,null,4.2]
["",null,null,"",null,"",null,"",null,"","",null,null,null,null,"","",null,2,null,null,null,null,null,null,null,null,null,null,null,null,null,null,null,null,4.21]
["",null,null,"",null,"",null,"",null,"","",null,null,null,null,"","",null,2,null,null,null,null,null,null,null,null,null,null,null,null,null,null,null,null,4.22]
["",null,null,"",null,"",null,"",null,"","",null,null,null,null,"","",null,2,null,null,null,null,null,null,null,null,null,null,null,null,null,null,null,null,4.2300000000000004]
["",null,null,"",null,"",null,"",null,"","",null,null,null,null,"","",null,2,null,null,null,null,null,null,null,null,null,null,null,null,null,null,null,null,4.24]
["",null,null,"",null,"",null,"",null,"","",null,null,null,null,"","",null,2,null,null,null,null,null,null,null,null,null,null,null,null,null,null,null,null,4.25]
["",null,null,"",null,"",null,"",null,"","",null,null,null,null,"","",null,2,null,null,null,null,null,null,null,null,null,null,null,null,null,null,null,null,4.26]
["",null,null,"",null,"",null,"",null,"","",null,null,null,null,"","",null,2,null,null,null,null,null,null,null,null,null,null,null,null,null,null,null,null,4.2699999999999996]
["",null,null,"",null,"",null,"",null,"","",null,null,null,null,"","",null,2,null,null,null,null,null,null,null,null,null,null,null,null,null,null,null,null,4.28]
["",null,null,"",null,"",null,"",null,"","",null,null,null,null,"","",null,2,null,null,null,null,null,null,null,null,null,null,null,null,null,null,null,null,4.29]
["",null,null,"",null,"",null,"",null,"","",null,null,null,null,"","",null,2,null,null,null,null,null,null,null,null,null,null,null,null,null,null,null,null,4.3]
["",null,null,"",null,"",null,"",null,"","",null,null,null,null,"","",null,2,null,null,null,null,null,null,null,null,null,null,null,null,null,null,null,null,4.3099999999999996]
["",null,null,"",null,"",null,"",null,"","",null,null,null,null,"","",null,2,null,null,null,null,null,null,null,null,null,null,null,null,null,null,null,null,4.32]
["",null,null,"",null,"",null,"",null,"","",null,null,null,null,"","",null,2,null,null,null,null,null,null,null,null,null,null,null,null,null,null,null,null,4.33]
["",null,null,"",null,"",null,"",null,"","",null,null,null,null,"","",null,2,null,null,null,null,null,null,null,null,null,null,null,null,null,null,null,null,4.34]
["",null,null,"",null,"",null,"",null,"","",null,null,null,null,"","",null,2,null,null,null,null,null,null,null,null,null,null,null,null,null,null,null,null,4.3499999999999996]
["",null,null,"",null,"",null,"",null,"","",null,null,null,null,"","",null,2,null,null,null,null,null,null,null,null,null,null,null,null,null,null,null,null,4.3600000000000003]
["",null,null,"",null,"",null,"",null,"","",null,null,null,null,"","",null,2,null,null,null,null,null,null,null,null,null,null,null,null,null,null,null,null,4.37]
["",null,null,"",null,"",null,"",null,"","",null,null,null,null,"","",null,2,null,null,null,null,null,null,null,null,null,null,null,null,null,null,null,null,4.38]
["",null,null,"",null,"",null,"",null,"","",null,null,null,null,"","",null,2,null,null,null,null,null,null,null,null,null,null,null,null,null,null,null,null,4.3899999999999997]
["",null,null,"",null,"",null,"",null,"","",null,null,null,null,"","",null,2,null,null,null,null,null,null,null,null,null,null,null,null,null,null,null,null,4.4000000000000004]
["",null,null,"",null,"",null,"",null,"","",null,null,null,null,"","",null,2,null,null,null,null,null,null,null,null,null,null,null,null,null,null,null,null,4.41]
["",null,null,"",null,"",null,"",null,"","",null,null,null,null,"","",null,2,null,null,null,null,null,null,null,null,null,null,null,null,null,null,null,null,4.42]
["",null,null,"",null,"",null,"",null,"","",null,null,null,null,"","",null,2,null,null,null,null,null,null,null,null,null,null,null,null,null,null,null,null,4.43]
["",null,null,"",null,"",null,"",null,"","",null,null,null,null,"","",null,2,null,null,null,null,null,null,null,null,null,null,null,null,null,null,null,null,4.4400000000000004]
["",null,null,"",null,"",null,"",null,"","",null,null,null,null,"","",null,2,null,null,null,null,null,null,null,null,null,null,null,null,null,null,null,null,4.45]
["",null,null,"",null,"",null,"",null,"","",null,null,null,null,"","",null,2,null,null,null,null,null,null,null,null,null,null,null,null,null,null,null,null,4.46]
["",null,null,"",null,"",null,"",null,"","",null,null,null,null,"","",null,2,null,null,null,null,null,null,null,null,null,null,null,null,null,null,null,null,4.47]
["",null,null,"",null,"",null,"",null,"","",null,null,null,null,"","",null,2,null,null,null,null,null,null,null,null,null,null,null,null,null,null,null,null,4.4800000000000004]
["",null,null,"",null,"",null,"",null,"","",null,null,null,null,"","",null,2,null,null,null,null,null,null,null,null,null,null,null,null,null,null,null,null,4.49]
["",null,null,"",null,"",null,"",null,"","",null,null,null,null,"","",null,2,null,null,null,null,null,null,null,null,null,null,null,null,null,null,null,null,4.5]
["",null,null,"",null,"",null,"",null,"","",null,null,null,null,"","",null,2,null,null,null,null,null,null,null,null,null,null,null,null,null,null,null,null,4.51]
["",null,null,"",null,"",null,"",null,"","",null,null,null,null,"","",null,2,null,null,null,null,null,null,null,null,null,null,null,null,null,null,null,null,4.5199999999999996]
["",null,null,"",null,"",null,"",null,"","",null,null,null,null,"","",null,2,null,null,null,null,null,null,null,null,null,null,null,null,null,null,null,null,4.53]
["",null,null,"",null,"",null,"",null,"","",null,null,null,null,"","",null,2,null,null,null,null,null,null,null,null,null,null,null,null,null,null,null,null,4.54]
[{"$f":"IF(E452=\"\",\"\",IF(A452=\"\",TODAY(),A452))","v":""},null,null,{"$f":"IF(B452=\"\",\"\",(C452-B452))","v":""},null,{"$f":"IFERROR(VLOOKUP(E452,AG451:AI765,2,FALSE),\"\")","v":""},null,{"$f":"IFERROR(G452/D452/24,\"\")","v":""},null,{"$f":"IFERROR(I452/D452/24,\"\")","v":""},{"$f":"IFERROR(L452/D452/24,\"\")","v":""},null,null,null,null,"",{"$f":"IFERROR(ROUND(SUM(L452*P452),2),\"\")","v":""},null,2,null,null,null,null,null,null,null,null,null,null,null,null,null,null,null,null,4.55]
["",null,null,"",null,"",null,"",null,"","",null,null,null,null,"","",null,2,null,null,null,null,null,null,null,null,null,null,null,null,null,null,null,null,4.5599999999999996]
["",null,null,"",null,"",null,"",null,"","",null,null,null,null,"","",null,2,null,null,null,null,null,null,null,null,null,null,null,null,null,null,null,null,4.57]
["",null,null,"",null,"",null,"",null,"","",null,null,null,null,"","",null,2,null,null,null,null,null,null,null,null,null,null,null,null,null,null,null,null,4.58]
["",null,null,"",null,"",null,"",null,"","",null,null,null,null,"","",null,2,null,null,null,null,null,null,null,null,null,null,null,null,null,null,null,null,4.59]
["",null,null,"",null,"",null,"",null,"","",null,null,null,null,"","",null,2,null,null,null,null,null,null,null,null,null,null,null,null,null,null,null,null,4.5999999999999996]
["",null,null,"",null,"",null,"",null,"","",null,null,null,null,"","",null,2,null,null,null,null,null,null,null,null,null,null,null,null,null,null,null,null,4.6100000000000003]
["",null,null,"",null,"",null,"",null,"","",null,null,null,null,"","",null,2,null,null,null,null,null,null,null,null,null,null,null,null,null,null,null,null,4.62]
["",null,null,"",null,"",null,"",null,"","",null,null,null,null,"","",null,2,null,null,null,null,null,null,null,null,null,null,null,null,null,null,null,null,4.63]
["",null,null,"",null,"",null,"",null,"","",null,null,null,null,"","",null,2,null,null,null,null,null,null,null,null,null,null,null,null,null,null,null,null,4.6399999999999997]
["",null,null,"",null,"",null,"",null,"","",null,null,null,null,"","",null,2,null,null,null,null,null,null,null,null,null,null,null,null,null,null,null,null,4.6500000000000004]
["",null,null,"",null,"",null,"",null,"","",null,null,null,null,"","",null,2,null,null,null,null,null,null,null,null,null,null,null,null,null,null,null,null,4.66]
["",null,null,"",null,"",null,"",null,"","",null,null,null,null,"","",null,2,null,null,null,null,null,null,null,null,null,null,null,null,null,null,null,null,4.67]
["",null,null,"",null,"",null,"",null,"","",null,null,null,null,"","",null,2,null,null,null,null,null,null,null,null,null,null,null,null,null,null,null,null,4.68]
["",null,null,"",null,"",null,"",null,"","",null,null,null,null,"","",null,2,null,null,null,null,null,null,null,null,null,null,null,null,null,null,null,null,4.6900000000000004]
["",null,null,"",null,"",null,"",null,"","",null,null,null,null,"","",null,2,null,null,null,null,null,null,null,null,null,null,null,null,null,null,null,null,4.7]
["",null,null,"",null,"",null,"",null,"","",null,null,null,null,"","",null,2,null,null,null,null,null,null,null,null,null,null,null,null,null,null,null,null,4.71]
["",null,null,"",null,"",null,"",null,"","",null,null,null,null,"","",null,2,null,null,null,null,null,null,null,null,null,null,null,null,null,null,null,null,4.72]
["",null,null,"",null,"",null,"",null,"","",null,null,null,null,"","",null,2,null,null,null,null,null,null,null,null,null,null,null,null,null,null,null,null,4.7300000000000004]
["",null,null,"",null,"",null,"",null,"","",null,null,null,null,"","",null,2,null,null,null,null,null,null,null,null,null,null,null,null,null,null,null,null,4.74]
["",null,null,"",null,"",null,"",null,"","",null,null,null,null,"","",null,2,null,null,null,null,null,null,null,null,null,null,null,null,null,null,null,null,4.75]
["",null,null,"",null,"",null,"",null,"","",null,null,null,null,"","",null,2,null,null,null,null,null,null,null,null,null,null,null,null,null,null,null,null,4.76]
["",null,null,"",null,"",null,"",null,"","",null,null,null,null,{"$f":"IFERROR(ROUND(SUM(1000/M474),2),\"\")","v":""},"",null,2,null,null,null,null,null,null,null,null,null,null,null,null,null,null,null,null,4.7699999999999996]
["",null,null,"",null,"",null,"",null,"","",null,null,null,null,"","",null,2,null,null,null,null,null,null,null,null,null,null,null,null,null,null,null,null,4.78]
["",null,null,"",null,"",null,"",null,"","",null,null,null,null,"","",null,2,null,null,null,null,null,null,null,null,null,null,null,null,null,null,null,null,4.79]
["",null,null,"",null,"",null,"",null,"","",null,null,null,null,"","",null,2,null,null,null,null,null,null,null,null,null,null,null,null,null,null,null,null,4.8]
["",null,null,"",null,"",null,"",null,"","",null,null,null,null,"","",null,2,null,null,null,null,null,null,null,null,null,null,null,null,null,null,null,null,4.8099999999999996]
["",null,null,"",null,"",null,"",null,"","",null,null,null,null,"","",null,2,null,null,null,null,null,null,null,null,null,null,null,null,null,null,null,null,4.82]
["",null,null,"",null,"",null,"",null,"","",null,null,null,null,"","",null,2,null,null,null,null,null,null,null,null,null,null,null,null,null,null,null,null,4.83]
["",null,null,"",null,"",null,"",null,"","",null,null,null,null,"","",null,2,null,null,null,null,null,null,null,null,null,null,null,null,null,null,null,null,4.84]
["",null,null,"",null,"",null,"",null,"","",null,null,null,null,"","",null,2,null,null,null,null,null,null,null,null,null,null,null,null,null,null,null,null,4.8499999999999996]
["",null,null,"",null,"",null,"",null,"","",null,null,null,null,"","",null,2,null,null,null,null,null,null,null,null,null,null,null,null,null,null,null,null,4.8600000000000003]
["",null,null,"",null,"",null,"",null,"","",null,null,null,null,"","",null,2,null,null,null,null,null,null,null,null,null,null,null,null,null,null,null,null,4.87]
["",null,null,"",null,"",null,"",null,"","",null,null,null,null,"","",null,2,null,null,null,null,null,null,null,null,null,null,null,null,null,null,null,null,4.88]
["",null,null,"",null,"",null,"",null,"","",null,null,null,null,"","",null,2,null,null,null,null,null,null,null,null,null,null,null,null,null,null,null,null,4.8899999999999997]
["",null,null,"",null,"",null,"",null,"","",null,null,null,null,"","",null,2,null,null,null,null,null,null,null,null,null,null,null,null,null,null,null,null,4.9000000000000004]
["",null,null,"",null,"",null,"",null,"","",null,null,null,null,"","",null,2,null,null,null,null,null,null,null,null,null,null,null,null,null,null,null,null,4.91]
["",null,null,"",null,"",null,"",null,"","",null,null,null,null,"","",null,2,null,null,null,null,null,null,null,null,null,null,null,null,null,null,null,null,4.92]
["",null,null,"",null,"",null,"",null,"","",null,null,null,null,"","",null,2,null,null,null,null,null,null,null,null,null,null,null,null,null,null,null,null,4.93]
["",null,null,"",null,"",null,"",null,"","",null,null,null,null,"","",null,2,null,null,null,null,null,null,null,null,null,null,null,null,null,null,null,null,4.9400000000000004]
["",null,null,"",null,"",null,"",null,"","",null,null,null,null,"","",null,2,null,null,null,null,null,null,null,null,null,null,null,null,null,null,null,null,4.95]
["",null,null,"",null,"",null,"",null,"","",null,null,null,null,"","",null,2,null,null,null,null,null,null,null,null,null,null,null,null,null,null,null,null,4.96]
["",null,null,"",null,"",null,"",null,"","",null,null,null,null,"","",null,2,null,null,null,null,null,null,null,null,null,null,null,null,null,null,null,null,4.97]
["",null,null,"",null,"",null,"",null,"","",null,null,null,null,"","",null,2,null,null,null,null,null,null,null,null,null,null,null,null,null,null,null,null,4.9800000000000004]
["",null,null,"",null,"",null,"",null,"","",null,null,null,null,"","",null,2,null,null,null,null,null,null,null,null,null,null,null,null,null,null,null,null,4.99]
["",null,null,"",null,"",null,"",null,"","",null,null,null,null,"","",null,2,null,null,null,null,null,null,null,null,null,null,null,null,null,null,null,null,5]
["",null,null,"",null,"",null,"",null,"","",null,null,null,null,"","",null,2,null,null,null,null,null,null,null,null,null,null,null,null,null,null,null,null,5.01]
["",null,null,"",null,"",null,"",null,"","",null,null,null,null,"","",null,2,null,null,null,null,null,null,null,null,null,null,null,null,null,null,null,null,5.0199999999999996]
["",null,null,"",null,"",null,"",null,"","",null,null,null,null,"","",null,2,null,null,null,null,null,null,null,null,null,null,null,null,null,null,null,null,5.03]
["",null,null,"",null,"",null,"",null,"","",null,null,null,null,"","",null,2,null,null,null,null,null,null,null,null,null,null,null,null,null,null,null,null,5.04]
["",null,null,"",null,"",null,"",null,"","",null,null,null,null,"","",null,2,null,null,null,null,null,null,null,null,null,null,null,null,null,null,null,null,5.05]
["",null,null,"",null,"",null,"",null,"","",null,null,null,null,"","",null,2,null,null,null,null,null,null,null,null,null,null,null,null,null,null,null,null,5.0599999999999996]
["",null,null,"",null,"",null,"",null,"","",null,null,null,null,"","",null,2,null,null,null,null,null,null,null,null,null,null,null,null,null,null,null,null,5.07]
["",null,null,"",null,"",null,"",null,"","",null,null,null,null,"","",null,2,null,null,null,null,null,null,null,null,null,null,null,null,null,null,null,null,5.08]
["",null,null,"",null,"",null,"",null,"","",null,null,null,null,"","",null,2,null,null,null,null,null,null,null,null,null,null,null,null,null,null,null,null,5.09]
["",null,null,"",null,"",null,"",null,"","",null,null,null,null,"","",null,2,null,null,null,null,null,null,null,null,null,null,null,null,null,null,null,null,5.0999999999999996]
["",null,null,"",null,"",null,"",null,"","",null,null,null,null,"","",null,2,null,null,null,null,null,null,null,null,null,null,null,null,null,null,null,null,5.1100000000000003]
["",null,null,"",null,"",null,"",null,"","",null,null,null,null,"","",null,2,null,null,null,null,null,null,null,null,null,null,null,null,null,null,null,null,5.12]
["",null,null,"",null,"",null,"",null,"","",null,null,null,null,"","",null,2,null,null,null,null,null,null,null,null,null,null,null,null,null,null,null,null,5.13]
["",null,null,"",null,"",null,"",null,"","",null,null,null,null,"","",null,2,null,null,null,null,null,null,null,null,null,null,null,null,null,null,null,null,5.14]
["",null,null,"",null,"",null,"",null,"","",null,null,null,null,"","",null,2,null,null,null,null,null,null,null,null,null,null,null,null,null,null,null,null,5.15]
["",null,null,"",null,"",null,"",null,"","",null,null,null,null,"","",null,2,null,null,null,null,null,null,null,null,null,null,null,null,null,null,null,null,5.16]
["",null,null,"",null,"",null,"",null,"","",null,null,null,null,"","",null,2,null,null,null,null,null,null,null,null,null,null,null,null,null,null,null,null,5.17]
["",null,null,"",null,"",null,"",null,"","",null,null,null,null,"","",null,2,null,null,null,null,null,null,null,null,null,null,null,null,null,null,null,null,5.18]
[{"$f":"IF(E516=\"\",\"\",IF(A516=\"\",TODAY(),A516))","v":""},null,null,{"$f":"IF(B516=\"\",\"\",(C516-B516))","v":""},null,{"$f":"IFERROR(VLOOKUP(E516,AG515:AI829,2,FALSE),\"\")","v":""},null,{"$f":"IFERROR(G516/D516/24,\"\")","v":""},null,{"$f":"IFERROR(I516/D516/24,\"\")","v":""},{"$f":"IFERROR(L516/D516/24,\"\")","v":""},null,null,null,null,"",{"$f":"IFERROR(ROUND(SUM(L516*P516),2),\"\")","v":""},null,2,null,null,null,null,null,null,null,null,null,null,null,null,null,null,null,null,5.19]
["",null,null,"",null,"",null,"",null,"","",null,null,null,null,"","",null,2,null,null,null,null,null,null,null,null,null,null,null,null,null,null,null,null,5.2]
["",null,null,"",null,"",null,"",null,"","",null,null,null,null,"","",null,2,null,null,null,null,null,null,null,null,null,null,null,null,null,null,null,null,5.21]
["",null,null,"",null,"",null,"",null,"","",null,null,null,null,"","",null,2,null,null,null,null,null,null,null,null,null,null,null,null,null,null,null,null,5.22]
["",null,null,"",null,"",null,"",null,"","",null,null,null,null,"","",null,2,null,null,null,null,null,null,null,null,null,null,null,null,null,null,null,null,5.23]
["",null,null,"",null,"",null,"",null,"","",null,null,null,null,"","",null,2,null,null,null,null,null,null,null,null,null,null,null,null,null,null,null,null,5.24]
["",null,null,"",null,"",null,"",null,"","",null,null,null,null,"","",null,2,null,null,null,null,null,null,null,null,null,null,null,null,null,null,null,null,5.25]
["",null,null,"",null,"",null,"",null,"","",null,null,null,null,"","",null,2,null,null,null,null,null,null,null,null,null,null,null,null,null,null,null,null,5.26]
["",null,null,"",null,"",null,"",null,"","",null,null,null,null,"","",null,2,null,null,null,null,null,null,null,null,null,null,null,null,null,null,null,null,5.27]
["",null,null,"",null,"",null,"",null,"","",null,null,null,null,"","",null,2,null,null,null,null,null,null,null,null,null,null,null,null,null,null,null,null,5.28]
["",null,null,"",null,"",null,"",null,"","",null,null,null,null,"","",null,2,null,null,null,null,null,null,null,null,null,null,null,null,null,null,null,null,5.29]
["",null,null,"",null,"",null,"",null,"","",null,null,null,null,"","",null,2,null,null,null,null,null,null,null,null,null,null,null,null,null,null,null,null,5.3]
["",null,null,"",null,"",null,"",null,"","",null,null,null,null,"","",null,2,null,null,null,null,null,null,null,null,null,null,null,null,null,null,null,null,5.31]
["",null,null,"",null,"",null,"",null,"","",null,null,null,null,"","",null,2,null,null,null,null,null,null,null,null,null,null,null,null,null,null,null,null,5.32]
["",null,null,"",null,"",null,"",null,"","",null,null,null,null,"","",null,2,null,null,null,null,null,null,null,null,null,null,null,null,null,null,null,null,5.33]
["",null,null,"",null,"",null,"",null,"","",null,null,null,null,"","",null,2,null,null,null,null,null,null,null,null,null,null,null,null,null,null,null,null,5.34]
["",null,null,"",null,"",null,"",null,"","",null,null,null,null,"","",null,2,null,null,null,null,null,null,null,null,null,null,null,null,null,null,null,null,5.35]
["",null,null,"",null,"",null,"",null,"","",null,null,null,null,"","",null,2,null,null,null,null,null,null,null,null,null,null,null,null,null,null,null,null,5.36]
["",null,null,"",null,"",null,"",null,"","",null,null,null,null,"","",null,2,null,null,null,null,null,null,null,null,null,null,null,null,null,null,null,null,5.37]
["",null,null,"",null,"",null,"",null,"","",null,null,null,null,"","",null,2,null,null,null,null,null,null,null,null,null,null,null,null,null,null,null,null,5.38]
["",null,null,"",null,"",null,"",null,"","",null,null,null,null,"","",null,2,null,null,null,null,null,null,null,null,null,null,null,null,null,null,null,null,5.39]
["",null,null,"",null,"",null,"",null,"","",null,null,null,null,"","",null,2,null,null,null,null,null,null,null,null,null,null,null,null,null,null,null,null,5.4]
["",null,null,"",null,"",null,"",null,"","",null,null,null,null,{"$f":"IFERROR(ROUND(SUM(1000/M538),2),\"\")","v":""},"",null,2,null,null,null,null,null,null,null,null,null,null,null,null,null,null,null,null,5.41]
["",null,null,"",null,"",null,"",null,"","",null,null,null,null,"","",null,2,null,null,null,null,null,null,null,null,null,null,null,null,null,null,null,null,5.42]
["",null,null,"",null,"",null,"",null,"","",null,null,null,null,"","",null,2,null,null,null,null,null,null,null,null,null,null,null,null,null,null,null,null,5.43]
["",null,null,"",null,"",null,"",null,"","",null,null,null,null,"","",null,2,null,null,null,null,null,null,null,null,null,null,null,null,null,null,null,null,5.44]
["",null,null,"",null,"",null,"",null,"","",null,null,null,null,"","",null,2,null,null,null,null,null,null,null,null,null,null,null,null,null,null,null,null,5.45]
["",null,null,"",null,"",null,"",null,"","",null,null,null,null,"","",null,2,null,null,null,null,null,null,null,null,null,null,null,null,null,null,null,null,5.46]
["",null,null,"",null,"",null,"",null,"","",null,null,null,null,"","",null,2,null,null,null,null,null,null,null,null,null,null,null,null,null,null,null,null,5.47]
["",null,null,"",null,"",null,"",null,"","",null,null,null,null,"","",null,2,null,null,null,null,null,null,null,null,null,null,null,null,null,null,null,null,5.48]
["",null,null,"",null,"",null,"",null,"","",null,null,null,null,"","",null,2,null,null,null,null,null,null,null,null,null,null,null,null,null,null,null,null,5.49]
["",null,null,"",null,"",null,"",null,"","",null,null,null,null,"","",null,2,null,null,null,null,null,null,null,null,null,null,null,null,null,null,null,null,5.5]
["",null,null,"",null,"",null,"",null,"","",null,null,null,null,"","",null,2,null,null,null,null,null,null,null,null,null,null,null,null,null,null,null,null,5.51]
["",null,null,"",null,"",null,"",null,"","",null,null,null,null,"","",null,2,null,null,null,null,null,null,null,null,null,null,null,null,null,null,null,null,5.52]
["",null,null,"",null,"",null,"",null,"","",null,null,null,null,"","",null,2,null,null,null,null,null,null,null,null,null,null,null,null,null,null,null,null,5.53]
["",null,null,"",null,"",null,"",null,"","",null,null,null,null,"","",null,2,null,null,null,null,null,null,null,null,null,null,null,null,null,null,null,null,5.54]
["",null,null,"",null,"",null,"",null,"","",null,null,null,null,"","",null,2,null,null,null,null,null,null,null,null,null,null,null,null,null,null,null,null,5.55]
["",null,null,"",null,"",null,"",null,"","",null,null,null,null,"","",null,2,null,null,null,null,null,null,null,null,null,null,null,null,null,null,null,null,5.56]
["",null,null,"",null,"",null,"",null,"","",null,null,null,null,"","",null,2,null,null,null,null,null,null,null,null,null,null,null,null,null,null,null,null,5.57]
["",null,null,"",null,"",null,"",null,"","",null,null,null,null,"","",null,2,null,null,null,null,null,null,null,null,null,null,null,null,null,null,null,null,5.58]
["",null,null,"",null,"",null,"",null,"","",null,null,null,null,"","",null,2,null,null,null,null,null,null,null,null,null,null,null,null,null,null,null,null,5.59]
["",null,null,"",null,"",null,"",null,"","",null,null,null,null,"","",null,2,null,null,null,null,null,null,null,null,null,null,null,null,null,null,null,null,5.6]
["",null,null,"",null,"",null,"",null,"","",null,null,null,null,"","",null,2,null,null,null,null,null,null,null,null,null,null,null,null,null,null,null,null,5.61]
["",null,null,"",null,"",null,"",null,"","",null,null,null,null,"","",null,2,null,null,null,null,null,null,null,null,null,null,null,null,null,null,null,null,5.62]
["",null,null,"",null,"",null,"",null,"","",null,null,null,null,"","",null,2,null,null,null,null,null,null,null,null,null,null,null,null,null,null,null,null,5.63]
["",null,null,"",null,"",null,"",null,"","",null,null,null,null,"","",null,2,null,null,null,null,null,null,null,null,null,null,null,null,null,null,null,null,5.64]
["",null,null,"",null,"",null,"",null,"","",null,null,null,null,"","",null,2,null,null,null,null,null,null,null,null,null,null,null,null,null,null,null,null,5.65]
["",null,null,"",null,"",null,"",null,"","",null,null,null,null,"","",null,2,null,null,null,null,null,null,null,null,null,null,null,null,null,null,null,null,5.66]
["",null,null,"",null,"",null,"",null,"","",null,null,null,null,"","",null,2,null,null,null,null,null,null,null,null,null,null,null,null,null,null,null,null,5.67]
["",null,null,"",null,"",null,"",null,"","",null,null,null,null,"","",null,2,null,null,null,null,null,null,null,null,null,null,null,null,null,null,null,null,5.68]
["",null,null,"",null,"",null,"",null,"","",null,null,null,null,"","",null,2,null,null,null,null,null,null,null,null,null,null,null,null,null,null,null,null,5.69]
["",null,null,"",null,"",null,"",null,"","",null,null,null,null,"","",null,2,null,null,null,null,null,null,null,null,null,null,null,null,null,null,null,null,5.7]
["",null,null,"",null,"",null,"",null,"","",null,null,null,null,"","",null,2,null,null,null,null,null,null,null,null,null,null,null,null,null,null,null,null,5.71]
["",null,null,"",null,"",null,"",null,"","",null,null,null,null,"","",null,2,null,null,null,null,null,null,null,null,null,null,null,null,null,null,null,null,5.72]
["",null,null,"",null,"",null,"",null,"","",null,null,null,null,"","",null,2,null,null,null,null,null,null,null,null,null,null,null,null,null,null,null,null,5.73]
["",null,null,"",null,"",null,"",null,"","",null,null,null,null,"","",null,2,null,null,null,null,null,null,null,null,null,null,null,null,null,null,null,null,5.74]
["",null,null,"",null,"",null,"",null,"","",null,null,null,null,"","",null,2,null,null,null,null,null,null,null,null,null,null,null,null,null,null,null,null,5.75]
["",null,null,"",null,"",null,"",null,"","",null,null,null,null,"","",null,2,null,null,null,null,null,null,null,null,null,null,null,null,null,null,null,null,5.76]
["",null,null,"",null,"",null,"",null,"","",null,null,null,null,"","",null,2,null,null,null,null,null,null,null,null,null,null,null,null,null,null,null,null,5.77]
["",null,null,"",null,"",null,"",null,"","",null,null,null,null,"","",null,2,null,null,null,null,null,null,null,null,null,null,null,null,null,null,null,null,5.78]
["",null,null,"",null,"",null,"",null,"","",null,null,null,null,"","",null,2,null,null,null,null,null,null,null,null,null,null,null,null,null,null,null,null,5.79]
["",null,null,"",null,"",null,"",null,"","",null,null,null,null,"","",null,2,null,null,null,null,null,null,null,null,null,null,null,null,null,null,null,null,5.8]
["",null,null,"",null,"",null,"",null,"","",null,null,null,null,"","",null,2,null,null,null,null,null,null,null,null,null,null,null,null,null,null,null,null,5.81]
["",null,null,"",null,"",null,"",null,"","",null,null,null,null,"","",null,2,null,null,null,null,null,null,null,null,null,null,null,null,null,null,null,null,5.82]
[{"$f":"IF(E580=\"\",\"\",IF(A580=\"\",TODAY(),A580))","v":""},null,null,{"$f":"IF(B580=\"\",\"\",(C580-B580))","v":""},null,{"$f":"IFERROR(VLOOKUP(E580,AG579:AI893,2,FALSE),\"\")","v":""},null,{"$f":"IFERROR(G580/D580/24,\"\")","v":""},null,{"$f":"IFERROR(I580/D580/24,\"\")","v":""},{"$f":"IFERROR(L580/D580/24,\"\")","v":""},null,null,null,null,"",{"$f":"IFERROR(ROUND(SUM(L580*P580),2),\"\")","v":""},null,2,null,null,null,null,null,null,null,null,null,null,null,null,null,null,null,null,5.83]
["",null,null,"",null,"",null,"",null,"","",null,null,null,null,"","",null,2,null,null,null,null,null,null,null,null,null,null,null,null,null,null,null,null,5.84]
["",null,null,"",null,"",null,"",null,"","",null,null,null,null,"","",null,2,null,null,null,null,null,null,null,null,null,null,null,null,null,null,null,null,5.85]
["",null,null,"",null,"",null,"",null,"","",null,null,null,null,"","",null,2,null,null,null,null,null,null,null,null,null,null,null,null,null,null,null,null,5.86]
["",null,null,"",null,"",null,"",null,"","",null,null,null,null,"","",null,2,null,null,null,null,null,null,null,null,null,null,null,null,null,null,null,null,5.87]
["",null,null,"",null,"",null,"",null,"","",null,null,null,null,"","",null,2,null,null,null,null,null,null,null,null,null,null,null,null,null,null,null,null,5.88]
["",null,null,"",null,"",null,"",null,"","",null,null,null,null,"","",null,2,null,null,null,null,null,null,null,null,null,null,null,null,null,null,null,null,5.89]
["",null,null,"",null,"",null,"",null,"","",null,null,null,null,"","",null,2,null,null,null,null,null,null,null,null,null,null,null,null,null,null,null,null,5.9]
["",null,null,"",null,"",null,"",null,"","",null,null,null,null,"","",null,2,null,null,null,null,null,null,null,null,null,null,null,null,null,null,null,null,5.91]
["",null,null,"",null,"",null,"",null,"","",null,null,null,null,"","",null,2,null,null,null,null,null,null,null,null,null,null,null,null,null,null,null,null,5.92]
["",null,null,"",null,"",null,"",null,"","",null,null,null,null,"","",null,2,null,null,null,null,null,null,null,null,null,null,null,null,null,null,null,null,5.93]
["",null,null,"",null,"",null,"",null,"","",null,null,null,null,"","",null,2,null,null,null,null,null,null,null,null,null,null,null,null,null,null,null,null,5.94]
["",null,null,"",null,"",null,"",null,"","",null,null,null,null,"","",null,2,null,null,null,null,null,null,null,null,null,null,null,null,null,null,null,null,5.95]
["",null,null,"",null,"",null,"",null,"","",null,null,null,null,"","",null,2,null,null,null,null,null,null,null,null,null,null,null,null,null,null,null,null,5.96]
["",null,null,"",null,"",null,"",null,"","",null,null,null,null,"","",null,2,null,null,null,null,null,null,null,null,null,null,null,null,null,null,null,null,5.97]
["",null,null,"",null,"",null,"",null,"","",null,null,null,null,"","",null,2,null,null,null,null,null,null,null,null,null,null,null,null,null,null,null,null,5.98]
["",null,null,"",null,"",null,"",null,"","",null,null,null,null,"","",null,2,null,null,null,null,null,null,null,null,null,null,null,null,null,null,null,null,5.99]
["",null,null,"",null,"",null,"",null,"","",null,null,null,null,"","",null,2,null,null,null,null,null,null,null,null,null,null,null,null,null,null,null,null,6]
["",null,null,"",null,"",null,"",null,"","",null,null,null,null,"","",null,2]
["",null,null,"",null,"",null,"",null,"","",null,null,null,null,"","",null,2]
["",null,null,"",null,"",null,"",null,"","",null,null,null,null,"","",null,2]
["",null,null,"",null,"",null,"",null,"","",null,null,null,null,"","",null,2]
["",null,null,"",null,"",null,"",null,"","",null,null,null,null,{"$f":"IFERROR(ROUND(SUM(1000/M602),2),\"\")","v":""},"",null,2]
["",null,null,"",null,"",null,"",null,"","",null,null,null,null,"","",null,2]
["",null,null,"",null,"",null,"",null,"","",null,null,null,null,"","",null,2]
["",null,null,"",null,"",null,"",null,"","",null,null,null,null,"","",null,2]
["",null,null,"",null,"",null,"",null,"","",null,null,null,null,"","",null,2]
["",null,null,"",null,"",null,"",null,"","",null,null,null,null,"","",null,2]
["",null,null,"",null,"",null,"",null,"","",null,null,null,null,"","",null,2]
["",null,null,"",null,"",null,"",null,"","",null,null,null,null,"","",null,2]
["",null,null,"",null,"",null,"",null,"","",null,null,null,null,"","",null,2]
["",null,null,"",null,"",null,"",null,"","",null,null,null,null,"","",null,2]
["",null,null,"",null,"",null,"",null,"","",null,null,null,null,"","",null,2]
["",null,null,"",null,"",null,"",null,"","",null,null,null,null,"","",null,2]
["",null,null,"",null,"",null,"",null,"","",null,null,null,null,"","",null,2]
["",null,null,"",null,"",null,"",null,"","",null,null,null,null,"","",null,2]
["",null,null,"",null,"",null,"",null,"","",null,null,null,null,"","",null,2]
["",null,null,"",null,"",null,"",null,"","",null,null,null,null,"","",null,2]
["",null,null,"",null,"",null,"",null,"","",null,null,null,null,"","",null,2]
["",null,null,"",null,"",null,"",null,"","",null,null,null,null,"","",null,2]
["",null,null,"",null,"",null,"",null,"","",null,null,null,null,"","",null,2]
["",null,null,"",null,"",null,"",null,"","",null,null,null,null,"","",null,2]
["",null,null,"",null,"",null,"",null,"","",null,null,null,null,"","",null,2]
["",null,null,"",null,"",null,"",null,"","",null,null,null,null,"","",null,2]
["",null,null,"",null,"",null,"",null,"","",null,null,null,null,"","",null,2]
["",null,null,"",null,"",null,"",null,"","",null,null,null,null,"","",null,2]
["",null,null,"",null,"",null,"",null,"","",null,null,null,null,"","",null,2]
["",null,null,"",null,"",null,"",null,"","",null,null,null,null,"","",null,2]
["",null,null,"",null,"",null,"",null,"","",null,null,null,null,"","",null,2]
["",null,null,"",null,"",null,"",null,"","",null,null,null,null,"","",null,2]
["",null,null,"",null,"",null,"",null,"","",null,null,null,null,"","",null,2]
["",null,null,"",null,"",null,"",null,"","",null,null,null,null,"","",null,2]
["",null,null,"",null,"",null,"",null,"","",null,null,null,null,"","",null,2]
["",null,null,"",null,"",null,"",null,"","",null,null,null,null,"","",null,2]
["",null,null,"",null,"",null,"",null,"","",null,null,null,null,"","",null,2]
["",null,null,"",null,"",null,"",null,"","",null,null,null,null,"","",null,2]
["",null,null,"",null,"",null,"",null,"","",null,null,null,null,"","",null,2]
["",null,null,"",null,"",null,"",null,"","",null,null,null,null,"","",null,2]
["",null,null,"",null,"",null,"",null,"","",null,null,null,null,"","",null,2]
["",null,null,"",null,"",null,"",null,"","",null,null,null,null,"","",null,2]
["",null,null,"",null,"",null,"",null,"","",null,null,null,null,"","",null,2]
["",null,null,"",null,"",null,"",null,"","",null,null,null,null,"","",null,2]
["",null,null,"",null,"",null,"",null,"","",null,null,null,null,"","",null,2]
["",null,null,"",null,"",null,"",null,"","",null,null,null,null,"","",null,2]
[{"$f":"IF(E644=\"\",\"\",IF(A644=\"\",TODAY(),A644))","v":""},null,null,{"$f":"IF(B644=\"\",\"\",(C644-B644))","v":""},null,{"$f":"IFERROR(VLOOKUP(E644,AG643:AI957,2,FALSE),\"\")","v":""},null,{"$f":"IFERROR(G644/D644/24,\"\")","v":""},null,{"$f":"IFERROR(I644/D644/24,\"\")","v":""},{"$f":"IFERROR(L644/D644/24,\"\")","v":""},null,null,null,null,"",{"$f":"IFERROR(ROUND(SUM(L644*P644),2),\"\")","v":""},null,2]
["",null,null,"",null,"",null,"",null,"","",null,null,null,null,"","",null,2]
["",null,null,"",null,"",null,"",null,"","",null,null,null,null,"","",null,2]
["",null,null,"",null,"",null,"",null,"","",null,null,null,null,"","",null,2]
["",null,null,"",null,"",null,"",null,"","",null,null,null,null,"","",null,2]
["",null,null,"",null,"",null,"",null,"","",null,null,null,null,"","",null,2]
["",null,null,"",null,"",null,"",null,"","",null,null,null,null,"","",null,2]
["",null,null,"",null,"",null,"",null,"","",null,null,null,null,"","",null,2]
["",null,null,"",null,"",null,"",null,"","",null,null,null,null,"","",null,2]
["",null,null,"",null,"",null,"",null,"","",null,null,null,null,"","",null,2]
["",null,null,"",null,"",null,"",null,"","",null,null,null,null,"","",null,2]
["",null,null,"",null,"",null,"",null,"","",null,null,null,null,"","",null,2]
["",null,null,"",null,"",null,"",null,"","",null,null,null,null,"","",null,2]
["",null,null,"",null,"",null,"",null,"","",null,null,null,null,"","",null,2]
["",null,null,"",null,"",null,"",null,"","",null,null,null,null,"","",null,2]
["",null,null,"",null,"",null,"",null,"","",null,null,null,null,"","",null,2]
["",null,null,"",null,"",null,"",null,"","",null,null,null,null,"","",null,2]
["",null,null,"",null,"",null,"",null,"","",null,null,null,null,"","",null,2]
["",null,null,"",null,"",null,"",null,"","",null,null,null,null,"","",null,2]
["",null,null,"",null,"",null,"",null,"","",null,null,null,null,"","",null,2]
["",null,null,"",null,"",null,"",null,"","",null,null,null,null,"","",null,2]
["",null,null,"",null,"",null,"",null,"","",null,null,null,null,"","",null,2]
["",null,null,"",null,"",null,"",null,"","",null,null,null,null,{"$f":"IFERROR(ROUND(SUM(1000/M666),2),\"\")","v":""},"",null,2]
["",null,null,"",null,"",null,"",null,"","",null,null,null,null,"","",null,2]
["",null,null,"",null,"",null,"",null,"","",null,null,null,null,"","",null,2]
["",null,null,"",null,"",null,"",null,"","",null,null,null,null,"","",null,2]
["",null,null,"",null,"",null,"",null,"","",null,null,null,null,"","",null,2]
["",null,null,"",null,"",null,"",null,"","",null,null,null,null,"","",null,2]
["",null,null,"",null,"",null,"",null,"","",null,null,null,null,"","",null,2]
["",null,null,"",null,"",null,"",null,"","",null,null,null,null,"","",null,2]
["",null,null,"",null,"",null,"",null,"","",null,null,null,null,"","",null,2]
["",null,null,"",null,"",null,"",null,"","",null,null,null,null,"","",null,2]
["",null,null,"",null,"",null,"",null,"","",null,null,null,null,"","",null,2]
["",null,null,"",null,"",null,"",null,"","",null,null,null,null,"","",null,2]
["",null,null,"",null,"",null,"",null,"","",null,null,null,null,"","",null,2]
["",null,null,"",null,"",null,"",null,"","",null,null,null,null,"","",null,2]
["",null,null,"",null,"",null,"",null,"","",null,null,null,null,"","",null,2]
["",null,null,"",null,"",null,"",null,"","",null,null,null,null,"","",null,2]
["",null,null,"",null,"",null,"",null,"","",null,null,null,null,"","",null,2]
["",null,null,"",null,"",null,"",null,"","",null,null,null,null,"","",null,2]
["",null,null,"",null,"",null,"",null,"","",null,null,null,null,"","",null,2]
["",null,null,"",null,"",null,"",null,"","",null,null,null,null,"","",null,2]
["",null,null,"",null,"",null,"",null,"","",null,null,null,null,"","",null,2]
["",null,null,"",null,"",null,"",null,"","",null,null,null,null,"","",null,2]
["",null,null,"",null,"",null,"",null,"","",null,null,null,null,"","",null,2]
["",null,null,"",null,"",null,"",null,"","",null,null,null,null,"","",null,2]
["",null,null,"",null,"",null,"",null,"","",null,null,null,null,"","",null,2]
["",null,null,"",null,"",null,"",null,"","",null,null,null,null,"","",null,2]
["",null,null,"",null,"",null,"",null,"","",null,null,null,null,"","",null,2]
["",null,null,"",null,"",null,"",null,"","",null,null,null,null,"","",null,2]
["",null,null,"",null,"",null,"",null,"","",null,null,null,null,"","",null,2]
["",null,null,"",null,"",null,"",null,"","",null,null,null,null,"","",null,2]
["",null,null,"",null,"",null,"",null,"","",null,null,null,null,"","",null,2]
["",null,null,"",null,"",null,"",null,"","",null,null,null,null,"","",null,2]
["",null,null,"",null,"",null,"",null,"","",null,null,null,null,"","",null,2]
["",null,null,"",null,"",null,"",null,"","",null,null,null,null,"","",null,2]
["",null,null,"",null,"",null,"",null,"","",null,null,null,null,"","",null,2]
["",null,null,"",null,"",null,"",null,"","",null,null,null,null,"","",null,2]
["",null,null,"",null,"",null,"",null,"","",null,null,null,null,"","",null,2]
["",null,null,"",null,"",null,"",null,"","",null,null,null,null,"","",null,2]
["",null,null,"",null,"",null,"",null,"","",null,null,null,null,"","",null,2]
["",null,null,"",null,"",null,"",null,"","",null,null,null,null,"","",null,2]
["",null,null,"",null,"",null,"",null,"","",null,null,null,null,"","",null,2]
["",null,null,"",null,"",null,"",null,"","",null,null,null,null,"","",null,2]
[{"$f":"IF(E708=\"\",\"\",IF(A708=\"\",TODAY(),A708))","v":""},null,null,{"$f":"IF(B708=\"\",\"\",(C708-B708))","v":""},null,{"$f":"IFERROR(VLOOKUP(E708,AG707:AI1021,2,FALSE),\"\")","v":""},null,{"$f":"IFERROR(G708/D708/24,\"\")","v":""},null,{"$f":"IFERROR(I708/D708/24,\"\")","v":""},{"$f":"IFERROR(L708/D708/24,\"\")","v":""},null,null,null,null,"",{"$f":"IFERROR(ROUND(SUM(L708*P708),2),\"\")","v":""},null,2]
["",null,null,"",null,"",null,"",null,"","",null,null,null,null,"","",null,2]
["",null,null,"",null,"",null,"",null,"","",null,null,null,null,"","",null,2]
["",null,null,"",null,"",null,"",null,"","",null,null,null,null,"","",null,2]
["",null,null,"",null,"",null,"",null,"","",null,null,null,null,"","",null,2]
["",null,null,"",null,"",null,"",null,"","",null,null,null,null,"","",null,2]
["",null,null,"",null,"",null,"",null,"","",null,null,null,null,"","",null,2]
["",null,null,"",null,"",null,"",null,"","",null,null,null,null,"","",null,2]
["",null,null,"",null,"",null,"",null,"","",null,null,null,null,"","",null,2]
["",null,null,"",null,"",null,"",null,"","",null,null,null,null,"","",null,2]
["",null,null,"",null,"",null,"",null,"","",null,null,null,null,"","",null,2]
["",null,null,"",null,"",null,"",null,"","",null,null,null,null,"","",null,2]
["",null,null,"",null,"",null,"",null,"","",null,null,null,null,"","",null,2]
["",null,null,"",null,"",null,"",null,"","",null,null,null,null,"","",null,2]
["",null,null,"",null,"",null,"",null,"","",null,null,null,null,"","",null,2]
["",null,null,"",null,"",null,"",null,"","",null,null,null,null,"","",null,2]
["",null,null,"",null,"",null,"",null,"","",null,null,null,null,"","",null,2]
["",null,null,"",null,"",null,"",null,"","",null,null,null,null,"","",null,2]
["",null,null,"",null,"",null,"",null,"","",null,null,null,null,"","",null,2]
["",null,null,"",null,"",null,"",null,"","",null,null,null,null,"","",null,2]
["",null,null,"",null,"",null,"",null,"","",null,null,null,null,"","",null,2]
["",null,null,"",null,"",null,"",null,"","",null,null,null,null,"","",null,2]
["",null,null,"",null,"",null,"",null,"","",null,null,null,null,{"$f":"IFERROR(ROUND(SUM(1000/M730),2),\"\")","v":""},"",null,2]
["",null,null,"",null,"",null,"",null,"","",null,null,null,null,"","",null,2]
["",null,null,"",null,"",null,"",null,"","",null,null,null,null,"","",null,2]
["",null,null,"",null,"",null,"",null,"","",null,null,null,null,"","",null,2]
["",null,null,"",null,"",null,"",null,"","",null,null,null,null,"","",null,2]
["",null,null,"",null,"",null,"",null,"","",null,null,null,null,"","",null,2]
["",null,null,"",null,"",null,"",null,"","",null,null,null,null,"","",null,2]
["",null,null,"",null,"",null,"",null,"","",null,null,null,null,"","",null,2]
["",null,null,"",null,"",null,"",null,"","",null,null,null,null,"","",null,2]
["",null,null,"",null,"",null,"",null,"","",null,null,null,null,"","",null,2]
["",null,null,"",null,"",null,"",null,"","",null,null,null,null,"","",null,2]
["",null,null,"",null,"",null,"",null,"","",null,null,null,null,"","",null,2]
["",null,null,"",null,"",null,"",null,"","",null,null,null,null,"","",null,2]
["",null,null,"",null,"",null,"",null,"","",null,null,null,null,"","",null,2]
["",null,null,"",null,"",null,"",null,"","",null,null,null,null,"","",null,2]
["",null,null,"",null,"",null,"",null,"","",null,null,null,null,"","",null,2]
["",null,null,"",null,"",null,"",null,"","",null,null,null,null,"","",null,2]
["",null,null,"",null,"",null,"",null,"","",null,null,null,null,"","",null,2]
["",null,null,"",null,"",null,"",null,"","",null,null,null,null,"","",null,2]
["",null,null,"",null,"",null,"",null,"","",null,null,null,null,"","",null,2]
["",null,null,"",null,"",null,"",null,"","",null,null,null,null,"","",null,2]
["",null,null,"",null,"",null,"",null,"","",null,null,null,null,"","",null,2]
["",null,null,"",null,"",null,"",null,"","",null,null,null,null,"","",null,2]
["",null,null,"",null,"",null,"",null,"","",null,null,null,null,"","",null,2]
["",null,null,"",null,"",null,"",null,"","",null,null,null,null,"","",null,2]
["",null,null,"",null,"",null,"",null,"","",null,null,null,null,"","",null,2]
["",null,null,"",null,"",null,"",null,"","",null,null,null,null,"","",null,2]
["",null,null,"",null,"",null,"",null,"","",null,null,null,null,"","",null,2]
["",null,null,"",null,"",null,"",null,"","",null,null,null,null,"","",null,2]
["",null,null,"",null,"",null,"",null,"","",null,null,null,null,"","",null,2]
["",null,null,"",null,"",null,"",null,"","",null,null,null,null,"","",null,2]
["",null,null,"",null,"",null,"",null,"","",null,null,null,null,"","",null,2]
["",null,null,"",null,"",null,"",null,"","",null,null,null,null,"","",null,2]
["",null,null,"",null,"",null,"",null,"","",null,null,null,null,"","",null,2]
["",null,null,"",null,"",null,"",null,"","",null,null,null,null,"","",null,2]
["",null,null,"",null,"",null,"",null,"","",null,null,null,null,"","",null,2]
["",null,null,"",null,"",null,"",null,"","",null,null,null,null,"","",null,2]
["",null,null,"",null,"",null,"",null,"","",null,null,null,null,"","",null,2]
["",null,null,"",null,"",null,"",null,"","",null,null,null,null,"","",null,2]
["",null,null,"",null,"",null,"",null,"","",null,null,null,null,"","",null,2]
["",null,null,"",null,"",null,"",null,"","",null,null,null,null,"","",null,2]
["",null,null,"",null,"",null,"",null,"","",null,null,null,null,"","",null,2]
[{"$f":"IF(E772=\"\",\"\",IF(A772=\"\",TODAY(),A772))","v":""},null,null,{"$f":"IF(B772=\"\",\"\",(C772-B772))","v":""},null,{"$f":"IFERROR(VLOOKUP(E772,AG771:AI1085,2,FALSE),\"\")","v":""},null,{"$f":"IFERROR(G772/D772/24,\"\")","v":""},null,{"$f":"IFERROR(I772/D772/24,\"\")","v":""},{"$f":"IFERROR(L772/D772/24,\"\")","v":""},null,null,null,null,"",{"$f":"IFERROR(ROUND(SUM(L772*P772),2),\"\")","v":""},null,2]
["",null,null,"",null,"",null,"",null,"","",null,null,null,null,"","",null,2]
["",null,null,"",null,"",null,"",null,"","",null,null,null,null,"","",null,2]
["",null,null,"",null,"",null,"",null,"","",null,null,null,null,"","",null,2]
["",null,null,"",null,"",null,"",null,"","",null,null,null,null,"","",null,2]
["",null,null,"",null,"",null,"",null,"","",null,null,null,null,"","",null,2]
["",null,null,"",null,"",null,"",null,"","",null,null,null,null,"","",null,2]
["",null,null,"",null,"",null,"",null,"","",null,null,null,null,"","",null,2]
["",null,null,"",null,"",null,"",null,"","",null,null,null,null,"","",null,2]
["",null,null,"",null,"",null,"",null,"","",null,null,null,null,"","",null,2]
["",null,null,"",null,"",null,"",null,"","",null,null,null,null,"","",null,2]
["",null,null,"",null,"",null,"",null,"","",null,null,null,null,"","",null,2]
["",null,null,"",null,"",null,"",null,"","",null,null,null,null,"","",null,2]
["",null,null,"",null,"",null,"",null,"","",null,null,null,null,"","",null,2]
["",null,null,"",null,"",null,"",null,"","",null,null,null,null,"","",null,2]
["",null,null,"",null,"",null,"",null,"","",null,null,null,null,"","",null,2]
["",null,null,"",null,"",null,"",null,"","",null,null,null,null,"","",null,2]
["",null,null,"",null,"",null,"",null,"","",null,null,null,null,"","",null,2]
["",null,null,"",null,"",null,"",null,"","",null,null,null,null,"","",null,2]
["",null,null,"",null,"",null,"",null,"","",null,null,null,null,"","",null,2]
["",null,null,"",null,"",null,"",null,"","",null,null,null,null,"","",null,2]
["",null,null,"",null,"",null,"",null,"","",null,null,null,null,"","",null,2]
["",null,null,"",null,"",null,"",null,"","",null,null,null,null,{"$f":"IFERROR(ROUND(SUM(1000/M794),2),\"\")","v":""},"",null,2]
["",null,null,"",null,"",null,"",null,"","",null,null,null,null,"","",null,2]
["",null,null,"",null,"",null,"",null,"","",null,null,null,null,"","",null,2]
["",null,null,"",null,"",null,"",null,"","",null,null,null,null,"","",null,2]
["",null,null,"",null,"",null,"",null,"","",null,null,null,null,"","",null,2]
["",null,null,"",null,"",null,"",null,"","",null,null,null,null,"","",null,2]
["",null,null,"",null,"",null,"",null,"","",null,null,null,null,"","",null,2]
["",null,null,"",null,"",null,"",null,"","",null,null,null,null,"","",null,2]
["",null,null,"",null,"",null,"",null,"","",null,null,null,null,"","",null,2]
["",null,null,"",null,"",null,"",null,"","",null,null,null,null,"","",null,2]
["",null,null,"",null,"",null,"",null,"","",null,null,null,null,"","",null,2]
["",null,null,"",null,"",null,"",null,"","",null,null,null,null,"","",null,2]
["",null,null,"",null,"",null,"",null,"","",null,null,null,null,"","",null,2]
["",null,null,"",null,"",null,"",null,"","",null,null,null,null,"","",null,2]
["",null,null,"",null,"",null,"",null,"","",null,null,null,null,"","",null,2]
["",null,null,"",null,"",null,"",null,"","",null,null,null,null,"","",null,2]
["",null,null,"",null,"",null,"",null,"","",null,null,null,null,"","",null,2]
["",null,null,"",null,"",null,"",null,"","",null,null,null,null,"","",null,2]
["",null,null,"",null,"",null,"",null,"","",null,null,null,null,"","",null,2]
["",null,null,"",null,"",null,"",null,"","",null,null,null,null,"","",null,2]
["",null,null,"",null,"",null,"",null,"","",null,null,null,null,"","",null,2]
["",null,null,"",null,"",null,"",null,"","",null,null,null,null,"","",null,2]
["",null,null,"",null,"",null,"",null,"","",null,null,null,null,"","",null,2]
["",null,null,"",null,"",null,"",null,"","",null,null,null,null,"","",null,2]
["",null,null,"",null,"",null,"",null,"","",null,null,null,null,"","",null,2]
["",null,null,"",null,"",null,"",null,"","",null,null,null,null,"","",null,2]
["",null,null,"",null,"",null,"",null,"","",null,null,null,null,"","",null,2]
["",null,null,"",null,"",null,"",null,"","",null,null,null,null,"","",null,2]
["",null,null,"",null,"",null,"",null,"","",null,null,null,null,"","",null,2]
["",null,null,"",null,"",null,"",null,"","",null,null,null,null,"","",null,2]
["",null,null,"",null,"",null,"",null,"","",null,null,null,null,"","",null,2]
["",null,null,"",null,"",null,"",null,"","",null,null,null,null,"","",null,2]
["",null,null,"",null,"",null,"",null,"","",null,null,null,null,"","",null,2]
["",null,null,"",null,"",null,"",null,"","",null,null,null,null,"","",null,2]
["",null,null,"",null,"",null,"",null,"","",null,null,null,null,"","",null,2]
["",null,null,"",null,"",null,"",null,"","",null,null,null,null,"","",null,2]
["",null,null,"",null,"",null,"",null,"","",null,null,null,null,"","",null,2]
["",null,null,"",null,"",null,"",null,"","",null,null,null,null,"","",null,2]
["",null,null,"",null,"",null,"",null,"","",null,null,null,null,"","",null,2]
["",null,null,"",null,"",null,"",null,"","",null,null,null,null,"","",null,2]
["",null,null,"",null,"",null,"",null,"","",null,null,null,null,"","",null,2]
["",null,null,"",null,"",null,"",null,"","",null,null,null,null,"","",null,2]
[{"$f":"IF(E836=\"\",\"\",IF(A836=\"\",TODAY(),A836))","v":""},null,null,{"$f":"IF(B836=\"\",\"\",(C836-B836))","v":""},null,{"$f":"IFERROR(VLOOKUP(E836,AG835:AI1149,2,FALSE),\"\")","v":""},null,{"$f":"IFERROR(G836/D836/24,\"\")","v":""},null,{"$f":"IFERROR(I836/D836/24,\"\")","v":""},{"$f":"IFERROR(L836/D836/24,\"\")","v":""},null,null,null,null,"",{"$f":"IFERROR(ROUND(SUM(L836*P836),2),\"\")","v":""},null,2]
["",null,null,"",null,"",null,"",null,"","",null,null,null,null,"","",null,2]
["",null,null,"",null,"",null,"",null,"","",null,null,null,null,"","",null,2]
["",null,null,"",null,"",null,"",null,"","",null,null,null,null,"","",null,2]
["",null,null,"",null,"",null,"",null,"","",null,null,null,null,"","",null,2]
["",null,null,"",null,"",null,"",null,"","",null,null,null,null,"","",null,2]
["",null,null,"",null,"",null,"",null,"","",null,null,null,null,"","",null,2]
["",null,null,"",null,"",null,"",null,"","",null,null,null,null,"","",null,2]
["",null,null,"",null,"",null,"",null,"","",null,null,null,null,"","",null,2]
["",null,null,"",null,"",null,"",null,"","",null,null,null,null,"","",null,2]
["",null,null,"",null,"",null,"",null,"","",null,null,null,null,"","",null,2]
["",null,null,"",null,"",null,"",null,"","",null,null,null,null,"","",null,2]
["",null,null,"",null,"",null,"",null,"","",null,null,null,null,"","",null,2]
["",null,null,"",null,"",null,"",null,"","",null,null,null,null,"","",null,2]
["",null,null,"",null,"",null,"",null,"","",null,null,null,null,"","",null,2]
["",null,null,"",null,"",null,"",null,"","",null,null,null,null,"","",null,2]
["",null,null,"",null,"",null,"",null,"","",null,null,null,null,"","",null,2]
["",null,null,"",null,"",null,"",null,"","",null,null,null,null,"","",null,2]
["",null,null,"",null,"",null,"",null,"","",null,null,null,null,"","",null,2]
["",null,null,"",null,"",null,"",null,"","",null,null,null,null,"","",null,2]
["",null,null,"",null,"",null,"",null,"","",null,null,null,null,"","",null,2]
["",null,null,"",null,"",null,"",null,"","",null,null,null,null,"","",null,2]
["",null,null,"",null,"",null,"",null,"","",null,null,null,null,{"$f":"IFERROR(ROUND(SUM(1000/M858),2),\"\")","v":""},"",null,2]
["",null,null,"",null,"",null,"",null,"","",null,null,null,null,"","",null,2]
["",null,null,"",null,"",null,"",null,"","",null,null,null,null,"","",null,2]
["",null,null,"",null,"",null,"",null,"","",null,null,null,null,"","",null,2]
["",null,null,"",null,"",null,"",null,"","",null,null,null,null,"","",null,2]
["",null,null,"",null,"",null,"",null,"","",null,null,null,null,"","",null,2]
["",null,null,"",null,"",null,"",null,"","",null,null,null,null,"","",null,2]
["",null,null,"",null,"",null,"",null,"","",null,null,null,null,"","",null,2]
["",null,null,"",null,"",null,"",null,"","",null,null,null,null,"","",null,2]
["",null,null,"",null,"",null,"",null,"","",null,null,null,null,"","",null,2]
["",null,null,"",null,"",null,"",null,"","",null,null,null,null,"","",null,2]
["",null,null,"",null,"",null,"",null,"","",null,null,null,null,"","",null,2]
["",null,null,"",null,"",null,"",null,"","",null,null,null,null,"","",null,2]
["",null,null,"",null,"",null,"",null,"","",null,null,null,null,"","",null,2]
["",null,null,"",null,"",null,"",null,"","",null,null,null,null,"","",null,2]
["",null,null,"",null,"",null,"",null,"","",null,null,null,null,"","",null,2]
["",null,null,"",null,"",null,"",null,"","",null,null,null,null,"","",null,2]
["",null,null,"",null,"",null,"",null,"","",null,null,null,null,"","",null,2]
["",null,null,"",null,"",null,"",null,"","",null,null,null,null,"","",null,2]
["",null,null,"",null,"",null,"",null,"","",null,null,null,null,"","",null,2]
["",null,null,"",null,"",null,"",null,"","",null,null,null,null,"","",null,2]
["",null,null,"",null,"",null,"",null,"","",null,null,null,null,"","",null,2]
["",null,null,"",null,"",null,"",null,"","",null,null,null,null,"","",null,2]
["",null,null,"",null,"",null,"",null,"","",null,null,null,null,"","",null,2]
["",null,null,"",null,"",null,"",null,"","",null,null,null,null,"","",null,2]
["",null,null,"",null,"",null,"",null,"","",null,null,null,null,"","",null,2]
["",null,null,"",null,"",null,"",null,"","",null,null,null,null,"","",null,2]
["",null,null,"",null,"",null,"",null,"","",null,null,null,null,"","",null,2]
["",null,null,"",null,"",null,"",null,"","",null,null,null,null,"","",null,2]
["",null,null,"",null,"",null,"",null,"","",null,null,null,null,"","",null,2]
["",null,null,"",null,"",null,"",null,"","",null,null,null,null,"","",null,2]
["",null,null,"",null,"",null,"",null,"","",null,null,null,null,"","",null,2]
["",null,null,"",null,"",null,"",null,"","",null,null,null,null,"","",null,2]
["",null,null,"",null,"",null,"",null,"","",null,null,null,null,"","",null,2]
["",null,null,"",null,"",null,"",null,"","",null,null,null,null,"","",null,2]
["",null,null,"",null,"",null,"",null,"","",null,null,null,null,"","",null,2]
["",null,null,"",null,"",null,"",null,"","",null,null,null,null,"","",null,2]
["",null,null,"",null,"",null,"",null,"","",null,null,null,null,"","",null,2]
["",null,null,"",null,"",null,"",null,"","",null,null,null,null,"","",null,2]
["",null,null,"",null,"",null,"",null,"","",null,null,null,null,"","",null,2]
["",null,null,"",null,"",null,"",null,"","",null,null,null,null,"","",null,2]
["",null,null,"",null,"",null,"",null,"","",null,null,null,null,"","",null,2]
[{"$f":"IF(E900=\"\",\"\",IF(A900=\"\",TODAY(),A900))","v":""},null,null,{"$f":"IF(B900=\"\",\"\",(C900-B900))","v":""},null,{"$f":"IFERROR(VLOOKUP(E900,AG899:AI1213,2,FALSE),\"\")","v":""},null,{"$f":"IFERROR(G900/D900/24,\"\")","v":""},null,{"$f":"IFERROR(I900/D900/24,\"\")","v":""},{"$f":"IFERROR(L900/D900/24,\"\")","v":""},null,null,null,null,"",{"$f":"IFERROR(ROUND(SUM(L900*P900),2),\"\")","v":""},null,2]
["",null,null,"",null,"",null,"",null,"","",null,null,null,null,"","",null,2]
["",null,null,"",null,"",null,"",null,"","",null,null,null,null,"","",null,2]
["",null,null,"",null,"",null,"",null,"","",null,null,null,null,"","",null,2]
["",null,null,"",null,"",null,"",null,"","",null,null,null,null,"","",null,2]
["",null,null,"",null,"",null,"",null,"","",null,null,null,null,"","",null,2]
["",null,null,"",null,"",null,"",null,"","",null,null,null,null,"","",null,2]
["",null,null,"",null,"",null,"",null,"","",null,null,null,null,"","",null,2]
["",null,null,"",null,"",null,"",null,"","",null,null,null,null,"","",null,2]
["",null,null,"",null,"",null,"",null,"","",null,null,null,null,"","",null,2]
["",null,null,"",null,"",null,"",null,"","",null,null,null,null,"","",null,2]
["",null,null,"",null,"",null,"",null,"","",null,null,null,null,"","",null,2]
["",null,null,"",null,"",null,"",null,"","",null,null,null,null,"","",null,2]
["",null,null,"",null,"",null,"",null,"","",null,null,null,null,"","",null,2]
["",null,null,"",null,"",null,"",null,"","",null,null,null,null,"","",null,2]
["",null,null,"",null,"",null,"",null,"","",null,null,null,null,"","",null,2]
["",null,null,"",null,"",null,"",null,"","",null,null,null,null,"","",null,2]
["",null,null,"",null,"",null,"",null,"","",null,null,null,null,"","",null,2]
["",null,null,"",null,"",null,"",null,"","",null,null,null,null,"","",null,2]
["",null,null,"",null,"",null,"",null,"","",null,null,null,null,"","",null,2]
["",null,null,"",null,"",null,"",null,"","",null,null,null,null,"","",null,2]
["",null,null,"",null,"",null,"",null,"","",null,null,null,null,"","",null,2]
["",null,null,"",null,"",null,"",null,"","",null,null,null,null,{"$f":"IFERROR(ROUND(SUM(1000/M922),2),\"\")","v":""},"",null,2]
["",null,null,"",null,"",null,"",null,"","",null,null,null,null,"","",null,2]
["",null,null,"",null,"",null,"",null,"","",null,null,null,null,"","",null,2]
["",null,null,"",null,"",null,"",null,"","",null,null,null,null,"","",null,2]
["",null,null,"",null,"",null,"",null,"","",null,null,null,null,"","",null,2]
["",null,null,"",null,"",null,"",null,"","",null,null,null,null,"","",null,2]
["",null,null,"",null,"",null,"",null,"","",null,null,null,null,"","",null,2]
["",null,null,"",null,"",null,"",null,"","",null,null,null,null,"","",null,2]
["",null,null,"",null,"",null,"",null,"","",null,null,null,null,"","",null,2]
["",null,null,"",null,"",null,"",null,"","",null,null,null,null,"","",null,2]
["",null,null,"",null,"",null,"",null,"","",null,null,null,null,"","",null,2]
["",null,null,"",null,"",null,"",null,"","",null,null,null,null,"","",null,2]
["",null,null,"",null,"",null,"",null,"","",null,null,null,null,"","",null,2]
["",null,null,"",null,"",null,"",null,"","",null,null,null,null,"","",null,2]
["",null,null,"",null,"",null,"",null,"","",null,null,null,null,"","",null,2]
["",null,null,"",null,"",null,"",null,"","",null,null,null,null,"","",null,2]
["",null,null,"",null,"",null,"",null,"","",null,null,null,null,"","",null,2]
["",null,null,"",null,"",null,"",null,"","",null,null,null,null,"","",null,2]
["",null,null,"",null,"",null,"",null,"","",null,null,null,null,"","",null,2]
["",null,null,"",null,"",null,"",null,"","",null,null,null,null,"","",null,2]
["",null,null,"",null,"",null,"",null,"","",null,null,null,null,"","",null,2]
["",null,null,"",null,"",null,"",null,"","",null,null,null,null,"","",null,2]
["",null,null,"",null,"",null,"",null,"","",null,null,null,null,"","",null,2]
["",null,null,"",null,"",null,"",null,"","",null,null,null,null,"","",null,2]
["",null,null,"",null,"",null,"",null,"","",null,null,null,null,"","",null,2]
["",null,null,"",null,"",null,"",null,"","",null,null,null,null,"","",null,2]
["",null,null,"",null,"",null,"",null,"","",null,null,null,null,"","",null,2]
["",null,null,"",null,"",null,"",null,"","",null,null,null,null,"","",null,2]
["",null,null,"",null,"",null,"",null,"","",null,null,null,null,"","",null,2]
["",null,null,"",null,"",null,"",null,"","",null,null,null,null,"","",null,2]
["",null,null,"",null,"",null,"",null,"","",null,null,null,null,"","",null,2]
["",null,null,"",null,"",null,"",null,"","",null,null,null,null,"","",null,2]
["",null,null,"",null,"",null,"",null,"","",null,null,null,null,"","",null,2]
["",null,null,"",null,"",null,"",null,"","",null,null,null,null,"","",null,2]
["",null,null,"",null,"",null,"",null,"","",null,null,null,null,"","",null,2]
["",null,null,"",null,"",null,"",null,"","",null,null,null,null,"","",null,2]
["",null,null,"",null,"",null,"",null,"","",null,null,null,null,"","",null,2]
["",null,null,"",null,"",null,"",null,"","",null,null,null,null,"","",null,2]
["",null,null,"",null,"",null,"",null,"","",null,null,null,null,"","",null,2]
["",null,null,"",null,"",null,"",null,"","",null,null,null,null,"","",null,2]
["",null,null,"",null,"",null,"",null,"","",null,null,null,null,"","",null,2]
["",null,null,"",null,"",null,"",null,"","",null,null,null,null,"","",null,2]
[{"$f":"IF(E964=\"\",\"\",IF(A964=\"\",TODAY(),A964))","v":""},null,null,{"$f":"IF(B964=\"\",\"\",(C964-B964))","v":""},null,{"$f":"IFERROR(VLOOKUP(E964,AG963:AI1277,2,FALSE),\"\")","v":""},null,{"$f":"IFERROR(G964/D964/24,\"\")","v":""},null,{"$f":"IFERROR(I964/D964/24,\"\")","v":""},{"$f":"IFERROR(L964/D964/24,\"\")","v":""},null,null,null,null,"",{"$f":"IFERROR(ROUND(SUM(L964*P964),2),\"\")","v":""},null,2]
["",null,null,"",null,"",null,"",null,"","",null,null,null,null,"","",null,2]
["",null,null,"",null,"",null,"",null,"","",null,null,null,null,"","",null,2]
["",null,null,"",null,"",null,"",null,"","",null,null,null,null,"","",null,2]
["",null,null,"",null,"",null,"",null,"","",null,null,null,null,"","",null,2]
["",null,null,"",null,"",null,"",null,"","",null,null,null,null,"","",null,2]
["",null,null,"",null,"",null,"",null,"","",null,null,null,null,"","",null,2]
["",null,null,"",null,"",null,"",null,"","",null,null,null,null,"","",null,2]
["",null,null,"",null,"",null,"",null,"","",null,null,null,null,"","",null,2]
["",null,null,"",null,"",null,"",null,"","",null,null,null,null,"","",null,2]
["",null,null,"",null,"",null,"",null,"","",null,null,null,null,"","",null,2]
["",null,null,"",null,"",null,"",null,"","",null,null,null,null,"","",null,2]
["",null,null,"",null,"",null,"",null,"","",null,null,null,null,"","",null,2]
["",null,null,"",null,"",null,"",null,"","",null,null,null,null,"","",null,2]
["",null,null,"",null,"",null,"",null,"","",null,null,null,null,"","",null,2]
["",null,null,"",null,"",null,"",null,"","",null,null,null,null,"","",null,2]
["",null,null,"",null,"",null,"",null,"","",null,null,null,null,"","",null,2]
["",null,null,"",null,"",null,"",null,"","",null,null,null,null,"","",null,2]
["",null,null,"",null,"",null,"",null,"","",null,null,null,null,"","",null,2]
["",null,null,"",null,"",null,"",null,"","",null,null,null,null,"","",null,2]
["",null,null,"",null,"",null,"",null,"","",null,null,null,null,"","",null,2]
["",null,null,"",null,"",null,"",null,"","",null,null,null,null,"","",null,2]
["",null,null,"",null,"",null,"",null,"","",null,null,null,null,{"$f":"IFERROR(ROUND(SUM(1000/M986),2),\"\")","v":""},"",null,2]
["",null,null,"",null,"",null,"",null,"","",null,null,null,null,"","",null,2]
["",null,null,"",null,"",null,"",null,"","",null,null,null,null,"","",null,2]
["",null,null,"",null,"",null,"",null,"","",null,null,null,null,"","",null,2]
["",null,null,"",null,"",null,"",null,"","",null,null,null,null,"","",null,2]
["",null,null,"",null,"",null,"",null,"","",null,null,null,null,"","",null,2]
["",null,null,"",null,"",null,"",null,"","",null,null,null,null,"","",null,2]
["",null,null,"",null,"",null,"",null,"","",null,null,null,null,"","",null,2]
["",null,null,"",null,"",null,"",null,"","",null,null,null,null,"","",null,2]
["",null,null,"",null,"",null,"",null,"","",null,null,null,null,"","",null,2]
["",null,null,"",null,"",null,"",null,"","",null,null,null,null,"","",null,2]
["",null,null,"",null,"",null,"",null,"","",null,null,null,null,"","",null,2]
["",null,null,"",null,"",null,"",null,"","",null,null,null,null,"","",null,2]
["",null,null,"",null,"",null,"",null,"","",null,null,null,null,"","",null,2]
["",null,null,"",null,"",null,"",null,"","",null,null,null,null,"","",null,2]
["",null,null,"",null,"",null,"",null,"","",null,null,null,null,"","",null,2]
["",null,null,"",null,"",null,"",null,"","",null,null,null,null,"","",null,2]
["",null,null,"",null,"",null,"",null,"","",null,null,null,null,"","",null,2]
["",null,null,"",null,"",null,"",null,"","",null,null,null,null,"","",null,2]
["",null,null,"",null,"",null,"",null,"","",null,null,null,null,"","",null,2]
["",null,null,"",null,"",null,"",null,"","",null,null,null,null,"","",null,2]
["",null,null,"",null,"",null,"",null,"","",null,null,null,null,"","",null,2]
["",null,null,"",null,"",null,"",null,"","",null,null,null,null,"","",null,2]
["",null,null,"",null,"",null,"",null,"","",null,null,null,null,"","",null,2]
["",null,null,"",null,"",null,"",null,"","",null,null,null,null,"","",null,2]
["",null,null,"",null,"",null,"",null,"","",null,null,null,null,"","",null,2]
["",null,null,"",null,"",null,"",null,"","",null,null,null,null,"","",null,2]
["",null,null,"",null,"",null,"",null,"","",null,null,null,null,"","",null,2]
["",null,null,"",null,"",null,"",null,"","",null,null,null,null,"","",null,2]
["",null,null,"",null,"",null,"",null,"","",null,null,null,null,"","",null,2]
["",null,null,"",null,"",null,"",null,"","",null,null,null,null,"","",null,2]
["",null,null,"",null,"",null,"",null,"","",null,null,null,null,"","",null,2]
["",null,null,"",null,"",null,"",null,"","",null,null,null,null,"","",null,2]
["",null,null,"",null,"",null,"",null,"","",null,null,null,null,"","",null,2]
["",null,null,"",null,"",null,"",null,"","",null,null,null,null,"","",null,2]
["",null,null,"",null,"",null,"",null,"","",null,null,null,null,"","",null,2]
["",null,null,"",null,"",null,"",null,"","",null,null,null,null,"","",null,2]
["",null,null,"",null,"",null,"",null,"","",null,null,null,null,"","",null,2]
["",null,null,"",null,"",null,"",null,"","",null,null,null,null,"","",null,2]
["",null,null,"",null,"",null,"",null,"","",null,null,null,null,"","",null,2]
["",null,null,"",null,"",null,"",null,"","",null,null,null,null,"","",null,2]
["",null,null,"",null,"",null,"",null,"","",null,null,null,null,"","",null,2]
[{"$f":"IF(E1028=\"\",\"\",IF(A1028=\"\",TODAY(),A1028))","v":""},null,null,{"$f":"IF(B1028=\"\",\"\",(C1028-B1028))","v":""},null,{"$f":"IFERROR(VLOOKUP(E1028,AG1027:AI1341,2,FALSE),\"\")","v":""},null,{"$f":"IFERROR(G1028/D1028/24,\"\")","v":""},null,{"$f":"IFERROR(I1028/D1028/24,\"\")","v":""},{"$f":"IFERROR(L1028/D1028/24,\"\")","v":""},null,null,null,null,"",{"$f":"IFERROR(ROUND(SUM(L1028*P1028),2),\"\")","v":""},null,2]
["",null,null,"",null,"",null,"",null,"","",null,null,null,null,"","",null,2]
["",null,null,"",null,"",null,"",null,"","",null,null,null,null,"","",null,2]
["",null,null,"",null,"",null,"",null,"","",null,null,null,null,"","",null,2]
["",null,null,"",null,"",null,"",null,"","",null,null,null,null,"","",null,2]
["",null,null,"",null,"",null,"",null,"","",null,null,null,null,"","",null,2]
["",null,null,"",null,"",null,"",null,"","",null,null,null,null,"","",null,2]
["",null,null,"",null,"",null,"",null,"","",null,null,null,null,"","",null,2]
["",null,null,"",null,"",null,"",null,"","",null,null,null,null,"","",null,2]
["",null,null,"",null,"",null,"",null,"","",null,null,null,null,"","",null,2]
["",null,null,"",null,"",null,"",null,"","",null,null,null,null,"","",null,2]
["",null,null,"",null,"",null,"",null,"","",null,null,null,null,"","",null,2]
["",null,null,"",null,"",null,"",null,"","",null,null,null,null,"","",null,2]
["",null,null,"",null,"",null,"",null,"","",null,null,null,null,"","",null,2]
["",null,null,"",null,"",null,"",null,"","",null,null,null,null,"","",null,2]
["",null,null,"",null,"",null,"",null,"","",null,null,null,null,"","",null,2]
["",null,null,"",null,"",null,"",null,"","",null,null,null,null,"","",null,2]
["",null,null,"",null,"",null,"",null,"","",null,null,null,null,"","",null,2]
["",null,null,"",null,"",null,"",null,"","",null,null,null,null,"","",null,2]
["",null,null,"",null,"",null,"",null,"","",null,null,null,null,"","",null,2]
["",null,null,"",null,"",null,"",null,"","",null,null,null,null,"","",null,2]
["",null,null,"",null,"",null,"",null,"","",null,null,null,null,"","",null,2]
["",null,null,"",null,"",null,"",null,"","",null,null,null,null,{"$f":"IFERROR(ROUND(SUM(1000/M1050),2),\"\")","v":""},"",null,2]
["",null,null,"",null,"",null,"",null,"","",null,null,null,null,"","",null,2]
["",null,null,"",null,"",null,"",null,"","",null,null,null,null,"","",null,2]
["",null,null,"",null,"",null,"",null,"","",null,null,null,null,"","",null,2]
["",null,null,"",null,"",null,"",null,"","",null,null,null,null,"","",null,2]
["",null,null,"",null,"",null,"",null,"","",null,null,null,null,"","",null,2]
["",null,null,"",null,"",null,"",null,"","",null,null,null,null,"","",null,2]
["",null,null,"",null,"",null,"",null,"","",null,null,null,null,"","",null,2]
["",null,null,"",null,"",null,"",null,"","",null,null,null,null,"","",null,2]
["",null,null,"",null,"",null,"",null,"","",null,null,null,null,"","",null,2]
["",null,null,"",null,"",null,"",null,"","",null,null,null,null,"","",null,2]
["",null,null,"",null,"",null,"",null,"","",null,null,null,null,"","",null,2]
["",null,null,"",null,"",null,"",null,"","",null,null,null,null,"","",null,2]
["",null,null,"",null,"",null,"",null,"","",null,null,null,null,"","",null,2]
["",null,null,"",null,"",null,"",null,"","",null,null,null,null,"","",null,2]
["",null,null,"",null,"",null,"",null,"","",null,null,null,null,"","",null,2]
["",null,null,"",null,"",null,"",null,"","",null,null,null,null,"","",null,2]
["",null,null,"",null,"",null,"",null,"","",null,null,null,null,"","",null,2]
["",null,null,"",null,"",null,"",null,"","",null,null,null,null,"","",null,2]
["",null,null,"",null,"",null,"",null,"","",null,null,null,null,"","",null,2]
["",null,null,"",null,"",null,"",null,"","",null,null,null,null,"","",null,2]
["",null,null,"",null,"",null,"",null,"","",null,null,null,null,"","",null,2]
["",null,null,"",null,"",null,"",null,"","",null,null,null,null,"","",null,2]
["",null,null,"",null,"",null,"",null,"","",null,null,null,null,"","",null,2]
["",null,null,"",null,"",null,"",null,"","",null,null,null,null,"","",null,2]
["",null,null,"",null,"",null,"",null,"","",null,null,null,null,"","",null,2]
["",null,null,"",null,"",null,"",null,"","",null,null,null,null,"","",null,2]
["",null,null,"",null,"",null,"",null,"","",null,null,null,null,"","",null,2]
["",null,null,"",null,"",null,"",null,"","",null,null,null,null,"","",null,2]
["",null,null,"",null,"",null,"",null,"","",null,null,null,null,"","",null,2]
["",null,null,"",null,"",null,"",null,"","",null,null,null,null,"","",null,2]
["",null,null,"",null,"",null,"",null,"","",null,null,null,null,"","",null,2]
["",null,null,"",null,"",null,"",null,"","",null,null,null,null,"","",null,2]
["",null,null,"",null,"",null,"",null,"","",null,null,null,null,"","",null,2]
["",null,null,"",null,"",null,"",null,"","",null,null,null,null,"","",null,2]
["",null,null,"",null,"",null,"",null,"","",null,null,null,null,"","",null,2]
["",null,null,"",null,"",null,"",null,"","",null,null,null,null,"","",null,2]
["",null,null,"",null,"",null,"",null,"","",null,null,null,null,"","",null,2]
["",null,null,"",null,"",null,"",null,"","",null,null,null,null,"","",null,2]
["",null,null,"",null,"",null,"",null,"","",null,null,null,null,"","",null,2]
["",null,null,"",null,"",null,"",null,"","",null,null,null,null,"","",null,2]
["",null,null,"",null,"",null,"",null,"","",null,null,null,null,"","",null,2]
[{"$f":"IF(E1092=\"\",\"\",IF(A1092=\"\",TODAY(),A1092))","v":""},null,null,{"$f":"IF(B1092=\"\",\"\",(C1092-B1092))","v":""},null,{"$f":"IFERROR(VLOOKUP(E1092,AG1091:AI1405,2,FALSE),\"\")","v":""},null,{"$f":"IFERROR(G1092/D1092/24,\"\")","v":""},null,{"$f":"IFERROR(I1092/D1092/24,\"\")","v":""},{"$f":"IFERROR(L1092/D1092/24,\"\")","v":""},null,null,null,null,"",{"$f":"IFERROR(ROUND(SUM(L1092*P1092),2),\"\")","v":""},null,2]
["",null,null,"",null,"",null,"",null,"","",null,null,null,null,"","",null,2]
["",null,null,"",null,"",null,"",null,"","",null,null,null,null,"","",null,2]
["",null,null,"",null,"",null,"",null,"","",null,null,null,null,"","",null,2]
["",null,null,"",null,"",null,"",null,"","",null,null,null,null,"","",null,2]
["",null,null,"",null,"",null,"",null,"","",null,null,null,null,"","",null,2]
["",null,null,"",null,"",null,"",null,"","",null,null,null,null,"","",null,2]
["",null,null,"",null,"",null,"",null,"","",null,null,null,null,"","",null,2]
["",null,null,"",null,"",null,"",null,"","",null,null,null,null,"","",null,2]
["",null,null,"",null,"",null,"",null,"","",null,null,null,null,"","",null,2]
["",null,null,"",null,"",null,"",null,"","",null,null,null,null,"","",null,2]
["",null,null,"",null,"",null,"",null,"","",null,null,null,null,"","",null,2]
["",null,null,"",null,"",null,"",null,"","",null,null,null,null,"","",null,2]
["",null,null,"",null,"",null,"",null,"","",null,null,null,null,"","",null,2]
["",null,null,"",null,"",null,"",null,"","",null,null,null,null,"","",null,2]
["",null,null,"",null,"",null,"",null,"","",null,null,null,null,"","",null,2]
["",null,null,"",null,"",null,"",null,"","",null,null,null,null,"","",null,2]
["",null,null,"",null,"",null,"",null,"","",null,null,null,null,"","",null,2]
["",null,null,"",null,"",null,"",null,"","",null,null,null,null,"","",null,2]
["",null,null,"",null,"",null,"",null,"","",null,null,null,null,"","",null,2]
["",null,null,"",null,"",null,"",null,"","",null,null,null,null,"","",null,2]
["",null,null,"",null,"",null,"",null,"","",null,null,null,null,"","",null,2]
["",null,null,"",null,"",null,"",null,"","",null,null,null,null,{"$f":"IFERROR(ROUND(SUM(1000/M1114),2),\"\")","v":""},"",null,2]
["",null,null,"",null,"",null,"",null,"","",null,null,null,null,"","",null,2]
["",null,null,"",null,"",null,"",null,"","",null,null,null,null,"","",null,2]
["",null,null,"",null,"",null,"",null,"","",null,null,null,null,"","",null,2]
["",null,null,"",null,"",null,"",null,"","",null,null,null,null,"","",null,2]
["",null,null,"",null,"",null,"",null,"","",null,null,null,null,"","",null,2]
["",null,null,"",null,"",null,"",null,"","",null,null,null,null,"","",null,2]
["",null,null,"",null,"",null,"",null,"","",null,null,null,null,"","",null,2]
["",null,null,"",null,"",null,"",null,"","",null,null,null,null,"","",null,2]
["",null,null,"",null,"",null,"",null,"","",null,null,null,null,"","",null,2]
["",null,null,"",null,"",null,"",null,"","",null,null,null,null,"","",null,2]
["",null,null,"",null,"",null,"",null,"","",null,null,null,null,"","",null,2]
["",null,null,"",null,"",null,"",null,"","",null,null,null,null,"","",null,2]
["",null,null,"",null,"",null,"",null,"","",null,null,null,null,"","",null,2]
["",null,null,"",null,"",null,"",null,"","",null,null,null,null,"","",null,2]
["",null,null,"",null,"",null,"",null,"","",null,null,null,null,"","",null,2]
["",null,null,"",null,"",null,"",null,"","",null,null,null,null,"","",null,2]
["",null,null,"",null,"",null,"",null,"","",null,null,null,null,"","",null,2]
["",null,null,"",null,"",null,"",null,"","",null,null,null,null,"","",null,2]
["",null,null,"",null,"",null,"",null,"","",null,null,null,null,"","",null,2]
["",null,null,"",null,"",null,"",null,"","",null,null,null,null,"","",null,2]
["",null,null,"",null,"",null,"",null,"","",null,null,null,null,"","",null,2]
["",null,null,"",null,"",null,"",null,"","",null,null,null,null,"","",null,2]
["",null,null,"",null,"",null,"",null,"","",null,null,null,null,"","",null,2]
["",null,null,"",null,"",null,"",null,"","",null,null,null,null,"","",null,2]
["",null,null,"",null,"",null,"",null,"","",null,null,null,null,"","",null,2]
["",null,null,"",null,"",null,"",null,"","",null,null,null,null,"","",null,2]
["",null,null,"",null,"",null,"",null,"","",null,null,null,null,"","",null,2]
["",null,null,"",null,"",null,"",null,"","",null,null,null,null,"","",null,2]
["",null,null,"",null,"",null,"",null,"","",null,null,null,null,"","",null,2]
["",null,null,"",null,"",null,"",null,"","",null,null,null,null,"","",null,2]
["",null,null,"",null,"",null,"",null,"","",null,null,null,null,"","",null,2]
["",null,null,"",null,"",null,"",null,"","",null,null,null,null,"","",null,2]
["",null,null,"",null,"",null,"",null,"","",null,null,null,null,"","",null,2]
["",null,null,"",null,"",null,"",null,"","",null,null,null,null,"","",null,2]
["",null,null,"",null,"",null,"",null,"","",null,null,null,null,"","",null,2]
["",null,null,"",null,"",null,"",null,"","",null,null,null,null,"","",null,2]
["",null,null,"",null,"",null,"",null,"","",null,null,null,null,"","",null,2]
["",null,null,"",null,"",null,"",null,"","",null,null,null,null,"","",null,2]
["",null,null,"",null,"",null,"",null,"","",null,null,null,null,"","",null,2]
["",null,null,"",null,"",null,"",null,"","",null,null,null,null,"","",null,2]
["",null,null,"",null,"",null,"",null,"","",null,null,null,null,"","",null,2]
[{"$f":"IF(E1156=\"\",\"\",IF(A1156=\"\",TODAY(),A1156))","v":""},null,null,{"$f":"IF(B1156=\"\",\"\",(C1156-B1156))","v":""},null,{"$f":"IFERROR(VLOOKUP(E1156,AG1155:AI1469,2,FALSE),\"\")","v":""},null,{"$f":"IFERROR(G1156/D1156/24,\"\")","v":""},null,{"$f":"IFERROR(I1156/D1156/24,\"\")","v":""},{"$f":"IFERROR(L1156/D1156/24,\"\")","v":""},null,null,null,null,"",{"$f":"IFERROR(ROUND(SUM(L1156*P1156),2),\"\")","v":""},null,2]
["",null,null,"",null,"",null,"",null,"","",null,null,null,null,"","",null,2]
["",null,null,"",null,"",null,"",null,"","",null,null,null,null,"","",null,2]
["",null,null,"",null,"",null,"",null,"","",null,null,null,null,"","",null,2]
["",null,null,"",null,"",null,"",null,"","",null,null,null,null,"","",null,2]
["",null,null,"",null,"",null,"",null,"","",null,null,null,null,"","",null,2]
["",null,null,"",null,"",null,"",null,"","",null,null,null,null,"","",null,2]
["",null,null,"",null,"",null,"",null,"","",null,null,null,null,"","",null,2]
["",null,null,"",null,"",null,"",null,"","",null,null,null,null,"","",null,2]
["",null,null,"",null,"",null,"",null,"","",null,null,null,null,"","",null,2]
["",null,null,"",null,"",null,"",null,"","",null,null,null,null,"","",null,2]
["",null,null,"",null,"",null,"",null,"","",null,null,null,null,"","",null,2]
["",null,null,"",null,"",null,"",null,"","",null,null,null,null,"","",null,2]
["",null,null,"",null,"",null,"",null,"","",null,null,null,null,"","",null,2]
["",null,null,"",null,"",null,"",null,"","",null,null,null,null,"","",null,2]
["",null,null,"",null,"",null,"",null,"","",null,null,null,null,"","",null,2]
["",null,null,"",null,"",null,"",null,"","",null,null,null,null,"","",null,2]
["",null,null,"",null,"",null,"",null,"","",null,null,null,null,"","",null,2]
["",null,null,"",null,"",null,"",null,"","",null,null,null,null,"","",null,2]
["",null,null,"",null,"",null,"",null,"","",null,null,null,null,"","",null,2]
["",null,null,"",null,"",null,"",null,"","",null,null,null,null,"","",null,2]
["",null,null,"",null,"",null,"",null,"","",null,null,null,null,"","",null,2]
["",null,null,"",null,"",null,"",null,"","",null,null,null,null,{"$f":"IFERROR(ROUND(SUM(1000/M1178),2),\"\")","v":""},"",null,2]
["",null,null,"",null,"",null,"",null,"","",null,null,null,null,"","",null,2]
["",null,null,"",null,"",null,"",null,"","",null,null,null,null,"","",null,2]
["",null,null,"",null,"",null,"",null,"","",null,null,null,null,"","",null,2]
["",null,null,"",null,"",null,"",null,"","",null,null,null,null,"","",null,2]
["",null,null,"",null,"",null,"",null,"","",null,null,null,null,"","",null,2]
["",null,null,"",null,"",null,"",null,"","",null,null,null,null,"","",null,2]
["",null,null,"",null,"",null,"",null,"","",null,null,null,null,"","",null,2]
["",null,null,"",null,"",null,"",null,"","",null,null,null,null,"","",null,2]
["",null,null,"",null,"",null,"",null,"","",null,null,null,null,"","",null,2]
["",null,null,"",null,"",null,"",null,"","",null,null,null,null,"","",null,2]
["",null,null,"",null,"",null,"",null,"","",null,null,null,null,"","",null,2]
["",null,null,"",null,"",null,"",null,"","",null,null,null,null,"","",null,2]
["",null,null,"",null,"",null,"",null,"","",null,null,null,null,"","",null,2]
["",null,null,"",null,"",null,"",null,"","",null,null,null,null,"","",null,2]
["",null,null,"",null,"",null,"",null,"","",null,null,null,null,"","",null,2]
["",null,null,"",null,"",null,"",null,"","",null,null,null,null,"","",null,2]
["",null,null,"",null,"",null,"",null,"","",null,null,null,null,"","",null,2]
["",null,null,"",null,"",null,"",null,"","",null,null,null,null,"","",null,2]
["",null,null,"",null,"",null,"",null,"","",null,null,null,null,"","",null,2]
["",null,null,"",null,"",null,"",null,"","",null,null,null,null,"","",null,2]
["",null,null,"",null,"",null,"",null,"","",null,null,null,null,"","",null,2]
["",null,null,"",null,"",null,"",null,"","",null,null,null,null,"","",null,2]
["",null,null,"",null,"",null,"",null,"","",null,null,null,null,"","",null,2]
["",null,null,"",null,"",null,"",null,"","",null,null,null,null,"","",null,2]
["",null,null,"",null,"",null,"",null,"","",null,null,null,null,"","",null,2]
["",null,null,"",null,"",null,"",null,"","",null,null,null,null,"","",null,2]
["",null,null,"",null,"",null,"",null,"","",null,null,null,null,"","",null,2]
["",null,null,"",null,"",null,"",null,"","",null,null,null,null,"","",null,2]
["",null,null,"",null,"",null,"",null,"","",null,null,null,null,"","",null,2]
["",null,null,"",null,"",null,"",null,"","",null,null,null,null,"","",null,2]
["",null,null,"",null,"",null,"",null,"","",null,null,null,null,"","",null,2]
["",null,null,"",null,"",null,"",null,"","",null,null,null,null,"","",null,2]
["",null,null,"",null,"",null,"",null,"","",null,null,null,null,"","",null,2]
["",null,null,"",null,"",null,"",null,"","",null,null,null,null,"","",null,2]
["",null,null,"",null,"",null,"",null,"","",null,null,null,null,"","",null,2]
["",null,null,"",null,"",null,"",null,"","",null,null,null,null,"","",null,2]
["",null,null,"",null,"",null,"",null,"","",null,null,null,null,"","",null,2]
["",null,null,"",null,"",null,"",null,"","",null,null,null,null,"","",null,2]
["",null,null,"",null,"",null,"",null,"","",null,null,null,null,"","",null,2]
["",null,null,"",null,"",null,"",null,"","",null,null,null,null,"","",null,2]
["",null,null,"",null,"",null,"",null,"","",null,null,null,null,"","",null,2]
[{"$f":"IF(E1220=\"\",\"\",IF(A1220=\"\",TODAY(),A1220))","v":""},null,null,{"$f":"IF(B1220=\"\",\"\",(C1220-B1220))","v":""},null,{"$f":"IFERROR(VLOOKUP(E1220,AG1219:AI1533,2,FALSE),\"\")","v":""},null,{"$f":"IFERROR(G1220/D1220/24,\"\")","v":""},null,{"$f":"IFERROR(I1220/D1220/24,\"\")","v":""},{"$f":"IFERROR(L1220/D1220/24,\"\")","v":""},null,null,null,null,"",{"$f":"IFERROR(ROUND(SUM(L1220*P1220),2),\"\")","v":""},null,2]
["",null,null,"",null,"",null,"",null,"","",null,null,null,null,"","",null,2]
["",null,null,"",null,"",null,"",null,"","",null,null,null,null,"","",null,2]
["",null,null,"",null,"",null,"",null,"","",null,null,null,null,"","",null,2]
["",null,null,"",null,"",null,"",null,"","",null,null,null,null,"","",null,2]
["",null,null,"",null,"",null,"",null,"","",null,null,null,null,"","",null,2]
["",null,null,"",null,"",null,"",null,"","",null,null,null,null,"","",null,2]
["",null,null,"",null,"",null,"",null,"","",null,null,null,null,"","",null,2]
["",null,null,"",null,"",null,"",null,"","",null,null,null,null,"","",null,2]
["",null,null,"",null,"",null,"",null,"","",null,null,null,null,"","",null,2]
["",null,null,"",null,"",null,"",null,"","",null,null,null,null,"","",null,2]
["",null,null,"",null,"",null,"",null,"","",null,null,null,null,"","",null,2]
["",null,null,"",null,"",null,"",null,"","",null,null,null,null,"","",null,2]
["",null,null,"",null,"",null,"",null,"","",null,null,null,null,"","",null,2]
["",null,null,"",null,"",null,"",null,"","",null,null,null,null,"","",null,2]
["",null,null,"",null,"",null,"",null,"","",null,null,null,null,"","",null,2]
["",null,null,"",null,"",null,"",null,"","",null,null,null,null,"","",null,2]
["",null,null,"",null,"",null,"",null,"","",null,null,null,null,"","",null,2]
["",null,null,"",null,"",null,"",null,"","",null,null,null,null,"","",null,2]
["",null,null,"",null,"",null,"",null,"","",null,null,null,null,"","",null,2]
["",null,null,"",null,"",null,"",null,"","",null,null,null,null,"","",null,2]
["",null,null,"",null,"",null,"",null,"","",null,null,null,null,"","",null,2]
["",null,null,"",null,"",null,"",null,"","",null,null,null,null,{"$f":"IFERROR(ROUND(SUM(1000/M1242),2),\"\")","v":""},"",null,2]
["",null,null,"",null,"",null,"",null,"","",null,null,null,null,"","",null,2]
["",null,null,"",null,"",null,"",null,"","",null,null,null,null,"","",null,2]
["",null,null,"",null,"",null,"",null,"","",null,null,null,null,"","",null,2]
["",null,null,"",null,"",null,"",null,"","",null,null,null,null,"","",null,2]
["",null,null,"",null,"",null,"",null,"","",null,null,null,null,"","",null,2]
["",null,null,"",null,"",null,"",null,"","",null,null,null,null,"","",null,2]
["",null,null,"",null,"",null,"",null,"","",null,null,null,null,"","",null,2]
["",null,null,"",null,"",null,"",null,"","",null,null,null,null,"","",null,2]
["",null,null,"",null,"",null,"",null,"","",null,null,null,null,"","",null,2]
["",null,null,"",null,"",null,"",null,"","",null,null,null,null,"","",null,2]
["",null,null,"",null,"",null,"",null,"","",null,null,null,null,"","",null,2]
["",null,null,"",null,"",null,"",null,"","",null,null,null,null,"","",null,2]
["",null,null,"",null,"",null,"",null,"","",null,null,null,null,"","",null,2]
["",null,null,"",null,"",null,"",null,"","",null,null,null,null,"","",null,2]
["",null,null,"",null,"",null,"",null,"","",null,null,null,null,"","",null,2]
["",null,null,"",null,"",null,"",null,"","",null,null,null,null,"","",null,2]
["",null,null,"",null,"",null,"",null,"","",null,null,null,null,"","",null,2]
["",null,null,"",null,"",null,"",null,"","",null,null,null,null,"","",null,2]
["",null,null,"",null,"",null,"",null,"","",null,null,null,null,"","",null,2]
["",null,null,"",null,"",null,"",null,"","",null,null,null,null,"","",null,2]
["",null,null,"",null,"",null,"",null,"","",null,null,null,null,"","",null,2]
["",null,null,"",null,"",null,"",null,"","",null,null,null,null,"","",null,2]
["",null,null,"",null,"",null,"",null,"","",null,null,null,null,"","",null,2]
["",null,null,"",null,"",null,"",null,"","",null,null,null,null,"","",null,2]
["",null,null,"",null,"",null,"",null,"","",null,null,null,null,"","",null,2]
["",null,null,"",null,"",null,"",null,"","",null,null,null,null,"","",null,2]
["",null,null,"",null,"",null,"",null,"","",null,null,null,null,"","",null,2]
["",null,null,"",null,"",null,"",null,"","",null,null,null,null,"","",null,2]
["",null,null,"",null,"",null,"",null,"","",null,null,null,null,"","",null,2]
["",null,null,"",null,"",null,"",null,"","",null,null,null,null,"","",null,2]
["",null,null,"",null,"",null,"",null,"","",null,null,null,null,"","",null,2]
["",null,null,"",null,"",null,"",null,"","",null,null,null,null,"","",null,2]
["",null,null,"",null,"",null,"",null,"","",null,null,null,null,"","",null,2]
["",null,null,"",null,"",null,"",null,"","",null,null,null,null,"","",null,2]
["",null,null,"",null,"",null,"",null,"","",null,null,null,null,"","",null,2]
["",null,null,"",null,"",null,"",null,"","",null,null,null,null,"","",null,2]
["",null,null,"",null,"",null,"",null,"","",null,null,null,null,"","",null,2]
["",null,null,"",null,"",null,"",null,"","",null,null,null,null,"","",null,2]
["",null,null,"",null,"",null,"",null,"","",null,null,null,null,"","",null,2]
["",null,null,"",null,"",null,"",null,"","",null,null,null,null,"","",null,2]
["",null,null,"",null,"",null,"",null,"","",null,null,null,null,"","",null,2]
[{"$f":"IF(E1284=\"\",\"\",IF(A1284=\"\",TODAY(),A1284))","v":""},null,null,{"$f":"IF(B1284=\"\",\"\",(C1284-B1284))","v":""},null,{"$f":"IFERROR(VLOOKUP(E1284,AG1283:AI1597,2,FALSE),\"\")","v":""},null,{"$f":"IFERROR(G1284/D1284/24,\"\")","v":""},null,{"$f":"IFERROR(I1284/D1284/24,\"\")","v":""},{"$f":"IFERROR(L1284/D1284/24,\"\")","v":""},null,null,null,null,"",{"$f":"IFERROR(ROUND(SUM(L1284*P1284),2),\"\")","v":""},null,2]
["",null,null,"",null,"",null,"",null,"","",null,null,null,null,"","",null,2]
["",null,null,"",null,"",null,"",null,"","",null,null,null,null,"","",null,2]
["",null,null,"",null,"",null,"",null,"","",null,null,null,null,"","",null,2]
["",null,null,"",null,"",null,"",null,"","",null,null,null,null,"","",null,2]
["",null,null,"",null,"",null,"",null,"","",null,null,null,null,"","",null,2]
["",null,null,"",null,"",null,"",null,"","",null,null,null,null,"","",null,2]
["",null,null,"",null,"",null,"",null,"","",null,null,null,null,"","",null,2]
["",null,null,"",null,"",null,"",null,"","",null,null,null,null,"","",null,2]
["",null,null,"",null,"",null,"",null,"","",null,null,null,null,"","",null,2]
["",null,null,"",null,"",null,"",null,"","",null,null,null,null,"","",null,2]
["",null,null,"",null,"",null,"",null,"","",null,null,null,null,"","",null,2]
["",null,null,"",null,"",null,"",null,"","",null,null,null,null,"","",null,2]
["",null,null,"",null,"",null,"",null,"","",null,null,null,null,"","",null,2]
["",null,null,"",null,"",null,"",null,"","",null,null,null,null,"","",null,2]
["",null,null,"",null,"",null,"",null,"","",null,null,null,null,"","",null,2]
["",null,null,"",null,"",null,"",null,"","",null,null,null,null,"","",null,2]
["",null,null,"",null,"",null,"",null,"","",null,null,null,null,"","",null,2]
["",null,null,"",null,"",null,"",null,"","",null,null,null,null,"","",null,2]
["",null,null,"",null,"",null,"",null,"","",null,null,null,null,"","",null,2]
["",null,null,"",null,"",null,"",null,"","",null,null,null,null,"","",null,2]
["",null,null,"",null,"",null,"",null,"","",null,null,null,null,"","",null,2]
["",null,null,"",null,"",null,"",null,"","",null,null,null,null,{"$f":"IFERROR(ROUND(SUM(1000/M1306),2),\"\")","v":""},"",null,2]
["",null,null,"",null,"",null,"",null,"","",null,null,null,null,"","",null,2]
["",null,null,"",null,"",null,"",null,"","",null,null,null,null,"","",null,2]
["",null,null,"",null,"",null,"",null,"","",null,null,null,null,"","",null,2]
["",null,null,"",null,"",null,"",null,"","",null,null,null,null,"","",null,2]
["",null,null,"",null,"",null,"",null,"","",null,null,null,null,"","",null,2]
["",null,null,"",null,"",null,"",null,"","",null,null,null,null,"","",null,2]
["",null,null,"",null,"",null,"",null,"","",null,null,null,null,"","",null,2]
["",null,null,"",null,"",null,"",null,"","",null,null,null,null,"","",null,2]
["",null,null,"",null,"",null,"",null,"","",null,null,null,null,"","",null,2]
["",null,null,"",null,"",null,"",null,"","",null,null,null,null,"","",null,2]
["",null,null,"",null,"",null,"",null,"","",null,null,null,null,"","",null,2]
["",null,null,"",null,"",null,"",null,"","",null,null,null,null,"","",null,2]
["",null,null,"",null,"",null,"",null,"","",null,null,null,null,"","",null,2]
["",null,null,"",null,"",null,"",null,"","",null,null,null,null,"","",null,2]
["",null,null,"",null,"",null,"",null,"","",null,null,null,null,"","",null,2]
["",null,null,"",null,"",null,"",null,"","",null,null,null,null,"","",null,2]
["",null,null,"",null,"",null,"",null,"","",null,null,null,null,"","",null,2]
["",null,null,"",null,"",null,"",null,"","",null,null,null,null,"","",null,2]
["",null,null,"",null,"",null,"",null,"","",null,null,null,null,"","",null,2]
["",null,null,"",null,"",null,"",null,"","",null,null,null,null,"","",null,2]
["",null,null,"",null,"",null,"",null,"","",null,null,null,null,"","",null,2]
["",null,null,"",null,"",null,"",null,"","",null,null,null,null,"","",null,2]
["",null,null,"",null,"",null,"",null,"","",null,null,null,null,"","",null,2]
["",null,null,"",null,"",null,"",null,"","",null,null,null,null,"","",null,2]
["",null,null,"",null,"",null,"",null,"","",null,null,null,null,"","",null,2]
["",null,null,"",null,"",null,"",null,"","",null,null,null,null,"","",null,2]
["",null,null,"",null,"",null,"",null,"","",null,null,null,null,"","",null,2]
["",null,null,"",null,"",null,"",null,"","",null,null,null,null,"","",null,2]
["",null,null,"",null,"",null,"",null,"","",null,null,null,null,"","",null,2]
["",null,null,"",null,"",null,"",null,"","",null,null,null,null,"","",null,2]
["",null,null,"",null,"",null,"",null,"","",null,null,null,null,"","",null,2]
["",null,null,"",null,"",null,"",null,"","",null,null,null,null,"","",null,2]
["",null,null,"",null,"",null,"",null,"","",null,null,null,null,"","",null,2]
["",null,null,"",null,"",null,"",null,"","",null,null,null,null,"","",null,2]
["",null,null,"",null,"",null,"",null,"","",null,null,null,null,"","",null,2]
["",null,null,"",null,"",null,"",null,"","",null,null,null,null,"","",null,2]
["",null,null,"",null,"",null,"",null,"","",null,null,null,null,"","",null,2]
["",null,null,"",null,"",null,"",null,"","",null,null,null,null,"","",null,2]
["",null,null,"",null,"",null,"",null,"","",null,null,null,null,"","",null,2]
["",null,null,"",null,"",null,"",null,"","",null,null,null,null,"","",null,2]
["",null,null,"",null,"",null,"",null,"","",null,null,null,null,"","",null,2]
[{"$f":"IF(E1348=\"\",\"\",IF(A1348=\"\",TODAY(),A1348))","v":""},null,null,{"$f":"IF(B1348=\"\",\"\",(C1348-B1348))","v":""},null,{"$f":"IFERROR(VLOOKUP(E1348,AG1347:AI1661,2,FALSE),\"\")","v":""},null,{"$f":"IFERROR(G1348/D1348/24,\"\")","v":""},null,{"$f":"IFERROR(I1348/D1348/24,\"\")","v":""},{"$f":"IFERROR(L1348/D1348/24,\"\")","v":""},null,null,null,null,"",{"$f":"IFERROR(ROUND(SUM(L1348*P1348),2),\"\")","v":""},null,2]
["",null,null,"",null,"",null,"",null,"","",null,null,null,null,"","",null,2]
["",null,null,"",null,"",null,"",null,"","",null,null,null,null,"","",null,2]
["",null,null,"",null,"",null,"",null,"","",null,null,null,null,"","",null,2]
["",null,null,"",null,"",null,"",null,"","",null,null,null,null,"","",null,2]
["",null,null,"",null,"",null,"",null,"","",null,null,null,null,"","",null,2]
["",null,null,"",null,"",null,"",null,"","",null,null,null,null,"","",null,2]
["",null,null,"",null,"",null,"",null,"","",null,null,null,null,"","",null,2]
["",null,null,"",null,"",null,"",null,"","",null,null,null,null,"","",null,2]
["",null,null,"",null,"",null,"",null,"","",null,null,null,null,"","",null,2]
["",null,null,"",null,"",null,"",null,"","",null,null,null,null,"","",null,2]
["",null,null,"",null,"",null,"",null,"","",null,null,null,null,"","",null,2]
["",null,null,"",null,"",null,"",null,"","",null,null,null,null,"","",null,2]
["",null,null,"",null,"",null,"",null,"","",null,null,null,null,"","",null,2]
["",null,null,"",null,"",null,"",null,"","",null,null,null,null,"","",null,2]
["",null,null,"",null,"",null,"",null,"","",null,null,null,null,"","",null,2]
["",null,null,"",null,"",null,"",null,"","",null,null,null,null,"","",null,2]
["",null,null,"",null,"",null,"",null,"","",null,null,null,null,"","",null,2]
["",null,null,"",null,"",null,"",null,"","",null,null,null,null,"","",null,2]
["",null,null,"",null,"",null,"",null,"","",null,null,null,null,"","",null,2]
["",null,null,"",null,"",null,"",null,"","",null,null,null,null,"","",null,2]
["",null,null,"",null,"",null,"",null,"","",null,null,null,null,"","",null,2]
["",null,null,"",null,"",null,"",null,"","",null,null,null,null,{"$f":"IFERROR(ROUND(SUM(1000/M1370),2),\"\")","v":""},"",null,2]
["",null,null,"",null,"",null,"",null,"","",null,null,null,null,"","",null,2]
["",null,null,"",null,"",null,"",null,"","",null,null,null,null,"","",null,2]
["",null,null,"",null,"",null,"",null,"","",null,null,null,null,"","",null,2]
["",null,null,"",null,"",null,"",null,"","",null,null,null,null,"","",null,2]
["",null,null,"",null,"",null,"",null,"","",null,null,null,null,"","",null,2]
["",null,null,"",null,"",null,"",null,"","",null,null,null,null,"","",null,2]
["",null,null,"",null,"",null,"",null,"","",null,null,null,null,"","",null,2]
["",null,null,"",null,"",null,"",null,"","",null,null,null,null,"","",null,2]
["",null,null,"",null,"",null,"",null,"","",null,null,null,null,"","",null,2]
["",null,null,"",null,"",null,"",null,"","",null,null,null,null,"","",null,2]
["",null,null,"",null,"",null,"",null,"","",null,null,null,null,"","",null,2]
["",null,null,"",null,"",null,"",null,"","",null,null,null,null,"","",null,2]
["",null,null,"",null,"",null,"",null,"","",null,null,null,null,"","",null,2]
["",null,null,"",null,"",null,"",null,"","",null,null,null,null,"","",null,2]
["",null,null,"",null,"",null,"",null,"","",null,null,null,null,"","",null,2]
["",null,null,"",null,"",null,"",null,"","",null,null,null,null,"","",null,2]
["",null,null,"",null,"",null,"",null,"","",null,null,null,null,"","",null,2]
["",null,null,"",null,"",null,"",null,"","",null,null,null,null,"","",null,2]
["",null,null,"",null,"",null,"",null,"","",null,null,null,null,"","",null,2]
["",null,null,"",null,"",null,"",null,"","",null,null,null,null,"","",null,2]
["",null,null,"",null,"",null,"",null,"","",null,null,null,null,"","",null,2]
["",null,null,"",null,"",null,"",null,"","",null,null,null,null,"","",null,2]
["",null,null,"",null,"",null,"",null,"","",null,null,null,null,"","",null,2]
["",null,null,"",null,"",null,"",null,"","",null,null,null,null,"","",null,2]
["",null,null,"",null,"",null,"",null,"","",null,null,null,null,"","",null,2]
["",null,null,"",null,"",null,"",null,"","",null,null,null,null,"","",null,2]
["",null,null,"",null,"",null,"",null,"","",null,null,null,null,"","",null,2]
["",null,null,"",null,"",null,"",null,"","",null,null,null,null,"","",null,2]
["",null,null,"",null,"",null,"",null,"","",null,null,null,null,"","",null,2]
["",null,null,"",null,"",null,"",null,"","",null,null,null,null,"","",null,2]
["",null,null,"",null,"",null,"",null,"","",null,null,null,null,"","",null,2]
["",null,null,"",null,"",null,"",null,"","",null,null,null,null,"","",null,2]
["",null,null,"",null,"",null,"",null,"","",null,null,null,null,"","",null,2]
["",null,null,"",null,"",null,"",null,"","",null,null,null,null,"","",null,2]
["",null,null,"",null,"",null,"",null,"","",null,null,null,null,"","",null,2]
["",null,null,"",null,"",null,"",null,"","",null,null,null,null,"","",null,2]
["",null,null,"",null,"",null,"",null,"","",null,null,null,null,"","",null,2]
["",null,null,"",null,"",null,"",null,"","",null,null,null,null,"","",null,2]
["",null,null,"",null,"",null,"",null,"","",null,null,null,null,"","",null,2]
["",null,null,"",null,"",null,"",null,"","",null,null,null,null,"","",null,2]
["",null,null,"",null,"",null,"",null,"","",null,null,null,null,"","",null,2]
[{"$f":"IF(E1412=\"\",\"\",IF(A1412=\"\",TODAY(),A1412))","v":""},null,null,{"$f":"IF(B1412=\"\",\"\",(C1412-B1412))","v":""},null,{"$f":"IFERROR(VLOOKUP(E1412,AG1411:AI1725,2,FALSE),\"\")","v":""},null,{"$f":"IFERROR(G1412/D1412/24,\"\")","v":""},null,{"$f":"IFERROR(I1412/D1412/24,\"\")","v":""},{"$f":"IFERROR(L1412/D1412/24,\"\")","v":""},null,null,null,null,"",{"$f":"IFERROR(ROUND(SUM(L1412*P1412),2),\"\")","v":""},null,2]
["",null,null,"",null,"",null,"",null,"","",null,null,null,null,"","",null,2]
["",null,null,"",null,"",null,"",null,"","",null,null,null,null,"","",null,2]
["",null,null,"",null,"",null,"",null,"","",null,null,null,null,"","",null,2]
["",null,null,"",null,"",null,"",null,"","",null,null,null,null,"","",null,2]
["",null,null,"",null,"",null,"",null,"","",null,null,null,null,"","",null,2]
["",null,null,"",null,"",null,"",null,"","",null,null,null,null,"","",null,2]
["",null,null,"",null,"",null,"",null,"","",null,null,null,null,"","",null,2]
["",null,null,"",null,"",null,"",null,"","",null,null,null,null,"","",null,2]
["",null,null,"",null,"",null,"",null,"","",null,null,null,null,"","",null,2]
["",null,null,"",null,"",null,"",null,"","",null,null,null,null,"","",null,2]
["",null,null,"",null,"",null,"",null,"","",null,null,null,null,"","",null,2]
["",null,null,"",null,"",null,"",null,"","",null,null,null,null,"","",null,2]
["",null,null,"",null,"",null,"",null,"","",null,null,null,null,"","",null,2]
["",null,null,"",null,"",null,"",null,"","",null,null,null,null,"","",null,2]
["",null,null,"",null,"",null,"",null,"","",null,null,null,null,"","",null,2]
["",null,null,"",null,"",null,"",null,"","",null,null,null,null,"","",null,2]
["",null,null,"",null,"",null,"",null,"","",null,null,null,null,"","",null,2]
["",null,null,"",null,"",null,"",null,"","",null,null,null,null,"","",null,2]
["",null,null,"",null,"",null,"",null,"","",null,null,null,null,"","",null,2]
["",null,null,"",null,"",null,"",null,"","",null,null,null,null,"","",null,2]
["",null,null,"",null,"",null,"",null,"","",null,null,null,null,"","",null,2]
["",null,null,"",null,"",null,"",null,"","",null,null,null,null,{"$f":"IFERROR(ROUND(SUM(1000/M1434),2),\"\")","v":""},"",null,2]
["",null,null,"",null,"",null,"",null,"","",null,null,null,null,"","",null,2]
["",null,null,"",null,"",null,"",null,"","",null,null,null,null,"","",null,2]
["",null,null,"",null,"",null,"",null,"","",null,null,null,null,"","",null,2]
["",null,null,"",null,"",null,"",null,"","",null,null,null,null,"","",null,2]
["",null,null,"",null,"",null,"",null,"","",null,null,null,null,"","",null,2]
["",null,null,"",null,"",null,"",null,"","",null,null,null,null,"","",null,2]
["",null,null,"",null,"",null,"",null,"","",null,null,null,null,"","",null,2]
["",null,null,"",null,"",null,"",null,"","",null,null,null,null,"","",null,2]
["",null,null,"",null,"",null,"",null,"","",null,null,null,null,"","",null,2]
["",null,null,"",null,"",null,"",null,"","",null,null,null,null,"","",null,2]
["",null,null,"",null,"",null,"",null,"","",null,null,null,null,"","",null,2]
["",null,null,"",null,"",null,"",null,"","",null,null,null,null,"","",null,2]
["",null,null,"",null,"",null,"",null,"","",null,null,null,null,"","",null,2]
["",null,null,"",null,"",null,"",null,"","",null,null,null,null,"","",null,2]
["",null,null,"",null,"",null,"",null,"","",null,null,null,null,"","",null,2]
["",null,null,"",null,"",null,"",null,"","",null,null,null,null,"","",null,2]
["",null,null,"",null,"",null,"",null,"","",null,null,null,null,"","",null,2]
["",null,null,"",null,"",null,"",null,"","",null,null,null,null,"","",null,2]
["",null,null,"",null,"",null,"",null,"","",null,null,null,null,"","",null,2]
["",null,null,"",null,"",null,"",null,"","",null,null,null,null,"","",null,2]
["",null,null,"",null,"",null,"",null,"","",null,null,null,null,"","",null,2]
["",null,null,"",null,"",null,"",null,"","",null,null,null,null,"","",null,2]
["",null,null,"",null,"",null,"",null,"","",null,null,null,null,"","",null,2]
["",null,null,"",null,"",null,"",null,"","",null,null,null,null,"","",null,2]
["",null,null,"",null,"",null,"",null,"","",null,null,null,null,"","",null,2]
["",null,null,"",null,"",null,"",null,"","",null,null,null,null,"","",null,2]
["",null,null,"",null,"",null,"",null,"","",null,null,null,null,"","",null,2]
["",null,null,"",null,"",null,"",null,"","",null,null,null,null,"","",null,2]
["",null,null,"",null,"",null,"",null,"","",null,null,null,null,"","",null,2]
["",null,null,"",null,"",null,"",null,"","",null,null,null,null,"","",null,2]
["",null,null,"",null,"",null,"",null,"","",null,null,null,null,"","",null,2]
["",null,null,"",null,"",null,"",null,"","",null,null,null,null,"","",null,2]
["",null,null,"",null,"",null,"",null,"","",null,null,null,null,"","",null,2]
["",null,null,"",null,"",null,"",null,"","",null,null,null,null,"","",null,2]
["",null,null,"",null,"",null,"",null,"","",null,null,null,null,"","",null,2]
["",null,null,"",null,"",null,"",null,"","",null,null,null,null,"","",null,2]
["",null,null,"",null,"",null,"",null,"","",null,null,null,null,"","",null,2]
["",null,null,"",null,"",null,"",null,"","",null,null,null,null,"","",null,2]
["",null,null,"",null,"",null,"",null,"","",null,null,null,null,"","",null,2]
["",null,null,"",null,"",null,"",null,"","",null,null,null,null,"","",null,2]
["",null,null,"",null,"",null,"",null,"","",null,null,null,null,"","",null,2]
[{"$f":"IF(E1476=\"\",\"\",IF(A1476=\"\",TODAY(),A1476))","v":""},null,null,{"$f":"IF(B1476=\"\",\"\",(C1476-B1476))","v":""},null,{"$f":"IFERROR(VLOOKUP(E1476,AG1475:AI1789,2,FALSE),\"\")","v":""},null,{"$f":"IFERROR(G1476/D1476/24,\"\")","v":""},null,{"$f":"IFERROR(I1476/D1476/24,\"\")","v":""},{"$f":"IFERROR(L1476/D1476/24,\"\")","v":""},null,null,null,null,"",{"$f":"IFERROR(ROUND(SUM(L1476*P1476),2),\"\")","v":""},null,2]
["",null,null,"",null,"",null,"",null,"","",null,null,null,null,"","",null,2]
["",null,null,"",null,"",null,"",null,"","",null,null,null,null,"","",null,2]
["",null,null,"",null,"",null,"",null,"","",null,null,null,null,"","",null,2]
["",null,null,"",null,"",null,"",null,"","",null,null,null,null,"","",null,2]
["",null,null,"",null,"",null,"",null,"","",null,null,null,null,"","",null,2]
["",null,null,"",null,"",null,"",null,"","",null,null,null,null,"","",null,2]
["",null,null,"",null,"",null,"",null,"","",null,null,null,null,"","",null,2]
["",null,null,"",null,"",null,"",null,"","",null,null,null,null,"","",null,2]
["",null,null,"",null,"",null,"",null,"","",null,null,null,null,"","",null,2]
["",null,null,"",null,"",null,"",null,"","",null,null,null,null,"","",null,2]
["",null,null,"",null,"",null,"",null,"","",null,null,null,null,"","",null,2]
["",null,null,"",null,"",null,"",null,"","",null,null,null,null,"","",null,2]
["",null,null,"",null,"",null,"",null,"","",null,null,null,null,"","",null,2]
["",null,null,"",null,"",null,"",null,"","",null,null,null,null,"","",null,2]
["",null,null,"",null,"",null,"",null,"","",null,null,null,null,"","",null,2]
["",null,null,"",null,"",null,"",null,"","",null,null,null,null,"","",null,2]
["",null,null,"",null,"",null,"",null,"","",null,null,null,null,"","",null,2]
["",null,null,"",null,"",null,"",null,"","",null,null,null,null,"","",null,2]
["",null,null,"",null,"",null,"",null,"","",null,null,null,null,"","",null,2]
["",null,null,"",null,"",null,"",null,"","",null,null,null,null,"","",null,2]
["",null,null,"",null,"",null,"",null,"","",null,null,null,null,"","",null,2]
["",null,null,"",null,"",null,"",null,"","",null,null,null,null,{"$f":"IFERROR(ROUND(SUM(1000/M1498),2),\"\")","v":""},"",null,2]
["",null,null,"",null,"",null,"",null,"","",null,null,null,null,"","",null,2]
["",null,null,"",null,"",null,"",null,"","",null,null,null,null,"","",null,2]
["",null,null,"",null,"",null,"",null,"","",null,null,null,null,"","",null,2]
["",null,null,"",null,"",null,"",null,"","",null,null,null,null,"","",null,2]
["",null,null,"",null,"",null,"",null,"","",null,null,null,null,"","",null,2]
["",null,null,"",null,"",null,"",null,"","",null,null,null,null,"","",null,2]
["",null,null,"",null,"",null,"",null,"","",null,null,null,null,"","",null,2]
["",null,null,"",null,"",null,"",null,"","",null,null,null,null,"","",null,2]
["",null,null,"",null,"",null,"",null,"","",null,null,null,null,"","",null,2]
["",null,null,"",null,"",null,"",null,"","",null,null,null,null,"","",null,2]
["",null,null,"",null,"",null,"",null,"","",null,null,null,null,"","",null,2]
["",null,null,"",null,"",null,"",null,"","",null,null,null,null,"","",null,2]
["",null,null,"",null,"",null,"",null,"","",null,null,null,null,"","",null,2]
["",null,null,"",null,"",null,"",null,"","",null,null,null,null,"","",null,2]
["",null,null,"",null,"",null,"",null,"","",null,null,null,null,"","",null,2]
["",null,null,"",null,"",null,"",null,"","",null,null,null,null,"","",null,2]
["",null,null,"",null,"",null,"",null,"","",null,null,null,null,"","",null,2]
["",null,null,"",null,"",null,"",null,"","",null,null,null,null,"","",null,2]
["",null,null,"",null,"",null,"",null,"","",null,null,null,null,"","",null,2]
["",null,null,"",null,"",null,"",null,"","",null,null,null,null,"","",null,2]
["",null,null,"",null,"",null,"",null,"","",null,null,null,null,"","",null,2]
["",null,null,"",null,"",null,"",null,"","",null,null,null,null,"","",null,2]
["",null,null,"",null,"",null,"",null,"","",null,null,null,null,"","",null,2]
["",null,null,"",null,"",null,"",null,"","",null,null,null,null,"","",null,2]
["",null,null,"",null,"",null,"",null,"","",null,null,null,null,"","",null,2]
["",null,null,"",null,"",null,"",null,"","",null,null,null,null,"","",null,2]
["",null,null,"",null,"",null,"",null,"","",null,null,null,null,"","",null,2]
["",null,null,"",null,"",null,"",null,"","",null,null,null,null,"","",null,2]
["",null,null,"",null,"",null,"",null,"","",null,null,null,null,"","",null,2]
["",null,null,"",null,"",null,"",null,"","",null,null,null,null,"","",null,2]
["",null,null,"",null,"",null,"",null,"","",null,null,null,null,"","",null,2]
["",null,null,"",null,"",null,"",null,"","",null,null,null,null,"","",null,2]
["",null,null,"",null,"",null,"",null,"","",null,null,null,null,"","",null,2]
["",null,null,"",null,"",null,"",null,"","",null,null,null,null,"","",null,2]
["",null,null,"",null,"",null,"",null,"","",null,null,null,null,"","",null,2]
["",null,null,"",null,"",null,"",null,"","",null,null,null,null,"","",null,2]
["",null,null,"",null,"",null,"",null,"","",null,null,null,null,"","",null,2]
["",null,null,"",null,"",null,"",null,"","",null,null,null,null,"","",null,2]
["",null,null,"",null,"",null,"",null,"","",null,null,null,null,"","",null,2]
["",null,null,"",null,"",null,"",null,"","",null,null,null,null,"","",null,2]
["",null,null,"",null,"",null,"",null,"","",null,null,null,null,"","",null,2]
[{"$f":"IF(E1540=\"\",\"\",IF(A1540=\"\",TODAY(),A1540))","v":""},null,null,{"$f":"IF(B1540=\"\",\"\",(C1540-B1540))","v":""},null,{"$f":"IFERROR(VLOOKUP(E1540,AG1539:AI1853,2,FALSE),\"\")","v":""},null,{"$f":"IFERROR(G1540/D1540/24,\"\")","v":""},null,{"$f":"IFERROR(I1540/D1540/24,\"\")","v":""},{"$f":"IFERROR(L1540/D1540/24,\"\")","v":""},null,null,null,null,"",{"$f":"IFERROR(ROUND(SUM(L1540*P1540),2),\"\")","v":""},null,2]
["",null,null,"",null,"",null,"",null,"","",null,null,null,null,"","",null,2]
["",null,null,"",null,"",null,"",null,"","",null,null,null,null,"","",null,2]
["",null,null,"",null,"",null,"",null,"","",null,null,null,null,"","",null,2]
["",null,null,"",null,"",null,"",null,"","",null,null,null,null,"","",null,2]
["",null,null,"",null,"",null,"",null,"","",null,null,null,null,"","",null,2]
["",null,null,"",null,"",null,"",null,"","",null,null,null,null,"","",null,2]
["",null,null,"",null,"",null,"",null,"","",null,null,null,null,"","",null,2]
["",null,null,"",null,"",null,"",null,"","",null,null,null,null,"","",null,2]
["",null,null,"",null,"",null,"",null,"","",null,null,null,null,"","",null,2]
["",null,null,"",null,"",null,"",null,"","",null,null,null,null,"","",null,2]
["",null,null,"",null,"",null,"",null,"","",null,null,null,null,"","",null,2]
["",null,null,"",null,"",null,"",null,"","",null,null,null,null,"","",null,2]
["",null,null,"",null,"",null,"",null,"","",null,null,null,null,"","",null,2]
["",null,null,"",null,"",null,"",null,"","",null,null,null,null,"","",null,2]
["",null,null,"",null,"",null,"",null,"","",null,null,null,null,"","",null,2]
["",null,null,"",null,"",null,"",null,"","",null,null,null,null,"","",null,2]
["",null,null,"",null,"",null,"",null,"","",null,null,null,null,"","",null,2]
["",null,null,"",null,"",null,"",null,"","",null,null,null,null,"","",null,2]
["",null,null,"",null,"",null,"",null,"","",null,null,null,null,"","",null,2]
["",null,null,"",null,"",null,"",null,"","",null,null,null,null,"","",null,2]
["",null,null,"",null,"",null,"",null,"","",null,null,null,null,"","",null,2]
["",null,null,"",null,"",null,"",null,"","",null,null,null,null,{"$f":"IFERROR(ROUND(SUM(1000/M1562),2),\"\")","v":""},"",null,2]
["",null,null,"",null,"",null,"",null,"","",null,null,null,null,"","",null,2]
["",null,null,"",null,"",null,"",null,"","",null,null,null,null,"","",null,2]
["",null,null,"",null,"",null,"",null,"","",null,null,null,null,"","",null,2]
["",null,null,"",null,"",null,"",null,"","",null,null,null,null,"","",null,2]
["",null,null,"",null,"",null,"",null,"","",null,null,null,null,"","",null,2]
["",null,null,"",null,"",null,"",null,"","",null,null,null,null,"","",null,2]
["",null,null,"",null,"",null,"",null,"","",null,null,null,null,"","",null,2]
["",null,null,"",null,"",null,"",null,"","",null,null,null,null,"","",null,2]
["",null,null,"",null,"",null,"",null,"","",null,null,null,null,"","",null,2]
["",null,null,"",null,"",null,"",null,"","",null,null,null,null,"","",null,2]
["",null,null,"",null,"",null,"",null,"","",null,null,null,null,"","",null,2]
["",null,null,"",null,"",null,"",null,"","",null,null,null,null,"","",null,2]
["",null,null,"",null,"",null,"",null,"","",null,null,null,null,"","",null,2]
["",null,null,"",null,"",null,"",null,"","",null,null,null,null,"","",null,2]
["",null,null,"",null,"",null,"",null,"","",null,null,null,null,"","",null,2]
["",null,null,"",null,"",null,"",null,"","",null,null,null,null,"","",null,2]
["",null,null,"",null,"",null,"",null,"","",null,null,null,null,"","",null,2]
["",null,null,"",null,"",null,"",null,"","",null,null,null,null,"","",null,2]
["",null,null,"",null,"",null,"",null,"","",null,null,null,null,"","",null,2]
["",null,null,"",null,"",null,"",null,"","",null,null,null,null,"","",null,2]
["",null,null,"",null,"",null,"",null,"","",null,null,null,null,"","",null,2]
["",null,null,"",null,"",null,"",null,"","",null,null,null,null,"","",null,2]
["",null,null,"",null,"",null,"",null,"","",null,null,null,null,"","",null,2]
["",null,null,"",null,"",null,"",null,"","",null,null,null,null,"","",null,2]
["",null,null,"",null,"",null,"",null,"","",null,null,null,null,"","",null,2]
["",null,null,"",null,"",null,"",null,"","",null,null,null,null,"","",null,2]
["",null,null,"",null,"",null,"",null,"","",null,null,null,null,"","",null,2]
["",null,null,"",null,"",null,"",null,"","",null,null,null,null,"","",null,2]
["",null,null,"",null,"",null,"",null,"","",null,null,null,null,"","",null,2]
["",null,null,"",null,"",null,"",null,"","",null,null,null,null,"","",null,2]
["",null,null,"",null,"",null,"",null,"","",null,null,null,null,"","",null,2]
["",null,null,"",null,"",null,"",null,"","",null,null,null,null,"","",null,2]
["",null,null,"",null,"",null,"",null,"","",null,null,null,null,"","",null,2]
["",null,null,"",null,"",null,"",null,"","",null,null,null,null,"","",null,2]
["",null,null,"",null,"",null,"",null,"","",null,null,null,null,"","",null,2]
["",null,null,"",null,"",null,"",null,"","",null,null,null,null,"","",null,2]
["",null,null,"",null,"",null,"",null,"","",null,null,null,null,"","",null,2]
["",null,null,"",null,"",null,"",null,"","",null,null,null,null,"","",null,2]
["",null,null,"",null,"",null,"",null,"","",null,null,null,null,"","",null,2]
["",null,null,"",null,"",null,"",null,"","",null,null,null,null,"","",null,2]
["",null,null,"",null,"",null,"",null,"","",null,null,null,null,"","",null,2]
[{"$f":"IF(E1604=\"\",\"\",IF(A1604=\"\",TODAY(),A1604))","v":""},null,null,{"$f":"IF(B1604=\"\",\"\",(C1604-B1604))","v":""},null,{"$f":"IFERROR(VLOOKUP(E1604,AG1603:AI1917,2,FALSE),\"\")","v":""},null,{"$f":"IFERROR(G1604/D1604/24,\"\")","v":""},null,{"$f":"IFERROR(I1604/D1604/24,\"\")","v":""},{"$f":"IFERROR(L1604/D1604/24,\"\")","v":""},null,null,null,null,"",{"$f":"IFERROR(ROUND(SUM(L1604*P1604),2),\"\")","v":""},null,2]
["",null,null,"",null,"",null,"",null,"","",null,null,null,null,"","",null,2]
["",null,null,"",null,"",null,"",null,"","",null,null,null,null,"","",null,2]
["",null,null,"",null,"",null,"",null,"","",null,null,null,null,"","",null,2]
["",null,null,"",null,"",null,"",null,"","",null,null,null,null,"","",null,2]
["",null,null,"",null,"",null,"",null,"","",null,null,null,null,"","",null,2]
["",null,null,"",null,"",null,"",null,"","",null,null,null,null,"","",null,2]
["",null,null,"",null,"",null,"",null,"","",null,null,null,null,"","",null,2]
["",null,null,"",null,"",null,"",null,"","",null,null,null,null,"","",null,2]
["",null,null,"",null,"",null,"",null,"","",null,null,null,null,"","",null,2]
["",null,null,"",null,"",null,"",null,"","",null,null,null,null,"","",null,2]
["",null,null,"",null,"",null,"",null,"","",null,null,null,null,"","",null,2]
["",null,null,"",null,"",null,"",null,"","",null,null,null,null,"","",null,2]
["",null,null,"",null,"",null,"",null,"","",null,null,null,null,"","",null,2]
["",null,null,"",null,"",null,"",null,"","",null,null,null,null,"","",null,2]
["",null,null,"",null,"",null,"",null,"","",null,null,null,null,"","",null,2]
["",null,null,"",null,"",null,"",null,"","",null,null,null,null,"","",null,2]
["",null,null,"",null,"",null,"",null,"","",null,null,null,null,"","",null,2]
["",null,null,"",null,"",null,"",null,"","",null,null,null,null,"","",null,2]
["",null,null,"",null,"",null,"",null,"","",null,null,null,null,"","",null,2]
["",null,null,"",null,"",null,"",null,"","",null,null,null,null,"","",null,2]
["",null,null,"",null,"",null,"",null,"","",null,null,null,null,"","",null,2]
["",null,null,"",null,"",null,"",null,"","",null,null,null,null,{"$f":"IFERROR(ROUND(SUM(1000/M1626),2),\"\")","v":""},"",null,2]
["",null,null,"",null,"",null,"",null,"","",null,null,null,null,"","",null,2]
["",null,null,"",null,"",null,"",null,"","",null,null,null,null,"","",null,2]
["",null,null,"",null,"",null,"",null,"","",null,null,null,null,"","",null,2]
["",null,null,"",null,"",null,"",null,"","",null,null,null,null,"","",null,2]
["",null,null,"",null,"",null,"",null,"","",null,null,null,null,"","",null,2]
["",null,null,"",null,"",null,"",null,"","",null,null,null,null,"","",null,2]
["",null,null,"",null,"",null,"",null,"","",null,null,null,null,"","",null,2]
["",null,null,"",null,"",null,"",null,"","",null,null,null,null,"","",null,2]
["",null,null,"",null,"",null,"",null,"","",null,null,null,null,"","",null,2]
["",null,null,"",null,"",null,"",null,"","",null,null,null,null,"","",null,2]
["",null,null,"",null,"",null,"",null,"","",null,null,null,null,"","",null,2]
["",null,null,"",null,"",null,"",null,"","",null,null,null,null,"","",null,2]
["",null,null,"",null,"",null,"",null,"","",null,null,null,null,"","",null,2]
["",null,null,"",null,"",null,"",null,"","",null,null,null,null,"","",null,2]
["",null,null,"",null,"",null,"",null,"","",null,null,null,null,"","",null,2]
["",null,null,"",null,"",null,"",null,"","",null,null,null,null,"","",null,2]
["",null,null,"",null,"",null,"",null,"","",null,null,null,null,"","",null,2]
["",null,null,"",null,"",null,"",null,"","",null,null,null,null,"","",null,2]
["",null,null,"",null,"",null,"",null,"","",null,null,null,null,"","",null,2]
["",null,null,"",null,"",null,"",null,"","",null,null,null,null,"","",null,2]
["",null,null,"",null,"",null,"",null,"","",null,null,null,null,"","",null,2]
["",null,null,"",null,"",null,"",null,"","",null,null,null,null,"","",null,2]
["",null,null,"",null,"",null,"",null,"","",null,null,null,null,"","",null,2]
["",null,null,"",null,"",null,"",null,"","",null,null,null,null,"","",null,2]
["",null,null,"",null,"",null,"",null,"","",null,null,null,null,"","",null,2]
["",null,null,"",null,"",null,"",null,"","",null,null,null,null,"","",null,2]
["",null,null,"",null,"",null,"",null,"","",null,null,null,null,"","",null,2]
["",null,null,"",null,"",null,"",null,"","",null,null,null,null,"","",null,2]
["",null,null,"",null,"",null,"",null,"","",null,null,null,null,"","",null,2]
["",null,null,"",null,"",null,"",null,"","",null,null,null,null,"","",null,2]
["",null,null,"",null,"",null,"",null,"","",null,null,null,null,"","",null,2]
["",null,null,"",null,"",null,"",null,"","",null,null,null,null,"","",null,2]
["",null,null,"",null,"",null,"",null,"","",null,null,null,null,"","",null,2]
["",null,null,"",null,"",null,"",null,"","",null,null,null,null,"","",null,2]
["",null,null,"",null,"",null,"",null,"","",null,null,null,null,"","",null,2]
["",null,null,"",null,"",null,"",null,"","",null,null,null,null,"","",null,2]
["",null,null,"",null,"",null,"",null,"","",null,null,null,null,"","",null,2]
["",null,null,"",null,"",null,"",null,"","",null,null,null,null,"","",null,2]
["",null,null,"",null,"",null,"",null,"","",null,null,null,null,"","",null,2]
["",null,null,"",null,"",null,"",null,"","",null,null,null,null,"","",null,2]
["",null,null,"",null,"",null,"",null,"","",null,null,null,null,"","",null,2]
[{"$f":"IF(E1668=\"\",\"\",IF(A1668=\"\",TODAY(),A1668))","v":""},null,null,{"$f":"IF(B1668=\"\",\"\",(C1668-B1668))","v":""},null,{"$f":"IFERROR(VLOOKUP(E1668,AG1667:AI1981,2,FALSE),\"\")","v":""},null,{"$f":"IFERROR(G1668/D1668/24,\"\")","v":""},null,{"$f":"IFERROR(I1668/D1668/24,\"\")","v":""},{"$f":"IFERROR(L1668/D1668/24,\"\")","v":""},null,null,null,null,"",{"$f":"IFERROR(ROUND(SUM(L1668*P1668),2),\"\")","v":""},null,2]
["",null,null,"",null,"",null,"",null,"","",null,null,null,null,"","",null,2]
["",null,null,"",null,"",null,"",null,"","",null,null,null,null,"","",null,2]
["",null,null,"",null,"",null,"",null,"","",null,null,null,null,"","",null,2]
["",null,null,"",null,"",null,"",null,"","",null,null,null,null,"","",null,2]
["",null,null,"",null,"",null,"",null,"","",null,null,null,null,"","",null,2]
["",null,null,"",null,"",null,"",null,"","",null,null,null,null,"","",null,2]
["",null,null,"",null,"",null,"",null,"","",null,null,null,null,"","",null,2]
["",null,null,"",null,"",null,"",null,"","",null,null,null,null,"","",null,2]
["",null,null,"",null,"",null,"",null,"","",null,null,null,null,"","",null,2]
["",null,null,"",null,"",null,"",null,"","",null,null,null,null,"","",null,2]
["",null,null,"",null,"",null,"",null,"","",null,null,null,null,"","",null,2]
["",null,null,"",null,"",null,"",null,"","",null,null,null,null,"","",null,2]
["",null,null,"",null,"",null,"",null,"","",null,null,null,null,"","",null,2]
["",null,null,"",null,"",null,"",null,"","",null,null,null,null,"","",null,2]
["",null,null,"",null,"",null,"",null,"","",null,null,null,null,"","",null,2]
["",null,null,"",null,"",null,"",null,"","",null,null,null,null,"","",null,2]
["",null,null,"",null,"",null,"",null,"","",null,null,null,null,"","",null,2]
["",null,null,"",null,"",null,"",null,"","",null,null,null,null,"","",null,2]
["",null,null,"",null,"",null,"",null,"","",null,null,null,null,"","",null,2]
["",null,null,"",null,"",null,"",null,"","",null,null,null,null,"","",null,2]
["",null,null,"",null,"",null,"",null,"","",null,null,null,null,"","",null,2]
["",null,null,"",null,"",null,"",null,"","",null,null,null,null,{"$f":"IFERROR(ROUND(SUM(1000/M1690),2),\"\")","v":""},"",null,2]
["",null,null,"",null,"",null,"",null,"","",null,null,null,null,"","",null,2]
["",null,null,"",null,"",null,"",null,"","",null,null,null,null,"","",null,2]
["",null,null,"",null,"",null,"",null,"","",null,null,null,null,"","",null,2]
["",null,null,"",null,"",null,"",null,"","",null,null,null,null,"","",null,2]
["",null,null,"",null,"",null,"",null,"","",null,null,null,null,"","",null,2]
["",null,null,"",null,"",null,"",null,"","",null,null,null,null,"","",null,2]
["",null,null,"",null,"",null,"",null,"","",null,null,null,null,"","",null,2]
["",null,null,"",null,"",null,"",null,"","",null,null,null,null,"","",null,2]
["",null,null,"",null,"",null,"",null,"","",null,null,null,null,"","",null,2]
["",null,null,"",null,"",null,"",null,"","",null,null,null,null,"","",null,2]
["",null,null,"",null,"",null,"",null,"","",null,null,null,null,"","",null,2]
["",null,null,"",null,"",null,"",null,"","",null,null,null,null,"","",null,2]
["",null,null,"",null,"",null,"",null,"","",null,null,null,null,"","",null,2]
["",null,null,"",null,"",null,"",null,"","",null,null,null,null,"","",null,2]
["",null,null,"",null,"",null,"",null,"","",null,null,null,null,"","",null,2]
["",null,null,"",null,"",null,"",null,"","",null,null,null,null,"","",null,2]
["",null,null,"",null,"",null,"",null,"","",null,null,null,null,"","",null,2]
["",null,null,"",null,"",null,"",null,"","",null,null,null,null,"","",null,2]
["",null,null,"",null,"",null,"",null,"","",null,null,null,null,"","",null,2]
["",null,null,"",null,"",null,"",null,"","",null,null,null,null,"","",null,2]
["",null,null,"",null,"",null,"",null,"","",null,null,null,null,"","",null,2]
["",null,null,"",null,"",null,"",null,"","",null,null,null,null,"","",null,2]
["",null,null,"",null,"",null,"",null,"","",null,null,null,null,"","",null,2]
["",null,null,"",null,"",null,"",null,"","",null,null,null,null,"","",null,2]
["",null,null,"",null,"",null,"",null,"","",null,null,null,null,"","",null,2]
["",null,null,"",null,"",null,"",null,"","",null,null,null,null,"","",null,2]
["",null,null,"",null,"",null,"",null,"","",null,null,null,null,"","",null,2]
["",null,null,"",null,"",null,"",null,"","",null,null,null,null,"","",null,2]
["",null,null,"",null,"",null,"",null,"","",null,null,null,null,"","",null,2]
["",null,null,"",null,"",null,"",null,"","",null,null,null,null,"","",null,2]
["",null,null,"",null,"",null,"",null,"","",null,null,null,null,"","",null,2]
["",null,null,"",null,"",null,"",null,"","",null,null,null,null,"","",null,2]
["",null,null,"",null,"",null,"",null,"","",null,null,null,null,"","",null,2]
["",null,null,"",null,"",null,"",null,"","",null,null,null,null,"","",null,2]
["",null,null,"",null,"",null,"",null,"","",null,null,null,null,"","",null,2]
["",null,null,"",null,"",null,"",null,"","",null,null,null,null,"","",null,2]
["",null,null,"",null,"",null,"",null,"","",null,null,null,null,"","",null,2]
["",null,null,"",null,"",null,"",null,"","",null,null,null,null,"","",null,2]
["",null,null,"",null,"",null,"",null,"","",null,null,null,null,"","",null,2]
["",null,null,"",null,"",null,"",null,"","",null,null,null,null,"","",null,2]
["",null,null,"",null,"",null,"",null,"","",null,null,null,null,"","",null,2]
[{"$f":"IF(E1732=\"\",\"\",IF(A1732=\"\",TODAY(),A1732))","v":""},null,null,{"$f":"IF(B1732=\"\",\"\",(C1732-B1732))","v":""},null,{"$f":"IFERROR(VLOOKUP(E1732,AG1731:AI2045,2,FALSE),\"\")","v":""},null,{"$f":"IFERROR(G1732/D1732/24,\"\")","v":""},null,{"$f":"IFERROR(I1732/D1732/24,\"\")","v":""},{"$f":"IFERROR(L1732/D1732/24,\"\")","v":""},null,null,null,null,"",{"$f":"IFERROR(ROUND(SUM(L1732*P1732),2),\"\")","v":""},null,2]
["",null,null,"",null,"",null,"",null,"","",null,null,null,null,"","",null,2]
["",null,null,"",null,"",null,"",null,"","",null,null,null,null,"","",null,2]
["",null,null,"",null,"",null,"",null,"","",null,null,null,null,"","",null,2]
["",null,null,"",null,"",null,"",null,"","",null,null,null,null,"","",null,2]
["",null,null,"",null,"",null,"",null,"","",null,null,null,null,"","",null,2]
["",null,null,"",null,"",null,"",null,"","",null,null,null,null,"","",null,2]
["",null,null,"",null,"",null,"",null,"","",null,null,null,null,"","",null,2]
["",null,null,"",null,"",null,"",null,"","",null,null,null,null,"","",null,2]
["",null,null,"",null,"",null,"",null,"","",null,null,null,null,"","",null,2]
["",null,null,"",null,"",null,"",null,"","",null,null,null,null,"","",null,2]
["",null,null,"",null,"",null,"",null,"","",null,null,null,null,"","",null,2]
["",null,null,"",null,"",null,"",null,"","",null,null,null,null,"","",null,2]
["",null,null,"",null,"",null,"",null,"","",null,null,null,null,"","",null,2]
["",null,null,"",null,"",null,"",null,"","",null,null,null,null,"","",null,2]
["",null,null,"",null,"",null,"",null,"","",null,null,null,null,"","",null,2]
["",null,null,"",null,"",null,"",null,"","",null,null,null,null,"","",null,2]
["",null,null,"",null,"",null,"",null,"","",null,null,null,null,"","",null,2]
["",null,null,"",null,"",null,"",null,"","",null,null,null,null,"","",null,2]
["",null,null,"",null,"",null,"",null,"","",null,null,null,null,"","",null,2]
["",null,null,"",null,"",null,"",null,"","",null,null,null,null,"","",null,2]
["",null,null,"",null,"",null,"",null,"","",null,null,null,null,"","",null,2]
["",null,null,"",null,"",null,"",null,"","",null,null,null,null,{"$f":"IFERROR(ROUND(SUM(1000/M1754),2),\"\")","v":""},"",null,2]
["",null,null,"",null,"",null,"",null,"","",null,null,null,null,"","",null,2]
["",null,null,"",null,"",null,"",null,"","",null,null,null,null,"","",null,2]
["",null,null,"",null,"",null,"",null,"","",null,null,null,null,"","",null,2]
["",null,null,"",null,"",null,"",null,"","",null,null,null,null,"","",null,2]
["",null,null,"",null,"",null,"",null,"","",null,null,null,null,"","",null,2]
["",null,null,"",null,"",null,"",null,"","",null,null,null,null,"","",null,2]
["",null,null,"",null,"",null,"",null,"","",null,null,null,null,"","",null,2]
["",null,null,"",null,"",null,"",null,"","",null,null,null,null,"","",null,2]
["",null,null,"",null,"",null,"",null,"","",null,null,null,null,"","",null,2]
["",null,null,"",null,"",null,"",null,"","",null,null,null,null,"","",null,2]
["",null,null,"",null,"",null,"",null,"","",null,null,null,null,"","",null,2]
["",null,null,"",null,"",null,"",null,"","",null,null,null,null,"","",null,2]
["",null,null,"",null,"",null,"",null,"","",null,null,null,null,"","",null,2]
["",null,null,"",null,"",null,"",null,"","",null,null,null,null,"","",null,2]
["",null,null,"",null,"",null,"",null,"","",null,null,null,null,"","",null,2]
["",null,null,"",null,"",null,"",null,"","",null,null,null,null,"","",null,2]
["",null,null,"",null,"",null,"",null,"","",null,null,null,null,"","",null,2]
["",null,null,"",null,"",null,"",null,"","",null,null,null,null,"","",null,2]
["",null,null,"",null,"",null,"",null,"","",null,null,null,null,"","",null,2]
["",null,null,"",null,"",null,"",null,"","",null,null,null,null,"","",null,2]
["",null,null,"",null,"",null,"",null,"","",null,null,null,null,"","",null,2]
["",null,null,"",null,"",null,"",null,"","",null,null,null,null,"","",null,2]
["",null,null,"",null,"",null,"",null,"","",null,null,null,null,"","",null,2]
["",null,null,"",null,"",null,"",null,"","",null,null,null,null,"","",null,2]
["",null,null,"",null,"",null,"",null,"","",null,null,null,null,"","",null,2]
["",null,null,"",null,"",null,"",null,"","",null,null,null,null,"","",null,2]
["",null,null,"",null,"",null,"",null,"","",null,null,null,null,"","",null,2]
["",null,null,"",null,"",null,"",null,"","",null,null,null,null,"","",null,2]
["",null,null,"",null,"",null,"",null,"","",null,null,null,null,"","",null,2]
["",null,null,"",null,"",null,"",null,"","",null,null,null,null,"","",null,2]
["",null,null,"",null,"",null,"",null,"","",null,null,null,null,"","",null,2]
["",null,null,"",null,"",null,"",null,"","",null,null,null,null,"","",null,2]
["",null,null,"",null,"",null,"",null,"","",null,null,null,null,"","",null,2]
["",null,null,"",null,"",null,"",null,"","",null,null,null,null,"","",null,2]
["",null,null,"",null,"",null,"",null,"","",null,null,null,null,"","",null,2]
["",null,null,"",null,"",null,"",null,"","",null,null,null,null,"","",null,2]
["",null,null,"",null,"",null,"",null,"","",null,null,null,null,"","",null,2]
["",null,null,"",null,"",null,"",null,"","",null,null,null,null,"","",null,2]
["",null,null,"",null,"",null,"",null,"","",null,null,null,null,"","",null,2]
["",null,null,"",null,"",null,"",null,"","",null,null,null,null,"","",null,2]
["",null,null,"",null,"",null,"",null,"","",null,null,null,null,"","",null,2]
[{"$f":"IF(E1796=\"\",\"\",IF(A1796=\"\",TODAY(),A1796))","v":""},null,null,{"$f":"IF(B1796=\"\",\"\",(C1796-B1796))","v":""},null,{"$f":"IFERROR(VLOOKUP(E1796,AG1795:AI2109,2,FALSE),\"\")","v":""},null,{"$f":"IFERROR(G1796/D1796/24,\"\")","v":""},null,{"$f":"IFERROR(I1796/D1796/24,\"\")","v":""},{"$f":"IFERROR(L1796/D1796/24,\"\")","v":""},null,null,null,null,"",{"$f":"IFERROR(ROUND(SUM(L1796*P1796),2),\"\")","v":""},null,2]
["",null,null,"",null,"",null,"",null,"","",null,null,null,null,"","",null,2]
["",null,null,"",null,"",null,"",null,"","",null,null,null,null,"","",null,2]
["",null,null,"",null,"",null,"",null,"","",null,null,null,null,"","",null,2]
["",null,null,"",null,"",null,"",null,"","",null,null,null,null,"","",null,2]
["",null,null,"",null,"",null,"",null,"","",null,null,null,null,"","",null,2]
["",null,null,"",null,"",null,"",null,"","",null,null,null,null,"","",null,2]
["",null,null,"",null,"",null,"",null,"","",null,null,null,null,"","",null,2]
["",null,null,"",null,"",null,"",null,"","",null,null,null,null,"","",null,2]
["",null,null,"",null,"",null,"",null,"","",null,null,null,null,"","",null,2]
["",null,null,"",null,"",null,"",null,"","",null,null,null,null,"","",null,2]
["",null,null,"",null,"",null,"",null,"","",null,null,null,null,"","",null,2]
["",null,null,"",null,"",null,"",null,"","",null,null,null,null,"","",null,2]
["",null,null,"",null,"",null,"",null,"","",null,null,null,null,"","",null,2]
["",null,null,"",null,"",null,"",null,"","",null,null,null,null,"","",null,2]
["",null,null,"",null,"",null,"",null,"","",null,null,null,null,"","",null,2]
["",null,null,"",null,"",null,"",null,"","",null,null,null,null,"","",null,2]
["",null,null,"",null,"",null,"",null,"","",null,null,null,null,"","",null,2]
["",null,null,"",null,"",null,"",null,"","",null,null,null,null,"","",null,2]
["",null,null,"",null,"",null,"",null,"","",null,null,null,null,"","",null,2]
["",null,null,"",null,"",null,"",null,"","",null,null,null,null,"","",null,2]
["",null,null,"",null,"",null,"",null,"","",null,null,null,null,"","",null,2]
["",null,null,"",null,"",null,"",null,"","",null,null,null,null,{"$f":"IFERROR(ROUND(SUM(1000/M1818),2),\"\")","v":""},"",null,2]
["",null,null,"",null,"",null,"",null,"","",null,null,null,null,"","",null,2]
["",null,null,"",null,"",null,"",null,"","",null,null,null,null,"","",null,2]
["",null,null,"",null,"",null,"",null,"","",null,null,null,null,"","",null,2]
["",null,null,"",null,"",null,"",null,"","",null,null,null,null,"","",null,2]
["",null,null,"",null,"",null,"",null,"","",null,null,null,null,"","",null,2]
["",null,null,"",null,"",null,"",null,"","",null,null,null,null,"","",null,2]
["",null,null,"",null,"",null,"",null,"","",null,null,null,null,"","",null,2]
["",null,null,"",null,"",null,"",null,"","",null,null,null,null,"","",null,2]
["",null,null,"",null,"",null,"",null,"","",null,null,null,null,"","",null,2]
["",null,null,"",null,"",null,"",null,"","",null,null,null,null,"","",null,2]
["",null,null,"",null,"",null,"",null,"","",null,null,null,null,"","",null,2]
["",null,null,"",null,"",null,"",null,"","",null,null,null,null,"","",null,2]
["",null,null,"",null,"",null,"",null,"","",null,null,null,null,"","",null,2]
["",null,null,"",null,"",null,"",null,"","",null,null,null,null,"","",null,2]
["",null,null,"",null,"",null,"",null,"","",null,null,null,null,"","",null,2]
["",null,null,"",null,"",null,"",null,"","",null,null,null,null,"","",null,2]
["",null,null,"",null,"",null,"",null,"","",null,null,null,null,"","",null,2]
["",null,null,"",null,"",null,"",null,"","",null,null,null,null,"","",null,2]
["",null,null,"",null,"",null,"",null,"","",null,null,null,null,"","",null,2]
["",null,null,"",null,"",null,"",null,"","",null,null,null,null,"","",null,2]
["",null,null,"",null,"",null,"",null,"","",null,null,null,null,"","",null,2]
["",null,null,"",null,"",null,"",null,"","",null,null,null,null,"","",null,2]
["",null,null,"",null,"",null,"",null,"","",null,null,null,null,"","",null,2]
["",null,null,"",null,"",null,"",null,"","",null,null,null,null,"","",null,2]
["",null,null,"",null,"",null,"",null,"","",null,null,null,null,"","",null,2]
["",null,null,"",null,"",null,"",null,"","",null,null,null,null,"","",null,2]
["",null,null,"",null,"",null,"",null,"","",null,null,null,null,"","",null,2]
["",null,null,"",null,"",null,"",null,"","",null,null,null,null,"","",null,2]
["",null,null,"",null,"",null,"",null,"","",null,null,null,null,"","",null,2]
["",null,null,"",null,"",null,"",null,"","",null,null,null,null,"","",null,2]
["",null,null,"",null,"",null,"",null,"","",null,null,null,null,"","",null,2]
["",null,null,"",null,"",null,"",null,"","",null,null,null,null,"","",null,2]
["",null,null,"",null,"",null,"",null,"","",null,null,null,null,"","",null,2]
["",null,null,"",null,"",null,"",null,"","",null,null,null,null,"","",null,2]
["",null,null,"",null,"",null,"",null,"","",null,null,null,null,"","",null,2]
["",null,null,"",null,"",null,"",null,"","",null,null,null,null,"","",null,2]
["",null,null,"",null,"",null,"",null,"","",null,null,null,null,"","",null,2]
["",null,null,"",null,"",null,"",null,"","",null,null,null,null,"","",null,2]
["",null,null,"",null,"",null,"",null,"","",null,null,null,null,"","",null,2]
["",null,null,"",null,"",null,"",null,"","",null,null,null,null,"","",null,2]
["",null,null,"",null,"",null,"",null,"","",null,null,null,null,"","",null,2]
[{"$f":"IF(E1860=\"\",\"\",IF(A1860=\"\",TODAY(),A1860))","v":""},null,null,{"$f":"IF(B1860=\"\",\"\",(C1860-B1860))","v":""},null,{"$f":"IFERROR(VLOOKUP(E1860,AG1859:AI2173,2,FALSE),\"\")","v":""},null,{"$f":"IFERROR(G1860/D1860/24,\"\")","v":""},null,{"$f":"IFERROR(I1860/D1860/24,\"\")","v":""},{"$f":"IFERROR(L1860/D1860/24,\"\")","v":""},null,null,null,null,"",{"$f":"IFERROR(ROUND(SUM(L1860*P1860),2),\"\")","v":""},null,2]
["",null,null,"",null,"",null,"",null,"","",null,null,null,null,"","",null,2]
["",null,null,"",null,"",null,"",null,"","",null,null,null,null,"","",null,2]
["",null,null,"",null,"",null,"",null,"","",null,null,null,null,"","",null,2]
["",null,null,"",null,"",null,"",null,"","",null,null,null,null,"","",null,2]
["",null,null,"",null,"",null,"",null,"","",null,null,null,null,"","",null,2]
["",null,null,"",null,"",null,"",null,"","",null,null,null,null,"","",null,2]
["",null,null,"",null,"",null,"",null,"","",null,null,null,null,"","",null,2]
["",null,null,"",null,"",null,"",null,"","",null,null,null,null,"","",null,2]
["",null,null,"",null,"",null,"",null,"","",null,null,null,null,"","",null,2]
["",null,null,"",null,"",null,"",null,"","",null,null,null,null,"","",null,2]
["",null,null,"",null,"",null,"",null,"","",null,null,null,null,"","",null,2]
["",null,null,"",null,"",null,"",null,"","",null,null,null,null,"","",null,2]
["",null,null,"",null,"",null,"",null,"","",null,null,null,null,"","",null,2]
["",null,null,"",null,"",null,"",null,"","",null,null,null,null,"","",null,2]
["",null,null,"",null,"",null,"",null,"","",null,null,null,null,"","",null,2]
["",null,null,"",null,"",null,"",null,"","",null,null,null,null,"","",null,2]
["",null,null,"",null,"",null,"",null,"","",null,null,null,null,"","",null,2]
["",null,null,"",null,"",null,"",null,"","",null,null,null,null,"","",null,2]
["",null,null,"",null,"",null,"",null,"","",null,null,null,null,"","",null,2]
["",null,null,"",null,"",null,"",null,"","",null,null,null,null,"","",null,2]
["",null,null,"",null,"",null,"",null,"","",null,null,null,null,"","",null,2]
["",null,null,"",null,"",null,"",null,"","",null,null,null,null,{"$f":"IFERROR(ROUND(SUM(1000/M1882),2),\"\")","v":""},"",null,2]
["",null,null,"",null,"",null,"",null,"","",null,null,null,null,"","",null,2]
["",null,null,"",null,"",null,"",null,"","",null,null,null,null,"","",null,2]
["",null,null,"",null,"",null,"",null,"","",null,null,null,null,"","",null,2]
["",null,null,"",null,"",null,"",null,"","",null,null,null,null,"","",null,2]
["",null,null,"",null,"",null,"",null,"","",null,null,null,null,"","",null,2]
["",null,null,"",null,"",null,"",null,"","",null,null,null,null,"","",null,2]
["",null,null,"",null,"",null,"",null,"","",null,null,null,null,"","",null,2]
["",null,null,"",null,"",null,"",null,"","",null,null,null,null,"","",null,2]
["",null,null,"",null,"",null,"",null,"","",null,null,null,null,"","",null,2]
["",null,null,"",null,"",null,"",null,"","",null,null,null,null,"","",null,2]
["",null,null,"",null,"",null,"",null,"","",null,null,null,null,"","",null,2]
["",null,null,"",null,"",null,"",null,"","",null,null,null,null,"","",null,2]
["",null,null,"",null,"",null,"",null,"","",null,null,null,null,"","",null,2]
["",null,null,"",null,"",null,"",null,"","",null,null,null,null,"","",null,2]
["",null,null,"",null,"",null,"",null,"","",null,null,null,null,"","",null,2]
["",null,null,"",null,"",null,"",null,"","",null,null,null,null,"","",null,2]
["",null,null,"",null,"",null,"",null,"","",null,null,null,null,"","",null,2]
["",null,null,"",null,"",null,"",null,"","",null,null,null,null,"","",null,2]
["",null,null,"",null,"",null,"",null,"","",null,null,null,null,"","",null,2]
["",null,null,"",null,"",null,"",null,"","",null,null,null,null,"","",null,2]
["",null,null,"",null,"",null,"",null,"","",null,null,null,null,"","",null,2]
["",null,null,"",null,"",null,"",null,"","",null,null,null,null,"","",null,2]
["",null,null,"",null,"",null,"",null,"","",null,null,null,null,"","",null,2]
["",null,null,"",null,"",null,"",null,"","",null,null,null,null,"","",null,2]
["",null,null,"",null,"",null,"",null,"","",null,null,null,null,"","",null,2]
["",null,null,"",null,"",null,"",null,"","",null,null,null,null,"","",null,2]
["",null,null,"",null,"",null,"",null,"","",null,null,null,null,"","",null,2]
["",null,null,"",null,"",null,"",null,"","",null,null,null,null,"","",null,2]
["",null,null,"",null,"",null,"",null,"","",null,null,null,null,"","",null,2]
["",null,null,"",null,"",null,"",null,"","",null,null,null,null,"","",null,2]
["",null,null,"",null,"",null,"",null,"","",null,null,null,null,"","",null,2]
["",null,null,"",null,"",null,"",null,"","",null,null,null,null,"","",null,2]
["",null,null,"",null,"",null,"",null,"","",null,null,null,null,"","",null,2]
["",null,null,"",null,"",null,"",null,"","",null,null,null,null,"","",null,2]
["",null,null,"",null,"",null,"",null,"","",null,null,null,null,"","",null,2]
["",null,null,"",null,"",null,"",null,"","",null,null,null,null,"","",null,2]
["",null,null,"",null,"",null,"",null,"","",null,null,null,null,"","",null,2]
["",null,null,"",null,"",null,"",null,"","",null,null,null,null,"","",null,2]
["",null,null,"",null,"",null,"",null,"","",null,null,null,null,"","",null,2]
["",null,null,"",null,"",null,"",null,"","",null,null,null,null,"","",null,2]
["",null,null,"",null,"",null,"",null,"","",null,null,null,null,"","",null,2]
[{"$f":"IF(E1924=\"\",\"\",IF(A1924=\"\",TODAY(),A1924))","v":""},null,null,{"$f":"IF(B1924=\"\",\"\",(C1924-B1924))","v":""},null,{"$f":"IFERROR(VLOOKUP(E1924,AG1923:AI2237,2,FALSE),\"\")","v":""},null,{"$f":"IFERROR(G1924/D1924/24,\"\")","v":""},null,{"$f":"IFERROR(I1924/D1924/24,\"\")","v":""},{"$f":"IFERROR(L1924/D1924/24,\"\")","v":""},null,null,null,null,"",{"$f":"IFERROR(ROUND(SUM(L1924*P1924),2),\"\")","v":""},null,2]
["",null,null,"",null,"",null,"",null,"","",null,null,null,null,"","",null,2]
["",null,null,"",null,"",null,"",null,"","",null,null,null,null,"","",null,2]
["",null,null,"",null,"",null,"",null,"","",null,null,null,null,"","",null,2]
["",null,null,"",null,"",null,"",null,"","",null,null,null,null,"","",null,2]
["",null,null,"",null,"",null,"",null,"","",null,null,null,null,"","",null,2]
["",null,null,"",null,"",null,"",null,"","",null,null,null,null,"","",null,2]
["",null,null,"",null,"",null,"",null,"","",null,null,null,null,"","",null,2]
["",null,null,"",null,"",null,"",null,"","",null,null,null,null,"","",null,2]
["",null,null,"",null,"",null,"",null,"","",null,null,null,null,"","",null,2]
["",null,null,"",null,"",null,"",null,"","",null,null,null,null,"","",null,2]
["",null,null,"",null,"",null,"",null,"","",null,null,null,null,"","",null,2]
["",null,null,"",null,"",null,"",null,"","",null,null,null,null,"","",null,2]
["",null,null,"",null,"",null,"",null,"","",null,null,null,null,"","",null,2]
["",null,null,"",null,"",null,"",null,"","",null,null,null,null,"","",null,2]
["",null,null,"",null,"",null,"",null,"","",null,null,null,null,"","",null,2]
["",null,null,"",null,"",null,"",null,"","",null,null,null,null,"","",null,2]
["",null,null,"",null,"",null,"",null,"","",null,null,null,null,"","",null,2]
["",null,null,"",null,"",null,"",null,"","",null,null,null,null,"","",null,2]
["",null,null,"",null,"",null,"",null,"","",null,null,null,null,"","",null,2]
["",null,null,"",null,"",null,"",null,"","",null,null,null,null,"","",null,2]
["",null,null,"",null,"",null,"",null,"","",null,null,null,null,"","",null,2]
["",null,null,"",null,"",null,"",null,"","",null,null,null,null,{"$f":"IFERROR(ROUND(SUM(1000/M1946),2),\"\")","v":""},"",null,2]
["",null,null,"",null,"",null,"",null,"","",null,null,null,null,"","",null,2]
["",null,null,"",null,"",null,"",null,"","",null,null,null,null,"","",null,2]
["",null,null,"",null,"",null,"",null,"","",null,null,null,null,"","",null,2]
["",null,null,"",null,"",null,"",null,"","",null,null,null,null,"","",null,2]
["",null,null,"",null,"",null,"",null,"","",null,null,null,null,"","",null,2]
["",null,null,"",null,"",null,"",null,"","",null,null,null,null,"","",null,2]
["",null,null,"",null,"",null,"",null,"","",null,null,null,null,"","",null,2]
["",null,null,"",null,"",null,"",null,"","",null,null,null,null,"","",null,2]
["",null,null,"",null,"",null,"",null,"","",null,null,null,null,"","",null,2]
["",null,null,"",null,"",null,"",null,"","",null,null,null,null,"","",null,2]
["",null,null,"",null,"",null,"",null,"","",null,null,null,null,"","",null,2]
["",null,null,"",null,"",null,"",null,"","",null,null,null,null,"","",null,2]
["",null,null,"",null,"",null,"",null,"","",null,null,null,null,"","",null,2]
["",null,null,"",null,"",null,"",null,"","",null,null,null,null,"","",null,2]
["",null,null,"",null,"",null,"",null,"","",null,null,null,null,"","",null,2]
["",null,null,"",null,"",null,"",null,"","",null,null,null,null,"","",null,2]
["",null,null,"",null,"",null,"",null,"","",null,null,null,null,"","",null,2]
["",null,null,"",null,"",null,"",null,"","",null,null,null,null,"","",null,2]
["",null,null,"",null,"",null,"",null,"","",null,null,null,null,"","",null,2]
["",null,null,"",null,"",null,"",null,"","",null,null,null,null,"","",null,2]
["",null,null,"",null,"",null,"",null,"","",null,null,null,null,"","",null,2]
["",null,null,"",null,"",null,"",null,"","",null,null,null,null,"","",null,2]
["",null,null,"",null,"",null,"",null,"","",null,null,null,null,"","",null,2]
["",null,null,"",null,"",null,"",null,"","",null,null,null,null,"","",null,2]
["",null,null,"",null,"",null,"",null,"","",null,null,null,null,"","",null,2]
["",null,null,"",null,"",null,"",null,"","",null,null,null,null,"","",null,2]
["",null,null,"",null,"",null,"",null,"","",null,null,null,null,"","",null,2]
["",null,null,"",null,"",null,"",null,"","",null,null,null,null,"","",null,2]
["",null,null,"",null,"",null,"",null,"","",null,null,null,null,"","",null,2]
["",null,null,"",null,"",null,"",null,"","",null,null,null,null,"","",null,2]
["",null,null,"",null,"",null,"",null,"","",null,null,null,null,"","",null,2]
["",null,null,"",null,"",null,"",null,"","",null,null,null,null,"","",null,2]
["",null,null,"",null,"",null,"",null,"","",null,null,null,null,"","",null,2]
["",null,null,"",null,"",null,"",null,"","",null,null,null,null,"","",null,2]
["",null,null,"",null,"",null,"",null,"","",null,null,null,null,"","",null,2]
["",null,null,"",null,"",null,"",null,"","",null,null,null,null,"","",null,2]
["",null,null,"",null,"",null,"",null,"","",null,null,null,null,"","",null,2]
["",null,null,"",null,"",null,"",null,"","",null,null,null,null,"","",null,2]
["",null,null,"",null,"",null,"",null,"","",null,null,null,null,"","",null,2]
["",null,null,"",null,"",null,"",null,"","",null,null,null,null,"","",null,2]
["",null,null,"",null,"",null,"",null,"","",null,null,null,null,"","",null,2]
[{"$f":"IF(E1988=\"\",\"\",IF(A1988=\"\",TODAY(),A1988))","v":""},null,null,{"$f":"IF(B1988=\"\",\"\",(C1988-B1988))","v":""},null,{"$f":"IFERROR(VLOOKUP(E1988,AG1987:AI2301,2,FALSE),\"\")","v":""},null,{"$f":"IFERROR(G1988/D1988/24,\"\")","v":""},null,{"$f":"IFERROR(I1988/D1988/24,\"\")","v":""},{"$f":"IFERROR(L1988/D1988/24,\"\")","v":""},null,null,null,null,"",{"$f":"IFERROR(ROUND(SUM(L1988*P1988),2),\"\")","v":""},null,2]
["",null,null,"",null,"",null,"",null,"","",null,null,null,null,"","",null,2]
["",null,null,"",null,"",null,"",null,"","",null,null,null,null,"","",null,2]
["",null,null,"",null,"",null,"",null,"","",null,null,null,null,"","",null,2]
["",null,null,"",null,"",null,"",null,"","",null,null,null,null,"","",null,2]
["",null,null,"",null,"",null,"",null,"","",null,null,null,null,"","",null,2]
["",null,null,"",null,"",null,"",null,"","",null,null,null,null,"","",null,2]
["",null,null,"",null,"",null,"",null,"","",null,null,null,null,"","",null,2]
["",null,null,"",null,"",null,"",null,"","",null,null,null,null,"","",null,2]
["",null,null,"",null,"",null,"",null,"","",null,null,null,null,"","",null,2]
["",null,null,"",null,"",null,"",null,"","",null,null,null,null,"","",null,2]
["",null,null,"",null,"",null,"",null,"","",null,null,null,null,"","",null,2]
["",null,null,"",null,"",null,"",null,"","",null,null,null,null,"","",null,2]
["",null,null,"",null,"",null,"",null,"","",null,null,null,null,"","",null,2]

{"sheet":"Shift_3","index":2,"n_rows":2001,"n_cols":42,"rows_kept":2001,"cut":false,"hidden":false,"merged":[]}
[null,"T","T",null,"T",null,null,null,"T",null,null,"T","T","T","T",null,null,"T",null,"T","T","T","T"]
["Date","Start Time","End Time","Total","Machine No.","Machine Name","Capisty Power (Kgs / Shift )","Capisty Power Rate  (KGS / 1 HRS)","Minmum Power     ( Kgs / Shift )","Minimum Power Rate  (KGS / 1 HRS)","Acual Production (KGS / 1 HRS)","Production rate per Shift   ","Gm/ML","Size MM"," Drawing  ","ML X KG."," ML.\\ day","Color","Shift","       Name of the Employee","       Name of Supervisor","OR No.","Comment",null,null,null,null,null,null,null,null,null,null,null,null,1,"Crosha COMEZ 2017",20,0.05,"Black ","منصور محمد منصور","محمد"]
[{"$f":"IF(E3=\"\",\"\",IF(A3=\"\",TODAY(),A3))","v":"2019-02-20"},"09:00:00","16:00:00",{"$f":"IF(B3=\"\",\"\",(C3-B3))","v":"07:00:00"},1,{"$f":"IFERROR(VLOOKUP(E3,$AJ$2:$AL$316,2,FALSE),\"\")","v":"Crosha COMEZ 2017"},null,{"$f":"IFERROR(G3/D3/24,\"\")","v":0},8,{"$f":"IFERROR(I3/D3/24,\"\")","v":1.142857142857143},{"$f":"IFERROR(L3/D3/24,\"\")","v":1.7142857142857144},12,3,0.06,"ttttt",{"$f":"IFERROR(ROUND(SUM(1000/M3),2),\"\")","v":333.33},{"$f":"IFERROR(ROUND(SUM(L3*P3),2),\"\")","v":3999.96},"White",3,"خالد السيد عبد القادر","اسامة",3333,"yyyyyy",null,null,null,null,null,null,null,null,null,null,null,null,2,"Crosha COMEZ 2017",15.2,0.06,"White","علي مراد حسن","محمود"]
[{"$f":"IF(E4=\"\",\"\",IF(A4=\"\",TODAY(),A4))","v":"2019-02-21"},"01:00:00","07:00:00",{"$f":"IF(B4=\"\",\"\",(C4-B4))","v":"06:00:00"},2,{"$f":"IFERROR(VLOOKUP(E4,$AJ$2:$AL$316,2,FALSE),\"\")","v":"Crosha COMEZ 2017"},null,{"$f":"IFERROR(G4/D4/24,\"\")","v":0},10,{"$f":"IFERROR(I4/D4/24,\"\")","v":1.6666666666666667},{"$f":"IFERROR(L4/D4/24,\"\")","v":2.6666666666666665},16,3,0.06,"ooooo",{"$f":"IFERROR(ROUND(SUM(1000/M4),2),\"\")","v":333.33},{"$f":"IFERROR(ROUND(SUM(L4*P4),2),\"\")","v":5333.28},"A prominent Black",3,"عادل سيف الله السيد","محمود",66666,"ll",null,null,null,null,null,null,null,null,null,null,null,null,3,"Crosha F.COLLIC 1996",12,7.0000000000000007E-2,"Black&White","ابراهيم محمود ابراهيم","اسامة"]
["",null,null,"",null,"",null,"",null,"","",null,null,null,null,"",{"$f":"IFERROR(ROUND(SUM(L5*P5),2),\"\")","v":""},null,3,null,null,null,null,null,null,null,null,null,null,null,null,null,null,null,null,4,"Crosha F.COLLIC 1997",10.8,0.08,"A prominent Black","مسعد رمزي مسعد"]
["",null,null,"",null,"",null,"",null,"","",null,null,null,null,"","",null,3,null,null,null,null,null,null,null,null,null,null,null,null,null,null,null,null,5,"Crosha F.COLLIC 1996",10.4,0.09,"A prominent White","عادل عزمي شنودة"]
["",null,null,"",null,"",null,"",null,"","",null,null,null,null,"","",null,3,null,null,null,null,null,null,null,null,null,null,null,null,null,null,null,null,6,"Crosha",null,0.1,null,"صبحي محمد محمود"]
["",null,null,"",null,"",null,"",null,"","",null,null,null,null,"","",null,3,null,null,null,null,null,null,null,null,null,null,null,null,null,null,null,null,7,"Crosha",null,0.11,null,"السيد محمد عبد العال"]
["",null,null,"",null,"",null,"",null,"","",null,null,null,null,"","",null,3,null,null,null,null,null,null,null,null,null,null,null,null,null,null,null,null,8,"Crosha",null,0.12,null,"عادل سيف الله السيد"]
["",null,null,"",null,"",null,"",null,"","",null,null,null,null,"","",null,3,null,null,null,null,null,null,null,null,null,null,null,null,null,null,null,null,9,"Crosha",null,0.13,null,"خالد السيد عبد القادر"]
["",null,null,"",null,"",null,"",null,"","",null,null,null,null,"","",null,3,null,null,null,null,null,null,null,null,null,null,null,null,null,null,null,null,10,"Crosha",null,0.14000000000000001,null,"عادل صادق بشير"]
["",null,null,"",null,"",null,"",null,"","",null,null,null,null,"","",null,3,null,null,null,null,null,null,null,null,null,null,null,null,null,null,null,null,11,"Crosha",null,0.15,null,"روماني عطية حبشي"]
["",null,null,"",null,"",null,"",null,"","",null,null,null,null,"","",null,3,null,null,null,null,null,null,null,null,null,null,null,null,null,null,null,null,12,"Crosha",null,0.16,null,"احمد صادق توفيق"]
["",null,null,"",null,"",null,"",null,"","",null,null,null,null,"","",null,3,null,null,null,null,null,null,null,null,null,null,null,null,null,null,null,null,13,"Crosha",null,0.17,null,"دينا مجدي ابراهيم"]
["",null,null,"",null,"",null,"",null,"","",null,null,null,null,"","",null,3,null,null,null,null,null,null,null,null,null,null,null,null,null,null,null,null,14,"Crosha",null,0.18,null,"علي فرج على محمد"]
["",null,null,"",null,"",null,"",null,"","",null,null,null,null,"","",null,3,null,null,null,null,null,null,null,null,null,null,null,null,null,null,null,null,15,"Crosha",null,0.19,null,"بوسي السيد عبد المنعم"]
["",null,null,"",null,"",null,"",null,"","",null,null,null,null,"","",null,3,null,null,null,null,null,null,null,null,null,null,null,null,null,null,null,null,16,"Crosha",null,0.2,null,"محمد محمد عبد الوهاب"]
["",null,null,"",null,"",null,"",null,"","",null,null,null,null,"","",null,3,null,null,null,null,null,null,null,null,null,null,null,null,null,null,null,null,17,"Crosha",null,0.21,null,"سعيد الليثي جاب الله"]
["",null,null,"",null,"",null,"",null,"","",null,null,null,null,"","",null,3,null,null,null,null,null,null,null,null,null,null,null,null,null,null,null,null,18,"Crosha",null,0.22,null,"احمد عبد الظاهر"]
["",null,null,"",null,"",null,"",null,"","",null,null,null,null,"","",null,3,null,null,null,null,null,null,null,null,null,null,null,null,null,null,null,null,19,"Crosha",null,0.23,null,"مصطفى عبد النبي مصطفى"]
["",null,null,"",null,"",null,"",null,"","",null,null,null,null,"","",null,3,null,null,null,null,null,null,null,null,null,null,null,null,null,null,null,null,20,"Crosha",null,0.24,null,"ابراهيم صبحي محمد السيد"]
["",null,null,"",null,"",null,"",null,"","",null,null,null,null,"","",null,3,null,null,null,null,null,null,null,null,null,null,null,null,null,null,null,null,21,"Crosha",null,0.25,null,"خميس حسن حسنين"]
["",null,null,"",null,"",null,"",null,"","",null,null,null,null,"","",null,3,null,null,null,null,null,null,null,null,null,null,null,null,null,null,null,null,22,"Crosha",null,0.26,null,"محمد حسني حسن"]
["",null,null,"",null,"",null,"",null,"","",null,null,null,null,"","",null,3,null,null,null,null,null,null,null,null,null,null,null,null,null,null,null,null,23,"Crosha",null,0.27,null,"محمد عادل محمد محمد"]
["",null,null,"",null,"",null,"",null,"","",null,null,null,null,"","",null,3,null,null,null,null,null,null,null,null,null,null,null,null,null,null,null,null,24,"Crosha",null,0.28000000000000003,null,"السيد عبد الحميد اسماعيل"]
["",null,null,"",null,"",null,"",null,"","",null,null,null,null,{"$f":"IFERROR(ROUND(SUM(1000/M26),2),\"\")","v":""},"",null,3,null,null,null,null,null,null,null,null,null,null,null,null,null,null,null,null,25,"Crosha",null,0.28999999999999998,null,"ابراهيم محمد فتوح"]
["",null,null,"",null,"",null,"",null,"","",null,null,null,null,"","",null,3,null,null,null,null,null,null,null,null,null,null,null,null,null,null,null,null,26,"Crosha",null,0.3,null,"عمرو محمد عبد الجليل"]
["",null,null,"",null,"",null,"",null,"","",null,null,null,null,"","",null,3,null,null,null,null,null,null,null,null,null,null,null,null,null,null,null,null,27,"Crosha",null,0.31,null,"خالد مصطفى العوضي"]
["",null,null,"",null,"",null,"",null,"","",null,null,null,null,"","",null,3,null,null,null,null,null,null,null,null,null,null,null,null,null,null,null,null,28,"Crosha",null,0.32,null,"حمادة احمد على النجار"]
["",null,null,"",null,"",null,"",null,"","",null,null,null,null,"","",null,3,null,null,null,null,null,null,null,null,null,null,null,null,null,null,null,null,29,"Crosha",null,0.33,null,"عاطف وليم لبيب"]
["",null,null,"",null,"",null,"",null,"","",null,null,null,null,"","",null,3,null,null,null,null,null,null,null,null,null,null,null,null,null,null,null,null,30,"Crosha",null,0.34,null,"عادل وليم نبيل"]
["",null,null,"",null,"",null,"",null,"","",null,null,null,null,"","",null,3,null,null,null,null,null,null,null,null,null,null,null,null,null,null,null,null,31,"Crosha",null,0.35,null,"بيشوي عزت شفيق"]
["",null,null,"",null,"",null,"",null,"","",null,null,null,null,"","",null,3,null,null,null,null,null,null,null,null,null,null,null,null,null,null,null,null,32,"Crosha",null,0.36,null,"محمد يحيى محمود"]
["",null,null,"",null,"",null,"",null,"","",null,null,null,null,"","",null,3,null,null,null,null,null,null,null,null,null,null,null,null,null,null,null,null,33,"Crosha",null,0.37,null,"احمد رمضان احمد"]
["",null,null,"",null,"",null,"",null,"","",null,null,null,null,"","",null,3,null,null,null,null,null,null,null,null,null,null,null,null,null,null,null,null,34,"Crosha",null,0.38]
["",null,null,"",null,"",null,"",null,"","",null,null,null,null,"","",null,3,null,null,null,null,null,null,null,null,null,null,null,null,null,null,null,null,35,"Crosha",null,0.39]
["",null,null,"",null,"",null,"",null,"","",null,null,null,null,"","",null,3,null,null,null,null,null,null,null,null,null,null,null,null,null,null,null,null,36,"Crosha",null,0.4]
["",null,null,"",null,"",null,"",null,"","",null,null,null,null,"","",null,3,null,null,null,null,null,null,null,null,null,null,null,null,null,null,null,null,37,"Crosha",null,0.41]
["",null,null,"",null,"",null,"",null,"","",null,null,null,null,"","",null,3,null,null,null,null,null,null,null,null,null,null,null,null,null,null,null,null,38,"Crosha",null,0.42]
["",null,null,"",null,"",null,"",null,"","",null,null,null,null,"","",null,3,null,null,null,null,null,null,null,null,null,null,null,null,null,null,null,null,39,"Crosha",null,0.43]
["",null,null,"",null,"",null,"",null,"","",null,null,null,null,"","",null,3,null,null,null,null,null,null,null,null,null,null,null,null,null,null,null,null,40,"Crosha",null,0.44]
["",null,null,"",null,"",null,"",null,"","",null,null,null,null,"","",null,3,null,null,null,null,null,null,null,null,null,null,null,null,null,null,null,null,41,"Crosha",null,0.45]
["",null,null,"",null,"",null,"",null,"","",null,null,null,null,"","",null,3,null,null,null,null,null,null,null,null,null,null,null,null,null,null,null,null,42,"Crosha",null,0.46]
["",null,null,"",null,"",null,"",null,"","",null,null,null,null,"","",null,3,null,null,null,null,null,null,null,null,null,null,null,null,null,null,null,null,43,"Crosha",null,0.47]
["",null,null,"",null,"",null,"",null,"","",null,null,null,null,"","",null,3,null,null,null,null,null,null,null,null,null,null,null,null,null,null,null,null,44,"Crosha",null,0.48]
["",null,null,"",null,"",null,"",null,"","",null,null,null,null,"","",null,3,null,null,null,null,null,null,null,null,null,null,null,null,null,null,null,null,45,"Crosha",null,0.49]
["",null,null,"",null,"",null,"",null,"","",null,null,null,null,"","",null,3,null,null,null,null,null,null,null,null,null,null,null,null,null,null,null,null,46,"Crosha",null,0.5]
["",null,null,"",null,"",null,"",null,"","",null,null,null,null,"","",null,3,null,null,null,null,null,null,null,null,null,null,null,null,null,null,null,null,47,"Crosha",null,0.51]
["",null,null,"",null,"",null,"",null,"","",null,null,null,null,"","",null,3,null,null,null,null,null,null,null,null,null,null,null,null,null,null,null,null,48,"Crosha",null,0.52]
["",null,null,"",null,"",null,"",null,"","",null,null,null,null,"","",null,3,null,null,null,null,null,null,null,null,null,null,null,null,null,null,null,null,49,"Crosha",null,0.53]
["",null,null,"",null,"",null,"",null,"","",null,null,null,null,"","",null,3,null,null,null,null,null,null,null,null,null,null,null,null,null,null,null,null,50,"Crosha",null,0.54]
["",null,null,"",null,"",null,"",null,"","",null,null,null,null,"","",null,3,null,null,null,null,null,null,null,null,null,null,null,null,null,null,null,null,51,"Crosha",null,0.55000000000000004]
["",null,null,"",null,"",null,"",null,"","",null,null,null,null,"","",null,3,null,null,null,null,null,null,null,null,null,null,null,null,null,null,null,null,52,"Crosha",null,0.56000000000000005]
["",null,null,"",null,"",null,"",null,"","",null,null,null,null,"","",null,3,null,null,null,null,null,null,null,null,null,null,null,null,null,null,null,null,53,"Crosha",null,0.56999999999999995]
["",null,null,"",null,"",null,"",null,"","",null,null,null,null,"","",null,3,null,null,null,null,null,null,null,null,null,null,null,null,null,null,null,null,54,"Crosha",null,0.57999999999999996]
["",null,null,"",null,"",null,"",null,"","",null,null,null,null,"","",null,3,null,null,null,null,null,null,null,null,null,null,null,null,null,null,null,null,55,"Crosha",null,0.59]
["",null,null,"",null,"",null,"",null,"","",null,null,null,null,"","",null,3,null,null,null,null,null,null,null,null,null,null,null,null,null,null,null,null,56,"Crosha",null,0.6]
["",null,null,"",null,"",null,"",null,"","",null,null,null,null,"","",null,3,null,null,null,null,null,null,null,null,null,null,null,null,null,null,null,null,57,"Crosha",null,0.61]
["",null,null,"",null,"",null,"",null,"","",null,null,null,null,"","",null,3,null,null,null,null,null,null,null,null,null,null,null,null,null,null,null,null,58,"Crosha",null,0.62]
["",null,null,"",null,"",null,"",null,"","",null,null,null,null,"","",null,3,null,null,null,null,null,null,null,null,null,null,null,null,null,null,null,null,59,"Crosha",null,0.63]
["",null,null,"",null,"",null,"",null,"","",null,null,null,null,"","",null,3,null,null,null,null,null,null,null,null,null,null,null,null,null,null,null,null,60,"Crosha",null,0.64]
["",null,null,"",null,"",null,"",null,"","",null,null,null,null,"","",null,3,null,null,null,null,null,null,null,null,null,null,null,null,null,null,null,null,61,"Crosha",null,0.65]
["",null,null,"",null,"",null,"",null,"","",null,null,null,null,"","",null,3,null,null,null,null,null,null,null,null,null,null,null,null,null,null,null,null,62,"Crosha",null,0.66]
["",null,null,"",null,"",null,"",null,"","",null,null,null,null,"","",null,3,null,null,null,null,null,null,null,null,null,null,null,null,null,null,null,null,63,"Crosha",null,0.67]
["",null,null,"",null,"",null,"",null,"","",null,null,null,null,"","",null,3,null,null,null,null,null,null,null,null,null,null,null,null,null,null,null,null,64,"Crosha",null,0.68]
["",null,null,"",null,"",null,"",null,"","",null,null,null,null,"","",null,3,null,null,null,null,null,null,null,null,null,null,null,null,null,null,null,null,65,"Crosha",null,0.69]
["",null,null,"",null,"",null,"",null,"","",null,null,null,null,"","",null,3,null,null,null,null,null,null,null,null,null,null,null,null,null,null,null,null,66,"Crosha",null,0.7]
[{"$f":"IF(E68=\"\",\"\",IF(A68=\"\",TODAY(),A68))","v":""},null,null,{"$f":"IF(B68=\"\",\"\",(C68-B68))","v":""},null,{"$f":"IFERROR(VLOOKUP(E68,$AJ$2:$AL$316,2,FALSE),\"\")","v":""},null,{"$f":"IFERROR(G68/D68/24,\"\")","v":""},null,{"$f":"IFERROR(I68/D68/24,\"\")","v":""},{"$f":"IFERROR(L68/D68/24,\"\")","v":""},null,null,null,null,"","",null,3,null,null,null,null,null,null,null,null,null,null,null,null,null,null,null,null,67,"Crosha",null,0.71]
["",null,null,"",null,"",null,"",null,"","",null,null,null,null,"",{"$f":"IFERROR(ROUND(SUM(L69*P69),2),\"\")","v":""},null,3,null,null,null,null,null,null,null,null,null,null,null,null,null,null,null,null,68,"Crosha",null,0.72]
["",null,null,"",null,"",null,"",null,"","",null,null,null,null,"","",null,3,null,null,null,null,null,null,null,null,null,null,null,null,null,null,null,null,69,"Crosha",null,0.73]
["",null,null,"",null,"",null,"",null,"","",null,null,null,null,"","",null,3,null,null,null,null,null,null,null,null,null,null,null,null,null,null,null,null,70,"Crosha",null,0.74]
["",null,null,"",null,"",null,"",null,"","",null,null,null,null,"","",null,3,null,null,null,null,null,null,null,null,null,null,null,null,null,null,null,null,71,"Crosha",null,0.75]
["",null,null,"",null,"",null,"",null,"","",null,null,null,null,"","",null,3,null,null,null,null,null,null,null,null,null,null,null,null,null,null,null,null,72,"Crosha",null,0.76]
["",null,null,"",null,"",null,"",null,"","",null,null,null,null,"","",null,3,null,null,null,null,null,null,null,null,null,null,null,null,null,null,null,null,73,"Crosha",null,0.77]
["",null,null,"",null,"",null,"",null,"","",null,null,null,null,"","",null,3,null,null,null,null,null,null,null,null,null,null,null,null,null,null,null,null,74,"Crosha",null,0.78]
["",null,null,"",null,"",null,"",null,"","",null,null,null,null,"","",null,3,null,null,null,null,null,null,null,null,null,null,null,null,null,null,null,null,75,"Crosha",null,0.79]
["",null,null,"",null,"",null,"",null,"","",null,null,null,null,"","",null,3,null,null,null,null,null,null,null,null,null,null,null,null,null,null,null,null,76,"Crosha",null,0.8]
["",null,null,"",null,"",null,"",null,"","",null,null,null,null,"","",null,3,null,null,null,null,null,null,null,null,null,null,null,null,null,null,null,null,77,"Crosha",null,0.81]
["",null,null,"",null,"",null,"",null,"","",null,null,null,null,"","",null,3,null,null,null,null,null,null,null,null,null,null,null,null,null,null,null,null,78,"Crosha",null,0.82]
["",null,null,"",null,"",null,"",null,"","",null,null,null,null,"","",null,3,null,null,null,null,null,null,null,null,null,null,null,null,null,null,null,null,79,"Crosha",null,0.83]
["",null,null,"",null,"",null,"",null,"","",null,null,null,null,"","",null,3,null,null,null,null,null,null,null,null,null,null,null,null,null,null,null,null,80,"Crosha",null,0.84]
["",null,null,"",null,"",null,"",null,"","",null,null,null,null,"","",null,3,null,null,null,null,null,null,null,null,null,null,null,null,null,null,null,null,81,"Crosha",null,0.85]
["",null,null,"",null,"",null,"",null,"","",null,null,null,null,"","",null,3,null,null,null,null,null,null,null,null,null,null,null,null,null,null,null,null,82,"Crosha",null,0.86]
["",null,null,"",null,"",null,"",null,"","",null,null,null,null,"","",null,3,null,null,null,null,null,null,null,null,null,null,null,null,null,null,null,null,83,"Crosha",null,0.87]
["",null,null,"",null,"",null,"",null,"","",null,null,null,null,"","",null,3,null,null,null,null,null,null,null,null,null,null,null,null,null,null,null,null,84,"Crosha",null,0.88]
["",null,null,"",null,"",null,"",null,"","",null,null,null,null,"","",null,3,null,null,null,null,null,null,null,null,null,null,null,null,null,null,null,null,85,"Crosha",null,0.89]
["",null,null,"",null,"",null,"",null,"","",null,null,null,null,"","",null,3,null,null,null,null,null,null,null,null,null,null,null,null,null,null,null,null,86,"Crosha",null,0.9]
["",null,null,"",null,"",null,"",null,"","",null,null,null,null,"","",null,3,null,null,null,null,null,null,null,null,null,null,null,null,null,null,null,null,87,"Crosha",null,0.91]
["",null,null,"",null,"",null,"",null,"","",null,null,null,null,"","",null,3,null,null,null,null,null,null,null,null,null,null,null,null,null,null,null,null,88,"Crosha",null,0.92]
["",null,null,"",null,"",null,"",null,"","",null,null,null,null,{"$f":"IFERROR(ROUND(SUM(1000/M90),2),\"\")","v":""},"",null,3,null,null,null,null,null,null,null,null,null,null,null,null,null,null,null,null,89,"Crosha",null,0.93]
["",null,null,"",null,"",null,"",null,"","",null,null,null,null,"","",null,3,null,null,null,null,null,null,null,null,null,null,null,null,null,null,null,null,90,"Crosha",null,0.94]
["",null,null,"",null,"",null,"",null,"","",null,null,null,null,"","",null,3,null,null,null,null,null,null,null,null,null,null,null,null,null,null,null,null,91,"Crosha",null,0.95]
["",null,null,"",null,"",null,"",null,"","",null,null,null,null,"","",null,3,null,null,null,null,null,null,null,null,null,null,null,null,null,null,null,null,92,"Crosha",null,0.96]
["",null,null,"",null,"",null,"",null,"","",null,null,null,null,"","",null,3,null,null,null,null,null,null,null,null,null,null,null,null,null,null,null,null,93,"Crosha",null,0.97]
["",null,null,"",null,"",null,"",null,"","",null,null,null,null,"","",null,3,null,null,null,null,null,null,null,null,null,null,null,null,null,null,null,null,94,"Crosha",null,0.98]
["",null,null,"",null,"",null,"",null,"","",null,null,null,null,"","",null,3,null,null,null,null,null,null,null,null,null,null,null,null,null,null,null,null,95,"Crosha",null,0.99]
["",null,null,"",null,"",null,"",null,"","",null,null,null,null,"","",null,3,null,null,null,null,null,null,null,null,null,null,null,null,null,null,null,null,96,"Crosha",null,1]
["",null,null,"",null,"",null,"",null,"","",null,null,null,null,"","",null,3,null,null,null,null,null,null,null,null,null,null,null,null,null,null,null,null,97,"Crosha",null,1.01]
["",null,null,"",null,"",null,"",null,"","",null,null,null,null,"","",null,3,null,null,null,null,null,null,null,null,null,null,null,null,null,null,null,null,98,"Crosha",null,1.02]
["",null,null,"",null,"",null,"",null,"","",null,null,null,null,"","",null,3,null,null,null,null,null,null,null,null,null,null,null,null,null,null,null,null,99,"Crosha",null,1.03]
["",null,null,"",null,"",null,"",null,"","",null,null,null,null,"","",null,3,null,null,null,null,null,null,null,null,null,null,null,null,null,null,null,null,100,"Crosha",null,1.04]
["",null,null,"",null,"",null,"",null,"","",null,null,null,null,"","",null,3,null,null,null,null,null,null,null,null,null,null,null,null,null,null,null,null,101,"Jakar - MULLER 2017",4.46,1.05]
["",null,null,"",null,"",null,"",null,"","",null,null,null,null,"","",null,3,null,null,null,null,null,null,null,null,null,null,null,null,null,null,null,null,102,"Jakar - MULLER 2017",6.78,1.06]
["",null,null,"",null,"",null,"",null,"","",null,null,null,null,"","",null,3,null,null,null,null,null,null,null,null,null,null,null,null,null,null,null,null,103,"Jakar",null,1.07]
["",null,null,"",null,"",null,"",null,"","",null,null,null,null,"","",null,3,null,null,null,null,null,null,null,null,null,null,null,null,null,null,null,null,104,"Jakar",null,1.08]
["",null,null,"",null,"",null,"",null,"","",null,null,null,null,"","",null,3,null,null,null,null,null,null,null,null,null,null,null,null,null,null,null,null,105,"Jakar",null,1.0900000000000001]
["",null,null,"",null,"",null,"",null,"","",null,null,null,null,"","",null,3,null,null,null,null,null,null,null,null,null,null,null,null,null,null,null,null,106,"Jakar",null,1.1000000000000001]
["",null,null,"",null,"",null,"",null,"","",null,null,null,null,"","",null,3,null,null,null,null,null,null,null,null,null,null,null,null,null,null,null,null,107,"Jakar",null,1.1100000000000001]
["",null,null,"",null,"",null,"",null,"","",null,null,null,null,"","",null,3,null,null,null,null,null,null,null,null,null,null,null,null,null,null,null,null,108,"Jakar",null,1.1200000000000001]
["",null,null,"",null,"",null,"",null,"","",null,null,null,null,"","",null,3,null,null,null,null,null,null,null,null,null,null,null,null,null,null,null,null,109,"Jakar",null,1.1299999999999999]
["",null,null,"",null,"",null,"",null,"","",null,null,null,null,"","",null,3,null,null,null,null,null,null,null,null,null,null,null,null,null,null,null,null,110,"Jakar",null,1.1399999999999999]
["",null,null,"",null,"",null,"",null,"","",null,null,null,null,"","",null,3,null,null,null,null,null,null,null,null,null,null,null,null,null,null,null,null,111,"Jakar",null,1.1499999999999999]
["",null,null,"",null,"",null,"",null,"","",null,null,null,null,"","",null,3,null,null,null,null,null,null,null,null,null,null,null,null,null,null,null,null,112,"Jakar",null,1.1599999999999999]
["",null,null,"",null,"",null,"",null,"","",null,null,null,null,"","",null,3,null,null,null,null,null,null,null,null,null,null,null,null,null,null,null,null,113,"Jakar",null,1.17]
["",null,null,"",null,"",null,"",null,"","",null,null,null,null,"","",null,3,null,null,null,null,null,null,null,null,null,null,null,null,null,null,null,null,114,"Jakar",null,1.18]
["",null,null,"",null,"",null,"",null,"","",null,null,null,null,"","",null,3,null,null,null,null,null,null,null,null,null,null,null,null,null,null,null,null,115,"Jakar",null,1.19]
["",null,null,"",null,"",null,"",null,"","",null,null,null,null,"","",null,3,null,null,null,null,null,null,null,null,null,null,null,null,null,null,null,null,116,"Jakar",null,1.2]
["",null,null,"",null,"",null,"",null,"","",null,null,null,null,"","",null,3,null,null,null,null,null,null,null,null,null,null,null,null,null,null,null,null,117,"Jakar",null,1.21]
["",null,null,"",null,"",null,"",null,"","",null,null,null,null,"","",null,3,null,null,null,null,null,null,null,null,null,null,null,null,null,null,null,null,118,"Jakar",null,1.22]
["",null,null,"",null,"",null,"",null,"","",null,null,null,null,"","",null,3,null,null,null,null,null,null,null,null,null,null,null,null,null,null,null,null,119,"Jakar",null,1.23]
["",null,null,"",null,"",null,"",null,"","",null,null,null,null,"","",null,3,null,null,null,null,null,null,null,null,null,null,null,null,null,null,null,null,120,"Jakar",null,1.24]
["",null,null,"",null,"",null,"",null,"","",null,null,null,null,"","",null,3,null,null,null,null,null,null,null,null,null,null,null,null,null,null,null,null,121,"Jakar",null,1.25]
["",null,null,"",null,"",null,"",null,"","",null,null,null,null,"","",null,3,null,null,null,null,null,null,null,null,null,null,null,null,null,null,null,null,122,"Jakar",null,1.26]
["",null,null,"",null,"",null,"",null,"","",null,null,null,null,"","",null,3,null,null,null,null,null,null,null,null,null,null,null,null,null,null,null,null,123,"Jakar",null,1.27]
["",null,null,"",null,"",null,"",null,"","",null,null,null,null,"","",null,3,null,null,null,null,null,null,null,null,null,null,null,null,null,null,null,null,124,"Jakar",null,1.28]
["",null,null,"",null,"",null,"",null,"","",null,null,null,null,"","",null,3,null,null,null,null,null,null,null,null,null,null,null,null,null,null,null,null,125,"Jakar",null,1.29]
["",null,null,"",null,"",null,"",null,"","",null,null,null,null,"","",null,3,null,null,null,null,null,null,null,null,null,null,null,null,null,null,null,null,126,"Jakar",null,1.3]
["",null,null,"",null,"",null,"",null,"","",null,null,null,null,"","",null,3,null,null,null,null,null,null,null,null,null,null,null,null,null,null,null,null,127,"Jakar",null,1.31]
["",null,null,"",null,"",null,"",null,"","",null,null,null,null,"","",null,3,null,null,null,null,null,null,null,null,null,null,null,null,null,null,null,null,128,"Jakar",null,1.32]
["",null,null,"",null,"",null,"",null,"","",null,null,null,null,"","",null,3,null,null,null,null,null,null,null,null,null,null,null,null,null,null,null,null,129,"Jakar",null,1.33]
["",null,null,"",null,"",null,"",null,"","",null,null,null,null,"","",null,3,null,null,null,null,null,null,null,null,null,null,null,null,null,null,null,null,130,"Jakar",null,1.34]
[{"$f":"IF(E132=\"\",\"\",IF(A132=\"\",TODAY(),A132))","v":""},null,null,{"$f":"IF(B132=\"\",\"\",(C132-B132))","v":""},null,{"$f":"IFERROR(VLOOKUP(E132,$AJ$2:$AL$316,2,FALSE),\"\")","v":""},null,{"$f":"IFERROR(G132/D132/24,\"\")","v":""},null,{"$f":"IFERROR(I132/D132/24,\"\")","v":""},{"$f":"IFERROR(L132/D132/24,\"\")","v":""},null,null,null,null,"","",null,3,null,null,null,null,null,null,null,null,null,null,null,null,null,null,null,null,131,"Jakar",null,1.35]
["",null,null,"",null,"",null,"",null,"","",null,null,null,null,"",{"$f":"IFERROR(ROUND(SUM(L133*P133),2),\"\")","v":""},null,3,null,null,null,null,null,null,null,null,null,null,null,null,null,null,null,null,132,"Jakar",null,1.36]
["",null,null,"",null,"",null,"",null,"","",null,null,null,null,"","",null,3,null,null,null,null,null,null,null,null,null,null,null,null,null,null,null,null,133,"Jakar",null,1.37]
["",null,null,"",null,"",null,"",null,"","",null,null,null,null,"","",null,3,null,null,null,null,null,null,null,null,null,null,null,null,null,null,null,null,134,"Jakar",null,1.38]
["",null,null,"",null,"",null,"",null,"","",null,null,null,null,"","",null,3,null,null,null,null,null,null,null,null,null,null,null,null,null,null,null,null,135,"Jakar",null,1.39]
["",null,null,"",null,"",null,"",null,"","",null,null,null,null,"","",null,3,null,null,null,null,null,null,null,null,null,null,null,null,null,null,null,null,136,"Jakar",null,1.4]
["",null,null,"",null,"",null,"",null,"","",null,null,null,null,"","",null,3,null,null,null,null,null,null,null,null,null,null,null,null,null,null,null,null,137,"Jakar",null,1.41]
["",null,null,"",null,"",null,"",null,"","",null,null,null,null,"","",null,3,null,null,null,null,null,null,null,null,null,null,null,null,null,null,null,null,138,"Jakar",null,1.42]
["",null,null,"",null,"",null,"",null,"","",null,null,null,null,"","",null,3,null,null,null,null,null,null,null,null,null,null,null,null,null,null,null,null,139,"Jakar",null,1.43]
["",null,null,"",null,"",null,"",null,"","",null,null,null,null,"","",null,3,null,null,null,null,null,null,null,null,null,null,null,null,null,null,null,null,140,"Jakar",null,1.44]
["",null,null,"",null,"",null,"",null,"","",null,null,null,null,"","",null,3,null,null,null,null,null,null,null,null,null,null,null,null,null,null,null,null,141,"Jakar",null,1.45]
["",null,null,"",null,"",null,"",null,"","",null,null,null,null,"","",null,3,null,null,null,null,null,null,null,null,null,null,null,null,null,null,null,null,142,"Jakar",null,1.46]
["",null,null,"",null,"",null,"",null,"","",null,null,null,null,"","",null,3,null,null,null,null,null,null,null,null,null,null,null,null,null,null,null,null,143,"Jakar",null,1.47]
["",null,null,"",null,"",null,"",null,"","",null,null,null,null,"","",null,3,null,null,null,null,null,null,null,null,null,null,null,null,null,null,null,null,144,"Jakar",null,1.48]
["",null,null,"",null,"",null,"",null,"","",null,null,null,null,"","",null,3,null,null,null,null,null,null,null,null,null,null,null,null,null,null,null,null,145,"Jakar",null,1.49]
["",null,null,"",null,"",null,"",null,"","",null,null,null,null,"","",null,3,null,null,null,null,null,null,null,null,null,null,null,null,null,null,null,null,146,"Jakar",null,1.5]
["",null,null,"",null,"",null,"",null,"","",null,null,null,null,"","",null,3,null,null,null,null,null,null,null,null,null,null,null,null,null,null,null,null,147,"Jakar",null,1.51]
["",null,null,"",null,"",null,"",null,"","",null,null,null,null,"","",null,3,null,null,null,null,null,null,null,null,null,null,null,null,null,null,null,null,148,"Jakar",null,1.52]
["",null,null,"",null,"",null,"",null,"","",null,null,null,null,"","",null,3,null,null,null,null,null,null,null,null,null,null,null,null,null,null,null,null,149,"Jakar",null,1.53]
["",null,null,"",null,"",null,"",null,"","",null,null,null,null,"","",null,3,null,null,null,null,null,null,null,null,null,null,null,null,null,null,null,null,150,"Jakar",null,1.54]
["",null,null,"",null,"",null,"",null,"","",null,null,null,null,"","",null,3,null,null,null,null,null,null,null,null,null,null,null,null,null,null,null,null,151,"Jakar",null,1.55]
["",null,null,"",null,"",null,"",null,"","",null,null,null,null,"","",null,3,null,null,null,null,null,null,null,null,null,null,null,null,null,null,null,null,152,"Jakar",null,1.56]
["",null,null,"",null,"",null,"",null,"","",null,null,null,null,{"$f":"IFERROR(ROUND(SUM(1000/M154),2),\"\")","v":""},"",null,3,null,null,null,null,null,null,null,null,null,null,null,null,null,null,null,null,153,"Jakar",null,1.57]
["",null,null,"",null,"",null,"",null,"","",null,null,null,null,"","",null,3,null,null,null,null,null,null,null,null,null,null,null,null,null,null,null,null,154,"Jakar",null,1.58]
["",null,null,"",null,"",null,"",null,"","",null,null,null,null,"","",null,3,null,null,null,null,null,null,null,null,null,null,null,null,null,null,null,null,155,"Jakar",null,1.59]
["",null,null,"",null,"",null,"",null,"","",null,null,null,null,"","",null,3,null,null,null,null,null,null,null,null,null,null,null,null,null,null,null,null,156,"Jakar",null,1.6]
["",null,null,"",null,"",null,"",null,"","",null,null,null,null,"","",null,3,null,null,null,null,null,null,null,null,null,null,null,null,null,null,null,null,157,"Jakar",null,1.61]
["",null,null,"",null,"",null,"",null,"","",null,null,null,null,"","",null,3,null,null,null,null,null,null,null,null,null,null,null,null,null,null,null,null,158,"Jakar",null,1.62]
["",null,null,"",null,"",null,"",null,"","",null,null,null,null,"","",null,3,null,null,null,null,null,null,null,null,null,null,null,null,null,null,null,null,159,"Jakar",null,1.63]
["",null,null,"",null,"",null,"",null,"","",null,null,null,null,"","",null,3,null,null,null,null,null,null,null,null,null,null,null,null,null,null,null,null,160,"Jakar",null,1.64]
["",null,null,"",null,"",null,"",null,"","",null,null,null,null,"","",null,3,null,null,null,null,null,null,null,null,null,null,null,null,null,null,null,null,161,"Jakar",null,1.65]
["",null,null,"",null,"",null,"",null,"","",null,null,null,null,"","",null,3,null,null,null,null,null,null,null,null,null,null,null,null,null,null,null,null,162,"Jakar",null,1.66]
["",null,null,"",null,"",null,"",null,"","",null,null,null,null,"","",null,3,null,null,null,null,null,null,null,null,null,null,null,null,null,null,null,null,163,"Jakar",null,1.67]
["",null,null,"",null,"",null,"",null,"","",null,null,null,null,"","",null,3,null,null,null,null,null,null,null,null,null,null,null,null,null,null,null,null,164,"Jakar",null,1.68]
["",null,null,"",null,"",null,"",null,"","",null,null,null,null,"","",null,3,null,null,null,null,null,null,null,null,null,null,null,null,null,null,null,null,165,"Jakar",null,1.69]
["",null,null,"",null,"",null,"",null,"","",null,null,null,null,"","",null,3,null,null,null,null,null,null,null,null,null,null,null,null,null,null,null,null,166,"Jakar",null,1.7]
["",null,null,"",null,"",null,"",null,"","",null,null,null,null,"","",null,3,null,null,null,null,null,null,null,null,null,null,null,null,null,null,null,null,167,"Jakar",null,1.71]
["",null,null,"",null,"",null,"",null,"","",null,null,null,null,"","",null,3,null,null,null,null,null,null,null,null,null,null,null,null,null,null,null,null,168,"Jakar",null,1.72]
["",null,null,"",null,"",null,"",null,"","",null,null,null,null,"","",null,3,null,null,null,null,null,null,null,null,null,null,null,null,null,null,null,null,169,"Jakar",null,1.73]
["",null,null,"",null,"",null,"",null,"","",null,null,null,null,"","",null,3,null,null,null,null,null,null,null,null,null,null,null,null,null,null,null,null,170,"Jakar",null,1.74]
["",null,null,"",null,"",null,"",null,"","",null,null,null,null,"","",null,3,null,null,null,null,null,null,null,null,null,null,null,null,null,null,null,null,171,"Jakar",null,1.75]
["",null,null,"",null,"",null,"",null,"","",null,null,null,null,"","",null,3,null,null,null,null,null,null,null,null,null,null,null,null,null,null,null,null,172,"Jakar",null,1.76]
["",null,null,"",null,"",null,"",null,"","",null,null,null,null,"","",null,3,null,null,null,null,null,null,null,null,null,null,null,null,null,null,null,null,173,"Jakar",null,1.77]
["",null,null,"",null,"",null,"",null,"","",null,null,null,null,"","",null,3,null,null,null,null,null,null,null,null,null,null,null,null,null,null,null,null,174,"Jakar",null,1.78]
["",null,null,"",null,"",null,"",null,"","",null,null,null,null,"","",null,3,null,null,null,null,null,null,null,null,null,null,null,null,null,null,null,null,175,"Jakar",null,1.79]
["",null,null,"",null,"",null,"",null,"","",null,null,null,null,"","",null,3,null,null,null,null,null,null,null,null,null,null,null,null,null,null,null,null,176,"Jakar",null,1.8]
["",null,null,"",null,"",null,"",null,"","",null,null,null,null,"","",null,3,null,null,null,null,null,null,null,null,null,null,null,null,null,null,null,null,177,"Jakar",null,1.81]
["",null,null,"",null,"",null,"",null,"","",null,null,null,null,"","",null,3,null,null,null,null,null,null,null,null,null,null,null,null,null,null,null,null,178,"Jakar",null,1.82]
["",null,null,"",null,"",null,"",null,"","",null,null,null,null,"","",null,3,null,null,null,null,null,null,null,null,null,null,null,null,null,null,null,null,179,"Jakar",null,1.83]
["",null,null,"",null,"",null,"",null,"","",null,null,null,null,"","",null,3,null,null,null,null,null,null,null,null,null,null,null,null,null,null,null,null,180,"Jakar",null,1.84]
["",null,null,"",null,"",null,"",null,"","",null,null,null,null,"","",null,3,null,null,null,null,null,null,null,null,null,null,null,null,null,null,null,null,181,"Jakar",null,1.85]
["",null,null,"",null,"",null,"",null,"","",null,null,null,null,"","",null,3,null,null,null,null,null,null,null,null,null,null,null,null,null,null,null,null,182,"Jakar",null,1.86]
["",null,null,"",null,"",null,"",null,"","",null,null,null,null,"","",null,3,null,null,null,null,null,null,null,null,null,null,null,null,null,null,null,null,183,"Jakar",null,1.87]
["",null,null,"",null,"",null,"",null,"","",null,null,null,null,"","",null,3,null,null,null,null,null,null,null,null,null,null,null,null,null,null,null,null,184,"Jakar",null,1.88]
["",null,null,"",null,"",null,"",null,"","",null,null,null,null,"","",null,3,null,null,null,null,null,null,null,null,null,null,null,null,null,null,null,null,185,"Jakar",null,1.89]
["",null,null,"",null,"",null,"",null,"","",null,null,null,null,"","",null,3,null,null,null,null,null,null,null,null,null,null,null,null,null,null,null,null,186,"Jakar",null,1.9]
["",null,null,"",null,"",null,"",null,"","",null,null,null,null,"","",null,3,null,null,null,null,null,null,null,null,null,null,null,null,null,null,null,null,187,"Jakar",null,1.91]
["",null,null,"",null,"",null,"",null,"","",null,null,null,null,"","",null,3,null,null,null,null,null,null,null,null,null,null,null,null,null,null,null,null,188,"Jakar",null,1.92]
["",null,null,"",null,"",null,"",null,"","",null,null,null,null,"","",null,3,null,null,null,null,null,null,null,null,null,null,null,null,null,null,null,null,189,"Jakar",null,1.93]
["",null,null,"",null,"",null,"",null,"","",null,null,null,null,"","",null,3,null,null,null,null,null,null,null,null,null,null,null,null,null,null,null,null,190,"Jakar",null,1.94]
["",null,null,"",null,"",null,"",null,"","",null,null,null,null,"","",null,3,null,null,null,null,null,null,null,null,null,null,null,null,null,null,null,null,191,"Jakar",null,1.95]
["",null,null,"",null,"",null,"",null,"","",null,null,null,null,"","",null,3,null,null,null,null,null,null,null,null,null,null,null,null,null,null,null,null,192,"Jakar",null,1.96]
["",null,null,"",null,"",null,"",null,"","",null,null,null,null,"","",null,3,null,null,null,null,null,null,null,null,null,null,null,null,null,null,null,null,193,"Jakar",null,1.97]
["",null,null,"",null,"",null,"",null,"","",null,null,null,null,"","",null,3,null,null,null,null,null,null,null,null,null,null,null,null,null,null,null,null,194,"Jakar",null,1.98]
[{"$f":"IF(E196=\"\",\"\",IF(A196=\"\",TODAY(),A196))","v":""},null,null,{"$f":"IF(B196=\"\",\"\",(C196-B196))","v":""},null,{"$f":"IFERROR(VLOOKUP(E196,$AJ$2:$AL$316,2,FALSE),\"\")","v":""},null,{"$f":"IFERROR(G196/D196/24,\"\")","v":""},null,{"$f":"IFERROR(I196/D196/24,\"\")","v":""},{"$f":"IFERROR(L196/D196/24,\"\")","v":""},null,null,null,null,"","",null,3,null,null,null,null,null,null,null,null,null,null,null,null,null,null,null,null,195,"Jakar",null,1.99]
["",null,null,"",null,"",null,"",null,"","",null,null,null,null,"",{"$f":"IFERROR(ROUND(SUM(L197*P197),2),\"\")","v":""},null,3,null,null,null,null,null,null,null,null,null,null,null,null,null,null,null,null,196,"Jakar",null,2]
["",null,null,"",null,"",null,"",null,"","",null,null,null,null,"","",null,3,null,null,null,null,null,null,null,null,null,null,null,null,null,null,null,null,197,"Jakar",null,2.0099999999999998]
["",null,null,"",null,"",null,"",null,"","",null,null,null,null,"","",null,3,null,null,null,null,null,null,null,null,null,null,null,null,null,null,null,null,198,"Jakar",null,2.02]
["",null,null,"",null,"",null,"",null,"","",null,null,null,null,"","",null,3,null,null,null,null,null,null,null,null,null,null,null,null,null,null,null,null,199,"Jakar",null,2.0299999999999998]
["",null,null,"",null,"",null,"",null,"","",null,null,null,null,"","",null,3,null,null,null,null,null,null,null,null,null,null,null,null,null,null,null,null,200,"Jakar",null,2.04]
["",null,null,"",null,"",null,"",null,"","",null,null,null,null,"","",null,3,null,null,null,null,null,null,null,null,null,null,null,null,null,null,null,null,201,"Jakar",null,2.0499999999999998]
["",null,null,"",null,"",null,"",null,"","",null,null,null,null,"","",null,3,null,null,null,null,null,null,null,null,null,null,null,null,null,null,null,null,202,"Jakar",null,2.06]
["",null,null,"",null,"",null,"",null,"","",null,null,null,null,"","",null,3,null,null,null,null,null,null,null,null,null,null,null,null,null,null,null,null,203,"Jakar",null,2.0699999999999998]
["",null,null,"",null,"",null,"",null,"","",null,null,null,null,"","",null,3,null,null,null,null,null,null,null,null,null,null,null,null,null,null,null,null,204,"Jakar",null,2.08]
["",null,null,"",null,"",null,"",null,"","",null,null,null,null,"","",null,3,null,null,null,null,null,null,null,null,null,null,null,null,null,null,null,null,205,"Jakar",null,2.09]
["",null,null,"",null,"",null,"",null,"","",null,null,null,null,"","",null,3,null,null,null,null,null,null,null,null,null,null,null,null,null,null,null,null,206,"Jakar",null,2.1]
["",null,null,"",null,"",null,"",null,"","",null,null,null,null,"","",null,3,null,null,null,null,null,null,null,null,null,null,null,null,null,null,null,null,207,"Jakar",null,2.11]
["",null,null,"",null,"",null,"",null,"","",null,null,null,null,"","",null,3,null,null,null,null,null,null,null,null,null,null,null,null,null,null,null,null,208,"Jakar",null,2.12]
["",null,null,"",null,"",null,"",null,"","",null,null,null,null,"","",null,3,null,null,null,null,null,null,null,null,null,null,null,null,null,null,null,null,209,"Jakar",null,2.13]
["",null,null,"",null,"",null,"",null,"","",null,null,null,null,"","",null,3,null,null,null,null,null,null,null,null,null,null,null,null,null,null,null,null,210,"Jakar",null,2.14]
["",null,null,"",null,"",null,"",null,"","",null,null,null,null,"","",null,3,null,null,null,null,null,null,null,null,null,null,null,null,null,null,null,null,211,"Jakar",null,2.15]
["",null,null,"",null,"",null,"",null,"","",null,null,null,null,"","",null,3,null,null,null,null,null,null,null,null,null,null,null,null,null,null,null,null,212,"Jakar",null,2.16]
["",null,null,"",null,"",null,"",null,"","",null,null,null,null,"","",null,3,null,null,null,null,null,null,null,null,null,null,null,null,null,null,null,null,213,"Jakar",null,2.17]
["",null,null,"",null,"",null,"",null,"","",null,null,null,null,"","",null,3,null,null,null,null,null,null,null,null,null,null,null,null,null,null,null,null,214,"Jakar",null,2.1800000000000002]
["",null,null,"",null,"",null,"",null,"","",null,null,null,null,"","",null,3,null,null,null,null,null,null,null,null,null,null,null,null,null,null,null,null,215,"Jakar",null,2.19]
["",null,null,"",null,"",null,"",null,"","",null,null,null,null,"","",null,3,null,null,null,null,null,null,null,null,null,null,null,null,null,null,null,null,216,"Jakar",null,2.2000000000000002]
["",null,null,"",null,"",null,"",null,"","",null,null,null,null,{"$f":"IFERROR(ROUND(SUM(1000/M218),2),\"\")","v":""},"",null,3,null,null,null,null,null,null,null,null,null,null,null,null,null,null,null,null,217,"Jakar",null,2.21]
["",null,null,"",null,"",null,"",null,"","",null,null,null,null,"","",null,3,null,null,null,null,null,null,null,null,null,null,null,null,null,null,null,null,218,"Jakar",null,2.2200000000000002]
["",null,null,"",null,"",null,"",null,"","",null,null,null,null,"","",null,3,null,null,null,null,null,null,null,null,null,null,null,null,null,null,null,null,219,"Jakar",null,2.23]
["",null,null,"",null,"",null,"",null,"","",null,null,null,null,"","",null,3,null,null,null,null,null,null,null,null,null,null,null,null,null,null,null,null,220,"Jakar",null,2.2400000000000002]
["",null,null,"",null,"",null,"",null,"","",null,null,null,null,"","",null,3,null,null,null,null,null,null,null,null,null,null,null,null,null,null,null,null,221,"Jakar",null,2.25]
["",null,null,"",null,"",null,"",null,"","",null,null,null,null,"","",null,3,null,null,null,null,null,null,null,null,null,null,null,null,null,null,null,null,222,"Jakar",null,2.2599999999999998]
["",null,null,"",null,"",null,"",null,"","",null,null,null,null,"","",null,3,null,null,null,null,null,null,null,null,null,null,null,null,null,null,null,null,223,"Jakar",null,2.27]
["",null,null,"",null,"",null,"",null,"","",null,null,null,null,"","",null,3,null,null,null,null,null,null,null,null,null,null,null,null,null,null,null,null,224,"Jakar",null,2.2799999999999998]
["",null,null,"",null,"",null,"",null,"","",null,null,null,null,"","",null,3,null,null,null,null,null,null,null,null,null,null,null,null,null,null,null,null,225,"Jakar",null,2.29]
["",null,null,"",null,"",null,"",null,"","",null,null,null,null,"","",null,3,null,null,null,null,null,null,null,null,null,null,null,null,null,null,null,null,226,"Jakar",null,2.2999999999999998]
["",null,null,"",null,"",null,"",null,"","",null,null,null,null,"","",null,3,null,null,null,null,null,null,null,null,null,null,null,null,null,null,null,null,227,"Jakar",null,2.31]
["",null,null,"",null,"",null,"",null,"","",null,null,null,null,"","",null,3,null,null,null,null,null,null,null,null,null,null,null,null,null,null,null,null,228,"Jakar",null,2.3199999999999998]
["",null,null,"",null,"",null,"",null,"","",null,null,null,null,"","",null,3,null,null,null,null,null,null,null,null,null,null,null,null,null,null,null,null,229,"Jakar",null,2.33]
["",null,null,"",null,"",null,"",null,"","",null,null,null,null,"","",null,3,null,null,null,null,null,null,null,null,null,null,null,null,null,null,null,null,230,"Jakar",null,2.34]
["",null,null,"",null,"",null,"",null,"","",null,null,null,null,"","",null,3,null,null,null,null,null,null,null,null,null,null,null,null,null,null,null,null,231,"Jakar",null,2.35]
["",null,null,"",null,"",null,"",null,"","",null,null,null,null,"","",null,3,null,null,null,null,null,null,null,null,null,null,null,null,null,null,null,null,232,"Jakar",null,2.36]
["",null,null,"",null,"",null,"",null,"","",null,null,null,null,"","",null,3,null,null,null,null,null,null,null,null,null,null,null,null,null,null,null,null,233,"Jakar",null,2.37]
["",null,null,"",null,"",null,"",null,"","",null,null,null,null,"","",null,3,null,null,null,null,null,null,null,null,null,null,null,null,null,null,null,null,234,"Jakar",null,2.38]
["",null,null,"",null,"",null,"",null,"","",null,null,null,null,"","",null,3,null,null,null,null,null,null,null,null,null,null,null,null,null,null,null,null,235,"Jakar",null,2.39]
["",null,null,"",null,"",null,"",null,"","",null,null,null,null,"","",null,3,null,null,null,null,null,null,null,null,null,null,null,null,null,null,null,null,236,"Jakar",null,2.4]
["",null,null,"",null,"",null,"",null,"","",null,null,null,null,"","",null,3,null,null,null,null,null,null,null,null,null,null,null,null,null,null,null,null,237,"Jakar",null,2.41]
["",null,null,"",null,"",null,"",null,"","",null,null,null,null,"","",null,3,null,null,null,null,null,null,null,null,null,null,null,null,null,null,null,null,238,"Jakar",null,2.42]
["",null,null,"",null,"",null,"",null,"","",null,null,null,null,"","",null,3,null,null,null,null,null,null,null,null,null,null,null,null,null,null,null,null,239,"Jakar",null,2.4300000000000002]
["",null,null,"",null,"",null,"",null,"","",null,null,null,null,"","",null,3,null,null,null,null,null,null,null,null,null,null,null,null,null,null,null,null,240,"Jakar",null,2.44]
["",null,null,"",null,"",null,"",null,"","",null,null,null,null,"","",null,3,null,null,null,null,null,null,null,null,null,null,null,null,null,null,null,null,241,"Jakar",null,2.4500000000000002]
["",null,null,"",null,"",null,"",null,"","",null,null,null,null,"","",null,3,null,null,null,null,null,null,null,null,null,null,null,null,null,null,null,null,242,"Jakar",null,2.46]
["",null,null,"",null,"",null,"",null,"","",null,null,null,null,"","",null,3,null,null,null,null,null,null,null,null,null,null,null,null,null,null,null,null,243,"Jakar",null,2.4700000000000002]
["",null,null,"",null,"",null,"",null,"","",null,null,null,null,"","",null,3,null,null,null,null,null,null,null,null,null,null,null,null,null,null,null,null,244,"Jakar",null,2.48]
["",null,null,"",null,"",null,"",null,"","",null,null,null,null,"","",null,3,null,null,null,null,null,null,null,null,null,null,null,null,null,null,null,null,245,"Jakar",null,2.4900000000000002]
["",null,null,"",null,"",null,"",null,"","",null,null,null,null,"","",null,3,null,null,null,null,null,null,null,null,null,null,null,null,null,null,null,null,246,"Jakar",null,2.5]
["",null,null,"",null,"",null,"",null,"","",null,null,null,null,"","",null,3,null,null,null,null,null,null,null,null,null,null,null,null,null,null,null,null,247,"Jakar",null,2.5099999999999998]
["",null,null,"",null,"",null,"",null,"","",null,null,null,null,"","",null,3,null,null,null,null,null,null,null,null,null,null,null,null,null,null,null,null,248,"Jakar",null,2.52]
["",null,null,"",null,"",null,"",null,"","",null,null,null,null,"","",null,3,null,null,null,null,null,null,null,null,null,null,null,null,null,null,null,null,249,"Jakar",null,2.5299999999999998]
["",null,null,"",null,"",null,"",null,"","",null,null,null,null,"","",null,3,null,null,null,null,null,null,null,null,null,null,null,null,null,null,null,null,250,"Jakar",null,2.54]
["",null,null,"",null,"",null,"",null,"","",null,null,null,null,"","",null,3,null,null,null,null,null,null,null,null,null,null,null,null,null,null,null,null,251,"Jakar",null,2.5499999999999998]
["",null,null,"",null,"",null,"",null,"","",null,null,null,null,"","",null,3,null,null,null,null,null,null,null,null,null,null,null,null,null,null,null,null,252,"Jakar",null,2.56]
["",null,null,"",null,"",null,"",null,"","",null,null,null,null,"","",null,3,null,null,null,null,null,null,null,null,null,null,null,null,null,null,null,null,253,"Jakar",null,2.57]
["",null,null,"",null,"",null,"",null,"","",null,null,null,null,"","",null,3,null,null,null,null,null,null,null,null,null,null,null,null,null,null,null,null,254,"Jakar",null,2.58]
["",null,null,"",null,"",null,"",null,"","",null,null,null,null,"","",null,3,null,null,null,null,null,null,null,null,null,null,null,null,null,null,null,null,255,"Jakar",null,2.59]
["",null,null,"",null,"",null,"",null,"","",null,null,null,null,"","",null,3,null,null,null,null,null,null,null,null,null,null,null,null,null,null,null,null,256,"Jakar",null,2.6]
["",null,null,"",null,"",null,"",null,"","",null,null,null,null,"","",null,3,null,null,null,null,null,null,null,null,null,null,null,null,null,null,null,null,257,"Jakar",null,2.61]
["",null,null,"",null,"",null,"",null,"","",null,null,null,null,"","",null,3,null,null,null,null,null,null,null,null,null,null,null,null,null,null,null,null,258,"Jakar",null,2.62]
[{"$f":"IF(E260=\"\",\"\",IF(A260=\"\",TODAY(),A260))","v":""},null,null,{"$f":"IF(B260=\"\",\"\",(C260-B260))","v":""},null,{"$f":"IFERROR(VLOOKUP(E260,$AJ$2:$AL$316,2,FALSE),\"\")","v":""},null,{"$f":"IFERROR(G260/D260/24,\"\")","v":""},null,{"$f":"IFERROR(I260/D260/24,\"\")","v":""},{"$f":"IFERROR(L260/D260/24,\"\")","v":""},null,null,null,null,"","",null,3,null,null,null,null,null,null,null,null,null,null,null,null,null,null,null,null,259,"Jakar",null,2.63]
["",null,null,"",null,"",null,"",null,"","",null,null,null,null,"",{"$f":"IFERROR(ROUND(SUM(L261*P261),2),\"\")","v":""},null,3,null,null,null,null,null,null,null,null,null,null,null,null,null,null,null,null,260,"Jakar",null,2.64]
["",null,null,"",null,"",null,"",null,"","",null,null,null,null,"","",null,3,null,null,null,null,null,null,null,null,null,null,null,null,null,null,null,null,261,"Jakar",null,2.65]
["",null,null,"",null,"",null,"",null,"","",null,null,null,null,"","",null,3,null,null,null,null,null,null,null,null,null,null,null,null,null,null,null,null,262,"Jakar",null,2.66]
["",null,null,"",null,"",null,"",null,"","",null,null,null,null,"","",null,3,null,null,null,null,null,null,null,null,null,null,null,null,null,null,null,null,263,"Jakar",null,2.67]
["",null,null,"",null,"",null,"",null,"","",null,null,null,null,"","",null,3,null,null,null,null,null,null,null,null,null,null,null,null,null,null,null,null,264,"Jakar",null,2.68]
["",null,null,"",null,"",null,"",null,"","",null,null,null,null,"","",null,3,null,null,null,null,null,null,null,null,null,null,null,null,null,null,null,null,265,"Jakar",null,2.69]
["",null,null,"",null,"",null,"",null,"","",null,null,null,null,"","",null,3,null,null,null,null,null,null,null,null,null,null,null,null,null,null,null,null,266,"Jakar",null,2.7]
["",null,null,"",null,"",null,"",null,"","",null,null,null,null,"","",null,3,null,null,null,null,null,null,null,null,null,null,null,null,null,null,null,null,267,"Jakar",null,2.71]
["",null,null,"",null,"",null,"",null,"","",null,null,null,null,"","",null,3,null,null,null,null,null,null,null,null,null,null,null,null,null,null,null,null,268,"Jakar",null,2.72]
["",null,null,"",null,"",null,"",null,"","",null,null,null,null,"","",null,3,null,null,null,null,null,null,null,null,null,null,null,null,null,null,null,null,269,"Jakar",null,2.73]
["",null,null,"",null,"",null,"",null,"","",null,null,null,null,"","",null,3,null,null,null,null,null,null,null,null,null,null,null,null,null,null,null,null,270,"Jakar",null,2.74]
["",null,null,"",null,"",null,"",null,"","",null,null,null,null,"","",null,3,null,null,null,null,null,null,null,null,null,null,null,null,null,null,null,null,271,"Jakar",null,2.75]
["",null,null,"",null,"",null,"",null,"","",null,null,null,null,"","",null,3,null,null,null,null,null,null,null,null,null,null,null,null,null,null,null,null,272,"Jakar",null,2.76]
["",null,null,"",null,"",null,"",null,"","",null,null,null,null,"","",null,3,null,null,null,null,null,null,null,null,null,null,null,null,null,null,null,null,273,"Jakar",null,2.77]
["",null,null,"",null,"",null,"",null,"","",null,null,null,null,"","",null,3,null,null,null,null,null,null,null,null,null,null,null,null,null,null,null,null,274,"Jakar",null,2.78]
["",null,null,"",null,"",null,"",null,"","",null,null,null,null,"","",null,3,null,null,null,null,null,null,null,null,null,null,null,null,null,null,null,null,275,"Jakar",null,2.79]
["",null,null,"",null,"",null,"",null,"","",null,null,null,null,"","",null,3,null,null,null,null,null,null,null,null,null,null,null,null,null,null,null,null,276,"Jakar",null,2.8]
["",null,null,"",null,"",null,"",null,"","",null,null,null,null,"","",null,3,null,null,null,null,null,null,null,null,null,null,null,null,null,null,null,null,277,"Jakar",null,2.81]
["",null,null,"",null,"",null,"",null,"","",null,null,null,null,"","",null,3,null,null,null,null,null,null,null,null,null,null,null,null,null,null,null,null,278,"Jakar",null,2.82]
["",null,null,"",null,"",null,"",null,"","",null,null,null,null,"","",null,3,null,null,null,null,null,null,null,null,null,null,null,null,null,null,null,null,279,"Jakar",null,2.83]
["",null,null,"",null,"",null,"",null,"","",null,null,null,null,"","",null,3,null,null,null,null,null,null,null,null,null,null,null,null,null,null,null,null,280,"Jakar",null,2.84]
["",null,null,"",null,"",null,"",null,"","",null,null,null,null,{"$f":"IFERROR(ROUND(SUM(1000/M282),2),\"\")","v":""},"",null,3,null,null,null,null,null,null,null,null,null,null,null,null,null,null,null,null,281,"Jakar",null,2.85]
["",null,null,"",null,"",null,"",null,"","",null,null,null,null,"","",null,3,null,null,null,null,null,null,null,null,null,null,null,null,null,null,null,null,282,"Jakar",null,2.86]
["",null,null,"",null,"",null,"",null,"","",null,null,null,null,"","",null,3,null,null,null,null,null,null,null,null,null,null,null,null,null,null,null,null,283,"Jakar",null,2.87]
["",null,null,"",null,"",null,"",null,"","",null,null,null,null,"","",null,3,null,null,null,null,null,null,null,null,null,null,null,null,null,null,null,null,284,"Jakar",null,2.88]
["",null,null,"",null,"",null,"",null,"","",null,null,null,null,"","",null,3,null,null,null,null,null,null,null,null,null,null,null,null,null,null,null,null,285,"Jakar",null,2.89]
["",null,null,"",null,"",null,"",null,"","",null,null,null,null,"","",null,3,null,null,null,null,null,null,null,null,null,null,null,null,null,null,null,null,286,"Jakar",null,2.9]
["",null,null,"",null,"",null,"",null,"","",null,null,null,null,"","",null,3,null,null,null,null,null,null,null,null,null,null,null,null,null,null,null,null,287,"Jakar",null,2.91]
["",null,null,"",null,"",null,"",null,"","",null,null,null,null,"","",null,3,null,null,null,null,null,null,null,null,null,null,null,null,null,null,null,null,288,"Jakar",null,2.92]
["",null,null,"",null,"",null,"",null,"","",null,null,null,null,"","",null,3,null,null,null,null,null,null,null,null,null,null,null,null,null,null,null,null,289,"Jakar",null,2.93]
["",null,null,"",null,"",null,"",null,"","",null,null,null,null,"","",null,3,null,null,null,null,null,null,null,null,null,null,null,null,null,null,null,null,290,"Jakar",null,2.94]
["",null,null,"",null,"",null,"",null,"","",null,null,null,null,"","",null,3,null,null,null,null,null,null,null,null,null,null,null,null,null,null,null,null,291,"Jakar",null,2.95]
["",null,null,"",null,"",null,"",null,"","",null,null,null,null,"","",null,3,null,null,null,null,null,null,null,null,null,null,null,null,null,null,null,null,292,"Jakar",null,2.96]
["",null,null,"",null,"",null,"",null,"","",null,null,null,null,"","",null,3,null,null,null,null,null,null,null,null,null,null,null,null,null,null,null,null,293,"Jakar",null,2.97]
["",null,null,"",null,"",null,"",null,"","",null,null,null,null,"","",null,3,null,null,null,null,null,null,null,null,null,null,null,null,null,null,null,null,294,"Jakar",null,2.98]
["",null,null,"",null,"",null,"",null,"","",null,null,null,null,"","",null,3,null,null,null,null,null,null,null,null,null,null,null,null,null,null,null,null,295,"Jakar",null,2.99]
["",null,null,"",null,"",null,"",null,"","",null,null,null,null,"","",null,3,null,null,null,null,null,null,null,null,null,null,null,null,null,null,null,null,296,"Jakar",null,3]
["",null,null,"",null,"",null,"",null,"","",null,null,null,null,"","",null,3,null,null,null,null,null,null,null,null,null,null,null,null,null,null,null,null,297,"Jakar",null,3.01]
["",null,null,"",null,"",null,"",null,"","",null,null,null,null,"","",null,3,null,null,null,null,null,null,null,null,null,null,null,null,null,null,null,null,298,"Jakar",null,3.02]
["",null,null,"",null,"",null,"",null,"","",null,null,null,null,"","",null,3,null,null,null,null,null,null,null,null,null,null,null,null,null,null,null,null,299,"Jakar",null,3.03]
["",null,null,"",null,"",null,"",null,"","",null,null,null,null,"","",null,3,null,null,null,null,null,null,null,null,null,null,null,null,null,null,null,null,300,"Jakar",null,3.04]
["",null,null,"",null,"",null,"",null,"","",null,null,null,null,"","",null,3,null,null,null,null,null,null,null,null,null,null,null,null,null,null,null,null,301,"Electric iron",null,3.05]
["",null,null,"",null,"",null,"",null,"","",null,null,null,null,"","",null,3,null,null,null,null,null,null,null,null,null,null,null,null,null,null,null,null,302,"Electric iron",null,3.06]
["",null,null,"",null,"",null,"",null,"","",null,null,null,null,"","",null,3,null,null,null,null,null,null,null,null,null,null,null,null,null,null,null,null,303,"Electric iron",null,3.07]
["",null,null,"",null,"",null,"",null,"","",null,null,null,null,"","",null,3,null,null,null,null,null,null,null,null,null,null,null,null,null,null,null,null,304,"Electric iron",null,3.08]
["",null,null,"",null,"",null,"",null,"","",null,null,null,null,"","",null,3,null,null,null,null,null,null,null,null,null,null,null,null,null,null,null,null,305,"Electric iron",null,3.09]
["",null,null,"",null,"",null,"",null,"","",null,null,null,null,"","",null,3,null,null,null,null,null,null,null,null,null,null,null,null,null,null,null,null,306,"Electric iron",null,3.1]
["",null,null,"",null,"",null,"",null,"","",null,null,null,null,"","",null,3,null,null,null,null,null,null,null,null,null,null,null,null,null,null,null,null,307,"Electric iron",null,3.11]
["",null,null,"",null,"",null,"",null,"","",null,null,null,null,"","",null,3,null,null,null,null,null,null,null,null,null,null,null,null,null,null,null,null,308,"Electric iron",null,3.12]
["",null,null,"",null,"",null,"",null,"","",null,null,null,null,"","",null,3,null,null,null,null,null,null,null,null,null,null,null,null,null,null,null,null,309,"Electric iron",null,3.13]
["",null,null,"",null,"",null,"",null,"","",null,null,null,null,"","",null,3,null,null,null,null,null,null,null,null,null,null,null,null,null,null,null,null,310,"Electric iron",null,3.14]
["",null,null,"",null,"",null,"",null,"","",null,null,null,null,"","",null,3,null,null,null,null,null,null,null,null,null,null,null,null,null,null,null,null,311,"Electric iron",null,3.15]
["",null,null,"",null,"",null,"",null,"","",null,null,null,null,"","",null,3,null,null,null,null,null,null,null,null,null,null,null,null,null,null,null,null,312,"Electric iron",null,3.16]
["",null,null,"",null,"",null,"",null,"","",null,null,null,null,"","",null,3,null,null,null,null,null,null,null,null,null,null,null,null,null,null,null,null,313,"Electric iron",null,3.17]
["",null,null,"",null,"",null,"",null,"","",null,null,null,null,"","",null,3,null,null,null,null,null,null,null,null,null,null,null,null,null,null,null,null,314,"Electric iron",null,3.18]
["",null,null,"",null,"",null,"",null,"","",null,null,null,null,"","",null,3,null,null,null,null,null,null,null,null,null,null,null,null,null,null,null,null,315,"Electric iron",null,3.19]
["",null,null,"",null,"",null,"",null,"","",null,null,null,null,"","",null,3,null,null,null,null,null,null,null,null,null,null,null,null,null,null,null,null,null,null,null,3.2]
["",null,null,"",null,"",null,"",null,"","",null,null,null,null,"","",null,3,null,null,null,null,null,null,null,null,null,null,null,null,null,null,null,null,null,null,null,3.21]
["",null,null,"",null,"",null,"",null,"","",null,null,null,null,"","",null,3,null,null,null,null,null,null,null,null,null,null,null,null,null,null,null,null,null,null,null,3.22]
["",null,null,"",null,"",null,"",null,"","",null,null,null,null,"","",null,3,null,null,null,null,null,null,null,null,null,null,null,null,null,null,null,null,null,null,null,3.23]
["",null,null,"",null,"",null,"",null,"","",null,null,null,null,"","",null,3,null,null,null,null,null,null,null,null,null,null,null,null,null,null,null,null,null,null,null,3.24]
["",null,null,"",null,"",null,"",null,"","",null,null,null,null,"","",null,3,null,null,null,null,null,null,null,null,null,null,null,null,null,null,null,null,null,null,null,3.25]
["",null,null,"",null,"",null,"",null,"","",null,null,null,null,"","",null,3,null,null,null,null,null,null,null,null,null,null,null,null,null,null,null,null,null,null,null,3.26]
[{"$f":"IF(E324=\"\",\"\",IF(A324=\"\",TODAY(),A324))","v":""},null,null,{"$f":"IF(B324=\"\",\"\",(C324-B324))","v":""},null,{"$f":"IFERROR(VLOOKUP(E324,$AJ$2:$AL$316,2,FALSE),\"\")","v":""},null,{"$f":"IFERROR(G324/D324/24,\"\")","v":""},null,{"$f":"IFERROR(I324/D324/24,\"\")","v":""},{"$f":"IFERROR(L324/D324/24,\"\")","v":""},null,null,null,null,"","",null,3,null,null,null,null,null,null,null,null,null,null,null,null,null,null,null,null,null,null,null,3.27]
["",null,null,"",null,"",null,"",null,"","",null,null,null,null,"",{"$f":"IFERROR(ROUND(SUM(L325*P325),2),\"\")","v":""},null,3,null,null,null,null,null,null,null,null,null,null,null,null,null,null,null,null,null,null,null,3.28]
["",null,null,"",null,"",null,"",null,"","",null,null,null,null,"","",null,3,null,null,null,null,null,null,null,null,null,null,null,null,null,null,null,null,null,null,null,3.29]
["",null,null,"",null,"",null,"",null,"","",null,null,null,null,"","",null,3,null,null,null,null,null,null,null,null,null,null,null,null,null,null,null,null,null,null,null,3.3]
["",null,null,"",null,"",null,"",null,"","",null,null,null,null,"","",null,3,null,null,null,null,null,null,null,null,null,null,null,null,null,null,null,null,null,null,null,3.31]
["",null,null,"",null,"",null,"",null,"","",null,null,null,null,"","",null,3,null,null,null,null,null,null,null,null,null,null,null,null,null,null,null,null,null,null,null,3.32]
["",null,null,"",null,"",null,"",null,"","",null,null,null,null,"","",null,3,null,null,null,null,null,null,null,null,null,null,null,null,null,null,null,null,null,null,null,3.33]
["",null,null,"",null,"",null,"",null,"","",null,null,null,null,"","",null,3,null,null,null,null,null,null,null,null,null,null,null,null,null,null,null,null,null,null,null,3.34]
["",null,null,"",null,"",null,"",null,"","",null,null,null,null,"","",null,3,null,null,null,null,null,null,null,null,null,null,null,null,null,null,null,null,null,null,null,3.35]
["",null,null,"",null,"",null,"",null,"","",null,null,null,null,"","",null,3,null,null,null,null,null,null,null,null,null,null,null,null,null,null,null,null,null,null,null,3.36]
["",null,null,"",null,"",null,"",null,"","",null,null,null,null,"","",null,3,null,null,null,null,null,null,null,null,null,null,null,null,null,null,null,null,null,null,null,3.37]
["",null,null,"",null,"",null,"",null,"","",null,null,null,null,"","",null,3,null,null,null,null,null,null,null,null,null,null,null,null,null,null,null,null,null,null,null,3.38]
["",null,null,"",null,"",null,"",null,"","",null,null,null,null,"","",null,3,null,null,null,null,null,null,null,null,null,null,null,null,null,null,null,null,null,null,null,3.39]
["",null,null,"",null,"",null,"",null,"","",null,null,null,null,"","",null,3,null,null,null,null,null,null,null,null,null,null,null,null,null,null,null,null,null,null,null,3.4]
["",null,null,"",null,"",null,"",null,"","",null,null,null,null,"","",null,3,null,null,null,null,null,null,null,null,null,null,null,null,null,null,null,null,null,null,null,3.41]
["",null,null,"",null,"",null,"",null,"","",null,null,null,null,"","",null,3,null,null,null,null,null,null,null,null,null,null,null,null,null,null,null,null,null,null,null,3.42]
["",null,null,"",null,"",null,"",null,"","",null,null,null,null,"","",null,3,null,null,null,null,null,null,null,null,null,null,null,null,null,null,null,null,null,null,null,3.43]
["",null,null,"",null,"",null,"",null,"","",null,null,null,null,"","",null,3,null,null,null,null,null,null,null,null,null,null,null,null,null,null,null,null,null,null,null,3.44]
["",null,null,"",null,"",null,"",null,"","",null,null,null,null,"","",null,3,null,null,null,null,null,null,null,null,null,null,null,null,null,null,null,null,null,null,null,3.45]
["",null,null,"",null,"",null,"",null,"","",null,null,null,null,"","",null,3,null,null,null,null,null,null,null,null,null,null,null,null,null,null,null,null,null,null,null,3.46]
["",null,null,"",null,"",null,"",null,"","",null,null,null,null,"","",null,3,null,null,null,null,null,null,null,null,null,null,null,null,null,null,null,null,null,null,null,3.47]
["",null,null,"",null,"",null,"",null,"","",null,null,null,null,"","",null,3,null,null,null,null,null,null,null,null,null,null,null,null,null,null,null,null,null,null,null,3.48]
["",null,null,"",null,"",null,"",null,"","",null,null,null,null,{"$f":"IFERROR(ROUND(SUM(1000/M346),2),\"\")","v":""},"",null,3,null,null,null,null,null,null,null,null,null,null,null,null,null,null,null,null,null,null,null,3.49]
["",null,null,"",null,"",null,"",null,"","",null,null,null,null,"","",null,3,null,null,null,null,null,null,null,null,null,null,null,null,null,null,null,null,null,null,null,3.5]
["",null,null,"",null,"",null,"",null,"","",null,null,null,null,"","",null,3,null,null,null,null,null,null,null,null,null,null,null,null,null,null,null,null,null,null,null,3.51]
["",null,null,"",null,"",null,"",null,"","",null,null,null,null,"","",null,3,null,null,null,null,null,null,null,null,null,null,null,null,null,null,null,null,null,null,null,3.52]
["",null,null,"",null,"",null,"",null,"","",null,null,null,null,"","",null,3,null,null,null,null,null,null,null,null,null,null,null,null,null,null,null,null,null,null,null,3.53]
["",null,null,"",null,"",null,"",null,"","",null,null,null,null,"","",null,3,null,null,null,null,null,null,null,null,null,null,null,null,null,null,null,null,null,null,null,3.54]
["",null,null,"",null,"",null,"",null,"","",null,null,null,null,"","",null,3,null,null,null,null,null,null,null,null,null,null,null,null,null,null,null,null,null,null,null,3.55]
["",null,null,"",null,"",null,"",null,"","",null,null,null,null,"","",null,3,null,null,null,null,null,null,null,null,null,null,null,null,null,null,null,null,null,null,null,3.56]
["",null,null,"",null,"",null,"",null,"","",null,null,null,null,"","",null,3,null,null,null,null,null,null,null,null,null,null,null,null,null,null,null,null,null,null,null,3.57]
["",null,null,"",null,"",null,"",null,"","",null,null,null,null,"","",null,3,null,null,null,null,null,null,null,null,null,null,null,null,null,null,null,null,null,null,null,3.58]
["",null,null,"",null,"",null,"",null,"","",null,null,null,null,"","",null,3,null,null,null,null,null,null,null,null,null,null,null,null,null,null,null,null,null,null,null,3.59]
["",null,null,"",null,"",null,"",null,"","",null,null,null,null,"","",null,3,null,null,null,null,null,null,null,null,null,null,null,null,null,null,null,null,null,null,null,3.6]
["",null,null,"",null,"",null,"",null,"","",null,null,null,null,"","",null,3,null,null,null,null,null,null,null,null,null,null,null,null,null,null,null,null,null,null,null,3.61]
["",null,null,"",null,"",null,"",null,"","",null,null,null,null,"","",null,3,null,null,null,null,null,null,null,null,null,null,null,null,null,null,null,null,null,null,null,3.62]
["",null,null,"",null,"",null,"",null,"","",null,null,null,null,"","",null,3,null,null,null,null,null,null,null,null,null,null,null,null,null,null,null,null,null,null,null,3.63]
["",null,null,"",null,"",null,"",null,"","",null,null,null,null,"","",null,3,null,null,null,null,null,null,null,null,null,null,null,null,null,null,null,null,null,null,null,3.64]
["",null,null,"",null,"",null,"",null,"","",null,null,null,null,"","",null,3,null,null,null,null,null,null,null,null,null,null,null,null,null,null,null,null,null,null,null,3.65]
["",null,null,"",null,"",null,"",null,"","",null,null,null,null,"","",null,3,null,null,null,null,null,null,null,null,null,null,null,null,null,null,null,null,null,null,null,3.66]
["",null,null,"",null,"",null,"",null,"","",null,null,null,null,"","",null,3,null,null,null,null,null,null,null,null,null,null,null,null,null,null,null,null,null,null,null,3.67]
["",null,null,"",null,"",null,"",null,"","",null,null,null,null,"","",null,3,null,null,null,null,null,null,null,null,null,null,null,null,null,null,null,null,null,null,null,3.68]
["",null,null,"",null,"",null,"",null,"","",null,null,null,null,"","",null,3,null,null,null,null,null,null,null,null,null,null,null,null,null,null,null,null,null,null,null,3.69]
["",null,null,"",null,"",null,"",null,"","",null,null,null,null,"","",null,3,null,null,null,null,null,null,null,null,null,null,null,null,null,null,null,null,null,null,null,3.7]
["",null,null,"",null,"",null,"",null,"","",null,null,null,null,"","",null,3,null,null,null,null,null,null,null,null,null,null,null,null,null,null,null,null,null,null,null,3.71]
["",null,null,"",null,"",null,"",null,"","",null,null,null,null,"","",null,3,null,null,null,null,null,null,null,null,null,null,null,null,null,null,null,null,null,null,null,3.72]
["",null,null,"",null,"",null,"",null,"","",null,null,null,null,"","",null,3,null,null,null,null,null,null,null,null,null,null,null,null,null,null,null,null,null,null,null,3.73]
["",null,null,"",null,"",null,"",null,"","",null,null,null,null,"","",null,3,null,null,null,null,null,null,null,null,null,null,null,null,null,null,null,null,null,null,null,3.74]
["",null,null,"",null,"",null,"",null,"","",null,null,null,null,"","",null,3,null,null,null,null,null,null,null,null,null,null,null,null,null,null,null,null,null,null,null,3.75]
["",null,null,"",null,"",null,"",null,"","",null,null,null,null,"","",null,3,null,null,null,null,null,null,null,null,null,null,null,null,null,null,null,null,null,null,null,3.76]
["",null,null,"",null,"",null,"",null,"","",null,null,null,null,"","",null,3,null,null,null,null,null,null,null,null,null,null,null,null,null,null,null,null,null,null,null,3.77]
["",null,null,"",null,"",null,"",null,"","",null,null,null,null,"","",null,3,null,null,null,null,null,null,null,null,null,null,null,null,null,null,null,null,null,null,null,3.78]
["",null,null,"",null,"",null,"",null,"","",null,null,null,null,"","",null,3,null,null,null,null,null,null,null,null,null,null,null,null,null,null,null,null,null,null,null,3.79]
["",null,null,"",null,"",null,"",null,"","",null,null,null,null,"","",null,3,null,null,null,null,null,null,null,null,null,null,null,null,null,null,null,null,null,null,null,3.8]
["",null,null,"",null,"",null,"",null,"","",null,null,null,null,"","",null,3,null,null,null,null,null,null,null,null,null,null,null,null,null,null,null,null,null,null,null,3.81]
["",null,null,"",null,"",null,"",null,"","",null,null,null,null,"","",null,3,null,null,null,null,null,null,null,null,null,null,null,null,null,null,null,null,null,null,null,3.82]
["",null,null,"",null,"",null,"",null,"","",null,null,null,null,"","",null,3,null,null,null,null,null,null,null,null,null,null,null,null,null,null,null,null,null,null,null,3.83]
["",null,null,"",null,"",null,"",null,"","",null,null,null,null,"","",null,3,null,null,null,null,null,null,null,null,null,null,null,null,null,null,null,null,null,null,null,3.84]
["",null,null,"",null,"",null,"",null,"","",null,null,null,null,"","",null,3,null,null,null,null,null,null,null,null,null,null,null,null,null,null,null,null,null,null,null,3.85]
["",null,null,"",null,"",null,"",null,"","",null,null,null,null,"","",null,3,null,null,null,null,null,null,null,null,null,null,null,null,null,null,null,null,null,null,null,3.86]
["",null,null,"",null,"",null,"",null,"","",null,null,null,null,"","",null,3,null,null,null,null,null,null,null,null,null,null,null,null,null,null,null,null,null,null,null,3.87]
["",null,null,"",null,"",null,"",null,"","",null,null,null,null,"","",null,3,null,null,null,null,null,null,null,null,null,null,null,null,null,null,null,null,null,null,null,3.88]
["",null,null,"",null,"",null,"",null,"","",null,null,null,null,"","",null,3,null,null,null,null,null,null,null,null,null,null,null,null,null,null,null,null,null,null,null,3.89]
["",null,null,"",null,"",null,"",null,"","",null,null,null,null,"","",null,3,null,null,null,null,null,null,null,null,null,null,null,null,null,null,null,null,null,null,null,3.9]
[{"$f":"IF(E388=\"\",\"\",IF(A388=\"\",TODAY(),A388))","v":""},null,null,{"$f":"IF(B388=\"\",\"\",(C388-B388))","v":""},null,{"$f":"IFERROR(VLOOKUP(E388,$AJ$2:$AL$316,2,FALSE),\"\")","v":""},null,{"$f":"IFERROR(G388/D388/24,\"\")","v":""},null,{"$f":"IFERROR(I388/D388/24,\"\")","v":""},{"$f":"IFERROR(L388/D388/24,\"\")","v":""},null,null,null,null,"","",null,3,null,null,null,null,null,null,null,null,null,null,null,null,null,null,null,null,null,null,null,3.91]
["",null,null,"",null,"",null,"",null,"","",null,null,null,null,"",{"$f":"IFERROR(ROUND(SUM(L389*P389),2),\"\")","v":""},null,3,null,null,null,null,null,null,null,null,null,null,null,null,null,null,null,null,null,null,null,3.92]
["",null,null,"",null,"",null,"",null,"","",null,null,null,null,"","",null,3,null,null,null,null,null,null,null,null,null,null,null,null,null,null,null,null,null,null,null,3.93]
["",null,null,"",null,"",null,"",null,"","",null,null,null,null,"","",null,3,null,null,null,null,null,null,null,null,null,null,null,null,null,null,null,null,null,null,null,3.94]
["",null,null,"",null,"",null,"",null,"","",null,null,null,null,"","",null,3,null,null,null,null,null,null,null,null,null,null,null,null,null,null,null,null,null,null,null,3.95]
["",null,null,"",null,"",null,"",null,"","",null,null,null,null,"","",null,3,null,null,null,null,null,null,null,null,null,null,null,null,null,null,null,null,null,null,null,3.96]
["",null,null,"",null,"",null,"",null,"","",null,null,null,null,"","",null,3,null,null,null,null,null,null,null,null,null,null,null,null,null,null,null,null,null,null,null,3.97]
["",null,null,"",null,"",null,"",null,"","",null,null,null,null,"","",null,3,null,null,null,null,null,null,null,null,null,null,null,null,null,null,null,null,null,null,null,3.98]
["",null,null,"",null,"",null,"",null,"","",null,null,null,null,"","",null,3,null,null,null,null,null,null,null,null,null,null,null,null,null,null,null,null,null,null,null,3.99]
["",null,null,"",null,"",null,"",null,"","",null,null,null,null,"","",null,3,null,null,null,null,null,null,null,null,null,null,null,null,null,null,null,null,null,null,null,4]
["",null,null,"",null,"",null,"",null,"","",null,null,null,null,"","",null,3,null,null,null,null,null,null,null,null,null,null,null,null,null,null,null,null,null,null,null,4.01]
["",null,null,"",null,"",null,"",null,"","",null,null,null,null,"","",null,3,null,null,null,null,null,null,null,null,null,null,null,null,null,null,null,null,null,null,null,4.0199999999999996]
["",null,null,"",null,"",null,"",null,"","",null,null,null,null,"","",null,3,null,null,null,null,null,null,null,null,null,null,null,null,null,null,null,null,null,null,null,4.03]
["",null,null,"",null,"",null,"",null,"","",null,null,null,null,"","",null,3,null,null,null,null,null,null,null,null,null,null,null,null,null,null,null,null,null,null,null,4.04]
["",null,null,"",null,"",null,"",null,"","",null,null,null,null,"","",null,3,null,null,null,null,null,null,null,null,null,null,null,null,null,null,null,null,null,null,null,4.05]
["",null,null,"",null,"",null,"",null,"","",null,null,null,null,"","",null,3,null,null,null,null,null,null,null,null,null,null,null,null,null,null,null,null,null,null,null,4.0599999999999996]
["",null,null,"",null,"",null,"",null,"","",null,null,null,null,"","",null,3,null,null,null,null,null,null,null,null,null,null,null,null,null,null,null,null,null,null,null,4.07]
["",null,null,"",null,"",null,"",null,"","",null,null,null,null,"","",null,3,null,null,null,null,null,null,null,null,null,null,null,null,null,null,null,null,null,null,null,4.08]
["",null,null,"",null,"",null,"",null,"","",null,null,null,null,"","",null,3,null,null,null,null,null,null,null,null,null,null,null,null,null,null,null,null,null,null,null,4.09]
["",null,null,"",null,"",null,"",null,"","",null,null,null,null,"","",null,3,null,null,null,null,null,null,null,null,null,null,null,null,null,null,null,null,null,null,null,4.0999999999999996]
["",null,null,"",null,"",null,"",null,"","",null,null,null,null,"","",null,3,null,null,null,null,null,null,null,null,null,null,null,null,null,null,null,null,null,null,null,4.1100000000000003]
["",null,null,"",null,"",null,"",null,"","",null,null,null,null,"","",null,3,null,null,null,null,null,null,null,null,null,null,null,null,null,null,null,null,null,null,null,4.12]
["",null,null,"",null,"",null,"",null,"","",null,null,null,null,{"$f":"IFERROR(ROUND(SUM(1000/M410),2),\"\")","v":""},"",null,3,null,null,null,null,null,null,null,null,null,null,null,null,null,null,null,null,null,null,null,4.13]
["",null,null,"",null,"",null,"",null,"","",null,null,null,null,"","",null,3,null,null,null,null,null,null,null,null,null,null,null,null,null,null,null,null,null,null,null,4.1399999999999997]
["",null,null,"",null,"",null,"",null,"","",null,null,null,null,"","",null,3,null,null,null,null,null,null,null,null,null,null,null,null,null,null,null,null,null,null,null,4.1500000000000004]
["",null,null,"",null,"",null,"",null,"","",null,null,null,null,"","",null,3,null,null,null,null,null,null,null,null,null,null,null,null,null,null,null,null,null,null,null,4.16]
["",null,null,"",null,"",null,"",null,"","",null,null,null,null,"","",null,3,null,null,null,null,null,null,null,null,null,null,null,null,null,null,null,null,null,null,null,4.17]
["",null,null,"",null,"",null,"",null,"","",null,null,null,null,"","",null,3,null,null,null,null,null,null,null,null,null,null,null,null,null,null,null,null,null,null,null,4.18]
["",null,null,"",null,"",null,"",null,"","",null,null,null,null,"","",null,3,null,null,null,null,null,null,null,null,null,null,null,null,null,null,null,null,null,null,null,4.1900000000000004]
["",null,null,"",null,"",null,"",null,"","",null,null,null,null,"","",null,3,null,null,null,null,null,null,null,null,null,null,null,null,null,null,null,null,null,null,null,4.2]
["",null,null,"",null,"",null,"",null,"","",null,null,null,null,"","",null,3,null,null,null,null,null,null,null,null,null,null,null,null,null,null,null,null,null,null,null,4.21]
["",null,null,"",null,"",null,"",null,"","",null,null,null,null,"","",null,3,null,null,null,null,null,null,null,null,null,null,null,null,null,null,null,null,null,null,null,4.22]
["",null,null,"",null,"",null,"",null,"","",null,null,null,null,"","",null,3,null,null,null,null,null,null,null,null,null,null,null,null,null,null,null,null,null,null,null,4.2300000000000004]
["",null,null,"",null,"",null,"",null,"","",null,null,null,null,"","",null,3,null,null,null,null,null,null,null,null,null,null,null,null,null,null,null,null,null,null,null,4.24]
["",null,null,"",null,"",null,"",null,"","",null,null,null,null,"","",null,3,null,null,null,null,null,null,null,null,null,null,null,null,null,null,null,null,null,null,null,4.25]
["",null,null,"",null,"",null,"",null,"","",null,null,null,null,"","",null,3,null,null,null,null,null,null,null,null,null,null,null,null,null,null,null,null,null,null,null,4.26]
["",null,null,"",null,"",null,"",null,"","",null,null,null,null,"","",null,3,null,null,null,null,null,null,null,null,null,null,null,null,null,null,null,null,null,null,null,4.2699999999999996]
["",null,null,"",null,"",null,"",null,"","",null,null,null,null,"","",null,3,null,null,null,null,null,null,null,null,null,null,null,null,null,null,null,null,null,null,null,4.28]
["",null,null,"",null,"",null,"",null,"","",null,null,null,null,"","",null,3,null,null,null,null,null,null,null,null,null,null,null,null,null,null,null,null,null,null,null,4.29]
["",null,null,"",null,"",null,"",null,"","",null,null,null,null,"","",null,3,null,null,null,null,null,null,null,null,null,null,null,null,null,null,null,null,null,null,null,4.3]
["",null,null,"",null,"",null,"",null,"","",null,null,null,null,"","",null,3,null,null,null,null,null,null,null,null,null,null,null,null,null,null,null,null,null,null,null,4.3099999999999996]
["",null,null,"",null,"",null,"",null,"","",null,null,null,null,"","",null,3,null,null,null,null,null,null,null,null,null,null,null,null,null,null,null,null,null,null,null,4.32]
["",null,null,"",null,"",null,"",null,"","",null,null,null,null,"","",null,3,null,null,null,null,null,null,null,null,null,null,null,null,null,null,null,null,null,null,null,4.33]
["",null,null,"",null,"",null,"",null,"","",null,null,null,null,"","",null,3,null,null,null,null,null,null,null,null,null,null,null,null,null,null,null,null,null,null,null,4.34]
["",null,null,"",null,"",null,"",null,"","",null,null,null,null,"","",null,3,null,null,null,null,null,null,null,null,null,null,null,null,null,null,null,null,null,null,null,4.3499999999999996]
["",null,null,"",null,"",null,"",null,"","",null,null,null,null,"","",null,3,null,null,null,null,null,null,null,null,null,null,null,null,null,null,null,null,null,null,null,4.3600000000000003]
["",null,null,"",null,"",null,"",null,"","",null,null,null,null,"","",null,3,null,null,null,null,null,null,null,null,null,null,null,null,null,null,null,null,null,null,null,4.37]
["",null,null,"",null,"",null,"",null,"","",null,null,null,null,"","",null,3,null,null,null,null,null,null,null,null,null,null,null,null,null,null,null,null,null,null,null,4.38]
["",null,null,"",null,"",null,"",null,"","",null,null,null,null,"","",null,3,null,null,null,null,null,null,null,null,null,null,null,null,null,null,null,null,null,null,null,4.3899999999999997]
["",null,null,"",null,"",null,"",null,"","",null,null,null,null,"","",null,3,null,null,null,null,null,null,null,null,null,null,null,null,null,null,null,null,null,null,null,4.4000000000000004]
["",null,null,"",null,"",null,"",null,"","",null,null,null,null,"","",null,3,null,null,null,null,null,null,null,null,null,null,null,null,null,null,null,null,null,null,null,4.41]
["",null,null,"",null,"",null,"",null,"","",null,null,null,null,"","",null,3,null,null,null,null,null,null,null,null,null,null,null,null,null,null,null,null,null,null,null,4.42]
["",null,null,"",null,"",null,"",null,"","",null,null,null,null,"","",null,3,null,null,null,null,null,null,null,null,null,null,null,null,null,null,null,null,null,null,null,4.43]
["",null,null,"",null,"",null,"",null,"","",null,null,null,null,"","",null,3,null,null,null,null,null,null,null,null,null,null,null,null,null,null,null,null,null,null,null,4.4400000000000004]
["",null,null,"",null,"",null,"",null,"","",null,null,null,null,"","",null,3,null,null,null,null,null,null,null,null,null,null,null,null,null,null,null,null,null,null,null,4.45]
["",null,null,"",null,"",null,"",null,"","",null,null,null,null,"","",null,3,null,null,null,null,null,null,null,null,null,null,null,null,null,null,null,null,null,null,null,4.46]
["",null,null,"",null,"",null,"",null,"","",null,null,null,null,"","",null,3,null,null,null,null,null,null,null,null,null,null,null,null,null,null,null,null,null,null,null,4.47]
["",null,null,"",null,"",null,"",null,"","",null,null,null,null,"","",null,3,null,null,null,null,null,null,null,null,null,null,null,null,null,null,null,null,null,null,null,4.4800000000000004]
["",null,null,"",null,"",null,"",null,"","",null,null,null,null,"","",null,3,null,null,null,null,null,null,null,null,null,null,null,null,null,null,null,null,null,null,null,4.49]
["",null,null,"",null,"",null,"",null,"","",null,null,null,null,"","",null,3,null,null,null,null,null,null,null,null,null,null,null,null,null,null,null,null,null,null,null,4.5]
["",null,null,"",null,"",null,"",null,"","",null,null,null,null,"","",null,3,null,null,null,null,null,null,null,null,null,null,null,null,null,null,null,null,null,null,null,4.51]
["",null,null,"",null,"",null,"",null,"","",null,null,null,null,"","",null,3,null,null,null,null,null,null,null,null,null,null,null,null,null,null,null,null,null,null,null,4.5199999999999996]
["",null,null,"",null,"",null,"",null,"","",null,null,null,null,"","",null,3,null,null,null,null,null,null,null,null,null,null,null,null,null,null,null,null,null,null,null,4.53]
["",null,null,"",null,"",null,"",null,"","",null,null,null,null,"","",null,3,null,null,null,null,null,null,null,null,null,null,null,null,null,null,null,null,null,null,null,4.54]
[{"$f":"IF(E452=\"\",\"\",IF(A452=\"\",TODAY(),A452))","v":""},null,null,{"$f":"IF(B452=\"\",\"\",(C452-B452))","v":""},null,{"$f":"IFERROR(VLOOKUP(E452,$AJ$2:$AL$316,2,FALSE),\"\")","v":""},null,{"$f":"IFERROR(G452/D452/24,\"\")","v":""},null,{"$f":"IFERROR(I452/D452/24,\"\")","v":""},{"$f":"IFERROR(L452/D452/24,\"\")","v":""},null,null,null,null,"","",null,3,null,null,null,null,null,null,null,null,null,null,null,null,null,null,null,null,null,null,null,4.55]
["",null,null,"",null,"",null,"",null,"","",null,null,null,null,"",{"$f":"IFERROR(ROUND(SUM(L453*P453),2),\"\")","v":""},null,3,null,null,null,null,null,null,null,null,null,null,null,null,null,null,null,null,null,null,null,4.5599999999999996]
["",null,null,"",null,"",null,"",null,"","",null,null,null,null,"","",null,3,null,null,null,null,null,null,null,null,null,null,null,null,null,null,null,null,null,null,null,4.57]
["",null,null,"",null,"",null,"",null,"","",null,null,null,null,"","",null,3,null,null,null,null,null,null,null,null,null,null,null,null,null,null,null,null,null,null,null,4.58]
["",null,null,"",null,"",null,"",null,"","",null,null,null,null,"","",null,3,null,null,null,null,null,null,null,null,null,null,null,null,null,null,null,null,null,null,null,4.59]
["",null,null,"",null,"",null,"",null,"","",null,null,null,null,"","",null,3,null,null,null,null,null,null,null,null,null,null,null,null,null,null,null,null,null,null,null,4.5999999999999996]
["",null,null,"",null,"",null,"",null,"","",null,null,null,null,"","",null,3,null,null,null,null,null,null,null,null,null,null,null,null,null,null,null,null,null,null,null,4.6100000000000003]
["",null,null,"",null,"",null,"",null,"","",null,null,null,null,"","",null,3,null,null,null,null,null,null,null,null,null,null,null,null,null,null,null,null,null,null,null,4.62]
["",null,null,"",null,"",null,"",null,"","",null,null,null,null,"","",null,3,null,null,null,null,null,null,null,null,null,null,null,null,null,null,null,null,null,null,null,4.63]
["",null,null,"",null,"",null,"",null,"","",null,null,null,null,"","",null,3,null,null,null,null,null,null,null,null,null,null,null,null,null,null,null,null,null,null,null,4.6399999999999997]
["",null,null,"",null,"",null,"",null,"","",null,null,null,null,"","",null,3,null,null,null,null,null,null,null,null,null,null,null,null,null,null,null,null,null,null,null,4.6500000000000004]
["",null,null,"",null,"",null,"",null,"","",null,null,null,null,"","",null,3,null,null,null,null,null,null,null,null,null,null,null,null,null,null,null,null,null,null,null,4.66]
["",null,null,"",null,"",null,"",null,"","",null,null,null,null,"","",null,3,null,null,null,null,null,null,null,null,null,null,null,null,null,null,null,null,null,null,null,4.67]
["",null,null,"",null,"",null,"",null,"","",null,null,null,null,"","",null,3,null,null,null,null,null,null,null,null,null,null,null,null,null,null,null,null,null,null,null,4.68]
["",null,null,"",null,"",null,"",null,"","",null,null,null,null,"","",null,3,null,null,null,null,null,null,null,null,null,null,null,null,null,null,null,null,null,null,null,4.6900000000000004]
["",null,null,"",null,"",null,"",null,"","",null,null,null,null,"","",null,3,null,null,null,null,null,null,null,null,null,null,null,null,null,null,null,null,null,null,null,4.7]
["",null,null,"",null,"",null,"",null,"","",null,null,null,null,"","",null,3,null,null,null,null,null,null,null,null,null,null,null,null,null,null,null,null,null,null,null,4.71]
["",null,null,"",null,"",null,"",null,"","",null,null,null,null,"","",null,3,null,null,null,null,null,null,null,null,null,null,null,null,null,null,null,null,null,null,null,4.72]
["",null,null,"",null,"",null,"",null,"","",null,null,null,null,"","",null,3,null,null,null,null,null,null,null,null,null,null,null,null,null,null,null,null,null,null,null,4.7300000000000004]
["",null,null,"",null,"",null,"",null,"","",null,null,null,null,"","",null,3,null,null,null,null,null,null,null,null,null,null,null,null,null,null,null,null,null,null,null,4.74]
["",null,null,"",null,"",null,"",null,"","",null,null,null,null,"","",null,3,null,null,null,null,null,null,null,null,null,null,null,null,null,null,null,null,null,null,null,4.75]
["",null,null,"",null,"",null,"",null,"","",null,null,null,null,"","",null,3,null,null,null,null,null,null,null,null,null,null,null,null,null,null,null,null,null,null,null,4.76]
["",null,null,"",null,"",null,"",null,"","",null,null,null,null,{"$f":"IFERROR(ROUND(SUM(1000/M474),2),\"\")","v":""},"",null,3,null,null,null,null,null,null,null,null,null,null,null,null,null,null,null,null,null,null,null,4.7699999999999996]
["",null,null,"",null,"",null,"",null,"","",null,null,null,null,"","",null,3,null,null,null,null,null,null,null,null,null,null,null,null,null,null,null,null,null,null,null,4.78]
["",null,null,"",null,"",null,"",null,"","",null,null,null,null,"","",null,3,null,null,null,null,null,null,null,null,null,null,null,null,null,null,null,null,null,null,null,4.79]
["",null,null,"",null,"",null,"",null,"","",null,null,null,null,"","",null,3,null,null,null,null,null,null,null,null,null,null,null,null,null,null,null,null,null,null,null,4.8]
["",null,null,"",null,"",null,"",null,"","",null,null,null,null,"","",null,3,null,null,null,null,null,null,null,null,null,null,null,null,null,null,null,null,null,null,null,4.8099999999999996]
["",null,null,"",null,"",null,"",null,"","",null,null,null,null,"","",null,3,null,null,null,null,null,null,null,null,null,null,null,null,null,null,null,null,null,null,null,4.82]
["",null,null,"",null,"",null,"",null,"","",null,null,null,null,"","",null,3,null,null,null,null,null,null,null,null,null,null,null,null,null,null,null,null,null,null,null,4.83]
["",null,null,"",null,"",null,"",null,"","",null,null,null,null,"","",null,3,null,null,null,null,null,null,null,null,null,null,null,null,null,null,null,null,null,null,null,4.84]
["",null,null,"",null,"",null,"",null,"","",null,null,null,null,"","",null,3,null,null,null,null,null,null,null,null,null,null,null,null,null,null,null,null,null,null,null,4.8499999999999996]
["",null,null,"",null,"",null,"",null,"","",null,null,null,null,"","",null,3,null,null,null,null,null,null,null,null,null,null,null,null,null,null,null,null,null,null,null,4.8600000000000003]
["",null,null,"",null,"",null,"",null,"","",null,null,null,null,"","",null,3,null,null,null,null,null,null,null,null,null,null,null,null,null,null,null,null,null,null,null,4.87]
["",null,null,"",null,"",null,"",null,"","",null,null,null,null,"","",null,3,null,null,null,null,null,null,null,null,null,null,null,null,null,null,null,null,null,null,null,4.88]
["",null,null,"",null,"",null,"",null,"","",null,null,null,null,"","",null,3,null,null,null,null,null,null,null,null,null,null,null,null,null,null,null,null,null,null,null,4.8899999999999997]
["",null,null,"",null,"",null,"",null,"","",null,null,null,null,"","",null,3,null,null,null,null,null,null,null,null,null,null,null,null,null,null,null,null,null,null,null,4.9000000000000004]
["",null,null,"",null,"",null,"",null,"","",null,null,null,null,"","",null,3,null,null,null,null,null,null,null,null,null,null,null,null,null,null,null,null,null,null,null,4.91]
["",null,null,"",null,"",null,"",null,"","",null,null,null,null,"","",null,3,null,null,null,null,null,null,null,null,null,null,null,null,null,null,null,null,null,null,null,4.92]
["",null,null,"",null,"",null,"",null,"","",null,null,null,null,"","",null,3,null,null,null,null,null,null,null,null,null,null,null,null,null,null,null,null,null,null,null,4.93]
["",null,null,"",null,"",null,"",null,"","",null,null,null,null,"","",null,3,null,null,null,null,null,null,null,null,null,null,null,null,null,null,null,null,null,null,null,4.9400000000000004]
["",null,null,"",null,"",null,"",null,"","",null,null,null,null,"","",null,3,null,null,null,null,null,null,null,null,null,null,null,null,null,null,null,null,null,null,null,4.95]
["",null,null,"",null,"",null,"",null,"","",null,null,null,null,"","",null,3,null,null,null,null,null,null,null,null,null,null,null,null,null,null,null,null,null,null,null,4.96]
["",null,null,"",null,"",null,"",null,"","",null,null,null,null,"","",null,3,null,null,null,null,null,null,null,null,null,null,null,null,null,null,null,null,null,null,null,4.97]
["",null,null,"",null,"",null,"",null,"","",null,null,null,null,"","",null,3,null,null,null,null,null,null,null,null,null,null,null,null,null,null,null,null,null,null,null,4.9800000000000004]
["",null,null,"",null,"",null,"",null,"","",null,null,null,null,"","",null,3,null,null,null,null,null,null,null,null,null,null,null,null,null,null,null,null,null,null,null,4.99]
["",null,null,"",null,"",null,"",null,"","",null,null,null,null,"","",null,3,null,null,null,null,null,null,null,null,null,null,null,null,null,null,null,null,null,null,null,5]
["",null,null,"",null,"",null,"",null,"","",null,null,null,null,"","",null,3,null,null,null,null,null,null,null,null,null,null,null,null,null,null,null,null,null,null,null,5.01]
["",null,null,"",null,"",null,"",null,"","",null,null,null,null,"","",null,3,null,null,null,null,null,null,null,null,null,null,null,null,null,null,null,null,null,null,null,5.0199999999999996]
["",null,null,"",null,"",null,"",null,"","",null,null,null,null,"","",null,3,null,null,null,null,null,null,null,null,null,null,null,null,null,null,null,null,null,null,null,5.03]
["",null,null,"",null,"",null,"",null,"","",null,null,null,null,"","",null,3,null,null,null,null,null,null,null,null,null,null,null,null,null,null,null,null,null,null,null,5.04]
["",null,null,"",null,"",null,"",null,"","",null,null,null,null,"","",null,3,null,null,null,null,null,null,null,null,null,null,null,null,null,null,null,null,null,null,null,5.05]
["",null,null,"",null,"",null,"",null,"","",null,null,null,null,"","",null,3,null,null,null,null,null,null,null,null,null,null,null,null,null,null,null,null,null,null,null,5.0599999999999996]
["",null,null,"",null,"",null,"",null,"","",null,null,null,null,"","",null,3,null,null,null,null,null,null,null,null,null,null,null,null,null,null,null,null,null,null,null,5.07]
["",null,null,"",null,"",null,"",null,"","",null,null,null,null,"","",null,3,null,null,null,null,null,null,null,null,null,null,null,null,null,null,null,null,null,null,null,5.08]
["",null,null,"",null,"",null,"",null,"","",null,null,null,null,"","",null,3,null,null,null,null,null,null,null,null,null,null,null,null,null,null,null,null,null,null,null,5.09]
["",null,null,"",null,"",null,"",null,"","",null,null,null,null,"","",null,3,null,null,null,null,null,null,null,null,null,null,null,null,null,null,null,null,null,null,null,5.0999999999999996]
["",null,null,"",null,"",null,"",null,"","",null,null,null,null,"","",null,3,null,null,null,null,null,null,null,null,null,null,null,null,null,null,null,null,null,null,null,5.1100000000000003]
["",null,null,"",null,"",null,"",null,"","",null,null,null,null,"","",null,3,null,null,null,null,null,null,null,null,null,null,null,null,null,null,null,null,null,null,null,5.12]
["",null,null,"",null,"",null,"",null,"","",null,null,null,null,"","",null,3,null,null,null,null,null,null,null,null,null,null,null,null,null,null,null,null,null,null,null,5.13]
["",null,null,"",null,"",null,"",null,"","",null,null,null,null,"","",null,3,null,null,null,null,null,null,null,null,null,null,null,null,null,null,null,null,null,null,null,5.14]
["",null,null,"",null,"",null,"",null,"","",null,null,null,null,"","",null,3,null,null,null,null,null,null,null,null,null,null,null,null,null,null,null,null,null,null,null,5.15]
["",null,null,"",null,"",null,"",null,"","",null,null,null,null,"","",null,3,null,null,null,null,null,null,null,null,null,null,null,null,null,null,null,null,null,null,null,5.16]
["",null,null,"",null,"",null,"",null,"","",null,null,null,null,"","",null,3,null,null,null,null,null,null,null,null,null,null,null,null,null,null,null,null,null,null,null,5.17]
["",null,null,"",null,"",null,"",null,"","",null,null,null,null,"","",null,3,null,null,null,null,null,null,null,null,null,null,null,null,null,null,null,null,null,null,null,5.18]
[{"$f":"IF(E516=\"\",\"\",IF(A516=\"\",TODAY(),A516))","v":""},null,null,{"$f":"IF(B516=\"\",\"\",(C516-B516))","v":""},null,{"$f":"IFERROR(VLOOKUP(E516,$AJ$2:$AL$316,2,FALSE),\"\")","v":""},null,{"$f":"IFERROR(G516/D516/24,\"\")","v":""},null,{"$f":"IFERROR(I516/D516/24,\"\")","v":""},{"$f":"IFERROR(L516/D516/24,\"\")","v":""},null,null,null,null,"","",null,3,null,null,null,null,null,null,null,null,null,null,null,null,null,null,null,null,null,null,null,5.19]
["",null,null,"",null,"",null,"",null,"","",null,null,null,null,"",{"$f":"IFERROR(ROUND(SUM(L517*P517),2),\"\")","v":""},null,3,null,null,null,null,null,null,null,null,null,null,null,null,null,null,null,null,null,null,null,5.2]
["",null,null,"",null,"",null,"",null,"","",null,null,null,null,"","",null,3,null,null,null,null,null,null,null,null,null,null,null,null,null,null,null,null,null,null,null,5.21]
["",null,null,"",null,"",null,"",null,"","",null,null,null,null,"","",null,3,null,null,null,null,null,null,null,null,null,null,null,null,null,null,null,null,null,null,null,5.22]
["",null,null,"",null,"",null,"",null,"","",null,null,null,null,"","",null,3,null,null,null,null,null,null,null,null,null,null,null,null,null,null,null,null,null,null,null,5.23]
["",null,null,"",null,"",null,"",null,"","",null,null,null,null,"","",null,3,null,null,null,null,null,null,null,null,null,null,null,null,null,null,null,null,null,null,null,5.24]
["",null,null,"",null,"",null,"",null,"","",null,null,null,null,"","",null,3,null,null,null,null,null,null,null,null,null,null,null,null,null,null,null,null,null,null,null,5.25]
["",null,null,"",null,"",null,"",null,"","",null,null,null,null,"","",null,3,null,null,null,null,null,null,null,null,null,null,null,null,null,null,null,null,null,null,null,5.26]
["",null,null,"",null,"",null,"",null,"","",null,null,null,null,"","",null,3,null,null,null,null,null,null,null,null,null,null,null,null,null,null,null,null,null,null,null,5.27]
["",null,null,"",null,"",null,"",null,"","",null,null,null,null,"","",null,3,null,null,null,null,null,null,null,null,null,null,null,null,null,null,null,null,null,null,null,5.28]
["",null,null,"",null,"",null,"",null,"","",null,null,null,null,"","",null,3,null,null,null,null,null,null,null,null,null,null,null,null,null,null,null,null,null,null,null,5.29]
["",null,null,"",null,"",null,"",null,"","",null,null,null,null,"","",null,3,null,null,null,null,null,null,null,null,null,null,null,null,null,null,null,null,null,null,null,5.3]
["",null,null,"",null,"",null,"",null,"","",null,null,null,null,"","",null,3,null,null,null,null,null,null,null,null,null,null,null,null,null,null,null,null,null,null,null,5.31]
["",null,null,"",null,"",null,"",null,"","",null,null,null,null,"","",null,3,null,null,null,null,null,null,null,null,null,null,null,null,null,null,null,null,null,null,null,5.32]
["",null,null,"",null,"",null,"",null,"","",null,null,null,null,"","",null,3,null,null,null,null,null,null,null,null,null,null,null,null,null,null,null,null,null,null,null,5.33]
["",null,null,"",null,"",null,"",null,"","",null,null,null,null,"","",null,3,null,null,null,null,null,null,null,null,null,null,null,null,null,null,null,null,null,null,null,5.34]
["",null,null,"",null,"",null,"",null,"","",null,null,null,null,"","",null,3,null,null,null,null,null,null,null,null,null,null,null,null,null,null,null,null,null,null,null,5.35]
["",null,null,"",null,"",null,"",null,"","",null,null,null,null,"","",null,3,null,null,null,null,null,null,null,null,null,null,null,null,null,null,null,null,null,null,null,5.36]
["",null,null,"",null,"",null,"",null,"","",null,null,null,null,"","",null,3,null,null,null,null,null,null,null,null,null,null,null,null,null,null,null,null,null,null,null,5.37]
["",null,null,"",null,"",null,"",null,"","",null,null,null,null,"","",null,3,null,null,null,null,null,null,null,null,null,null,null,null,null,null,null,null,null,null,null,5.38]
["",null,null,"",null,"",null,"",null,"","",null,null,null,null,"","",null,3,null,null,null,null,null,null,null,null,null,null,null,null,null,null,null,null,null,null,null,5.39]
["",null,null,"",null,"",null,"",null,"","",null,null,null,null,"","",null,3,null,null,null,null,null,null,null,null,null,null,null,null,null,null,null,null,null,null,null,5.4]
["",null,null,"",null,"",null,"",null,"","",null,null,null,null,{"$f":"IFERROR(ROUND(SUM(1000/M538),2),\"\")","v":""},"",null,3,null,null,null,null,null,null,null,null,null,null,null,null,null,null,null,null,null,null,null,5.41]
["",null,null,"",null,"",null,"",null,"","",null,null,null,null,"","",null,3,null,null,null,null,null,null,null,null,null,null,null,null,null,null,null,null,null,null,null,5.42]
["",null,null,"",null,"",null,"",null,"","",null,null,null,null,"","",null,3,null,null,null,null,null,null,null,null,null,null,null,null,null,null,null,null,null,null,null,5.43]
["",null,null,"",null,"",null,"",null,"","",null,null,null,null,"","",null,3,null,null,null,null,null,null,null,null,null,null,null,null,null,null,null,null,null,null,null,5.44]
["",null,null,"",null,"",null,"",null,"","",null,null,null,null,"","",null,3,null,null,null,null,null,null,null,null,null,null,null,null,null,null,null,null,null,null,null,5.45]
["",null,null,"",null,"",null,"",null,"","",null,null,null,null,"","",null,3,null,null,null,null,null,null,null,null,null,null,null,null,null,null,null,null,null,null,null,5.46]
["",null,null,"",null,"",null,"",null,"","",null,null,null,null,"","",null,3,null,null,null,null,null,null,null,null,null,null,null,null,null,null,null,null,null,null,null,5.47]
["",null,null,"",null,"",null,"",null,"","",null,null,null,null,"","",null,3,null,null,null,null,null,null,null,null,null,null,null,null,null,null,null,null,null,null,null,5.48]
["",null,null,"",null,"",null,"",null,"","",null,null,null,null,"","",null,3,null,null,null,null,null,null,null,null,null,null,null,null,null,null,null,null,null,null,null,5.49]
["",null,null,"",null,"",null,"",null,"","",null,null,null,null,"","",null,3,null,null,null,null,null,null,null,null,null,null,null,null,null,null,null,null,null,null,null,5.5]
["",null,null,"",null,"",null,"",null,"","",null,null,null,null,"","",null,3,null,null,null,null,null,null,null,null,null,null,null,null,null,null,null,null,null,null,null,5.51]
["",null,null,"",null,"",null,"",null,"","",null,null,null,null,"","",null,3,null,null,null,null,null,null,null,null,null,null,null,null,null,null,null,null,null,null,null,5.52]
["",null,null,"",null,"",null,"",null,"","",null,null,null,null,"","",null,3,null,null,null,null,null,null,null,null,null,null,null,null,null,null,null,null,null,null,null,5.53]
["",null,null,"",null,"",null,"",null,"","",null,null,null,null,"","",null,3,null,null,null,null,null,null,null,null,null,null,null,null,null,null,null,null,null,null,null,5.54]
["",null,null,"",null,"",null,"",null,"","",null,null,null,null,"","",null,3,null,null,null,null,null,null,null,null,null,null,null,null,null,null,null,null,null,null,null,5.55]
["",null,null,"",null,"",null,"",null,"","",null,null,null,null,"","",null,3,null,null,null,null,null,null,null,null,null,null,null,null,null,null,null,null,null,null,null,5.56]
["",null,null,"",null,"",null,"",null,"","",null,null,null,null,"","",null,3,null,null,null,null,null,null,null,null,null,null,null,null,null,null,null,null,null,null,null,5.57]
["",null,null,"",null,"",null,"",null,"","",null,null,null,null,"","",null,3,null,null,null,null,null,null,null,null,null,null,null,null,null,null,null,null,null,null,null,5.58]
["",null,null,"",null,"",null,"",null,"","",null,null,null,null,"","",null,3,null,null,null,null,null,null,null,null,null,null,null,null,null,null,null,null,null,null,null,5.59]
["",null,null,"",null,"",null,"",null,"","",null,null,null,null,"","",null,3,null,null,null,null,null,null,null,null,null,null,null,null,null,null,null,null,null,null,null,5.6]
["",null,null,"",null,"",null,"",null,"","",null,null,null,null,"","",null,3,null,null,null,null,null,null,null,null,null,null,null,null,null,null,null,null,null,null,null,5.61]
["",null,null,"",null,"",null,"",null,"","",null,null,null,null,"","",null,3,null,null,null,null,null,null,null,null,null,null,null,null,null,null,null,null,null,null,null,5.62]
["",null,null,"",null,"",null,"",null,"","",null,null,null,null,"","",null,3,null,null,null,null,null,null,null,null,null,null,null,null,null,null,null,null,null,null,null,5.63]
["",null,null,"",null,"",null,"",null,"","",null,null,null,null,"","",null,3,null,null,null,null,null,null,null,null,null,null,null,null,null,null,null,null,null,null,null,5.64]
["",null,null,"",null,"",null,"",null,"","",null,null,null,null,"","",null,3,null,null,null,null,null,null,null,null,null,null,null,null,null,null,null,null,null,null,null,5.65]
["",null,null,"",null,"",null,"",null,"","",null,null,null,null,"","",null,3,null,null,null,null,null,null,null,null,null,null,null,null,null,null,null,null,null,null,null,5.66]
["",null,null,"",null,"",null,"",null,"","",null,null,null,null,"","",null,3,null,null,null,null,null,null,null,null,null,null,null,null,null,null,null,null,null,null,null,5.67]
["",null,null,"",null,"",null,"",null,"","",null,null,null,null,"","",null,3,null,null,null,null,null,null,null,null,null,null,null,null,null,null,null,null,null,null,null,5.68]
["",null,null,"",null,"",null,"",null,"","",null,null,null,null,"","",null,3,null,null,null,null,null,null,null,null,null,null,null,null,null,null,null,null,null,null,null,5.69]
["",null,null,"",null,"",null,"",null,"","",null,null,null,null,"","",null,3,null,null,null,null,null,null,null,null,null,null,null,null,null,null,null,null,null,null,null,5.7]
["",null,null,"",null,"",null,"",null,"","",null,null,null,null,"","",null,3,null,null,null,null,null,null,null,null,null,null,null,null,null,null,null,null,null,null,null,5.71]
["",null,null,"",null,"",null,"",null,"","",null,null,null,null,"","",null,3,null,null,null,null,null,null,null,null,null,null,null,null,null,null,null,null,null,null,null,5.72]
["",null,null,"",null,"",null,"",null,"","",null,null,null,null,"","",null,3,null,null,null,null,null,null,null,null,null,null,null,null,null,null,null,null,null,null,null,5.73]
["",null,null,"",null,"",null,"",null,"","",null,null,null,null,"","",null,3,null,null,null,null,null,null,null,null,null,null,null,null,null,null,null,null,null,null,null,5.74]
["",null,null,"",null,"",null,"",null,"","",null,null,null,null,"","",null,3,null,null,null,null,null,null,null,null,null,null,null,null,null,null,null,null,null,null,null,5.75]
["",null,null,"",null,"",null,"",null,"","",null,null,null,null,"","",null,3,null,null,null,null,null,null,null,null,null,null,null,null,null,null,null,null,null,null,null,5.76]
["",null,null,"",null,"",null,"",null,"","",null,null,null,null,"","",null,3,null,null,null,null,null,null,null,null,null,null,null,null,null,null,null,null,null,null,null,5.77]
["",null,null,"",null,"",null,"",null,"","",null,null,null,null,"","",null,3,null,null,null,null,null,null,null,null,null,null,null,null,null,null,null,null,null,null,null,5.78]
["",null,null,"",null,"",null,"",null,"","",null,null,null,null,"","",null,3,null,null,null,null,null,null,null,null,null,null,null,null,null,null,null,null,null,null,null,5.79]
["",null,null,"",null,"",null,"",null,"","",null,null,null,null,"","",null,3,null,null,null,null,null,null,null,null,null,null,null,null,null,null,null,null,null,null,null,5.8]
["",null,null,"",null,"",null,"",null,"","",null,null,null,null,"","",null,3,null,null,null,null,null,null,null,null,null,null,null,null,null,null,null,null,null,null,null,5.81]
["",null,null,"",null,"",null,"",null,"","",null,null,null,null,"","",null,3,null,null,null,null,null,null,null,null,null,null,null,null,null,null,null,null,null,null,null,5.82]
[{"$f":"IF(E580=\"\",\"\",IF(A580=\"\",TODAY(),A580))","v":""},null,null,{"$f":"IF(B580=\"\",\"\",(C580-B580))","v":""},null,{"$f":"IFERROR(VLOOKUP(E580,$AJ$2:$AL$316,2,FALSE),\"\")","v":""},null,{"$f":"IFERROR(G580/D580/24,\"\")","v":""},null,{"$f":"IFERROR(I580/D580/24,\"\")","v":""},{"$f":"IFERROR(L580/D580/24,\"\")","v":""},null,null,null,null,"","",null,3,null,null,null,null,null,null,null,null,null,null,null,null,null,null,null,null,null,null,null,5.83]
["",null,null,"",null,"",null,"",null,"","",null,null,null,null,"",{"$f":"IFERROR(ROUND(SUM(L581*P581),2),\"\")","v":""},null,3,null,null,null,null,null,null,null,null,null,null,null,null,null,null,null,null,null,null,null,5.84]
["",null,null,"",null,"",null,"",null,"","",null,null,null,null,"","",null,3,null,null,null,null,null,null,null,null,null,null,null,null,null,null,null,null,null,null,null,5.85]
["",null,null,"",null,"",null,"",null,"","",null,null,null,null,"","",null,3,null,null,null,null,null,null,null,null,null,null,null,null,null,null,null,null,null,null,null,5.86]
["",null,null,"",null,"",null,"",null,"","",null,null,null,null,"","",null,3,null,null,null,null,null,null,null,null,null,null,null,null,null,null,null,null,null,null,null,5.87]
["",null,null,"",null,"",null,"",null,"","",null,null,null,null,"","",null,3,null,null,null,null,null,null,null,null,null,null,null,null,null,null,null,null,null,null,null,5.88]
["",null,null,"",null,"",null,"",null,"","",null,null,null,null,"","",null,3,null,null,null,null,null,null,null,null,null,null,null,null,null,null,null,null,null,null,null,5.89]
["",null,null,"",null,"",null,"",null,"","",null,null,null,null,"","",null,3,null,null,null,null,null,null,null,null,null,null,null,null,null,null,null,null,null,null,null,5.9]
["",null,null,"",null,"",null,"",null,"","",null,null,null,null,"","",null,3,null,null,null,null,null,null,null,null,null,null,null,null,null,null,null,null,null,null,null,5.91]
["",null,null,"",null,"",null,"",null,"","",null,null,null,null,"","",null,3,null,null,null,null,null,null,null,null,null,null,null,null,null,null,null,null,null,null,null,5.92]
["",null,null,"",null,"",null,"",null,"","",null,null,null,null,"","",null,3,null,null,null,null,null,null,null,null,null,null,null,null,null,null,null,null,null,null,null,5.93]
["",null,null,"",null,"",null,"",null,"","",null,null,null,null,"","",null,3,null,null,null,null,null,null,null,null,null,null,null,null,null,null,null,null,null,null,null,5.94]
["",null,null,"",null,"",null,"",null,"","",null,null,null,null,"","",null,3,null,null,null,null,null,null,null,null,null,null,null,null,null,null,null,null,null,null,null,5.95]
["",null,null,"",null,"",null,"",null,"","",null,null,null,null,"","",null,3,null,null,null,null,null,null,null,null,null,null,null,null,null,null,null,null,null,null,null,5.96]
["",null,null,"",null,"",null,"",null,"","",null,null,null,null,"","",null,3,null,null,null,null,null,null,null,null,null,null,null,null,null,null,null,null,null,null,null,5.97]
["",null,null,"",null,"",null,"",null,"","",null,null,null,null,"","",null,3,null,null,null,null,null,null,null,null,null,null,null,null,null,null,null,null,null,null,null,5.98]
["",null,null,"",null,"",null,"",null,"","",null,null,null,null,"","",null,3,null,null,null,null,null,null,null,null,null,null,null,null,null,null,null,null,null,null,null,5.99]
["",null,null,"",null,"",null,"",null,"","",null,null,null,null,"","",null,3,null,null,null,null,null,null,null,null,null,null,null,null,null,null,null,null,null,null,null,6]
["",null,null,"",null,"",null,"",null,"","",null,null,null,null,"","",null,3]
["",null,null,"",null,"",null,"",null,"","",null,null,null,null,"","",null,3]
["",null,null,"",null,"",null,"",null,"","",null,null,null,null,"","",null,3]
["",null,null,"",null,"",null,"",null,"","",null,null,null,null,"","",null,3]
["",null,null,"",null,"",null,"",null,"","",null,null,null,null,{"$f":"IFERROR(ROUND(SUM(1000/M602),2),\"\")","v":""},"",null,3]
["",null,null,"",null,"",null,"",null,"","",null,null,null,null,"","",null,3]
["",null,null,"",null,"",null,"",null,"","",null,null,null,null,"","",null,3]
["",null,null,"",null,"",null,"",null,"","",null,null,null,null,"","",null,3]
["",null,null,"",null,"",null,"",null,"","",null,null,null,null,"","",null,3]
["",null,null,"",null,"",null,"",null,"","",null,null,null,null,"","",null,3]
["",null,null,"",null,"",null,"",null,"","",null,null,null,null,"","",null,3]
["",null,null,"",null,"",null,"",null,"","",null,null,null,null,"","",null,3]
["",null,null,"",null,"",null,"",null,"","",null,null,null,null,"","",null,3]
["",null,null,"",null,"",null,"",null,"","",null,null,null,null,"","",null,3]
["",null,null,"",null,"",null,"",null,"","",null,null,null,null,"","",null,3]
["",null,null,"",null,"",null,"",null,"","",null,null,null,null,"","",null,3]
["",null,null,"",null,"",null,"",null,"","",null,null,null,null,"","",null,3]
["",null,null,"",null,"",null,"",null,"","",null,null,null,null,"","",null,3]
["",null,null,"",null,"",null,"",null,"","",null,null,null,null,"","",null,3]
["",null,null,"",null,"",null,"",null,"","",null,null,null,null,"","",null,3]
["",null,null,"",null,"",null,"",null,"","",null,null,null,null,"","",null,3]
["",null,null,"",null,"",null,"",null,"","",null,null,null,null,"","",null,3]
["",null,null,"",null,"",null,"",null,"","",null,null,null,null,"","",null,3]
["",null,null,"",null,"",null,"",null,"","",null,null,null,null,"","",null,3]
["",null,null,"",null,"",null,"",null,"","",null,null,null,null,"","",null,3]
["",null,null,"",null,"",null,"",null,"","",null,null,null,null,"","",null,3]
["",null,null,"",null,"",null,"",null,"","",null,null,null,null,"","",null,3]
["",null,null,"",null,"",null,"",null,"","",null,null,null,null,"","",null,3]
["",null,null,"",null,"",null,"",null,"","",null,null,null,null,"","",null,3]
["",null,null,"",null,"",null,"",null,"","",null,null,null,null,"","",null,3]
["",null,null,"",null,"",null,"",null,"","",null,null,null,null,"","",null,3]
["",null,null,"",null,"",null,"",null,"","",null,null,null,null,"","",null,3]
["",null,null,"",null,"",null,"",null,"","",null,null,null,null,"","",null,3]
["",null,null,"",null,"",null,"",null,"","",null,null,null,null,"","",null,3]
["",null,null,"",null,"",null,"",null,"","",null,null,null,null,"","",null,3]
["",null,null,"",null,"",null,"",null,"","",null,null,null,null,"","",null,3]
["",null,null,"",null,"",null,"",null,"","",null,null,null,null,"","",null,3]
["",null,null,"",null,"",null,"",null,"","",null,null,null,null,"","",null,3]
["",null,null,"",null,"",null,"",null,"","",null,null,null,null,"","",null,3]
["",null,null,"",null,"",null,"",null,"","",null,null,null,null,"","",null,3]
["",null,null,"",null,"",null,"",null,"","",null,null,null,null,"","",null,3]
["",null,null,"",null,"",null,"",null,"","",null,null,null,null,"","",null,3]
["",null,null,"",null,"",null,"",null,"","",null,null,null,null,"","",null,3]
["",null,null,"",null,"",null,"",null,"","",null,null,null,null,"","",null,3]
["",null,null,"",null,"",null,"",null,"","",null,null,null,null,"","",null,3]
["",null,null,"",null,"",null,"",null,"","",null,null,null,null,"","",null,3]
[{"$f":"IF(E644=\"\",\"\",IF(A644=\"\",TODAY(),A644))","v":""},null,null,{"$f":"IF(B644=\"\",\"\",(C644-B644))","v":""},null,{"$f":"IFERROR(VLOOKUP(E644,$AJ$2:$AL$316,2,FALSE),\"\")","v":""},null,{"$f":"IFERROR(G644/D644/24,\"\")","v":""},null,{"$f":"IFERROR(I644/D644/24,\"\")","v":""},{"$f":"IFERROR(L644/D644/24,\"\")","v":""},null,null,null,null,"","",null,3]
["",null,null,"",null,"",null,"",null,"","",null,null,null,null,"",{"$f":"IFERROR(ROUND(SUM(L645*P645),2),\"\")","v":""},null,3]
["",null,null,"",null,"",null,"",null,"","",null,null,null,null,"","",null,3]
["",null,null,"",null,"",null,"",null,"","",null,null,null,null,"","",null,3]
["",null,null,"",null,"",null,"",null,"","",null,null,null,null,"","",null,3]
["",null,null,"",null,"",null,"",null,"","",null,null,null,null,"","",null,3]
["",null,null,"",null,"",null,"",null,"","",null,null,null,null,"","",null,3]
["",null,null,"",null,"",null,"",null,"","",null,null,null,null,"","",null,3]
["",null,null,"",null,"",null,"",null,"","",null,null,null,null,"","",null,3]
["",null,null,"",null,"",null,"",null,"","",null,null,null,null,"","",null,3]
["",null,null,"",null,"",null,"",null,"","",null,null,null,null,"","",null,3]
["",null,null,"",null,"",null,"",null,"","",null,null,null,null,"","",null,3]
["",null,null,"",null,"",null,"",null,"","",null,null,null,null,"","",null,3]
["",null,null,"",null,"",null,"",null,"","",null,null,null,null,"","",null,3]
["",null,null,"",null,"",null,"",null,"","",null,null,null,null,"","",null,3]
["",null,null,"",null,"",null,"",null,"","",null,null,null,null,"","",null,3]
["",null,null,"",null,"",null,"",null,"","",null,null,null,null,"","",null,3]
["",null,null,"",null,"",null,"",null,"","",null,null,null,null,"","",null,3]
["",null,null,"",null,"",null,"",null,"","",null,null,null,null,"","",null,3]
["",null,null,"",null,"",null,"",null,"","",null,null,null,null,"","",null,3]
["",null,null,"",null,"",null,"",null,"","",null,null,null,null,"","",null,3]
["",null,null,"",null,"",null,"",null,"","",null,null,null,null,"","",null,3]
["",null,null,"",null,"",null,"",null,"","",null,null,null,null,{"$f":"IFERROR(ROUND(SUM(1000/M666),2),\"\")","v":""},"",null,3]
["",null,null,"",null,"",null,"",null,"","",null,null,null,null,"","",null,3]
["",null,null,"",null,"",null,"",null,"","",null,null,null,null,"","",null,3]
["",null,null,"",null,"",null,"",null,"","",null,null,null,null,"","",null,3]
["",null,null,"",null,"",null,"",null,"","",null,null,null,null,"","",null,3]
["",null,null,"",null,"",null,"",null,"","",null,null,null,null,"","",null,3]
["",null,null,"",null,"",null,"",null,"","",null,null,null,null,"","",null,3]
["",null,null,"",null,"",null,"",null,"","",null,null,null,null,"","",null,3]
["",null,null,"",null,"",null,"",null,"","",null,null,null,null,"","",null,3]
["",null,null,"",null,"",null,"",null,"","",null,null,null,null,"","",null,3]
["",null,null,"",null,"",null,"",null,"","",null,null,null,null,"","",null,3]
["",null,null,"",null,"",null,"",null,"","",null,null,null,null,"","",null,3]
["",null,null,"",null,"",null,"",null,"","",null,null,null,null,"","",null,3]
["",null,null,"",null,"",null,"",null,"","",null,null,null,null,"","",null,3]
["",null,null,"",null,"",null,"",null,"","",null,null,null,null,"","",null,3]
["",null,null,"",null,"",null,"",null,"","",null,null,null,null,"","",null,3]
["",null,null,"",null,"",null,"",null,"","",null,null,null,null,"","",null,3]
["",null,null,"",null,"",null,"",null,"","",null,null,null,null,"","",null,3]
["",null,null,"",null,"",null,"",null,"","",null,null,null,null,"","",null,3]
["",null,null,"",null,"",null,"",null,"","",null,null,null,null,"","",null,3]
["",null,null,"",null,"",null,"",null,"","",null,null,null,null,"","",null,3]
["",null,null,"",null,"",null,"",null,"","",null,null,null,null,"","",null,3]
["",null,null,"",null,"",null,"",null,"","",null,null,null,null,"","",null,3]
["",null,null,"",null,"",null,"",null,"","",null,null,null,null,"","",null,3]
["",null,null,"",null,"",null,"",null,"","",null,null,null,null,"","",null,3]
["",null,null,"",null,"",null,"",null,"","",null,null,null,null,"","",null,3]
["",null,null,"",null,"",null,"",null,"","",null,null,null,null,"","",null,3]
["",null,null,"",null,"",null,"",null,"","",null,null,null,null,"","",null,3]
["",null,null,"",null,"",null,"",null,"","",null,null,null,null,"","",null,3]
["",null,null,"",null,"",null,"",null,"","",null,null,null,null,"","",null,3]
["",null,null,"",null,"",null,"",null,"","",null,null,null,null,"","",null,3]
["",null,null,"",null,"",null,"",null,"","",null,null,null,null,"","",null,3]
["",null,null,"",null,"",null,"",null,"","",null,null,null,null,"","",null,3]
["",null,null,"",null,"",null,"",null,"","",null,null,null,null,"","",null,3]
["",null,null,"",null,"",null,"",null,"","",null,null,null,null,"","",null,3]
["",null,null,"",null,"",null,"",null,"","",null,null,null,null,"","",null,3]
["",null,null,"",null,"",null,"",null,"","",null,null,null,null,"","",null,3]
["",null,null,"",null,"",null,"",null,"","",null,null,null,null,"","",null,3]
["",null,null,"",null,"",null,"",null,"","",null,null,null,null,"","",null,3]
["",null,null,"",null,"",null,"",null,"","",null,null,null,null,"","",null,3]
["",null,null,"",null,"",null,"",null,"","",null,null,null,null,"","",null,3]
["",null,null,"",null,"",null,"",null,"","",null,null,null,null,"","",null,3]
[{"$f":"IF(E708=\"\",\"\",IF(A708=\"\",TODAY(),A708))","v":""},null,null,{"$f":"IF(B708=\"\",\"\",(C708-B708))","v":""},null,{"$f":"IFERROR(VLOOKUP(E708,$AJ$2:$AL$316,2,FALSE),\"\")","v":""},null,{"$f":"IFERROR(G708/D708/24,\"\")","v":""},null,{"$f":"IFERROR(I708/D708/24,\"\")","v":""},{"$f":"IFERROR(L708/D708/24,\"\")","v":""},null,null,null,null,"","",null,3]
["",null,null,"",null,"",null,"",null,"","",null,null,null,null,"",{"$f":"IFERROR(ROUND(SUM(L709*P709),2),\"\")","v":""},null,3]
["",null,null,"",null,"",null,"",null,"","",null,null,null,null,"","",null,3]
["",null,null,"",null,"",null,"",null,"","",null,null,null,null,"","",null,3]
["",null,null,"",null,"",null,"",null,"","",null,null,null,null,"","",null,3]
["",null,null,"",null,"",null,"",null,"","",null,null,null,null,"","",null,3]
["",null,null,"",null,"",null,"",null,"","",null,null,null,null,"","",null,3]
["",null,null,"",null,"",null,"",null,"","",null,null,null,null,"","",null,3]
["",null,null,"",null,"",null,"",null,"","",null,null,null,null,"","",null,3]
["",null,null,"",null,"",null,"",null,"","",null,null,null,null,"","",null,3]
["",null,null,"",null,"",null,"",null,"","",null,null,null,null,"","",null,3]
["",null,null,"",null,"",null,"",null,"","",null,null,null,null,"","",null,3]
["",null,null,"",null,"",null,"",null,"","",null,null,null,null,"","",null,3]
["",null,null,"",null,"",null,"",null,"","",null,null,null,null,"","",null,3]
["",null,null,"",null,"",null,"",null,"","",null,null,null,null,"","",null,3]
["",null,null,"",null,"",null,"",null,"","",null,null,null,null,"","",null,3]
["",null,null,"",null,"",null,"",null,"","",null,null,null,null,"","",null,3]
["",null,null,"",null,"",null,"",null,"","",null,null,null,null,"","",null,3]
["",null,null,"",null,"",null,"",null,"","",null,null,null,null,"","",null,3]
["",null,null,"",null,"",null,"",null,"","",null,null,null,null,"","",null,3]
["",null,null,"",null,"",null,"",null,"","",null,null,null,null,"","",null,3]
["",null,null,"",null,"",null,"",null,"","",null,null,null,null,"","",null,3]
["",null,null,"",null,"",null,"",null,"","",null,null,null,null,{"$f":"IFERROR(ROUND(SUM(1000/M730),2),\"\")","v":""},"",null,3]
["",null,null,"",null,"",null,"",null,"","",null,null,null,null,"","",null,3]
["",null,null,"",null,"",null,"",null,"","",null,null,null,null,"","",null,3]
["",null,null,"",null,"",null,"",null,"","",null,null,null,null,"","",null,3]
["",null,null,"",null,"",null,"",null,"","",null,null,null,null,"","",null,3]
["",null,null,"",null,"",null,"",null,"","",null,null,null,null,"","",null,3]
["",null,null,"",null,"",null,"",null,"","",null,null,null,null,"","",null,3]
["",null,null,"",null,"",null,"",null,"","",null,null,null,null,"","",null,3]
["",null,null,"",null,"",null,"",null,"","",null,null,null,null,"","",null,3]
["",null,null,"",null,"",null,"",null,"","",null,null,null,null,"","",null,3]
["",null,null,"",null,"",null,"",null,"","",null,null,null,null,"","",null,3]
["",null,null,"",null,"",null,"",null,"","",null,null,null,null,"","",null,3]
["",null,null,"",null,"",null,"",null,"","",null,null,null,null,"","",null,3]
["",null,null,"",null,"",null,"",null,"","",null,null,null,null,"","",null,3]
["",null,null,"",null,"",null,"",null,"","",null,null,null,null,"","",null,3]
["",null,null,"",null,"",null,"",null,"","",null,null,null,null,"","",null,3]
["",null,null,"",null,"",null,"",null,"","",null,null,null,null,"","",null,3]
["",null,null,"",null,"",null,"",null,"","",null,null,null,null,"","",null,3]
["",null,null,"",null,"",null,"",null,"","",null,null,null,null,"","",null,3]
["",null,null,"",null,"",null,"",null,"","",null,null,null,null,"","",null,3]
["",null,null,"",null,"",null,"",null,"","",null,null,null,null,"","",null,3]
["",null,null,"",null,"",null,"",null,"","",null,null,null,null,"","",null,3]
["",null,null,"",null,"",null,"",null,"","",null,null,null,null,"","",null,3]
["",null,null,"",null,"",null,"",null,"","",null,null,null,null,"","",null,3]
["",null,null,"",null,"",null,"",null,"","",null,null,null,null,"","",null,3]
["",null,null,"",null,"",null,"",null,"","",null,null,null,null,"","",null,3]
["",null,null,"",null,"",null,"",null,"","",null,null,null,null,"","",null,3]
["",null,null,"",null,"",null,"",null,"","",null,null,null,null,"","",null,3]
["",null,null,"",null,"",null,"",null,"","",null,null,null,null,"","",null,3]
["",null,null,"",null,"",null,"",null,"","",null,null,null,null,"","",null,3]
["",null,null,"",null,"",null,"",null,"","",null,null,null,null,"","",null,3]
["",null,null,"",null,"",null,"",null,"","",null,null,null,null,"","",null,3]
["",null,null,"",null,"",null,"",null,"","",null,null,null,null,"","",null,3]
["",null,null,"",null,"",null,"",null,"","",null,null,null,null,"","",null,3]
["",null,null,"",null,"",null,"",null,"","",null,null,null,null,"","",null,3]
["",null,null,"",null,"",null,"",null,"","",null,null,null,null,"","",null,3]
["",null,null,"",null,"",null,"",null,"","",null,null,null,null,"","",null,3]
["",null,null,"",null,"",null,"",null,"","",null,null,null,null,"","",null,3]
["",null,null,"",null,"",null,"",null,"","",null,null,null,null,"","",null,3]
["",null,null,"",null,"",null,"",null,"","",null,null,null,null,"","",null,3]
["",null,null,"",null,"",null,"",null,"","",null,null,null,null,"","",null,3]
["",null,null,"",null,"",null,"",null,"","",null,null,null,null,"","",null,3]
[{"$f":"IF(E772=\"\",\"\",IF(A772=\"\",TODAY(),A772))","v":""},null,null,{"$f":"IF(B772=\"\",\"\",(C772-B772))","v":""},null,{"$f":"IFERROR(VLOOKUP(E772,$AJ$2:$AL$316,2,FALSE),\"\")","v":""},null,{"$f":"IFERROR(G772/D772/24,\"\")","v":""},null,{"$f":"IFERROR(I772/D772/24,\"\")","v":""},{"$f":"IFERROR(L772/D772/24,\"\")","v":""},null,null,null,null,"","",null,3]
["",null,null,"",null,"",null,"",null,"","",null,null,null,null,"",{"$f":"IFERROR(ROUND(SUM(L773*P773),2),\"\")","v":""},null,3]
["",null,null,"",null,"",null,"",null,"","",null,null,null,null,"","",null,3]
["",null,null,"",null,"",null,"",null,"","",null,null,null,null,"","",null,3]
["",null,null,"",null,"",null,"",null,"","",null,null,null,null,"","",null,3]
["",null,null,"",null,"",null,"",null,"","",null,null,null,null,"","",null,3]
["",null,null,"",null,"",null,"",null,"","",null,null,null,null,"","",null,3]
["",null,null,"",null,"",null,"",null,"","",null,null,null,null,"","",null,3]
["",null,null,"",null,"",null,"",null,"","",null,null,null,null,"","",null,3]
["",null,null,"",null,"",null,"",null,"","",null,null,null,null,"","",null,3]
["",null,null,"",null,"",null,"",null,"","",null,null,null,null,"","",null,3]
["",null,null,"",null,"",null,"",null,"","",null,null,null,null,"","",null,3]
["",null,null,"",null,"",null,"",null,"","",null,null,null,null,"","",null,3]
["",null,null,"",null,"",null,"",null,"","",null,null,null,null,"","",null,3]
["",null,null,"",null,"",null,"",null,"","",null,null,null,null,"","",null,3]
["",null,null,"",null,"",null,"",null,"","",null,null,null,null,"","",null,3]
["",null,null,"",null,"",null,"",null,"","",null,null,null,null,"","",null,3]
["",null,null,"",null,"",null,"",null,"","",null,null,null,null,"","",null,3]
["",null,null,"",null,"",null,"",null,"","",null,null,null,null,"","",null,3]
["",null,null,"",null,"",null,"",null,"","",null,null,null,null,"","",null,3]
["",null,null,"",null,"",null,"",null,"","",null,null,null,null,"","",null,3]
["",null,null,"",null,"",null,"",null,"","",null,null,null,null,"","",null,3]
["",null,null,"",null,"",null,"",null,"","",null,null,null,null,{"$f":"IFERROR(ROUND(SUM(1000/M794),2),\"\")","v":""},"",null,3]
["",null,null,"",null,"",null,"",null,"","",null,null,null,null,"","",null,3]
["",null,null,"",null,"",null,"",null,"","",null,null,null,null,"","",null,3]
["",null,null,"",null,"",null,"",null,"","",null,null,null,null,"","",null,3]
["",null,null,"",null,"",null,"",null,"","",null,null,null,null,"","",null,3]
["",null,null,"",null,"",null,"",null,"","",null,null,null,null,"","",null,3]
["",null,null,"",null,"",null,"",null,"","",null,null,null,null,"","",null,3]
["",null,null,"",null,"",null,"",null,"","",null,null,null,null,"","",null,3]
["",null,null,"",null,"",null,"",null,"","",null,null,null,null,"","",null,3]
["",null,null,"",null,"",null,"",null,"","",null,null,null,null,"","",null,3]
["",null,null,"",null,"",null,"",null,"","",null,null,null,null,"","",null,3]
["",null,null,"",null,"",null,"",null,"","",null,null,null,null,"","",null,3]
["",null,null,"",null,"",null,"",null,"","",null,null,null,null,"","",null,3]
["",null,null,"",null,"",null,"",null,"","",null,null,null,null,"","",null,3]
["",null,null,"",null,"",null,"",null,"","",null,null,null,null,"","",null,3]
["",null,null,"",null,"",null,"",null,"","",null,null,null,null,"","",null,3]
["",null,null,"",null,"",null,"",null,"","",null,null,null,null,"","",null,3]
["",null,null,"",null,"",null,"",null,"","",null,null,null,null,"","",null,3]
["",null,null,"",null,"",null,"",null,"","",null,null,null,null,"","",null,3]
["",null,null,"",null,"",null,"",null,"","",null,null,null,null,"","",null,3]
["",null,null,"",null,"",null,"",null,"","",null,null,null,null,"","",null,3]
["",null,null,"",null,"",null,"",null,"","",null,null,null,null,"","",null,3]
["",null,null,"",null,"",null,"",null,"","",null,null,null,null,"","",null,3]
["",null,null,"",null,"",null,"",null,"","",null,null,null,null,"","",null,3]
["",null,null,"",null,"",null,"",null,"","",null,null,null,null,"","",null,3]
["",null,null,"",null,"",null,"",null,"","",null,null,null,null,"","",null,3]
["",null,null,"",null,"",null,"",null,"","",null,null,null,null,"","",null,3]
["",null,null,"",null,"",null,"",null,"","",null,null,null,null,"","",null,3]
["",null,null,"",null,"",null,"",null,"","",null,null,null,null,"","",null,3]
["",null,null,"",null,"",null,"",null,"","",null,null,null,null,"","",null,3]
["",null,null,"",null,"",null,"",null,"","",null,null,null,null,"","",null,3]
["",null,null,"",null,"",null,"",null,"","",null,null,null,null,"","",null,3]
["",null,null,"",null,"",null,"",null,"","",null,null,null,null,"","",null,3]
["",null,null,"",null,"",null,"",null,"","",null,null,null,null,"","",null,3]
["",null,null,"",null,"",null,"",null,"","",null,null,null,null,"","",null,3]
["",null,null,"",null,"",null,"",null,"","",null,null,null,null,"","",null,3]
["",null,null,"",null,"",null,"",null,"","",null,null,null,null,"","",null,3]
["",null,null,"",null,"",null,"",null,"","",null,null,null,null,"","",null,3]
["",null,null,"",null,"",null,"",null,"","",null,null,null,null,"","",null,3]
["",null,null,"",null,"",null,"",null,"","",null,null,null,null,"","",null,3]
["",null,null,"",null,"",null,"",null,"","",null,null,null,null,"","",null,3]
["",null,null,"",null,"",null,"",null,"","",null,null,null,null,"","",null,3]
[{"$f":"IF(E836=\"\",\"\",IF(A836=\"\",TODAY(),A836))","v":""},null,null,{"$f":"IF(B836=\"\",\"\",(C836-B836))","v":""},null,{"$f":"IFERROR(VLOOKUP(E836,$AJ$2:$AL$316,2,FALSE),\"\")","v":""},null,{"$f":"IFERROR(G836/D836/24,\"\")","v":""},null,{"$f":"IFERROR(I836/D836/24,\"\")","v":""},{"$f":"IFERROR(L836/D836/24,\"\")","v":""},null,null,null,null,"","",null,3]
["",null,null,"",null,"",null,"",null,"","",null,null,null,null,"",{"$f":"IFERROR(ROUND(SUM(L837*P837),2),\"\")","v":""},null,3]
["",null,null,"",null,"",null,"",null,"","",null,null,null,null,"","",null,3]
["",null,null,"",null,"",null,"",null,"","",null,null,null,null,"","",null,3]
["",null,null,"",null,"",null,"",null,"","",null,null,null,null,"","",null,3]
["",null,null,"",null,"",null,"",null,"","",null,null,null,null,"","",null,3]
["",null,null,"",null,"",null,"",null,"","",null,null,null,null,"","",null,3]
["",null,null,"",null,"",null,"",null,"","",null,null,null,null,"","",null,3]
["",null,null,"",null,"",null,"",null,"","",null,null,null,null,"","",null,3]
["",null,null,"",null,"",null,"",null,"","",null,null,null,null,"","",null,3]
["",null,null,"",null,"",null,"",null,"","",null,null,null,null,"","",null,3]
["",null,null,"",null,"",null,"",null,"","",null,null,null,null,"","",null,3]
["",null,null,"",null,"",null,"",null,"","",null,null,null,null,"","",null,3]
["",null,null,"",null,"",null,"",null,"","",null,null,null,null,"","",null,3]
["",null,null,"",null,"",null,"",null,"","",null,null,null,null,"","",null,3]
["",null,null,"",null,"",null,"",null,"","",null,null,null,null,"","",null,3]
["",null,null,"",null,"",null,"",null,"","",null,null,null,null,"","",null,3]
["",null,null,"",null,"",null,"",null,"","",null,null,null,null,"","",null,3]
["",null,null,"",null,"",null,"",null,"","",null,null,null,null,"","",null,3]
["",null,null,"",null,"",null,"",null,"","",null,null,null,null,"","",null,3]
["",null,null,"",null,"",null,"",null,"","",null,null,null,null,"","",null,3]
["",null,null,"",null,"",null,"",null,"","",null,null,null,null,"","",null,3]
["",null,null,"",null,"",null,"",null,"","",null,null,null,null,{"$f":"IFERROR(ROUND(SUM(1000/M858),2),\"\")","v":""},"",null,3]
["",null,null,"",null,"",null,"",null,"","",null,null,null,null,"","",null,3]
["",null,null,"",null,"",null,"",null,"","",null,null,null,null,"","",null,3]
["",null,null,"",null,"",null,"",null,"","",null,null,null,null,"","",null,3]
["",null,null,"",null,"",null,"",null,"","",null,null,null,null,"","",null,3]
["",null,null,"",null,"",null,"",null,"","",null,null,null,null,"","",null,3]
["",null,null,"",null,"",null,"",null,"","",null,null,null,null,"","",null,3]
["",null,null,"",null,"",null,"",null,"","",null,null,null,null,"","",null,3]
["",null,null,"",null,"",null,"",null,"","",null,null,null,null,"","",null,3]
["",null,null,"",null,"",null,"",null,"","",null,null,null,null,"","",null,3]
["",null,null,"",null,"",null,"",null,"","",null,null,null,null,"","",null,3]
["",null,null,"",null,"",null,"",null,"","",null,null,null,null,"","",null,3]
["",null,null,"",null,"",null,"",null,"","",null,null,null,null,"","",null,3]
["",null,null,"",null,"",null,"",null,"","",null,null,null,null,"","",null,3]
["",null,null,"",null,"",null,"",null,"","",null,null,null,null,"","",null,3]
["",null,null,"",null,"",null,"",null,"","",null,null,null,null,"","",null,3]
["",null,null,"",null,"",null,"",null,"","",null,null,null,null,"","",null,3]
["",null,null,"",null,"",null,"",null,"","",null,null,null,null,"","",null,3]
["",null,null,"",null,"",null,"",null,"","",null,null,null,null,"","",null,3]
["",null,null,"",null,"",null,"",null,"","",null,null,null,null,"","",null,3]
["",null,null,"",null,"",null,"",null,"","",null,null,null,null,"","",null,3]
["",null,null,"",null,"",null,"",null,"","",null,null,null,null,"","",null,3]
["",null,null,"",null,"",null,"",null,"","",null,null,null,null,"","",null,3]
["",null,null,"",null,"",null,"",null,"","",null,null,null,null,"","",null,3]
["",null,null,"",null,"",null,"",null,"","",null,null,null,null,"","",null,3]
["",null,null,"",null,"",null,"",null,"","",null,null,null,null,"","",null,3]
["",null,null,"",null,"",null,"",null,"","",null,null,null,null,"","",null,3]
["",null,null,"",null,"",null,"",null,"","",null,null,null,null,"","",null,3]
["",null,null,"",null,"",null,"",null,"","",null,null,null,null,"","",null,3]
["",null,null,"",null,"",null,"",null,"","",null,null,null,null,"","",null,3]
["",null,null,"",null,"",null,"",null,"","",null,null,null,null,"","",null,3]
["",null,null,"",null,"",null,"",null,"","",null,null,null,null,"","",null,3]
["",null,null,"",null,"",null,"",null,"","",null,null,null,null,"","",null,3]
["",null,null,"",null,"",null,"",null,"","",null,null,null,null,"","",null,3]
["",null,null,"",null,"",null,"",null,"","",null,null,null,null,"","",null,3]
["",null,null,"",null,"",null,"",null,"","",null,null,null,null,"","",null,3]
["",null,null,"",null,"",null,"",null,"","",null,null,null,null,"","",null,3]
["",null,null,"",null,"",null,"",null,"","",null,null,null,null,"","",null,3]
["",null,null,"",null,"",null,"",null,"","",null,null,null,null,"","",null,3]
["",null,null,"",null,"",null,"",null,"","",null,null,null,null,"","",null,3]
["",null,null,"",null,"",null,"",null,"","",null,null,null,null,"","",null,3]
["",null,null,"",null,"",null,"",null,"","",null,null,null,null,"","",null,3]
[{"$f":"IF(E900=\"\",\"\",IF(A900=\"\",TODAY(),A900))","v":""},null,null,{"$f":"IF(B900=\"\",\"\",(C900-B900))","v":""},null,{"$f":"IFERROR(VLOOKUP(E900,$AJ$2:$AL$316,2,FALSE),\"\")","v":""},null,{"$f":"IFERROR(G900/D900/24,\"\")","v":""},null,{"$f":"IFERROR(I900/D900/24,\"\")","v":""},{"$f":"IFERROR(L900/D900/24,\"\")","v":""},null,null,null,null,"","",null,3]
["",null,null,"",null,"",null,"",null,"","",null,null,null,null,"",{"$f":"IFERROR(ROUND(SUM(L901*P901),2),\"\")","v":""},null,3]
["",null,null,"",null,"",null,"",null,"","",null,null,null,null,"","",null,3]
["",null,null,"",null,"",null,"",null,"","",null,null,null,null,"","",null,3]
["",null,null,"",null,"",null,"",null,"","",null,null,null,null,"","",null,3]
["",null,null,"",null,"",null,"",null,"","",null,null,null,null,"","",null,3]
["",null,null,"",null,"",null,"",null,"","",null,null,null,null,"","",null,3]
["",null,null,"",null,"",null,"",null,"","",null,null,null,null,"","",null,3]
["",null,null,"",null,"",null,"",null,"","",null,null,null,null,"","",null,3]
["",null,null,"",null,"",null,"",null,"","",null,null,null,null,"","",null,3]
["",null,null,"",null,"",null,"",null,"","",null,null,null,null,"","",null,3]
["",null,null,"",null,"",null,"",null,"","",null,null,null,null,"","",null,3]
["",null,null,"",null,"",null,"",null,"","",null,null,null,null,"","",null,3]
["",null,null,"",null,"",null,"",null,"","",null,null,null,null,"","",null,3]
["",null,null,"",null,"",null,"",null,"","",null,null,null,null,"","",null,3]
["",null,null,"",null,"",null,"",null,"","",null,null,null,null,"","",null,3]
["",null,null,"",null,"",null,"",null,"","",null,null,null,null,"","",null,3]
["",null,null,"",null,"",null,"",null,"","",null,null,null,null,"","",null,3]
["",null,null,"",null,"",null,"",null,"","",null,null,null,null,"","",null,3]
["",null,null,"",null,"",null,"",null,"","",null,null,null,null,"","",null,3]
["",null,null,"",null,"",null,"",null,"","",null,null,null,null,"","",null,3]
["",null,null,"",null,"",null,"",null,"","",null,null,null,null,"","",null,3]
["",null,null,"",null,"",null,"",null,"","",null,null,null,null,{"$f":"IFERROR(ROUND(SUM(1000/M922),2),\"\")","v":""},"",null,3]
["",null,null,"",null,"",null,"",null,"","",null,null,null,null,"","",null,3]
["",null,null,"",null,"",null,"",null,"","",null,null,null,null,"","",null,3]
["",null,null,"",null,"",null,"",null,"","",null,null,null,null,"","",null,3]
["",null,null,"",null,"",null,"",null,"","",null,null,null,null,"","",null,3]
["",null,null,"",null,"",null,"",null,"","",null,null,null,null,"","",null,3]
["",null,null,"",null,"",null,"",null,"","",null,null,null,null,"","",null,3]
["",null,null,"",null,"",null,"",null,"","",null,null,null,null,"","",null,3]
["",null,null,"",null,"",null,"",null,"","",null,null,null,null,"","",null,3]
["",null,null,"",null,"",null,"",null,"","",null,null,null,null,"","",null,3]
["",null,null,"",null,"",null,"",null,"","",null,null,null,null,"","",null,3]
["",null,null,"",null,"",null,"",null,"","",null,null,null,null,"","",null,3]
["",null,null,"",null,"",null,"",null,"","",null,null,null,null,"","",null,3]
["",null,null,"",null,"",null,"",null,"","",null,null,null,null,"","",null,3]
["",null,null,"",null,"",null,"",null,"","",null,null,null,null,"","",null,3]
["",null,null,"",null,"",null,"",null,"","",null,null,null,null,"","",null,3]
["",null,null,"",null,"",null,"",null,"","",null,null,null,null,"","",null,3]
["",null,null,"",null,"",null,"",null,"","",null,null,null,null,"","",null,3]
["",null,null,"",null,"",null,"",null,"","",null,null,null,null,"","",null,3]
["",null,null,"",null,"",null,"",null,"","",null,null,null,null,"","",null,3]
["",null,null,"",null,"",null,"",null,"","",null,null,null,null,"","",null,3]
["",null,null,"",null,"",null,"",null,"","",null,null,null,null,"","",null,3]
["",null,null,"",null,"",null,"",null,"","",null,null,null,null,"","",null,3]
["",null,null,"",null,"",null,"",null,"","",null,null,null,null,"","",null,3]
["",null,null,"",null,"",null,"",null,"","",null,null,null,null,"","",null,3]
["",null,null,"",null,"",null,"",null,"","",null,null,null,null,"","",null,3]
["",null,null,"",null,"",null,"",null,"","",null,null,null,null,"","",null,3]
["",null,null,"",null,"",null,"",null,"","",null,null,null,null,"","",null,3]
["",null,null,"",null,"",null,"",null,"","",null,null,null,null,"","",null,3]
["",null,null,"",null,"",null,"",null,"","",null,null,null,null,"","",null,3]
["",null,null,"",null,"",null,"",null,"","",null,null,null,null,"","",null,3]
["",null,null,"",null,"",null,"",null,"","",null,null,null,null,"","",null,3]
["",null,null,"",null,"",null,"",null,"","",null,null,null,null,"","",null,3]
["",null,null,"",null,"",null,"",null,"","",null,null,null,null,"","",null,3]
["",null,null,"",null,"",null,"",null,"","",null,null,null,null,"","",null,3]
["",null,null,"",null,"",null,"",null,"","",null,null,null,null,"","",null,3]
["",null,null,"",null,"",null,"",null,"","",null,null,null,null,"","",null,3]
["",null,null,"",null,"",null,"",null,"","",null,null,null,null,"","",null,3]
["",null,null,"",null,"",null,"",null,"","",null,null,null,null,"","",null,3]
["",null,null,"",null,"",null,"",null,"","",null,null,null,null,"","",null,3]
["",null,null,"",null,"",null,"",null,"","",null,null,null,null,"","",null,3]
["",null,null,"",null,"",null,"",null,"","",null,null,null,null,"","",null,3]
[{"$f":"IF(E964=\"\",\"\",IF(A964=\"\",TODAY(),A964))","v":""},null,null,{"$f":"IF(B964=\"\",\"\",(C964-B964))","v":""},null,{"$f":"IFERROR(VLOOKUP(E964,$AJ$2:$AL$316,2,FALSE),\"\")","v":""},null,{"$f":"IFERROR(G964/D964/24,\"\")","v":""},null,{"$f":"IFERROR(I964/D964/24,\"\")","v":""},{"$f":"IFERROR(L964/D964/24,\"\")","v":""},null,null,null,null,"","",null,3]
["",null,null,"",null,"",null,"",null,"","",null,null,null,null,"",{"$f":"IFERROR(ROUND(SUM(L965*P965),2),\"\")","v":""},null,3]
["",null,null,"",null,"",null,"",null,"","",null,null,null,null,"","",null,3]
["",null,null,"",null,"",null,"",null,"","",null,null,null,null,"","",null,3]
["",null,null,"",null,"",null,"",null,"","",null,null,null,null,"","",null,3]
["",null,null,"",null,"",null,"",null,"","",null,null,null,null,"","",null,3]
["",null,null,"",null,"",null,"",null,"","",null,null,null,null,"","",null,3]
["",null,null,"",null,"",null,"",null,"","",null,null,null,null,"","",null,3]
["",null,null,"",null,"",null,"",null,"","",null,null,null,null,"","",null,3]
["",null,null,"",null,"",null,"",null,"","",null,null,null,null,"","",null,3]
["",null,null,"",null,"",null,"",null,"","",null,null,null,null,"","",null,3]
["",null,null,"",null,"",null,"",null,"","",null,null,null,null,"","",null,3]
["",null,null,"",null,"",null,"",null,"","",null,null,null,null,"","",null,3]
["",null,null,"",null,"",null,"",null,"","",null,null,null,null,"","",null,3]
["",null,null,"",null,"",null,"",null,"","",null,null,null,null,"","",null,3]
["",null,null,"",null,"",null,"",null,"","",null,null,null,null,"","",null,3]
["",null,null,"",null,"",null,"",null,"","",null,null,null,null,"","",null,3]
["",null,null,"",null,"",null,"",null,"","",null,null,null,null,"","",null,3]
["",null,null,"",null,"",null,"",null,"","",null,null,null,null,"","",null,3]
["",null,null,"",null,"",null,"",null,"","",null,null,null,null,"","",null,3]
["",null,null,"",null,"",null,"",null,"","",null,null,null,null,"","",null,3]
["",null,null,"",null,"",null,"",null,"","",null,null,null,null,"","",null,3]
["",null,null,"",null,"",null,"",null,"","",null,null,null,null,{"$f":"IFERROR(ROUND(SUM(1000/M986),2),\"\")","v":""},"",null,3]
["",null,null,"",null,"",null,"",null,"","",null,null,null,null,"","",null,3]
["",null,null,"",null,"",null,"",null,"","",null,null,null,null,"","",null,3]
["",null,null,"",null,"",null,"",null,"","",null,null,null,null,"","",null,3]
["",null,null,"",null,"",null,"",null,"","",null,null,null,null,"","",null,3]
["",null,null,"",null,"",null,"",null,"","",null,null,null,null,"","",null,3]
["",null,null,"",null,"",null,"",null,"","",null,null,null,null,"","",null,3]
["",null,null,"",null,"",null,"",null,"","",null,null,null,null,"","",null,3]
["",null,null,"",null,"",null,"",null,"","",null,null,null,null,"","",null,3]
["",null,null,"",null,"",null,"",null,"","",null,null,null,null,"","",null,3]
["",null,null,"",null,"",null,"",null,"","",null,null,null,null,"","",null,3]
["",null,null,"",null,"",null,"",null,"","",null,null,null,null,"","",null,3]
["",null,null,"",null,"",null,"",null,"","",null,null,null,null,"","",null,3]
["",null,null,"",null,"",null,"",null,"","",null,null,null,null,"","",null,3]
["",null,null,"",null,"",null,"",null,"","",null,null,null,null,"","",null,3]
["",null,null,"",null,"",null,"",null,"","",null,null,null,null,"","",null,3]
["",null,null,"",null,"",null,"",null,"","",null,null,null,null,"","",null,3]
["",null,null,"",null,"",null,"",null,"","",null,null,null,null,"","",null,3]
["",null,null,"",null,"",null,"",null,"","",null,null,null,null,"","",null,3]
["",null,null,"",null,"",null,"",null,"","",null,null,null,null,"","",null,3]
["",null,null,"",null,"",null,"",null,"","",null,null,null,null,"","",null,3]
["",null,null,"",null,"",null,"",null,"","",null,null,null,null,"","",null,3]
["",null,null,"",null,"",null,"",null,"","",null,null,null,null,"","",null,3]
["",null,null,"",null,"",null,"",null,"","",null,null,null,null,"","",null,3]
["",null,null,"",null,"",null,"",null,"","",null,null,null,null,"","",null,3]
["",null,null,"",null,"",null,"",null,"","",null,null,null,null,"","",null,3]
["",null,null,"",null,"",null,"",null,"","",null,null,null,null,"","",null,3]
["",null,null,"",null,"",null,"",null,"","",null,null,null,null,"","",null,3]
["",null,null,"",null,"",null,"",null,"","",null,null,null,null,"","",null,3]
["",null,null,"",null,"",null,"",null,"","",null,null,null,null,"","",null,3]
["",null,null,"",null,"",null,"",null,"","",null,null,null,null,"","",null,3]
["",null,null,"",null,"",null,"",null,"","",null,null,null,null,"","",null,3]
["",null,null,"",null,"",null,"",null,"","",null,null,null,null,"","",null,3]
["",null,null,"",null,"",null,"",null,"","",null,null,null,null,"","",null,3]
["",null,null,"",null,"",null,"",null,"","",null,null,null,null,"","",null,3]
["",null,null,"",null,"",null,"",null,"","",null,null,null,null,"","",null,3]
["",null,null,"",null,"",null,"",null,"","",null,null,null,null,"","",null,3]
["",null,null,"",null,"",null,"",null,"","",null,null,null,null,"","",null,3]
["",null,null,"",null,"",null,"",null,"","",null,null,null,null,"","",null,3]
["",null,null,"",null,"",null,"",null,"","",null,null,null,null,"","",null,3]
["",null,null,"",null,"",null,"",null,"","",null,null,null,null,"","",null,3]
["",null,null,"",null,"",null,"",null,"","",null,null,null,null,"","",null,3]
[{"$f":"IF(E1028=\"\",\"\",IF(A1028=\"\",TODAY(),A1028))","v":""},null,null,{"$f":"IF(B1028=\"\",\"\",(C1028-B1028))","v":""},null,{"$f":"IFERROR(VLOOKUP(E1028,$AJ$2:$AL$316,2,FALSE),\"\")","v":""},null,{"$f":"IFERROR(G1028/D1028/24,\"\")","v":""},null,{"$f":"IFERROR(I1028/D1028/24,\"\")","v":""},{"$f":"IFERROR(L1028/D1028/24,\"\")","v":""},null,null,null,null,"","",null,3]
["",null,null,"",null,"",null,"",null,"","",null,null,null,null,"",{"$f":"IFERROR(ROUND(SUM(L1029*P1029),2),\"\")","v":""},null,3]
["",null,null,"",null,"",null,"",null,"","",null,null,null,null,"","",null,3]
["",null,null,"",null,"",null,"",null,"","",null,null,null,null,"","",null,3]
["",null,null,"",null,"",null,"",null,"","",null,null,null,null,"","",null,3]
["",null,null,"",null,"",null,"",null,"","",null,null,null,null,"","",null,3]
["",null,null,"",null,"",null,"",null,"","",null,null,null,null,"","",null,3]
["",null,null,"",null,"",null,"",null,"","",null,null,null,null,"","",null,3]
["",null,null,"",null,"",null,"",null,"","",null,null,null,null,"","",null,3]
["",null,null,"",null,"",null,"",null,"","",null,null,null,null,"","",null,3]
["",null,null,"",null,"",null,"",null,"","",null,null,null,null,"","",null,3]
["",null,null,"",null,"",null,"",null,"","",null,null,null,null,"","",null,3]
["",null,null,"",null,"",null,"",null,"","",null,null,null,null,"","",null,3]
["",null,null,"",null,"",null,"",null,"","",null,null,null,null,"","",null,3]
["",null,null,"",null,"",null,"",null,"","",null,null,null,null,"","",null,3]
["",null,null,"",null,"",null,"",null,"","",null,null,null,null,"","",null,3]
["",null,null,"",null,"",null,"",null,"","",null,null,null,null,"","",null,3]
["",null,null,"",null,"",null,"",null,"","",null,null,null,null,"","",null,3]
["",null,null,"",null,"",null,"",null,"","",null,null,null,null,"","",null,3]
["",null,null,"",null,"",null,"",null,"","",null,null,null,null,"","",null,3]
["",null,null,"",null,"",null,"",null,"","",null,null,null,null,"","",null,3]
["",null,null,"",null,"",null,"",null,"","",null,null,null,null,"","",null,3]
["",null,null,"",null,"",null,"",null,"","",null,null,null,null,{"$f":"IFERROR(ROUND(SUM(1000/M1050),2),\"\")","v":""},"",null,3]
["",null,null,"",null,"",null,"",null,"","",null,null,null,null,"","",null,3]
["",null,null,"",null,"",null,"",null,"","",null,null,null,null,"","",null,3]
["",null,null,"",null,"",null,"",null,"","",null,null,null,null,"","",null,3]
["",null,null,"",null,"",null,"",null,"","",null,null,null,null,"","",null,3]
["",null,null,"",null,"",null,"",null,"","",null,null,null,null,"","",null,3]
["",null,null,"",null,"",null,"",null,"","",null,null,null,null,"","",null,3]
["",null,null,"",null,"",null,"",null,"","",null,null,null,null,"","",null,3]
["",null,null,"",null,"",null,"",null,"","",null,null,null,null,"","",null,3]
["",null,null,"",null,"",null,"",null,"","",null,null,null,null,"","",null,3]
["",null,null,"",null,"",null,"",null,"","",null,null,null,null,"","",null,3]
["",null,null,"",null,"",null,"",null,"","",null,null,null,null,"","",null,3]
["",null,null,"",null,"",null,"",null,"","",null,null,null,null,"","",null,3]
["",null,null,"",null,"",null,"",null,"","",null,null,null,null,"","",null,3]
["",null,null,"",null,"",null,"",null,"","",null,null,null,null,"","",null,3]
["",null,null,"",null,"",null,"",null,"","",null,null,null,null,"","",null,3]
["",null,null,"",null,"",null,"",null,"","",null,null,null,null,"","",null,3]
["",null,null,"",null,"",null,"",null,"","",null,null,null,null,"","",null,3]
["",null,null,"",null,"",null,"",null,"","",null,null,null,null,"","",null,3]
["",null,null,"",null,"",null,"",null,"","",null,null,null,null,"","",null,3]
["",null,null,"",null,"",null,"",null,"","",null,null,null,null,"","",null,3]
["",null,null,"",null,"",null,"",null,"","",null,null,null,null,"","",null,3]
["",null,null,"",null,"",null,"",null,"","",null,null,null,null,"","",null,3]
["",null,null,"",null,"",null,"",null,"","",null,null,null,null,"","",null,3]
["",null,null,"",null,"",null,"",null,"","",null,null,null,null,"","",null,3]
["",null,null,"",null,"",null,"",null,"","",null,null,null,null,"","",null,3]
["",null,null,"",null,"",null,"",null,"","",null,null,null,null,"","",null,3]
["",null,null,"",null,"",null,"",null,"","",null,null,null,null,"","",null,3]
["",null,null,"",null,"",null,"",null,"","",null,null,null,null,"","",null,3]
["",null,null,"",null,"",null,"",null,"","",null,null,null,null,"","",null,3]
["",null,null,"",null,"",null,"",null,"","",null,null,null,null,"","",null,3]
["",null,null,"",null,"",null,"",null,"","",null,null,null,null,"","",null,3]
["",null,null,"",null,"",null,"",null,"","",null,null,null,null,"","",null,3]
["",null,null,"",null,"",null,"",null,"","",null,null,null,null,"","",null,3]
["",null,null,"",null,"",null,"",null,"","",null,null,null,null,"","",null,3]
["",null,null,"",null,"",null,"",null,"","",null,null,null,null,"","",null,3]
["",null,null,"",null,"",null,"",null,"","",null,null,null,null,"","",null,3]
["",null,null,"",null,"",null,"",null,"","",null,null,null,null,"","",null,3]
["",null,null,"",null,"",null,"",null,"","",null,null,null,null,"","",null,3]
["",null,null,"",null,"",null,"",null,"","",null,null,null,null,"","",null,3]
["",null,null,"",null,"",null,"",null,"","",null,null,null,null,"","",null,3]
["",null,null,"",null,"",null,"",null,"","",null,null,null,null,"","",null,3]
[{"$f":"IF(E1092=\"\",\"\",IF(A1092=\"\",TODAY(),A1092))","v":""},null,null,{"$f":"IF(B1092=\"\",\"\",(C1092-B1092))","v":""},null,{"$f":"IFERROR(VLOOKUP(E1092,$AJ$2:$AL$316,2,FALSE),\"\")","v":""},null,{"$f":"IFERROR(G1092/D1092/24,\"\")","v":""},null,{"$f":"IFERROR(I1092/D1092/24,\"\")","v":""},{"$f":"IFERROR(L1092/D1092/24,\"\")","v":""},null,null,null,null,"","",null,3]
["",null,null,"",null,"",null,"",null,"","",null,null,null,null,"",{"$f":"IFERROR(ROUND(SUM(L1093*P1093),2),\"\")","v":""},null,3]
["",null,null,"",null,"",null,"",null,"","",null,null,null,null,"","",null,3]
["",null,null,"",null,"",null,"",null,"","",null,null,null,null,"","",null,3]
["",null,null,"",null,"",null,"",null,"","",null,null,null,null,"","",null,3]
["",null,null,"",null,"",null,"",null,"","",null,null,null,null,"","",null,3]
["",null,null,"",null,"",null,"",null,"","",null,null,null,null,"","",null,3]
["",null,null,"",null,"",null,"",null,"","",null,null,null,null,"","",null,3]
["",null,null,"",null,"",null,"",null,"","",null,null,null,null,"","",null,3]
["",null,null,"",null,"",null,"",null,"","",null,null,null,null,"","",null,3]
["",null,null,"",null,"",null,"",null,"","",null,null,null,null,"","",null,3]
["",null,null,"",null,"",null,"",null,"","",null,null,null,null,"","",null,3]
["",null,null,"",null,"",null,"",null,"","",null,null,null,null,"","",null,3]
["",null,null,"",null,"",null,"",null,"","",null,null,null,null,"","",null,3]
["",null,null,"",null,"",null,"",null,"","",null,null,null,null,"","",null,3]
["",null,null,"",null,"",null,"",null,"","",null,null,null,null,"","",null,3]
["",null,null,"",null,"",null,"",null,"","",null,null,null,null,"","",null,3]
["",null,null,"",null,"",null,"",null,"","",null,null,null,null,"","",null,3]
["",null,null,"",null,"",null,"",null,"","",null,null,null,null,"","",null,3]
["",null,null,"",null,"",null,"",null,"","",null,null,null,null,"","",null,3]
["",null,null,"",null,"",null,"",null,"","",null,null,null,null,"","",null,3]
["",null,null,"",null,"",null,"",null,"","",null,null,null,null,"","",null,3]
["",null,null,"",null,"",null,"",null,"","",null,null,null,null,{"$f":"IFERROR(ROUND(SUM(1000/M1114),2),\"\")","v":""},"",null,3]
["",null,null,"",null,"",null,"",null,"","",null,null,null,null,"","",null,3]
["",null,null,"",null,"",null,"",null,"","",null,null,null,null,"","",null,3]
["",null,null,"",null,"",null,"",null,"","",null,null,null,null,"","",null,3]
["",null,null,"",null,"",null,"",null,"","",null,null,null,null,"","",null,3]
["",null,null,"",null,"",null,"",null,"","",null,null,null,null,"","",null,3]
["",null,null,"",null,"",null,"",null,"","",null,null,null,null,"","",null,3]
["",null,null,"",null,"",null,"",null,"","",null,null,null,null,"","",null,3]
["",null,null,"",null,"",null,"",null,"","",null,null,null,null,"","",null,3]
["",null,null,"",null,"",null,"",null,"","",null,null,null,null,"","",null,3]
["",null,null,"",null,"",null,"",null,"","",null,null,null,null,"","",null,3]
["",null,null,"",null,"",null,"",null,"","",null,null,null,null,"","",null,3]
["",null,null,"",null,"",null,"",null,"","",null,null,null,null,"","",null,3]
["",null,null,"",null,"",null,"",null,"","",null,null,null,null,"","",null,3]
["",null,null,"",null,"",null,"",null,"","",null,null,null,null,"","",null,3]
["",null,null,"",null,"",null,"",null,"","",null,null,null,null,"","",null,3]
["",null,null,"",null,"",null,"",null,"","",null,null,null,null,"","",null,3]
["",null,null,"",null,"",null,"",null,"","",null,null,null,null,"","",null,3]
["",null,null,"",null,"",null,"",null,"","",null,null,null,null,"","",null,3]
["",null,null,"",null,"",null,"",null,"","",null,null,null,null,"","",null,3]
["",null,null,"",null,"",null,"",null,"","",null,null,null,null,"","",null,3]
["",null,null,"",null,"",null,"",null,"","",null,null,null,null,"","",null,3]
["",null,null,"",null,"",null,"",null,"","",null,null,null,null,"","",null,3]
["",null,null,"",null,"",null,"",null,"","",null,null,null,null,"","",null,3]
["",null,null,"",null,"",null,"",null,"","",null,null,null,null,"","",null,3]
["",null,null,"",null,"",null,"",null,"","",null,null,null,null,"","",null,3]
["",null,null,"",null,"",null,"",null,"","",null,null,null,null,"","",null,3]
["",null,null,"",null,"",null,"",null,"","",null,null,null,null,"","",null,3]
["",null,null,"",null,"",null,"",null,"","",null,null,null,null,"","",null,3]
["",null,null,"",null,"",null,"",null,"","",null,null,null,null,"","",null,3]
["",null,null,"",null,"",null,"",null,"","",null,null,null,null,"","",null,3]
["",null,null,"",null,"",null,"",null,"","",null,null,null,null,"","",null,3]
["",null,null,"",null,"",null,"",null,"","",null,null,null,null,"","",null,3]
["",null,null,"",null,"",null,"",null,"","",null,null,null,null,"","",null,3]
["",null,null,"",null,"",null,"",null,"","",null,null,null,null,"","",null,3]
["",null,null,"",null,"",null,"",null,"","",null,null,null,null,"","",null,3]
["",null,null,"",null,"",null,"",null,"","",null,null,null,null,"","",null,3]
["",null,null,"",null,"",null,"",null,"","",null,null,null,null,"","",null,3]
["",null,null,"",null,"",null,"",null,"","",null,null,null,null,"","",null,3]
["",null,null,"",null,"",null,"",null,"","",null,null,null,null,"","",null,3]
["",null,null,"",null,"",null,"",null,"","",null,null,null,null,"","",null,3]
["",null,null,"",null,"",null,"",null,"","",null,null,null,null,"","",null,3]
[{"$f":"IF(E1156=\"\",\"\",IF(A1156=\"\",TODAY(),A1156))","v":""},null,null,{"$f":"IF(B1156=\"\",\"\",(C1156-B1156))","v":""},null,{"$f":"IFERROR(VLOOKUP(E1156,$AJ$2:$AL$316,2,FALSE),\"\")","v":""},null,{"$f":"IFERROR(G1156/D1156/24,\"\")","v":""},null,{"$f":"IFERROR(I1156/D1156/24,\"\")","v":""},{"$f":"IFERROR(L1156/D1156/24,\"\")","v":""},null,null,null,null,"","",null,3]
["",null,null,"",null,"",null,"",null,"","",null,null,null,null,"",{"$f":"IFERROR(ROUND(SUM(L1157*P1157),2),\"\")","v":""},null,3]
["",null,null,"",null,"",null,"",null,"","",null,null,null,null,"","",null,3]
["",null,null,"",null,"",null,"",null,"","",null,null,null,null,"","",null,3]
["",null,null,"",null,"",null,"",null,"","",null,null,null,null,"","",null,3]
["",null,null,"",null,"",null,"",null,"","",null,null,null,null,"","",null,3]
["",null,null,"",null,"",null,"",null,"","",null,null,null,null,"","",null,3]
["",null,null,"",null,"",null,"",null,"","",null,null,null,null,"","",null,3]
["",null,null,"",null,"",null,"",null,"","",null,null,null,null,"","",null,3]
["",null,null,"",null,"",null,"",null,"","",null,null,null,null,"","",null,3]
["",null,null,"",null,"",null,"",null,"","",null,null,null,null,"","",null,3]
["",null,null,"",null,"",null,"",null,"","",null,null,null,null,"","",null,3]
["",null,null,"",null,"",null,"",null,"","",null,null,null,null,"","",null,3]
["",null,null,"",null,"",null,"",null,"","",null,null,null,null,"","",null,3]
["",null,null,"",null,"",null,"",null,"","",null,null,null,null,"","",null,3]
["",null,null,"",null,"",null,"",null,"","",null,null,null,null,"","",null,3]
["",null,null,"",null,"",null,"",null,"","",null,null,null,null,"","",null,3]
["",null,null,"",null,"",null,"",null,"","",null,null,null,null,"","",null,3]
["",null,null,"",null,"",null,"",null,"","",null,null,null,null,"","",null,3]
["",null,null,"",null,"",null,"",null,"","",null,null,null,null,"","",null,3]
["",null,null,"",null,"",null,"",null,"","",null,null,null,null,"","",null,3]
["",null,null,"",null,"",null,"",null,"","",null,null,null,null,"","",null,3]
["",null,null,"",null,"",null,"",null,"","",null,null,null,null,{"$f":"IFERROR(ROUND(SUM(1000/M1178),2),\"\")","v":""},"",null,3]
["",null,null,"",null,"",null,"",null,"","",null,null,null,null,"","",null,3]
["",null,null,"",null,"",null,"",null,"","",null,null,null,null,"","",null,3]
["",null,null,"",null,"",null,"",null,"","",null,null,null,null,"","",null,3]
["",null,null,"",null,"",null,"",null,"","",null,null,null,null,"","",null,3]
["",null,null,"",null,"",null,"",null,"","",null,null,null,null,"","",null,3]
["",null,null,"",null,"",null,"",null,"","",null,null,null,null,"","",null,3]
["",null,null,"",null,"",null,"",null,"","",null,null,null,null,"","",null,3]
["",null,null,"",null,"",null,"",null,"","",null,null,null,null,"","",null,3]
["",null,null,"",null,"",null,"",null,"","",null,null,null,null,"","",null,3]
["",null,null,"",null,"",null,"",null,"","",null,null,null,null,"","",null,3]
["",null,null,"",null,"",null,"",null,"","",null,null,null,null,"","",null,3]
["",null,null,"",null,"",null,"",null,"","",null,null,null,null,"","",null,3]
["",null,null,"",null,"",null,"",null,"","",null,null,null,null,"","",null,3]
["",null,null,"",null,"",null,"",null,"","",null,null,null,null,"","",null,3]
["",null,null,"",null,"",null,"",null,"","",null,null,null,null,"","",null,3]
["",null,null,"",null,"",null,"",null,"","",null,null,null,null,"","",null,3]
["",null,null,"",null,"",null,"",null,"","",null,null,null,null,"","",null,3]
["",null,null,"",null,"",null,"",null,"","",null,null,null,null,"","",null,3]
["",null,null,"",null,"",null,"",null,"","",null,null,null,null,"","",null,3]
["",null,null,"",null,"",null,"",null,"","",null,null,null,null,"","",null,3]
["",null,null,"",null,"",null,"",null,"","",null,null,null,null,"","",null,3]
["",null,null,"",null,"",null,"",null,"","",null,null,null,null,"","",null,3]
["",null,null,"",null,"",null,"",null,"","",null,null,null,null,"","",null,3]
["",null,null,"",null,"",null,"",null,"","",null,null,null,null,"","",null,3]
["",null,null,"",null,"",null,"",null,"","",null,null,null,null,"","",null,3]
["",null,null,"",null,"",null,"",null,"","",null,null,null,null,"","",null,3]
["",null,null,"",null,"",null,"",null,"","",null,null,null,null,"","",null,3]
["",null,null,"",null,"",null,"",null,"","",null,null,null,null,"","",null,3]
["",null,null,"",null,"",null,"",null,"","",null,null,null,null,"","",null,3]
["",null,null,"",null,"",null,"",null,"","",null,null,null,null,"","",null,3]
["",null,null,"",null,"",null,"",null,"","",null,null,null,null,"","",null,3]
["",null,null,"",null,"",null,"",null,"","",null,null,null,null,"","",null,3]
["",null,null,"",null,"",null,"",null,"","",null,null,null,null,"","",null,3]
["",null,null,"",null,"",null,"",null,"","",null,null,null,null,"","",null,3]
["",null,null,"",null,"",null,"",null,"","",null,null,null,null,"","",null,3]
["",null,null,"",null,"",null,"",null,"","",null,null,null,null,"","",null,3]
["",null,null,"",null,"",null,"",null,"","",null,null,null,null,"","",null,3]
["",null,null,"",null,"",null,"",null,"","",null,null,null,null,"","",null,3]
["",null,null,"",null,"",null,"",null,"","",null,null,null,null,"","",null,3]
["",null,null,"",null,"",null,"",null,"","",null,null,null,null,"","",null,3]
["",null,null,"",null,"",null,"",null,"","",null,null,null,null,"","",null,3]
[{"$f":"IF(E1220=\"\",\"\",IF(A1220=\"\",TODAY(),A1220))","v":""},null,null,{"$f":"IF(B1220=\"\",\"\",(C1220-B1220))","v":""},null,{"$f":"IFERROR(VLOOKUP(E1220,$AJ$2:$AL$316,2,FALSE),\"\")","v":""},null,{"$f":"IFERROR(G1220/D1220/24,\"\")","v":""},null,{"$f":"IFERROR(I1220/D1220/24,\"\")","v":""},{"$f":"IFERROR(L1220/D1220/24,\"\")","v":""},null,null,null,null,"","",null,3]
["",null,null,"",null,"",null,"",null,"","",null,null,null,null,"",{"$f":"IFERROR(ROUND(SUM(L1221*P1221),2),\"\")","v":""},null,3]
["",null,null,"",null,"",null,"",null,"","",null,null,null,null,"","",null,3]
["",null,null,"",null,"",null,"",null,"","",null,null,null,null,"","",null,3]
["",null,null,"",null,"",null,"",null,"","",null,null,null,null,"","",null,3]
["",null,null,"",null,"",null,"",null,"","",null,null,null,null,"","",null,3]
["",null,null,"",null,"",null,"",null,"","",null,null,null,null,"","",null,3]
["",null,null,"",null,"",null,"",null,"","",null,null,null,null,"","",null,3]
["",null,null,"",null,"",null,"",null,"","",null,null,null,null,"","",null,3]
["",null,null,"",null,"",null,"",null,"","",null,null,null,null,"","",null,3]
["",null,null,"",null,"",null,"",null,"","",null,null,null,null,"","",null,3]
["",null,null,"",null,"",null,"",null,"","",null,null,null,null,"","",null,3]
["",null,null,"",null,"",null,"",null,"","",null,null,null,null,"","",null,3]
["",null,null,"",null,"",null,"",null,"","",null,null,null,null,"","",null,3]
["",null,null,"",null,"",null,"",null,"","",null,null,null,null,"","",null,3]
["",null,null,"",null,"",null,"",null,"","",null,null,null,null,"","",null,3]
["",null,null,"",null,"",null,"",null,"","",null,null,null,null,"","",null,3]
["",null,null,"",null,"",null,"",null,"","",null,null,null,null,"","",null,3]
["",null,null,"",null,"",null,"",null,"","",null,null,null,null,"","",null,3]
["",null,null,"",null,"",null,"",null,"","",null,null,null,null,"","",null,3]
["",null,null,"",null,"",null,"",null,"","",null,null,null,null,"","",null,3]
["",null,null,"",null,"",null,"",null,"","",null,null,null,null,"","",null,3]
["",null,null,"",null,"",null,"",null,"","",null,null,null,null,{"$f":"IFERROR(ROUND(SUM(1000/M1242),2),\"\")","v":""},"",null,3]
["",null,null,"",null,"",null,"",null,"","",null,null,null,null,"","",null,3]
["",null,null,"",null,"",null,"",null,"","",null,null,null,null,"","",null,3]
["",null,null,"",null,"",null,"",null,"","",null,null,null,null,"","",null,3]
["",null,null,"",null,"",null,"",null,"","",null,null,null,null,"","",null,3]
["",null,null,"",null,"",null,"",null,"","",null,null,null,null,"","",null,3]
["",null,null,"",null,"",null,"",null,"","",null,null,null,null,"","",null,3]
["",null,null,"",null,"",null,"",null,"","",null,null,null,null,"","",null,3]
["",null,null,"",null,"",null,"",null,"","",null,null,null,null,"","",null,3]
["",null,null,"",null,"",null,"",null,"","",null,null,null,null,"","",null,3]
["",null,null,"",null,"",null,"",null,"","",null,null,null,null,"","",null,3]
["",null,null,"",null,"",null,"",null,"","",null,null,null,null,"","",null,3]
["",null,null,"",null,"",null,"",null,"","",null,null,null,null,"","",null,3]
["",null,null,"",null,"",null,"",null,"","",null,null,null,null,"","",null,3]
["",null,null,"",null,"",null,"",null,"","",null,null,null,null,"","",null,3]
["",null,null,"",null,"",null,"",null,"","",null,null,null,null,"","",null,3]
["",null,null,"",null,"",null,"",null,"","",null,null,null,null,"","",null,3]
["",null,null,"",null,"",null,"",null,"","",null,null,null,null,"","",null,3]
["",null,null,"",null,"",null,"",null,"","",null,null,null,null,"","",null,3]
["",null,null,"",null,"",null,"",null,"","",null,null,null,null,"","",null,3]
["",null,null,"",null,"",null,"",null,"","",null,null,null,null,"","",null,3]
["",null,null,"",null,"",null,"",null,"","",null,null,null,null,"","",null,3]
["",null,null,"",null,"",null,"",null,"","",null,null,null,null,"","",null,3]
["",null,null,"",null,"",null,"",null,"","",null,null,null,null,"","",null,3]
["",null,null,"",null,"",null,"",null,"","",null,null,null,null,"","",null,3]
["",null,null,"",null,"",null,"",null,"","",null,null,null,null,"","",null,3]
["",null,null,"",null,"",null,"",null,"","",null,null,null,null,"","",null,3]
["",null,null,"",null,"",null,"",null,"","",null,null,null,null,"","",null,3]
["",null,null,"",null,"",null,"",null,"","",null,null,null,null,"","",null,3]
["",null,null,"",null,"",null,"",null,"","",null,null,null,null,"","",null,3]
["",null,null,"",null,"",null,"",null,"","",null,null,null,null,"","",null,3]
["",null,null,"",null,"",null,"",null,"","",null,null,null,null,"","",null,3]
["",null,null,"",null,"",null,"",null,"","",null,null,null,null,"","",null,3]
["",null,null,"",null,"",null,"",null,"","",null,null,null,null,"","",null,3]
["",null,null,"",null,"",null,"",null,"","",null,null,null,null,"","",null,3]
["",null,null,"",null,"",null,"",null,"","",null,null,null,null,"","",null,3]
["",null,null,"",null,"",null,"",null,"","",null,null,null,null,"","",null,3]
["",null,null,"",null,"",null,"",null,"","",null,null,null,null,"","",null,3]
["",null,null,"",null,"",null,"",null,"","",null,null,null,null,"","",null,3]
["",null,null,"",null,"",null,"",null,"","",null,null,null,null,"","",null,3]
["",null,null,"",null,"",null,"",null,"","",null,null,null,null,"","",null,3]
["",null,null,"",null,"",null,"",null,"","",null,null,null,null,"","",null,3]
[{"$f":"IF(E1284=\"\",\"\",IF(A1284=\"\",TODAY(),A1284))","v":""},null,null,{"$f":"IF(B1284=\"\",\"\",(C1284-B1284))","v":""},null,{"$f":"IFERROR(VLOOKUP(E1284,$AJ$2:$AL$316,2,FALSE),\"\")","v":""},null,{"$f":"IFERROR(G1284/D1284/24,\"\")","v":""},null,{"$f":"IFERROR(I1284/D1284/24,\"\")","v":""},{"$f":"IFERROR(L1284/D1284/24,\"\")","v":""},null,null,null,null,"","",null,3]
["",null,null,"",null,"",null,"",null,"","",null,null,null,null,"",{"$f":"IFERROR(ROUND(SUM(L1285*P1285),2),\"\")","v":""},null,3]
["",null,null,"",null,"",null,"",null,"","",null,null,null,null,"","",null,3]
["",null,null,"",null,"",null,"",null,"","",null,null,null,null,"","",null,3]
["",null,null,"",null,"",null,"",null,"","",null,null,null,null,"","",null,3]
["",null,null,"",null,"",null,"",null,"","",null,null,null,null,"","",null,3]
["",null,null,"",null,"",null,"",null,"","",null,null,null,null,"","",null,3]
["",null,null,"",null,"",null,"",null,"","",null,null,null,null,"","",null,3]
["",null,null,"",null,"",null,"",null,"","",null,null,null,null,"","",null,3]
["",null,null,"",null,"",null,"",null,"","",null,null,null,null,"","",null,3]
["",null,null,"",null,"",null,"",null,"","",null,null,null,null,"","",null,3]
["",null,null,"",null,"",null,"",null,"","",null,null,null,null,"","",null,3]
["",null,null,"",null,"",null,"",null,"","",null,null,null,null,"","",null,3]
["",null,null,"",null,"",null,"",null,"","",null,null,null,null,"","",null,3]
["",null,null,"",null,"",null,"",null,"","",null,null,null,null,"","",null,3]
["",null,null,"",null,"",null,"",null,"","",null,null,null,null,"","",null,3]
["",null,null,"",null,"",null,"",null,"","",null,null,null,null,"","",null,3]
["",null,null,"",null,"",null,"",null,"","",null,null,null,null,"","",null,3]
["",null,null,"",null,"",null,"",null,"","",null,null,null,null,"","",null,3]
["",null,null,"",null,"",null,"",null,"","",null,null,null,null,"","",null,3]
["",null,null,"",null,"",null,"",null,"","",null,null,null,null,"","",null,3]
["",null,null,"",null,"",null,"",null,"","",null,null,null,null,"","",null,3]
["",null,null,"",null,"",null,"",null,"","",null,null,null,null,{"$f":"IFERROR(ROUND(SUM(1000/M1306),2),\"\")","v":""},"",null,3]
["",null,null,"",null,"",null,"",null,"","",null,null,null,null,"","",null,3]
["",null,null,"",null,"",null,"",null,"","",null,null,null,null,"","",null,3]
["",null,null,"",null,"",null,"",null,"","",null,null,null,null,"","",null,3]
["",null,null,"",null,"",null,"",null,"","",null,null,null,null,"","",null,3]
["",null,null,"",null,"",null,"",null,"","",null,null,null,null,"","",null,3]
["",null,null,"",null,"",null,"",null,"","",null,null,null,null,"","",null,3]
["",null,null,"",null,"",null,"",null,"","",null,null,null,null,"","",null,3]
["",null,null,"",null,"",null,"",null,"","",null,null,null,null,"","",null,3]
["",null,null,"",null,"",null,"",null,"","",null,null,null,null,"","",null,3]
["",null,null,"",null,"",null,"",null,"","",null,null,null,null,"","",null,3]
["",null,null,"",null,"",null,"",null,"","",null,null,null,null,"","",null,3]
["",null,null,"",null,"",null,"",null,"","",null,null,null,null,"","",null,3]
["",null,null,"",null,"",null,"",null,"","",null,null,null,null,"","",null,3]
["",null,null,"",null,"",null,"",null,"","",null,null,null,null,"","",null,3]
["",null,null,"",null,"",null,"",null,"","",null,null,null,null,"","",null,3]
["",null,null,"",null,"",null,"",null,"","",null,null,null,null,"","",null,3]
["",null,null,"",null,"",null,"",null,"","",null,null,null,null,"","",null,3]
["",null,null,"",null,"",null,"",null,"","",null,null,null,null,"","",null,3]
["",null,null,"",null,"",null,"",null,"","",null,null,null,null,"","",null,3]
["",null,null,"",null,"",null,"",null,"","",null,null,null,null,"","",null,3]
["",null,null,"",null,"",null,"",null,"","",null,null,null,null,"","",null,3]
["",null,null,"",null,"",null,"",null,"","",null,null,null,null,"","",null,3]
["",null,null,"",null,"",null,"",null,"","",null,null,null,null,"","",null,3]
["",null,null,"",null,"",null,"",null,"","",null,null,null,null,"","",null,3]
["",null,null,"",null,"",null,"",null,"","",null,null,null,null,"","",null,3]
["",null,null,"",null,"",null,"",null,"","",null,null,null,null,"","",null,3]
["",null,null,"",null,"",null,"",null,"","",null,null,null,null,"","",null,3]
["",null,null,"",null,"",null,"",null,"","",null,null,null,null,"","",null,3]
["",null,null,"",null,"",null,"",null,"","",null,null,null,null,"","",null,3]
["",null,null,"",null,"",null,"",null,"","",null,null,null,null,"","",null,3]
["",null,null,"",null,"",null,"",null,"","",null,null,null,null,"","",null,3]
["",null,null,"",null,"",null,"",null,"","",null,null,null,null,"","",null,3]
["",null,null,"",null,"",null,"",null,"","",null,null,null,null,"","",null,3]
["",null,null,"",null,"",null,"",null,"","",null,null,null,null,"","",null,3]
["",null,null,"",null,"",null,"",null,"","",null,null,null,null,"","",null,3]
["",null,null,"",null,"",null,"",null,"","",null,null,null,null,"","",null,3]
["",null,null,"",null,"",null,"",null,"","",null,null,null,null,"","",null,3]
["",null,null,"",null,"",null,"",null,"","",null,null,null,null,"","",null,3]
["",null,null,"",null,"",null,"",null,"","",null,null,null,null,"","",null,3]
["",null,null,"",null,"",null,"",null,"","",null,null,null,null,"","",null,3]
["",null,null,"",null,"",null,"",null,"","",null,null,null,null,"","",null,3]
[{"$f":"IF(E1348=\"\",\"\",IF(A1348=\"\",TODAY(),A1348))","v":""},null,null,{"$f":"IF(B1348=\"\",\"\",(C1348-B1348))","v":""},null,{"$f":"IFERROR(VLOOKUP(E1348,$AJ$2:$AL$316,2,FALSE),\"\")","v":""},null,{"$f":"IFERROR(G1348/D1348/24,\"\")","v":""},null,{"$f":"IFERROR(I1348/D1348/24,\"\")","v":""},{"$f":"IFERROR(L1348/D1348/24,\"\")","v":""},null,null,null,null,"","",null,3]
["",null,null,"",null,"",null,"",null,"","",null,null,null,null,"",{"$f":"IFERROR(ROUND(SUM(L1349*P1349),2),\"\")","v":""},null,3]
["",null,null,"",null,"",null,"",null,"","",null,null,null,null,"","",null,3]
["",null,null,"",null,"",null,"",null,"","",null,null,null,null,"","",null,3]
["",null,null,"",null,"",null,"",null,"","",null,null,null,null,"","",null,3]
["",null,null,"",null,"",null,"",null,"","",null,null,null,null,"","",null,3]
["",null,null,"",null,"",null,"",null,"","",null,null,null,null,"","",null,3]
["",null,null,"",null,"",null,"",null,"","",null,null,null,null,"","",null,3]
["",null,null,"",null,"",null,"",null,"","",null,null,null,null,"","",null,3]
["",null,null,"",null,"",null,"",null,"","",null,null,null,null,"","",null,3]
["",null,null,"",null,"",null,"",null,"","",null,null,null,null,"","",null,3]
["",null,null,"",null,"",null,"",null,"","",null,null,null,null,"","",null,3]
["",null,null,"",null,"",null,"",null,"","",null,null,null,null,"","",null,3]
["",null,null,"",null,"",null,"",null,"","",null,null,null,null,"","",null,3]
["",null,null,"",null,"",null,"",null,"","",null,null,null,null,"","",null,3]
["",null,null,"",null,"",null,"",null,"","",null,null,null,null,"","",null,3]
["",null,null,"",null,"",null,"",null,"","",null,null,null,null,"","",null,3]
["",null,null,"",null,"",null,"",null,"","",null,null,null,null,"","",null,3]
["",null,null,"",null,"",null,"",null,"","",null,null,null,null,"","",null,3]
["",null,null,"",null,"",null,"",null,"","",null,null,null,null,"","",null,3]
["",null,null,"",null,"",null,"",null,"","",null,null,null,null,"","",null,3]
["",null,null,"",null,"",null,"",null,"","",null,null,null,null,"","",null,3]
["",null,null,"",null,"",null,"",null,"","",null,null,null,null,{"$f":"IFERROR(ROUND(SUM(1000/M1370),2),\"\")","v":""},"",null,3]
["",null,null,"",null,"",null,"",null,"","",null,null,null,null,"","",null,3]
["",null,null,"",null,"",null,"",null,"","",null,null,null,null,"","",null,3]
["",null,null,"",null,"",null,"",null,"","",null,null,null,null,"","",null,3]
["",null,null,"",null,"",null,"",null,"","",null,null,null,null,"","",null,3]
["",null,null,"",null,"",null,"",null,"","",null,null,null,null,"","",null,3]
["",null,null,"",null,"",null,"",null,"","",null,null,null,null,"","",null,3]
["",null,null,"",null,"",null,"",null,"","",null,null,null,null,"","",null,3]
["",null,null,"",null,"",null,"",null,"","",null,null,null,null,"","",null,3]
["",null,null,"",null,"",null,"",null,"","",null,null,null,null,"","",null,3]
["",null,null,"",null,"",null,"",null,"","",null,null,null,null,"","",null,3]
["",null,null,"",null,"",null,"",null,"","",null,null,null,null,"","",null,3]
["",null,null,"",null,"",null,"",null,"","",null,null,null,null,"","",null,3]
["",null,null,"",null,"",null,"",null,"","",null,null,null,null,"","",null,3]
["",null,null,"",null,"",null,"",null,"","",null,null,null,null,"","",null,3]
["",null,null,"",null,"",null,"",null,"","",null,null,null,null,"","",null,3]
["",null,null,"",null,"",null,"",null,"","",null,null,null,null,"","",null,3]
["",null,null,"",null,"",null,"",null,"","",null,null,null,null,"","",null,3]
["",null,null,"",null,"",null,"",null,"","",null,null,null,null,"","",null,3]
["",null,null,"",null,"",null,"",null,"","",null,null,null,null,"","",null,3]
["",null,null,"",null,"",null,"",null,"","",null,null,null,null,"","",null,3]
["",null,null,"",null,"",null,"",null,"","",null,null,null,null,"","",null,3]
["",null,null,"",null,"",null,"",null,"","",null,null,null,null,"","",null,3]
["",null,null,"",null,"",null,"",null,"","",null,null,null,null,"","",null,3]
["",null,null,"",null,"",null,"",null,"","",null,null,null,null,"","",null,3]
["",null,null,"",null,"",null,"",null,"","",null,null,null,null,"","",null,3]
["",null,null,"",null,"",null,"",null,"","",null,null,null,null,"","",null,3]
["",null,null,"",null,"",null,"",null,"","",null,null,null,null,"","",null,3]
["",null,null,"",null,"",null,"",null,"","",null,null,null,null,"","",null,3]
["",null,null,"",null,"",null,"",null,"","",null,null,null,null,"","",null,3]
["",null,null,"",null,"",null,"",null,"","",null,null,null,null,"","",null,3]
["",null,null,"",null,"",null,"",null,"","",null,null,null,null,"","",null,3]
["",null,null,"",null,"",null,"",null,"","",null,null,null,null,"","",null,3]
["",null,null,"",null,"",null,"",null,"","",null,null,null,null,"","",null,3]
["",null,null,"",null,"",null,"",null,"","",null,null,null,null,"","",null,3]
["",null,null,"",null,"",null,"",null,"","",null,null,null,null,"","",null,3]
["",null,null,"",null,"",null,"",null,"","",null,null,null,null,"","",null,3]
["",null,null,"",null,"",null,"",null,"","",null,null,null,null,"","",null,3]
["",null,null,"",null,"",null,"",null,"","",null,null,null,null,"","",null,3]
["",null,null,"",null,"",null,"",null,"","",null,null,null,null,"","",null,3]
["",null,null,"",null,"",null,"",null,"","",null,null,null,null,"","",null,3]
["",null,null,"",null,"",null,"",null,"","",null,null,null,null,"","",null,3]
[{"$f":"IF(E1412=\"\",\"\",IF(A1412=\"\",TODAY(),A1412))","v":""},null,null,{"$f":"IF(B1412=\"\",\"\",(C1412-B1412))","v":""},null,{"$f":"IFERROR(VLOOKUP(E1412,$AJ$2:$AL$316,2,FALSE),\"\")","v":""},null,{"$f":"IFERROR(G1412/D1412/24,\"\")","v":""},null,{"$f":"IFERROR(I1412/D1412/24,\"\")","v":""},{"$f":"IFERROR(L1412/D1412/24,\"\")","v":""},null,null,null,null,"","",null,3]
["",null,null,"",null,"",null,"",null,"","",null,null,null,null,"",{"$f":"IFERROR(ROUND(SUM(L1413*P1413),2),\"\")","v":""},null,3]
["",null,null,"",null,"",null,"",null,"","",null,null,null,null,"","",null,3]
["",null,null,"",null,"",null,"",null,"","",null,null,null,null,"","",null,3]
["",null,null,"",null,"",null,"",null,"","",null,null,null,null,"","",null,3]
["",null,null,"",null,"",null,"",null,"","",null,null,null,null,"","",null,3]
["",null,null,"",null,"",null,"",null,"","",null,null,null,null,"","",null,3]
["",null,null,"",null,"",null,"",null,"","",null,null,null,null,"","",null,3]
["",null,null,"",null,"",null,"",null,"","",null,null,null,null,"","",null,3]
["",null,null,"",null,"",null,"",null,"","",null,null,null,null,"","",null,3]
["",null,null,"",null,"",null,"",null,"","",null,null,null,null,"","",null,3]
["",null,null,"",null,"",null,"",null,"","",null,null,null,null,"","",null,3]
["",null,null,"",null,"",null,"",null,"","",null,null,null,null,"","",null,3]
["",null,null,"",null,"",null,"",null,"","",null,null,null,null,"","",null,3]
["",null,null,"",null,"",null,"",null,"","",null,null,null,null,"","",null,3]
["",null,null,"",null,"",null,"",null,"","",null,null,null,null,"","",null,3]
["",null,null,"",null,"",null,"",null,"","",null,null,null,null,"","",null,3]
["",null,null,"",null,"",null,"",null,"","",null,null,null,null,"","",null,3]
["",null,null,"",null,"",null,"",null,"","",null,null,null,null,"","",null,3]
["",null,null,"",null,"",null,"",null,"","",null,null,null,null,"","",null,3]
["",null,null,"",null,"",null,"",null,"","",null,null,null,null,"","",null,3]
["",null,null,"",null,"",null,"",null,"","",null,null,null,null,"","",null,3]
["",null,null,"",null,"",null,"",null,"","",null,null,null,null,{"$f":"IFERROR(ROUND(SUM(1000/M1434),2),\"\")","v":""},"",null,3]
["",null,null,"",null,"",null,"",null,"","",null,null,null,null,"","",null,3]
["",null,null,"",null,"",null,"",null,"","",null,null,null,null,"","",null,3]
["",null,null,"",null,"",null,"",null,"","",null,null,null,null,"","",null,3]
["",null,null,"",null,"",null,"",null,"","",null,null,null,null,"","",null,3]
["",null,null,"",null,"",null,"",null,"","",null,null,null,null,"","",null,3]
["",null,null,"",null,"",null,"",null,"","",null,null,null,null,"","",null,3]
["",null,null,"",null,"",null,"",null,"","",null,null,null,null,"","",null,3]
["",null,null,"",null,"",null,"",null,"","",null,null,null,null,"","",null,3]
["",null,null,"",null,"",null,"",null,"","",null,null,null,null,"","",null,3]
["",null,null,"",null,"",null,"",null,"","",null,null,null,null,"","",null,3]
["",null,null,"",null,"",null,"",null,"","",null,null,null,null,"","",null,3]
["",null,null,"",null,"",null,"",null,"","",null,null,null,null,"","",null,3]
["",null,null,"",null,"",null,"",null,"","",null,null,null,null,"","",null,3]
["",null,null,"",null,"",null,"",null,"","",null,null,null,null,"","",null,3]
["",null,null,"",null,"",null,"",null,"","",null,null,null,null,"","",null,3]
["",null,null,"",null,"",null,"",null,"","",null,null,null,null,"","",null,3]
["",null,null,"",null,"",null,"",null,"","",null,null,null,null,"","",null,3]
["",null,null,"",null,"",null,"",null,"","",null,null,null,null,"","",null,3]
["",null,null,"",null,"",null,"",null,"","",null,null,null,null,"","",null,3]
["",null,null,"",null,"",null,"",null,"","",null,null,null,null,"","",null,3]
["",null,null,"",null,"",null,"",null,"","",null,null,null,null,"","",null,3]
["",null,null,"",null,"",null,"",null,"","",null,null,null,null,"","",null,3]
["",null,null,"",null,"",null,"",null,"","",null,null,null,null,"","",null,3]
["",null,null,"",null,"",null,"",null,"","",null,null,null,null,"","",null,3]
["",null,null,"",null,"",null,"",null,"","",null,null,null,null,"","",null,3]
["",null,null,"",null,"",null,"",null,"","",null,null,null,null,"","",null,3]
["",null,null,"",null,"",null,"",null,"","",null,null,null,null,"","",null,3]
["",null,null,"",null,"",null,"",null,"","",null,null,null,null,"","",null,3]
["",null,null,"",null,"",null,"",null,"","",null,null,null,null,"","",null,3]
["",null,null,"",null,"",null,"",null,"","",null,null,null,null,"","",null,3]
["",null,null,"",null,"",null,"",null,"","",null,null,null,null,"","",null,3]
["",null,null,"",null,"",null,"",null,"","",null,null,null,null,"","",null,3]
["",null,null,"",null,"",null,"",null,"","",null,null,null,null,"","",null,3]
["",null,null,"",null,"",null,"",null,"","",null,null,null,null,"","",null,3]
["",null,null,"",null,"",null,"",null,"","",null,null,null,null,"","",null,3]
["",null,null,"",null,"",null,"",null,"","",null,null,null,null,"","",null,3]
["",null,null,"",null,"",null,"",null,"","",null,null,null,null,"","",null,3]
["",null,null,"",null,"",null,"",null,"","",null,null,null,null,"","",null,3]
["",null,null,"",null,"",null,"",null,"","",null,null,null,null,"","",null,3]
["",null,null,"",null,"",null,"",null,"","",null,null,null,null,"","",null,3]
["",null,null,"",null,"",null,"",null,"","",null,null,null,null,"","",null,3]
[{"$f":"IF(E1476=\"\",\"\",IF(A1476=\"\",TODAY(),A1476))","v":""},null,null,{"$f":"IF(B1476=\"\",\"\",(C1476-B1476))","v":""},null,{"$f":"IFERROR(VLOOKUP(E1476,$AJ$2:$AL$316,2,FALSE),\"\")","v":""},null,{"$f":"IFERROR(G1476/D1476/24,\"\")","v":""},null,{"$f":"IFERROR(I1476/D1476/24,\"\")","v":""},{"$f":"IFERROR(L1476/D1476/24,\"\")","v":""},null,null,null,null,"","",null,3]
["",null,null,"",null,"",null,"",null,"","",null,null,null,null,"",{"$f":"IFERROR(ROUND(SUM(L1477*P1477),2),\"\")","v":""},null,3]
["",null,null,"",null,"",null,"",null,"","",null,null,null,null,"","",null,3]
["",null,null,"",null,"",null,"",null,"","",null,null,null,null,"","",null,3]
["",null,null,"",null,"",null,"",null,"","",null,null,null,null,"","",null,3]
["",null,null,"",null,"",null,"",null,"","",null,null,null,null,"","",null,3]
["",null,null,"",null,"",null,"",null,"","",null,null,null,null,"","",null,3]
["",null,null,"",null,"",null,"",null,"","",null,null,null,null,"","",null,3]
["",null,null,"",null,"",null,"",null,"","",null,null,null,null,"","",null,3]
["",null,null,"",null,"",null,"",null,"","",null,null,null,null,"","",null,3]
["",null,null,"",null,"",null,"",null,"","",null,null,null,null,"","",null,3]
["",null,null,"",null,"",null,"",null,"","",null,null,null,null,"","",null,3]
["",null,null,"",null,"",null,"",null,"","",null,null,null,null,"","",null,3]
["",null,null,"",null,"",null,"",null,"","",null,null,null,null,"","",null,3]
["",null,null,"",null,"",null,"",null,"","",null,null,null,null,"","",null,3]
["",null,null,"",null,"",null,"",null,"","",null,null,null,null,"","",null,3]
["",null,null,"",null,"",null,"",null,"","",null,null,null,null,"","",null,3]
["",null,null,"",null,"",null,"",null,"","",null,null,null,null,"","",null,3]
["",null,null,"",null,"",null,"",null,"","",null,null,null,null,"","",null,3]
["",null,null,"",null,"",null,"",null,"","",null,null,null,null,"","",null,3]
["",null,null,"",null,"",null,"",null,"","",null,null,null,null,"","",null,3]
["",null,null,"",null,"",null,"",null,"","",null,null,null,null,"","",null,3]
["",null,null,"",null,"",null,"",null,"","",null,null,null,null,{"$f":"IFERROR(ROUND(SUM(1000/M1498),2),\"\")","v":""},"",null,3]
["",null,null,"",null,"",null,"",null,"","",null,null,null,null,"","",null,3]
["",null,null,"",null,"",null,"",null,"","",null,null,null,null,"","",null,3]
["",null,null,"",null,"",null,"",null,"","",null,null,null,null,"","",null,3]
["",null,null,"",null,"",null,"",null,"","",null,null,null,null,"","",null,3]
["",null,null,"",null,"",null,"",null,"","",null,null,null,null,"","",null,3]
["",null,null,"",null,"",null,"",null,"","",null,null,null,null,"","",null,3]
["",null,null,"",null,"",null,"",null,"","",null,null,null,null,"","",null,3]
["",null,null,"",null,"",null,"",null,"","",null,null,null,null,"","",null,3]
["",null,null,"",null,"",null,"",null,"","",null,null,null,null,"","",null,3]
["",null,null,"",null,"",null,"",null,"","",null,null,null,null,"","",null,3]
["",null,null,"",null,"",null,"",null,"","",null,null,null,null,"","",null,3]
["",null,null,"",null,"",null,"",null,"","",null,null,null,null,"","",null,3]
["",null,null,"",null,"",null,"",null,"","",null,null,null,null,"","",null,3]
["",null,null,"",null,"",null,"",null,"","",null,null,null,null,"","",null,3]
["",null,null,"",null,"",null,"",null,"","",null,null,null,null,"","",null,3]
["",null,null,"",null,"",null,"",null,"","",null,null,null,null,"","",null,3]
["",null,null,"",null,"",null,"",null,"","",null,null,null,null,"","",null,3]
["",null,null,"",null,"",null,"",null,"","",null,null,null,null,"","",null,3]
["",null,null,"",null,"",null,"",null,"","",null,null,null,null,"","",null,3]
["",null,null,"",null,"",null,"",null,"","",null,null,null,null,"","",null,3]
["",null,null,"",null,"",null,"",null,"","",null,null,null,null,"","",null,3]
["",null,null,"",null,"",null,"",null,"","",null,null,null,null,"","",null,3]
["",null,null,"",null,"",null,"",null,"","",null,null,null,null,"","",null,3]
["",null,null,"",null,"",null,"",null,"","",null,null,null,null,"","",null,3]
["",null,null,"",null,"",null,"",null,"","",null,null,null,null,"","",null,3]
["",null,null,"",null,"",null,"",null,"","",null,null,null,null,"","",null,3]
["",null,null,"",null,"",null,"",null,"","",null,null,null,null,"","",null,3]
["",null,null,"",null,"",null,"",null,"","",null,null,null,null,"","",null,3]
["",null,null,"",null,"",null,"",null,"","",null,null,null,null,"","",null,3]
["",null,null,"",null,"",null,"",null,"","",null,null,null,null,"","",null,3]
["",null,null,"",null,"",null,"",null,"","",null,null,null,null,"","",null,3]
["",null,null,"",null,"",null,"",null,"","",null,null,null,null,"","",null,3]
["",null,null,"",null,"",null,"",null,"","",null,null,null,null,"","",null,3]
["",null,null,"",null,"",null,"",null,"","",null,null,null,null,"","",null,3]
["",null,null,"",null,"",null,"",null,"","",null,null,null,null,"","",null,3]
["",null,null,"",null,"",null,"",null,"","",null,null,null,null,"","",null,3]
["",null,null,"",null,"",null,"",null,"","",null,null,null,null,"","",null,3]
["",null,null,"",null,"",null,"",null,"","",null,null,null,null,"","",null,3]
["",null,null,"",null,"",null,"",null,"","",null,null,null,null,"","",null,3]
["",null,null,"",null,"",null,"",null,"","",null,null,null,null,"","",null,3]
["",null,null,"",null,"",null,"",null,"","",null,null,null,null,"","",null,3]
[{"$f":"IF(E1540=\"\",\"\",IF(A1540=\"\",TODAY(),A1540))","v":""},null,null,{"$f":"IF(B1540=\"\",\"\",(C1540-B1540))","v":""},null,{"$f":"IFERROR(VLOOKUP(E1540,$AJ$2:$AL$316,2,FALSE),\"\")","v":""},null,{"$f":"IFERROR(G1540/D1540/24,\"\")","v":""},null,{"$f":"IFERROR(I1540/D1540/24,\"\")","v":""},{"$f":"IFERROR(L1540/D1540/24,\"\")","v":""},null,null,null,null,"","",null,3]
["",null,null,"",null,"",null,"",null,"","",null,null,null,null,"",{"$f":"IFERROR(ROUND(SUM(L1541*P1541),2),\"\")","v":""},null,3]
["",null,null,"",null,"",null,"",null,"","",null,null,null,null,"","",null,3]
["",null,null,"",null,"",null,"",null,"","",null,null,null,null,"","",null,3]
["",null,null,"",null,"",null,"",null,"","",null,null,null,null,"","",null,3]
["",null,null,"",null,"",null,"",null,"","",null,null,null,null,"","",null,3]
["",null,null,"",null,"",null,"",null,"","",null,null,null,null,"","",null,3]
["",null,null,"",null,"",null,"",null,"","",null,null,null,null,"","",null,3]
["",null,null,"",null,"",null,"",null,"","",null,null,null,null,"","",null,3]
["",null,null,"",null,"",null,"",null,"","",null,null,null,null,"","",null,3]
["",null,null,"",null,"",null,"",null,"","",null,null,null,null,"","",null,3]
["",null,null,"",null,"",null,"",null,"","",null,null,null,null,"","",null,3]
["",null,null,"",null,"",null,"",null,"","",null,null,null,null,"","",null,3]
["",null,null,"",null,"",null,"",null,"","",null,null,null,null,"","",null,3]
["",null,null,"",null,"",null,"",null,"","",null,null,null,null,"","",null,3]
["",null,null,"",null,"",null,"",null,"","",null,null,null,null,"","",null,3]
["",null,null,"",null,"",null,"",null,"","",null,null,null,null,"","",null,3]
["",null,null,"",null,"",null,"",null,"","",null,null,null,null,"","",null,3]
["",null,null,"",null,"",null,"",null,"","",null,null,null,null,"","",null,3]
["",null,null,"",null,"",null,"",null,"","",null,null,null,null,"","",null,3]
["",null,null,"",null,"",null,"",null,"","",null,null,null,null,"","",null,3]
["",null,null,"",null,"",null,"",null,"","",null,null,null,null,"","",null,3]
["",null,null,"",null,"",null,"",null,"","",null,null,null,null,{"$f":"IFERROR(ROUND(SUM(1000/M1562),2),\"\")","v":""},"",null,3]
["",null,null,"",null,"",null,"",null,"","",null,null,null,null,"","",null,3]
["",null,null,"",null,"",null,"",null,"","",null,null,null,null,"","",null,3]
["",null,null,"",null,"",null,"",null,"","",null,null,null,null,"","",null,3]
["",null,null,"",null,"",null,"",null,"","",null,null,null,null,"","",null,3]
["",null,null,"",null,"",null,"",null,"","",null,null,null,null,"","",null,3]
["",null,null,"",null,"",null,"",null,"","",null,null,null,null,"","",null,3]
["",null,null,"",null,"",null,"",null,"","",null,null,null,null,"","",null,3]
["",null,null,"",null,"",null,"",null,"","",null,null,null,null,"","",null,3]
["",null,null,"",null,"",null,"",null,"","",null,null,null,null,"","",null,3]
["",null,null,"",null,"",null,"",null,"","",null,null,null,null,"","",null,3]
["",null,null,"",null,"",null,"",null,"","",null,null,null,null,"","",null,3]
["",null,null,"",null,"",null,"",null,"","",null,null,null,null,"","",null,3]
["",null,null,"",null,"",null,"",null,"","",null,null,null,null,"","",null,3]
["",null,null,"",null,"",null,"",null,"","",null,null,null,null,"","",null,3]
["",null,null,"",null,"",null,"",null,"","",null,null,null,null,"","",null,3]
["",null,null,"",null,"",null,"",null,"","",null,null,null,null,"","",null,3]
["",null,null,"",null,"",null,"",null,"","",null,null,null,null,"","",null,3]
["",null,null,"",null,"",null,"",null,"","",null,null,null,null,"","",null,3]
["",null,null,"",null,"",null,"",null,"","",null,null,null,null,"","",null,3]
["",null,null,"",null,"",null,"",null,"","",null,null,null,null,"","",null,3]
["",null,null,"",null,"",null,"",null,"","",null,null,null,null,"","",null,3]
["",null,null,"",null,"",null,"",null,"","",null,null,null,null,"","",null,3]
["",null,null,"",null,"",null,"",null,"","",null,null,null,null,"","",null,3]
["",null,null,"",null,"",null,"",null,"","",null,null,null,null,"","",null,3]
["",null,null,"",null,"",null,"",null,"","",null,null,null,null,"","",null,3]
["",null,null,"",null,"",null,"",null,"","",null,null,null,null,"","",null,3]
["",null,null,"",null,"",null,"",null,"","",null,null,null,null,"","",null,3]
["",null,null,"",null,"",null,"",null,"","",null,null,null,null,"","",null,3]
["",null,null,"",null,"",null,"",null,"","",null,null,null,null,"","",null,3]
["",null,null,"",null,"",null,"",null,"","",null,null,null,null,"","",null,3]
["",null,null,"",null,"",null,"",null,"","",null,null,null,null,"","",null,3]
["",null,null,"",null,"",null,"",null,"","",null,null,null,null,"","",null,3]
["",null,null,"",null,"",null,"",null,"","",null,null,null,null,"","",null,3]
["",null,null,"",null,"",null,"",null,"","",null,null,null,null,"","",null,3]
["",null,null,"",null,"",null,"",null,"","",null,null,null,null,"","",null,3]
["",null,null,"",null,"",null,"",null,"","",null,null,null,null,"","",null,3]
["",null,null,"",null,"",null,"",null,"","",null,null,null,null,"","",null,3]
["",null,null,"",null,"",null,"",null,"","",null,null,null,null,"","",null,3]
["",null,null,"",null,"",null,"",null,"","",null,null,null,null,"","",null,3]
["",null,null,"",null,"",null,"",null,"","",null,null,null,null,"","",null,3]
["",null,null,"",null,"",null,"",null,"","",null,null,null,null,"","",null,3]
[{"$f":"IF(E1604=\"\",\"\",IF(A1604=\"\",TODAY(),A1604))","v":""},null,null,{"$f":"IF(B1604=\"\",\"\",(C1604-B1604))","v":""},null,{"$f":"IFERROR(VLOOKUP(E1604,$AJ$2:$AL$316,2,FALSE),\"\")","v":""},null,{"$f":"IFERROR(G1604/D1604/24,\"\")","v":""},null,{"$f":"IFERROR(I1604/D1604/24,\"\")","v":""},{"$f":"IFERROR(L1604/D1604/24,\"\")","v":""},null,null,null,null,"","",null,3]
["",null,null,"",null,"",null,"",null,"","",null,null,null,null,"",{"$f":"IFERROR(ROUND(SUM(L1605*P1605),2),\"\")","v":""},null,3]
["",null,null,"",null,"",null,"",null,"","",null,null,null,null,"","",null,3]
["",null,null,"",null,"",null,"",null,"","",null,null,null,null,"","",null,3]
["",null,null,"",null,"",null,"",null,"","",null,null,null,null,"","",null,3]
["",null,null,"",null,"",null,"",null,"","",null,null,null,null,"","",null,3]
["",null,null,"",null,"",null,"",null,"","",null,null,null,null,"","",null,3]
["",null,null,"",null,"",null,"",null,"","",null,null,null,null,"","",null,3]
["",null,null,"",null,"",null,"",null,"","",null,null,null,null,"","",null,3]
["",null,null,"",null,"",null,"",null,"","",null,null,null,null,"","",null,3]
["",null,null,"",null,"",null,"",null,"","",null,null,null,null,"","",null,3]
["",null,null,"",null,"",null,"",null,"","",null,null,null,null,"","",null,3]
["",null,null,"",null,"",null,"",null,"","",null,null,null,null,"","",null,3]
["",null,null,"",null,"",null,"",null,"","",null,null,null,null,"","",null,3]
["",null,null,"",null,"",null,"",null,"","",null,null,null,null,"","",null,3]
["",null,null,"",null,"",null,"",null,"","",null,null,null,null,"","",null,3]
["",null,null,"",null,"",null,"",null,"","",null,null,null,null,"","",null,3]
["",null,null,"",null,"",null,"",null,"","",null,null,null,null,"","",null,3]
["",null,null,"",null,"",null,"",null,"","",null,null,null,null,"","",null,3]
["",null,null,"",null,"",null,"",null,"","",null,null,null,null,"","",null,3]
["",null,null,"",null,"",null,"",null,"","",null,null,null,null,"","",null,3]
["",null,null,"",null,"",null,"",null,"","",null,null,null,null,"","",null,3]
["",null,null,"",null,"",null,"",null,"","",null,null,null,null,{"$f":"IFERROR(ROUND(SUM(1000/M1626),2),\"\")","v":""},"",null,3]
["",null,null,"",null,"",null,"",null,"","",null,null,null,null,"","",null,3]
["",null,null,"",null,"",null,"",null,"","",null,null,null,null,"","",null,3]
["",null,null,"",null,"",null,"",null,"","",null,null,null,null,"","",null,3]
["",null,null,"",null,"",null,"",null,"","",null,null,null,null,"","",null,3]
["",null,null,"",null,"",null,"",null,"","",null,null,null,null,"","",null,3]
["",null,null,"",null,"",null,"",null,"","",null,null,null,null,"","",null,3]
["",null,null,"",null,"",null,"",null,"","",null,null,null,null,"","",null,3]
["",null,null,"",null,"",null,"",null,"","",null,null,null,null,"","",null,3]
["",null,null,"",null,"",null,"",null,"","",null,null,null,null,"","",null,3]
["",null,null,"",null,"",null,"",null,"","",null,null,null,null,"","",null,3]
["",null,null,"",null,"",null,"",null,"","",null,null,null,null,"","",null,3]
["",null,null,"",null,"",null,"",null,"","",null,null,null,null,"","",null,3]
["",null,null,"",null,"",null,"",null,"","",null,null,null,null,"","",null,3]
["",null,null,"",null,"",null,"",null,"","",null,null,null,null,"","",null,3]
["",null,null,"",null,"",null,"",null,"","",null,null,null,null,"","",null,3]
["",null,null,"",null,"",null,"",null,"","",null,null,null,null,"","",null,3]
["",null,null,"",null,"",null,"",null,"","",null,null,null,null,"","",null,3]
["",null,null,"",null,"",null,"",null,"","",null,null,null,null,"","",null,3]
["",null,null,"",null,"",null,"",null,"","",null,null,null,null,"","",null,3]
["",null,null,"",null,"",null,"",null,"","",null,null,null,null,"","",null,3]
["",null,null,"",null,"",null,"",null,"","",null,null,null,null,"","",null,3]
["",null,null,"",null,"",null,"",null,"","",null,null,null,null,"","",null,3]
["",null,null,"",null,"",null,"",null,"","",null,null,null,null,"","",null,3]
["",null,null,"",null,"",null,"",null,"","",null,null,null,null,"","",null,3]
["",null,null,"",null,"",null,"",null,"","",null,null,null,null,"","",null,3]
["",null,null,"",null,"",null,"",null,"","",null,null,null,null,"","",null,3]
["",null,null,"",null,"",null,"",null,"","",null,null,null,null,"","",null,3]
["",null,null,"",null,"",null,"",null,"","",null,null,null,null,"","",null,3]
["",null,null,"",null,"",null,"",null,"","",null,null,null,null,"","",null,3]
["",null,null,"",null,"",null,"",null,"","",null,null,null,null,"","",null,3]
["",null,null,"",null,"",null,"",null,"","",null,null,null,null,"","",null,3]
["",null,null,"",null,"",null,"",null,"","",null,null,null,null,"","",null,3]
["",null,null,"",null,"",null,"",null,"","",null,null,null,null,"","",null,3]
["",null,null,"",null,"",null,"",null,"","",null,null,null,null,"","",null,3]
["",null,null,"",null,"",null,"",null,"","",null,null,null,null,"","",null,3]
["",null,null,"",null,"",null,"",null,"","",null,null,null,null,"","",null,3]
["",null,null,"",null,"",null,"",null,"","",null,null,null,null,"","",null,3]
["",null,null,"",null,"",null,"",null,"","",null,null,null,null,"","",null,3]
["",null,null,"",null,"",null,"",null,"","",null,null,null,null,"","",null,3]
["",null,null,"",null,"",null,"",null,"","",null,null,null,null,"","",null,3]
["",null,null,"",null,"",null,"",null,"","",null,null,null,null,"","",null,3]
[{"$f":"IF(E1668=\"\",\"\",IF(A1668=\"\",TODAY(),A1668))","v":""},null,null,{"$f":"IF(B1668=\"\",\"\",(C1668-B1668))","v":""},null,{"$f":"IFERROR(VLOOKUP(E1668,$AJ$2:$AL$316,2,FALSE),\"\")","v":""},null,{"$f":"IFERROR(G1668/D1668/24,\"\")","v":""},null,{"$f":"IFERROR(I1668/D1668/24,\"\")","v":""},{"$f":"IFERROR(L1668/D1668/24,\"\")","v":""},null,null,null,null,"","",null,3]
["",null,null,"",null,"",null,"",null,"","",null,null,null,null,"",{"$f":"IFERROR(ROUND(SUM(L1669*P1669),2),\"\")","v":""},null,3]
["",null,null,"",null,"",null,"",null,"","",null,null,null,null,"","",null,3]
["",null,null,"",null,"",null,"",null,"","",null,null,null,null,"","",null,3]
["",null,null,"",null,"",null,"",null,"","",null,null,null,null,"","",null,3]
["",null,null,"",null,"",null,"",null,"","",null,null,null,null,"","",null,3]
["",null,null,"",null,"",null,"",null,"","",null,null,null,null,"","",null,3]
["",null,null,"",null,"",null,"",null,"","",null,null,null,null,"","",null,3]
["",null,null,"",null,"",null,"",null,"","",null,null,null,null,"","",null,3]
["",null,null,"",null,"",null,"",null,"","",null,null,null,null,"","",null,3]
["",null,null,"",null,"",null,"",null,"","",null,null,null,null,"","",null,3]
["",null,null,"",null,"",null,"",null,"","",null,null,null,null,"","",null,3]
["",null,null,"",null,"",null,"",null,"","",null,null,null,null,"","",null,3]
["",null,null,"",null,"",null,"",null,"","",null,null,null,null,"","",null,3]
["",null,null,"",null,"",null,"",null,"","",null,null,null,null,"","",null,3]
["",null,null,"",null,"",null,"",null,"","",null,null,null,null,"","",null,3]
["",null,null,"",null,"",null,"",null,"","",null,null,null,null,"","",null,3]
["",null,null,"",null,"",null,"",null,"","",null,null,null,null,"","",null,3]
["",null,null,"",null,"",null,"",null,"","",null,null,null,null,"","",null,3]
["",null,null,"",null,"",null,"",null,"","",null,null,null,null,"","",null,3]
["",null,null,"",null,"",null,"",null,"","",null,null,null,null,"","",null,3]
["",null,null,"",null,"",null,"",null,"","",null,null,null,null,"","",null,3]
["",null,null,"",null,"",null,"",null,"","",null,null,null,null,{"$f":"IFERROR(ROUND(SUM(1000/M1690),2),\"\")","v":""},"",null,3]
["",null,null,"",null,"",null,"",null,"","",null,null,null,null,"","",null,3]
["",null,null,"",null,"",null,"",null,"","",null,null,null,null,"","",null,3]
["",null,null,"",null,"",null,"",null,"","",null,null,null,null,"","",null,3]
["",null,null,"",null,"",null,"",null,"","",null,null,null,null,"","",null,3]
["",null,null,"",null,"",null,"",null,"","",null,null,null,null,"","",null,3]
["",null,null,"",null,"",null,"",null,"","",null,null,null,null,"","",null,3]
["",null,null,"",null,"",null,"",null,"","",null,null,null,null,"","",null,3]
["",null,null,"",null,"",null,"",null,"","",null,null,null,null,"","",null,3]
["",null,null,"",null,"",null,"",null,"","",null,null,null,null,"","",null,3]
["",null,null,"",null,"",null,"",null,"","",null,null,null,null,"","",null,3]
["",null,null,"",null,"",null,"",null,"","",null,null,null,null,"","",null,3]
["",null,null,"",null,"",null,"",null,"","",null,null,null,null,"","",null,3]
["",null,null,"",null,"",null,"",null,"","",null,null,null,null,"","",null,3]
["",null,null,"",null,"",null,"",null,"","",null,null,null,null,"","",null,3]
["",null,null,"",null,"",null,"",null,"","",null,null,null,null,"","",null,3]
["",null,null,"",null,"",null,"",null,"","",null,null,null,null,"","",null,3]
["",null,null,"",null,"",null,"",null,"","",null,null,null,null,"","",null,3]
["",null,null,"",null,"",null,"",null,"","",null,null,null,null,"","",null,3]
["",null,null,"",null,"",null,"",null,"","",null,null,null,null,"","",null,3]
["",null,null,"",null,"",null,"",null,"","",null,null,null,null,"","",null,3]
["",null,null,"",null,"",null,"",null,"","",null,null,null,null,"","",null,3]
["",null,null,"",null,"",null,"",null,"","",null,null,null,null,"","",null,3]
["",null,null,"",null,"",null,"",null,"","",null,null,null,null,"","",null,3]
["",null,null,"",null,"",null,"",null,"","",null,null,null,null,"","",null,3]
["",null,null,"",null,"",null,"",null,"","",null,null,null,null,"","",null,3]
["",null,null,"",null,"",null,"",null,"","",null,null,null,null,"","",null,3]
["",null,null,"",null,"",null,"",null,"","",null,null,null,null,"","",null,3]
["",null,null,"",null,"",null,"",null,"","",null,null,null,null,"","",null,3]
["",null,null,"",null,"",null,"",null,"","",null,null,null,null,"","",null,3]
["",null,null,"",null,"",null,"",null,"","",null,null,null,null,"","",null,3]
["",null,null,"",null,"",null,"",null,"","",null,null,null,null,"","",null,3]
["",null,null,"",null,"",null,"",null,"","",null,null,null,null,"","",null,3]
["",null,null,"",null,"",null,"",null,"","",null,null,null,null,"","",null,3]
["",null,null,"",null,"",null,"",null,"","",null,null,null,null,"","",null,3]
["",null,null,"",null,"",null,"",null,"","",null,null,null,null,"","",null,3]
["",null,null,"",null,"",null,"",null,"","",null,null,null,null,"","",null,3]
["",null,null,"",null,"",null,"",null,"","",null,null,null,null,"","",null,3]
["",null,null,"",null,"",null,"",null,"","",null,null,null,null,"","",null,3]
["",null,null,"",null,"",null,"",null,"","",null,null,null,null,"","",null,3]
["",null,null,"",null,"",null,"",null,"","",null,null,null,null,"","",null,3]
["",null,null,"",null,"",null,"",null,"","",null,null,null,null,"","",null,3]
[{"$f":"IF(E1732=\"\",\"\",IF(A1732=\"\",TODAY(),A1732))","v":""},null,null,{"$f":"IF(B1732=\"\",\"\",(C1732-B1732))","v":""},null,{"$f":"IFERROR(VLOOKUP(E1732,$AJ$2:$AL$316,2,FALSE),\"\")","v":""},null,{"$f":"IFERROR(G1732/D1732/24,\"\")","v":""},null,{"$f":"IFERROR(I1732/D1732/24,\"\")","v":""},{"$f":"IFERROR(L1732/D1732/24,\"\")","v":""},null,null,null,null,"","",null,3]
["",null,null,"",null,"",null,"",null,"","",null,null,null,null,"",{"$f":"IFERROR(ROUND(SUM(L1733*P1733),2),\"\")","v":""},null,3]
["",null,null,"",null,"",null,"",null,"","",null,null,null,null,"","",null,3]
["",null,null,"",null,"",null,"",null,"","",null,null,null,null,"","",null,3]
["",null,null,"",null,"",null,"",null,"","",null,null,null,null,"","",null,3]
["",null,null,"",null,"",null,"",null,"","",null,null,null,null,"","",null,3]
["",null,null,"",null,"",null,"",null,"","",null,null,null,null,"","",null,3]
["",null,null,"",null,"",null,"",null,"","",null,null,null,null,"","",null,3]
["",null,null,"",null,"",null,"",null,"","",null,null,null,null,"","",null,3]
["",null,null,"",null,"",null,"",null,"","",null,null,null,null,"","",null,3]
["",null,null,"",null,"",null,"",null,"","",null,null,null,null,"","",null,3]
["",null,null,"",null,"",null,"",null,"","",null,null,null,null,"","",null,3]
["",null,null,"",null,"",null,"",null,"","",null,null,null,null,"","",null,3]
["",null,null,"",null,"",null,"",null,"","",null,null,null,null,"","",null,3]
["",null,null,"",null,"",null,"",null,"","",null,null,null,null,"","",null,3]
["",null,null,"",null,"",null,"",null,"","",null,null,null,null,"","",null,3]
["",null,null,"",null,"",null,"",null,"","",null,null,null,null,"","",null,3]
["",null,null,"",null,"",null,"",null,"","",null,null,null,null,"","",null,3]
["",null,null,"",null,"",null,"",null,"","",null,null,null,null,"","",null,3]
["",null,null,"",null,"",null,"",null,"","",null,null,null,null,"","",null,3]
["",null,null,"",null,"",null,"",null,"","",null,null,null,null,"","",null,3]
["",null,null,"",null,"",null,"",null,"","",null,null,null,null,"","",null,3]
["",null,null,"",null,"",null,"",null,"","",null,null,null,null,{"$f":"IFERROR(ROUND(SUM(1000/M1754),2),\"\")","v":""},"",null,3]
["",null,null,"",null,"",null,"",null,"","",null,null,null,null,"","",null,3]
["",null,null,"",null,"",null,"",null,"","",null,null,null,null,"","",null,3]
["",null,null,"",null,"",null,"",null,"","",null,null,null,null,"","",null,3]
["",null,null,"",null,"",null,"",null,"","",null,null,null,null,"","",null,3]
["",null,null,"",null,"",null,"",null,"","",null,null,null,null,"","",null,3]
["",null,null,"",null,"",null,"",null,"","",null,null,null,null,"","",null,3]
["",null,null,"",null,"",null,"",null,"","",null,null,null,null,"","",null,3]
["",null,null,"",null,"",null,"",null,"","",null,null,null,null,"","",null,3]
["",null,null,"",null,"",null,"",null,"","",null,null,null,null,"","",null,3]
["",null,null,"",null,"",null,"",null,"","",null,null,null,null,"","",null,3]
["",null,null,"",null,"",null,"",null,"","",null,null,null,null,"","",null,3]
["",null,null,"",null,"",null,"",null,"","",null,null,null,null,"","",null,3]
["",null,null,"",null,"",null,"",null,"","",null,null,null,null,"","",null,3]
["",null,null,"",null,"",null,"",null,"","",null,null,null,null,"","",null,3]
["",null,null,"",null,"",null,"",null,"","",null,null,null,null,"","",null,3]
["",null,null,"",null,"",null,"",null,"","",null,null,null,null,"","",null,3]
["",null,null,"",null,"",null,"",null,"","",null,null,null,null,"","",null,3]
["",null,null,"",null,"",null,"",null,"","",null,null,null,null,"","",null,3]
["",null,null,"",null,"",null,"",null,"","",null,null,null,null,"","",null,3]
["",null,null,"",null,"",null,"",null,"","",null,null,null,null,"","",null,3]
["",null,null,"",null,"",null,"",null,"","",null,null,null,null,"","",null,3]
["",null,null,"",null,"",null,"",null,"","",null,null,null,null,"","",null,3]
["",null,null,"",null,"",null,"",null,"","",null,null,null,null,"","",null,3]
["",null,null,"",null,"",null,"",null,"","",null,null,null,null,"","",null,3]
["",null,null,"",null,"",null,"",null,"","",null,null,null,null,"","",null,3]
["",null,null,"",null,"",null,"",null,"","",null,null,null,null,"","",null,3]
["",null,null,"",null,"",null,"",null,"","",null,null,null,null,"","",null,3]
["",null,null,"",null,"",null,"",null,"","",null,null,null,null,"","",null,3]
["",null,null,"",null,"",null,"",null,"","",null,null,null,null,"","",null,3]
["",null,null,"",null,"",null,"",null,"","",null,null,null,null,"","",null,3]
["",null,null,"",null,"",null,"",null,"","",null,null,null,null,"","",null,3]
["",null,null,"",null,"",null,"",null,"","",null,null,null,null,"","",null,3]
["",null,null,"",null,"",null,"",null,"","",null,null,null,null,"","",null,3]
["",null,null,"",null,"",null,"",null,"","",null,null,null,null,"","",null,3]
["",null,null,"",null,"",null,"",null,"","",null,null,null,null,"","",null,3]
["",null,null,"",null,"",null,"",null,"","",null,null,null,null,"","",null,3]
["",null,null,"",null,"",null,"",null,"","",null,null,null,null,"","",null,3]
["",null,null,"",null,"",null,"",null,"","",null,null,null,null,"","",null,3]
["",null,null,"",null,"",null,"",null,"","",null,null,null,null,"","",null,3]
["",null,null,"",null,"",null,"",null,"","",null,null,null,null,"","",null,3]
["",null,null,"",null,"",null,"",null,"","",null,null,null,null,"","",null,3]
[{"$f":"IF(E1796=\"\",\"\",IF(A1796=\"\",TODAY(),A1796))","v":""},null,null,{"$f":"IF(B1796=\"\",\"\",(C1796-B1796))","v":""},null,{"$f":"IFERROR(VLOOKUP(E1796,$AJ$2:$AL$316,2,FALSE),\"\")","v":""},null,{"$f":"IFERROR(G1796/D1796/24,\"\")","v":""},null,{"$f":"IFERROR(I1796/D1796/24,\"\")","v":""},{"$f":"IFERROR(L1796/D1796/24,\"\")","v":""},null,null,null,null,"","",null,3]
["",null,null,"",null,"",null,"",null,"","",null,null,null,null,"",{"$f":"IFERROR(ROUND(SUM(L1797*P1797),2),\"\")","v":""},null,3]
["",null,null,"",null,"",null,"",null,"","",null,null,null,null,"","",null,3]
["",null,null,"",null,"",null,"",null,"","",null,null,null,null,"","",null,3]
["",null,null,"",null,"",null,"",null,"","",null,null,null,null,"","",null,3]
["",null,null,"",null,"",null,"",null,"","",null,null,null,null,"","",null,3]
["",null,null,"",null,"",null,"",null,"","",null,null,null,null,"","",null,3]
["",null,null,"",null,"",null,"",null,"","",null,null,null,null,"","",null,3]
["",null,null,"",null,"",null,"",null,"","",null,null,null,null,"","",null,3]
["",null,null,"",null,"",null,"",null,"","",null,null,null,null,"","",null,3]
["",null,null,"",null,"",null,"",null,"","",null,null,null,null,"","",null,3]
["",null,null,"",null,"",null,"",null,"","",null,null,null,null,"","",null,3]
["",null,null,"",null,"",null,"",null,"","",null,null,null,null,"","",null,3]
["",null,null,"",null,"",null,"",null,"","",null,null,null,null,"","",null,3]
["",null,null,"",null,"",null,"",null,"","",null,null,null,null,"","",null,3]
["",null,null,"",null,"",null,"",null,"","",null,null,null,null,"","",null,3]
["",null,null,"",null,"",null,"",null,"","",null,null,null,null,"","",null,3]
["",null,null,"",null,"",null,"",null,"","",null,null,null,null,"","",null,3]
["",null,null,"",null,"",null,"",null,"","",null,null,null,null,"","",null,3]
["",null,null,"",null,"",null,"",null,"","",null,null,null,null,"","",null,3]
["",null,null,"",null,"",null,"",null,"","",null,null,null,null,"","",null,3]
["",null,null,"",null,"",null,"",null,"","",null,null,null,null,"","",null,3]
["",null,null,"",null,"",null,"",null,"","",null,null,null,null,{"$f":"IFERROR(ROUND(SUM(1000/M1818),2),\"\")","v":""},"",null,3]
["",null,null,"",null,"",null,"",null,"","",null,null,null,null,"","",null,3]
["",null,null,"",null,"",null,"",null,"","",null,null,null,null,"","",null,3]
["",null,null,"",null,"",null,"",null,"","",null,null,null,null,"","",null,3]
["",null,null,"",null,"",null,"",null,"","",null,null,null,null,"","",null,3]
["",null,null,"",null,"",null,"",null,"","",null,null,null,null,"","",null,3]
["",null,null,"",null,"",null,"",null,"","",null,null,null,null,"","",null,3]
["",null,null,"",null,"",null,"",null,"","",null,null,null,null,"","",null,3]
["",null,null,"",null,"",null,"",null,"","",null,null,null,null,"","",null,3]
["",null,null,"",null,"",null,"",null,"","",null,null,null,null,"","",null,3]
["",null,null,"",null,"",null,"",null,"","",null,null,null,null,"","",null,3]
["",null,null,"",null,"",null,"",null,"","",null,null,null,null,"","",null,3]
["",null,null,"",null,"",null,"",null,"","",null,null,null,null,"","",null,3]
["",null,null,"",null,"",null,"",null,"","",null,null,null,null,"","",null,3]
["",null,null,"",null,"",null,"",null,"","",null,null,null,null,"","",null,3]
["",null,null,"",null,"",null,"",null,"","",null,null,null,null,"","",null,3]
["",null,null,"",null,"",null,"",null,"","",null,null,null,null,"","",null,3]
["",null,null,"",null,"",null,"",null,"","",null,null,null,null,"","",null,3]
["",null,null,"",null,"",null,"",null,"","",null,null,null,null,"","",null,3]
["",null,null,"",null,"",null,"",null,"","",null,null,null,null,"","",null,3]
["",null,null,"",null,"",null,"",null,"","",null,null,null,null,"","",null,3]
["",null,null,"",null,"",null,"",null,"","",null,null,null,null,"","",null,3]
["",null,null,"",null,"",null,"",null,"","",null,null,null,null,"","",null,3]
["",null,null,"",null,"",null,"",null,"","",null,null,null,null,"","",null,3]
["",null,null,"",null,"",null,"",null,"","",null,null,null,null,"","",null,3]
["",null,null,"",null,"",null,"",null,"","",null,null,null,null,"","",null,3]
["",null,null,"",null,"",null,"",null,"","",null,null,null,null,"","",null,3]
["",null,null,"",null,"",null,"",null,"","",null,null,null,null,"","",null,3]
["",null,null,"",null,"",null,"",null,"","",null,null,null,null,"","",null,3]
["",null,null,"",null,"",null,"",null,"","",null,null,null,null,"","",null,3]
["",null,null,"",null,"",null,"",null,"","",null,null,null,null,"","",null,3]
["",null,null,"",null,"",null,"",null,"","",null,null,null,null,"","",null,3]
["",null,null,"",null,"",null,"",null,"","",null,null,null,null,"","",null,3]
["",null,null,"",null,"",null,"",null,"","",null,null,null,null,"","",null,3]
["",null,null,"",null,"",null,"",null,"","",null,null,null,null,"","",null,3]
["",null,null,"",null,"",null,"",null,"","",null,null,null,null,"","",null,3]
["",null,null,"",null,"",null,"",null,"","",null,null,null,null,"","",null,3]
["",null,null,"",null,"",null,"",null,"","",null,null,null,null,"","",null,3]
["",null,null,"",null,"",null,"",null,"","",null,null,null,null,"","",null,3]
["",null,null,"",null,"",null,"",null,"","",null,null,null,null,"","",null,3]
["",null,null,"",null,"",null,"",null,"","",null,null,null,null,"","",null,3]
["",null,null,"",null,"",null,"",null,"","",null,null,null,null,"","",null,3]
[{"$f":"IF(E1860=\"\",\"\",IF(A1860=\"\",TODAY(),A1860))","v":""},null,null,{"$f":"IF(B1860=\"\",\"\",(C1860-B1860))","v":""},null,{"$f":"IFERROR(VLOOKUP(E1860,$AJ$2:$AL$316,2,FALSE),\"\")","v":""},null,{"$f":"IFERROR(G1860/D1860/24,\"\")","v":""},null,{"$f":"IFERROR(I1860/D1860/24,\"\")","v":""},{"$f":"IFERROR(L1860/D1860/24,\"\")","v":""},null,null,null,null,"","",null,3]
["",null,null,"",null,"",null,"",null,"","",null,null,null,null,"",{"$f":"IFERROR(ROUND(SUM(L1861*P1861),2),\"\")","v":""},null,3]
["",null,null,"",null,"",null,"",null,"","",null,null,null,null,"","",null,3]
["",null,null,"",null,"",null,"",null,"","",null,null,null,null,"","",null,3]
["",null,null,"",null,"",null,"",null,"","",null,null,null,null,"","",null,3]
["",null,null,"",null,"",null,"",null,"","",null,null,null,null,"","",null,3]
["",null,null,"",null,"",null,"",null,"","",null,null,null,null,"","",null,3]
["",null,null,"",null,"",null,"",null,"","",null,null,null,null,"","",null,3]
["",null,null,"",null,"",null,"",null,"","",null,null,null,null,"","",null,3]
["",null,null,"",null,"",null,"",null,"","",null,null,null,null,"","",null,3]
["",null,null,"",null,"",null,"",null,"","",null,null,null,null,"","",null,3]
["",null,null,"",null,"",null,"",null,"","",null,null,null,null,"","",null,3]
["",null,null,"",null,"",null,"",null,"","",null,null,null,null,"","",null,3]
["",null,null,"",null,"",null,"",null,"","",null,null,null,null,"","",null,3]
["",null,null,"",null,"",null,"",null,"","",null,null,null,null,"","",null,3]
["",null,null,"",null,"",null,"",null,"","",null,null,null,null,"","",null,3]
["",null,null,"",null,"",null,"",null,"","",null,null,null,null,"","",null,3]
["",null,null,"",null,"",null,"",null,"","",null,null,null,null,"","",null,3]
["",null,null,"",null,"",null,"",null,"","",null,null,null,null,"","",null,3]
["",null,null,"",null,"",null,"",null,"","",null,null,null,null,"","",null,3]
["",null,null,"",null,"",null,"",null,"","",null,null,null,null,"","",null,3]
["",null,null,"",null,"",null,"",null,"","",null,null,null,null,"","",null,3]
["",null,null,"",null,"",null,"",null,"","",null,null,null,null,{"$f":"IFERROR(ROUND(SUM(1000/M1882),2),\"\")","v":""},"",null,3]
["",null,null,"",null,"",null,"",null,"","",null,null,null,null,"","",null,3]
["",null,null,"",null,"",null,"",null,"","",null,null,null,null,"","",null,3]
["",null,null,"",null,"",null,"",null,"","",null,null,null,null,"","",null,3]
["",null,null,"",null,"",null,"",null,"","",null,null,null,null,"","",null,3]
["",null,null,"",null,"",null,"",null,"","",null,null,null,null,"","",null,3]
["",null,null,"",null,"",null,"",null,"","",null,null,null,null,"","",null,3]
["",null,null,"",null,"",null,"",null,"","",null,null,null,null,"","",null,3]
["",null,null,"",null,"",null,"",null,"","",null,null,null,null,"","",null,3]
["",null,null,"",null,"",null,"",null,"","",null,null,null,null,"","",null,3]
["",null,null,"",null,"",null,"",null,"","",null,null,null,null,"","",null,3]
["",null,null,"",null,"",null,"",null,"","",null,null,null,null,"","",null,3]
["",null,null,"",null,"",null,"",null,"","",null,null,null,null,"","",null,3]
["",null,null,"",null,"",null,"",null,"","",null,null,null,null,"","",null,3]
["",null,null,"",null,"",null,"",null,"","",null,null,null,null,"","",null,3]
["",null,null,"",null,"",null,"",null,"","",null,null,null,null,"","",null,3]
["",null,null,"",null,"",null,"",null,"","",null,null,null,null,"","",null,3]
["",null,null,"",null,"",null,"",null,"","",null,null,null,null,"","",null,3]
["",null,null,"",null,"",null,"",null,"","",null,null,null,null,"","",null,3]
["",null,null,"",null,"",null,"",null,"","",null,null,null,null,"","",null,3]
["",null,null,"",null,"",null,"",null,"","",null,null,null,null,"","",null,3]
["",null,null,"",null,"",null,"",null,"","",null,null,null,null,"","",null,3]
["",null,null,"",null,"",null,"",null,"","",null,null,null,null,"","",null,3]
["",null,null,"",null,"",null,"",null,"","",null,null,null,null,"","",null,3]
["",null,null,"",null,"",null,"",null,"","",null,null,null,null,"","",null,3]
["",null,null,"",null,"",null,"",null,"","",null,null,null,null,"","",null,3]
["",null,null,"",null,"",null,"",null,"","",null,null,null,null,"","",null,3]
["",null,null,"",null,"",null,"",null,"","",null,null,null,null,"","",null,3]
["",null,null,"",null,"",null,"",null,"","",null,null,null,null,"","",null,3]
["",null,null,"",null,"",null,"",null,"","",null,null,null,null,"","",null,3]
["",null,null,"",null,"",null,"",null,"","",null,null,null,null,"","",null,3]
["",null,null,"",null,"",null,"",null,"","",null,null,null,null,"","",null,3]
["",null,null,"",null,"",null,"",null,"","",null,null,null,null,"","",null,3]
["",null,null,"",null,"",null,"",null,"","",null,null,null,null,"","",null,3]
["",null,null,"",null,"",null,"",null,"","",null,null,null,null,"","",null,3]
["",null,null,"",null,"",null,"",null,"","",null,null,null,null,"","",null,3]
["",null,null,"",null,"",null,"",null,"","",null,null,null,null,"","",null,3]
["",null,null,"",null,"",null,"",null,"","",null,null,null,null,"","",null,3]
["",null,null,"",null,"",null,"",null,"","",null,null,null,null,"","",null,3]
["",null,null,"",null,"",null,"",null,"","",null,null,null,null,"","",null,3]
["",null,null,"",null,"",null,"",null,"","",null,null,null,null,"","",null,3]
["",null,null,"",null,"",null,"",null,"","",null,null,null,null,"","",null,3]
[{"$f":"IF(E1924=\"\",\"\",IF(A1924=\"\",TODAY(),A1924))","v":""},null,null,{"$f":"IF(B1924=\"\",\"\",(C1924-B1924))","v":""},null,{"$f":"IFERROR(VLOOKUP(E1924,$AJ$2:$AL$316,2,FALSE),\"\")","v":""},null,{"$f":"IFERROR(G1924/D1924/24,\"\")","v":""},null,{"$f":"IFERROR(I1924/D1924/24,\"\")","v":""},{"$f":"IFERROR(L1924/D1924/24,\"\")","v":""},null,null,null,null,"","",null,3]
["",null,null,"",null,"",null,"",null,"","",null,null,null,null,"",{"$f":"IFERROR(ROUND(SUM(L1925*P1925),2),\"\")","v":""},null,3]
["",null,null,"",null,"",null,"",null,"","",null,null,null,null,"","",null,3]
["",null,null,"",null,"",null,"",null,"","",null,null,null,null,"","",null,3]
["",null,null,"",null,"",null,"",null,"","",null,null,null,null,"","",null,3]
["",null,null,"",null,"",null,"",null,"","",null,null,null,null,"","",null,3]
["",null,null,"",null,"",null,"",null,"","",null,null,null,null,"","",null,3]
["",null,null,"",null,"",null,"",null,"","",null,null,null,null,"","",null,3]
["",null,null,"",null,"",null,"",null,"","",null,null,null,null,"","",null,3]
["",null,null,"",null,"",null,"",null,"","",null,null,null,null,"","",null,3]
["",null,null,"",null,"",null,"",null,"","",null,null,null,null,"","",null,3]
["",null,null,"",null,"",null,"",null,"","",null,null,null,null,"","",null,3]
["",null,null,"",null,"",null,"",null,"","",null,null,null,null,"","",null,3]
["",null,null,"",null,"",null,"",null,"","",null,null,null,null,"","",null,3]
["",null,null,"",null,"",null,"",null,"","",null,null,null,null,"","",null,3]
["",null,null,"",null,"",null,"",null,"","",null,null,null,null,"","",null,3]
["",null,null,"",null,"",null,"",null,"","",null,null,null,null,"","",null,3]
["",null,null,"",null,"",null,"",null,"","",null,null,null,null,"","",null,3]
["",null,null,"",null,"",null,"",null,"","",null,null,null,null,"","",null,3]
["",null,null,"",null,"",null,"",null,"","",null,null,null,null,"","",null,3]
["",null,null,"",null,"",null,"",null,"","",null,null,null,null,"","",null,3]
["",null,null,"",null,"",null,"",null,"","",null,null,null,null,"","",null,3]
["",null,null,"",null,"",null,"",null,"","",null,null,null,null,{"$f":"IFERROR(ROUND(SUM(1000/M1946),2),\"\")","v":""},"",null,3]
["",null,null,"",null,"",null,"",null,"","",null,null,null,null,"","",null,3]
["",null,null,"",null,"",null,"",null,"","",null,null,null,null,"","",null,3]
["",null,null,"",null,"",null,"",null,"","",null,null,null,null,"","",null,3]
["",null,null,"",null,"",null,"",null,"","",null,null,null,null,"","",null,3]
["",null,null,"",null,"",null,"",null,"","",null,null,null,null,"","",null,3]
["",null,null,"",null,"",null,"",null,"","",null,null,null,null,"","",null,3]
["",null,null,"",null,"",null,"",null,"","",null,null,null,null,"","",null,3]
["",null,null,"",null,"",null,"",null,"","",null,null,null,null,"","",null,3]
["",null,null,"",null,"",null,"",null,"","",null,null,null,null,"","",null,3]
["",null,null,"",null,"",null,"",null,"","",null,null,null,null,"","",null,3]
["",null,null,"",null,"",null,"",null,"","",null,null,null,null,"","",null,3]
["",null,null,"",null,"",null,"",null,"","",null,null,null,null,"","",null,3]
["",null,null,"",null,"",null,"",null,"","",null,null,null,null,"","",null,3]
["",null,null,"",null,"",null,"",null,"","",null,null,null,null,"","",null,3]
["",null,null,"",null,"",null,"",null,"","",null,null,null,null,"","",null,3]
["",null,null,"",null,"",null,"",null,"","",null,null,null,null,"","",null,3]
["",null,null,"",null,"",null,"",null,"","",null,null,null,null,"","",null,3]
["",null,null,"",null,"",null,"",null,"","",null,null,null,null,"","",null,3]
["",null,null,"",null,"",null,"",null,"","",null,null,null,null,"","",null,3]
["",null,null,"",null,"",null,"",null,"","",null,null,null,null,"","",null,3]
["",null,null,"",null,"",null,"",null,"","",null,null,null,null,"","",null,3]
["",null,null,"",null,"",null,"",null,"","",null,null,null,null,"","",null,3]
["",null,null,"",null,"",null,"",null,"","",null,null,null,null,"","",null,3]
["",null,null,"",null,"",null,"",null,"","",null,null,null,null,"","",null,3]
["",null,null,"",null,"",null,"",null,"","",null,null,null,null,"","",null,3]
["",null,null,"",null,"",null,"",null,"","",null,null,null,null,"","",null,3]
["",null,null,"",null,"",null,"",null,"","",null,null,null,null,"","",null,3]
["",null,null,"",null,"",null,"",null,"","",null,null,null,null,"","",null,3]
["",null,null,"",null,"",null,"",null,"","",null,null,null,null,"","",null,3]
["",null,null,"",null,"",null,"",null,"","",null,null,null,null,"","",null,3]
["",null,null,"",null,"",null,"",null,"","",null,null,null,null,"","",null,3]
["",null,null,"",null,"",null,"",null,"","",null,null,null,null,"","",null,3]
["",null,null,"",null,"",null,"",null,"","",null,null,null,null,"","",null,3]
["",null,null,"",null,"",null,"",null,"","",null,null,null,null,"","",null,3]
["",null,null,"",null,"",null,"",null,"","",null,null,null,null,"","",null,3]
["",null,null,"",null,"",null,"",null,"","",null,null,null,null,"","",null,3]
["",null,null,"",null,"",null,"",null,"","",null,null,null,null,"","",null,3]
["",null,null,"",null,"",null,"",null,"","",null,null,null,null,"","",null,3]
["",null,null,"",null,"",null,"",null,"","",null,null,null,null,"","",null,3]
["",null,null,"",null,"",null,"",null,"","",null,null,null,null,"","",null,3]
["",null,null,"",null,"",null,"",null,"","",null,null,null,null,"","",null,3]
[{"$f":"IF(E1988=\"\",\"\",IF(A1988=\"\",TODAY(),A1988))","v":""},null,null,{"$f":"IF(B1988=\"\",\"\",(C1988-B1988))","v":""},null,{"$f":"IFERROR(VLOOKUP(E1988,$AJ$2:$AL$316,2,FALSE),\"\")","v":""},null,{"$f":"IFERROR(G1988/D1988/24,\"\")","v":""},null,{"$f":"IFERROR(I1988/D1988/24,\"\")","v":""},{"$f":"IFERROR(L1988/D1988/24,\"\")","v":""},null,null,null,null,"","",null,3]
["",null,null,"",null,"",null,"",null,"","",null,null,null,null,"",{"$f":"IFERROR(ROUND(SUM(L1989*P1989),2),\"\")","v":""},null,3]
["",null,null,"",null,"",null,"",null,"","",null,null,null,null,"","",null,3]
["",null,null,"",null,"",null,"",null,"","",null,null,null,null,"","",null,3]
["",null,null,"",null,"",null,"",null,"","",null,null,null,null,"","",null,3]
["",null,null,"",null,"",null,"",null,"","",null,null,null,null,"","",null,3]
["",null,null,"",null,"",null,"",null,"","",null,null,null,null,"","",null,3]
["",null,null,"",null,"",null,"",null,"","",null,null,null,null,"","",null,3]
["",null,null,"",null,"",null,"",null,"","",null,null,null,null,"","",null,3]
["",null,null,"",null,"",null,"",null,"","",null,null,null,null,"","",null,3]
["",null,null,"",null,"",null,"",null,"","",null,null,null,null,"","",null,3]
["",null,null,"",null,"",null,"",null,"","",null,null,null,null,"","",null,3]
["",null,null,"",null,"",null,"",null,"","",null,null,null,null,"","",null,3]
["",null,null,"",null,"",null,"",null,"","",null,null,null,null,"","",null,3]

{"sheet":"Total Prodaction By shift","index":3,"n_rows":16,"n_cols":97,"rows_kept":16,"cut":false,"hidden":false,"merged":[[1,0,1,11],[1,12,1,21],[1,24,1,35],[1,36,1,45],[1,48,1,59],[1,60,1,69],[0,32,0,34],[0,36,0,45],[0,49,0,50],[0,52,0,53],[0,56,0,58],[0,60,0,69],[0,28,0,29],[0,1,0,2],[0,4,0,5],[0,8,0,10],[0,12,0,21],[0,25,0,26]]}
["From Date","2019-02-20",null,"To Date","2019-02-20",null,"Machine No.",2,"Name of the employee",null,null,null,null,null,null,null,null,null,null,null,null,null,null,null,"From Date","2019-02-20",null,"To Date","2019-02-21",null,"Machine No.",2,"Name of the employee",null,null,"صبحي محمد محمود",null,null,null,null,null,null,null,null,null,null,null,null,"From Date","2019-02-20",null,"To Date","2019-02-21",null,"Machine No.",2,"Name of the employee",null,null,"خالد السيد عبد القادر",null,null,null,null,null,null,null,null,null,null,null,null,1,"Date","Date","Machine No.","Machine Operator",2,"Date","Date","Machine No.","Machine Operator",3,"Date","Date","Machine No.","Machine Operator",null,"منصور محمد منصور",null,"Date","Date","Machine Operator",null,"Date","Date","Machine Operator"]
[null,null,null,null,null,null,null,null,null,null,null,null,null,null,null,null,null,null,null,null,null,null,null,null,null,null,null,null,null,null,null,null,null,null,null,null,null,null,null,null,null,null,null,null,null,null,null,null,null,null,null,null,null,null,null,null,null,null,null,null,null,null,null,null,null,null,null,null,null,null,null,null,null,{"$f":"\">=\"&B1","v":">=43516"},{"$f":"\"<=\"&E1","v":"<=43516"},{"$f":"H1","v":2},{"$f":"L1","v":0},null,{"$f":"\">=\"&Z1","v":">=43516"},{"$f":"\"<=\"&AC1","v":"<=43517"},{"$f":"AF1","v":2},{"$f":"AJ1","v":"صبحي محمد محمود"},null,{"$f":"\">=\"&AX1","v":">=43516"},{"$f":"\"<=\"&BA1","v":"<=43517"},{"$f":"BD1","v":2},{"$f":"BH1","v":"خالد السيد عبد القادر"},null,"علي مراد حسن",null,{"$f":"\">=\"&Z1","v":">=43516"},{"$f":"\"<=\"&AC1","v":"<=43517"},{"$f":"AJ1","v":"صبحي محمد محمود"}]
["Date","Start Time","End Time","Total","Machine No.","Machine Name","Capisty Power (Kgs / Shift )","Capisty Power Rate  (KGS / 1 HRS)","Minmum Power     ( Kgs / Shift )","Minimum Power Rate  (KGS / 1 HRS)","Acual Production (KGS / 1 HRS)","Production rate per Shift   ","Gm/ML","Size MM"," Drawing  "," Mtrs \\ KILO"," MTRS \\ SHIFT","Color","Shift","Machine Operator","Supervisor","Po. No.","Comment",null,"Date","Start Time","End Time","Total","Machine No.","Machine Name","Capisty Power (Kgs / Shift )","Capisty Power Rate  (KGS / 1 HRS)","Minmum Power     ( Kgs / Shift )","Minimum Power Rate  (KGS / 1 HRS)","Acual Production (KGS / 1 HRS)","Production rate per Shift   ","Gm/ML","Size MM"," Drawing  ","ML X KG."," ML.\\ day","Color","Shift","       Name of the Employee","       Name of Supervisor","OR No.","Comment",null,"Date","Start Time","End Time","Total","Machine No.","Machine Name","Capisty Power (Kgs / Shift )","Capisty Power Rate  (KGS / 1 HRS)","Minmum Power     ( Kgs / Shift )","Minimum Power Rate  (KGS / 1 HRS)","Acual Production (KGS / 1 HRS)","Production rate per Shift   ","Gm/ML","Size MM"," Drawing  ","ML X KG."," ML.\\ day","Color","Shift","       Name of the Employee","       Name of Supervisor","OR No.","Comment",null,1,"Date","Date","Machine Operator",null,null,null,null,null,null,null,"Date","Date","Machine Operator",null,null,"ابراهيم محمود ابراهيم"]
[null,null,null,null,null,null,null,null,null,null,null,null,null,null,null,null,null,null,null,null,null,null,null,null,null,null,null,null,null,null,null,null,null,null,null,null,null,null,null,null,null,null,null,null,null,null,null,null,null,null,null,null,null,null,null,null,null,null,null,null,null,null,null,null,null,null,null,null,null,null,null,null,null,{"$f":"\">=\"&B1","v":">=43516"},{"$f":"\"<=\"&E1","v":"<=43516"},{"$f":"L1","v":0},null,null,null,null,null,null,null,{"$f":"\">=\"&AX1","v":">=43516"},{"$f":"\"<=\"&BA1","v":"<=43517"},{"$f":"BH1","v":"خالد السيد عبد القادر"},null,null,"مسعد رمزي مسعد"]
[null,null,null,null,null,null,null,null,null,null,null,null,null,null,null,null,null,null,null,null,null,null,null,null,null,null,null,null,null,null,null,null,null,null,null,null,null,null,null,null,null,null,null,null,null,null,null,null,null,null,null,null,null,null,null,null,null,null,null,null,null,null,null,null,null,null,null,null,null,null,null,null,null,"Date","Date","Machine Operator",null,null,null,null,null,null,null,null,null,null,null,null,"عادل عزمي شنودة"]
[null,null,null,null,null,null,null,null,null,null,null,null,null,null,null,null,null,null,null,null,null,null,null,null,null,null,null,null,null,null,null,null,null,null,null,null,null,null,null,null,null,null,null,null,null,null,null,null,null,null,null,null,null,null,null,null,null,null,null,null,null,null,null,null,null,null,null,null,null,null,null,null,null,{"$f":"\">=\"&Z1","v":">=43516"},{"$f":"\"<=\"&AC1","v":"<=43517"},{"$f":"AJ1","v":"صبحي محمد محمود"},null,null,null,null,null,null,null,null,null,null,null,null,"صبحي محمد محمود"]
[null,null,null,null,null,null,null,null,null,null,null,null,null,null,null,null,null,null,null,null,null,null,null,null,null,null,null,null,null,null,null,null,null,null,null,null,null,null,null,null,null,null,null,null,null,null,null,null,null,null,null,null,null,null,null,null,null,null,null,null,null,null,null,null,null,null,null,null,null,null,null,null,null,"Date","Date","Machine Operator",null,null,null,null,null,null,null,null,null,null,null,null,"السيد محمد عبد العال"]
[null,null,null,null,null,null,null,null,null,null,null,null,null,null,null,null,null,null,null,null,null,null,null,null,null,null,null,null,null,null,null,null,null,null,null,null,null,null,null,null,null,null,null,null,null,null,null,null,null,null,null,null,null,null,null,null,null,null,null,null,null,null,null,null,null,null,null,null,null,null,null,null,null,{"$f":"\">=\"&AX1","v":">=43516"},{"$f":"\"<=\"&BA1","v":"<=43517"},{"$f":"BH1","v":"خالد السيد عبد القادر"},null,null,null,null,null,null,null,null,null,null,null,null,"عادل سيف الله السيد"]
[null,null,null,null,null,null,null,null,null,null,null,null,null,null,null,null,null,null,null,null,null,null,null,null,null,null,null,null,null,null,null,null,null,null,null,null,null,null,null,null,null,null,null,null,null,null,null,null,null,null,null,null,null,null,null,null,null,null,null,null,null,null,null,null,null,null,null,null,null,null,null,null,null,null,null,null,null,null,null,null,null,null,null,null,null,null,null,null,"خالد السيد عبد القادر"]
[null,null,null,null,null,null,null,null,null,null,null,null,null,null,null,null,null,null,null,null,null,null,null,null,null,null,null,null,null,null,null,null,null,null,null,null,null,null,null,null,null,null,null,null,null,null,null,null,null,null,null,null,null,null,null,null,null,null,null,null,null,null,null,null,null,null,null,null,null,null,null,null,null,null,null,null,null,null,null,null,null,null,null,null,null,null,null,null,"عادل صادق بشير"]
[null,null,null,null,null,null,null,null,null,null,null,null,null,null,null,null,null,null,null,null,null,null,null,null,null,null,null,null,null,null,null,null,null,null,null,null,null,null,null,null,null,null,null,null,null,null,null,null,null,null,null,null,null,null,null,null,null,null,null,null,null,null,null,null,null,null,null,null,null,null,null,null,null,null,null,null,null,null,null,null,null,null,null,null,null,null,null,null,"روماني عطية حبشي"]
[null,null,null,null,null,null,null,null,null,null,null,null,null,null,null,null,null,null,null,null,null,null,null,null,null,null,null,null,null,null,null,null,null,null,null,null,null,null,null,null,null,null,null,null,null,null,null,null,null,null,null,null,null,null,null,null,null,null,null,null,null,null,null,null,null,null,null,null,null,null,null,null,null,null,null,null,null,null,null,null,null,null,null,null,null,null,null,null,"احمد صادق توفيق"]
[null,null,null,null,null,null,null,null,null,null,null,null,null,null,null,null,null,null,null,null,null,null,null,null,null,null,null,null,null,null,null,null,null,null,null,null,null,null,null,null,null,null,null,null,null,null,null,null,null,null,null,null,null,null,null,null,null,null,null,null,null,null,null,null,null,null,null,null,null,null,null,null,null,null,null,null,null,null,null,null,null,null,null,null,null,null,null,null,"دينا مجدي ابراهيم"]
[null,null,null,null,null,null,null,null,null,null,null,null,null,null,null,null,null,null,null,null,null,null,null,null,null,null,null,null,null,null,null,null,null,null,null,null,null,null,null,null,null,null,null,null,null,null,null,null,null,null,null,null,null,null,null,null,null,null,null,null,null,null,null,null,null,null,null,null,null,null,null,null,null,null,null,null,null,null,null,null,null,null,null,null,null,null,null,null,"علي فرج على محمد"]
[null,null,null,null,null,null,null,null,null,null,null,null,null,null,null,null,null,null,null,null,null,null,null,null,null,null,null,null,null,null,null,null,null,null,null,null,null,null,null,null,null,null,null,null,null,null,null,null,null,null,null,null,null,null,null,null,null,null,null,null,null,null,null,null,null,null,null,null,null,null,null,null,null,null,null,null,null,null,null,null,null,null,null,null,null,null,null,null,"بوسي السيد عبد المنعم"]
[null,null,null,null,null,null,null,null,null,null,null,null,null,null,null,null,null,null,null,null,null,null,null,null,null,null,null,null,null,null,null,null,null,null,null,null,null,null,null,null,null,null,null,null,null,null,null,null,null,null,null,null,null,null,null,null,null,null,null,null,null,null,null,null,null,null,null,null,null,null,null,null,null,null,null,null,null,null,null,null,null,null,null,null,null,null,null,null,"محمد محمد عبد الوهاب"]

{"sheet":"Sheet1","index":4,"n_rows":0,"n_cols":0,"rows_kept":0,"cut":false,"hidden":false,"merged":[]}

{"sheet":"Sheet2","index":5,"n_rows":0,"n_cols":0,"rows_kept":0,"cut":false,"hidden":false,"merged":[]}