{"text_format":"1","workbook":"xlsx","n_sheets":2,"sheets":["ورقة2","ورقة1"],"not_rendered":{"charts":0,"images":0,"macros":1,"external_links":0,"defined_names":1,"comments":0,"pivot_tables":0},"unopened":[],"bounds":{"document_bytes":16777216,"sheet_cells":100000,"rows_first":2000,"rows_last":500,"rows_between":2000,"halvings":0,"cell_chars":16384,"cell_head_chars":4096},"cells_cut":0,"cells_raw":0,"read":"whole","date_system":"1900"}

{"sheet":"ورقة2","index":0,"n_rows":467,"n_cols":17,"rows_kept":467,"cut":false,"hidden":false,"merged":[[370,1,370,2],[371,1,371,3],[379,1,379,2],[380,1,380,3],[388,1,388,2],[389,1,389,3],[326,1,326,3],[334,1,334,2],[335,1,335,3],[343,1,343,2],[344,1,344,3],[352,1,352,2],[353,1,353,3],[361,1,361,2],[362,1,362,3],[289,1,289,2],[290,1,290,3],[298,1,298,2],[299,1,299,3],[307,1,307,2],[308,1,308,3],[316,1,316,2],[317,1,317,3],[325,1,325,2],[245,1,245,3],[253,1,253,2],[254,1,254,3],[262,1,262,2],[263,1,263,3],[271,1,271,2],[272,1,272,3],[280,1,280,2],[281,1,281,3],[208,1,208,2],[209,1,209,3],[217,1,217,2],[218,1,218,3],[226,1,226,2],[227,1,227,3],[235,1,235,2],[236,1,236,3],[244,1,244,2],[164,1,164,3],[172,1,172,2],[173,1,173,3],[181,1,181,2],[182,1,182,3],[190,1,190,2],[191,1,191,3],[199,1,199,2],[200,1,200,3],[127,1,127,2],[128,1,128,3],[136,1,136,2],[137,1,137,3],[145,1,145,2],[146,1,146,3],[154,1,154,2],[155,1,155,3],[163,1,163,2],[83,1,83,3],[91,1,91,2],[92,1,92,3],[100,1,100,2],[101,1,101,3],[109,1,109,2],[110,1,110,3],[118,1,118,2],[119,1,119,3],[397,1,397,2],[398,1,398,3],[406,1,406,2],[407,1,407,3],[415,1,415,2],[29,1,29,3],[1,1,1,2],[10,1,10,2],[19,1,19,2],[28,1,28,2],[2,1,2,3],[11,1,11,3],[20,1,20,3],[37,1,37,2],[38,1,38,3],[46,1,46,2],[47,1,47,3],[55,1,55,2],[56,1,56,3],[64,1,64,2],[65,1,65,3],[73,1,73,2],[74,1,74,3],[82,1,82,2],[461,1,461,3],[442,1,442,2],[443,1,443,3],[451,1,451,2],[452,1,452,3],[460,1,460,2],[416,1,416,3],[424,1,424,2],[425,1,425,3],[433,1,433,2],[434,1,434,3]]}
[null,null,null,null,null,null,null,null,null,null,null,null,"رقم الطالب"]
["الطالب ",{"$f":"IF(M2<=$N$3,INDEX(ورقة1!$M:$M,$N$6+M2-1),\"\")","v":"محمد أسامه عبد العاطى عبد العزيز موسى"},null,null,null,"الصف",{"$f":"$K$2","v":"الرابع 2"},null,null,"اختر الصف","الرابع 2",null,1,"عدد الطلبة  بهذا الفصل"]
[null,"درجات شهر ",null,null,{"$f":"$K$3","v":"أكتوبر"},null,null,null,null,"اختر الشهر","أكتوبر",null,null,{"$f":"COUNTIF(ورقة1!L:L,ورقة2!K2)","v":25}]
[null,"لغة عربية",{"$f":"IF(M2<=$N$3,INDEX(ورقة1!$A:$AW,$N$6+M2-1,$N$9),\"\")","v":30}]
[null,null,null,null,null,null,null,null,null,null,null,null,null,"رقم أول سطر إكسل بالورقة1 به هذا الفصل"]
[null,"رياضيات",{"$f":"IF(M2<=$N$3,INDEX(ورقة1!$A:$AW,$N$6+M2-1,$N$9+1),\"\")","v":30},null,null,null,null,null,null,null,null,null,null,{"$f":"MATCH(K2,ورقة1!L:L,0)","v":43}]
[]
[null,"  لغة إنجليزية ",{"$f":"IF(M2<=$N$3,INDEX(ورقة1!$A:$AW,$N$6+M2-1,$N$9+2),\"\")","v":30},null,null,null,null,null,null,null,null,null,null,"رقم أول عمود بالورقة1 به هذا الشهر"]
[null,null,null,null,null,null,null,null,null,null,null,null,null,{"$f":"MATCH(K3,ورقة1!3:3,0)","v":20}]
[null,null,null,null,null,null,null,null,null,null,null,null,null,null,null,"الرابع 1","سبتمبر"]
["الطالب ",{"$f":"IF(M11<=$N$3,INDEX(ورقة1!$M:$M,$N$6+M11-1),\"\")","v":"محمد السيد البيومى السيد"},null,null,null,"الصف",{"$f":"$K$2","v":"الرابع 2"},null,null,null,null,null,2,"رقم آخر سطر بهذه الورقة يتم طباعته",null,"الرابع 2","أكتوبر"]
[null,"درجات شهر ",null,null,{"$f":"$K$3","v":"أكتوبر"},null,null,null,null,null,null,null,null,{"$f":"MATCH(N3,M:M,0)+8","v":226},null,"الرابع 3","نوفمبر"]
[null,"لغة عربية",{"$f":"IF(M11<=$N$3,INDEX(ورقة1!$A:$AW,$N$6+M11-1,$N$9),\"\")","v":27},null,null,null,null,null,null,null,null,null,null,null,null,"الرابع 4","ديسمبر"]
[null,null,null,null,null,null,null,null,null,null,null,null,null,null,null,"الرابع 5","يناير"]
[null,"رياضيات",{"$f":"IF(M11<=$N$3,INDEX(ورقة1!$A:$AW,$N$6+M11-1,$N$9+1),\"\")","v":27},null,null,null,null,null,null,null,null,null,null,null,null,"الرابع 6","فبراير"]
[null,null,null,null,null,null,null,null,null,null,null,null,null,null,null,"الرابع 7","مارس"]
[null,"  لغة إنجليزية ",{"$f":"IF(M11<=$N$3,INDEX(ورقة1!$A:$AW,$N$6+M11-1,$N$9+2),\"\")","v":21},null,null,null,null,null,null,null,null,null,null,null,null,"الرابع 8","أبريل"]
[null,null,null,null,null,null,null,null,null,null,null,null,null,null,null,null,"مايو"]
[null,null,null,null,null,null,null,null,null,null,null,null,null,null,null,null,"يونيو"]
["الطالب ",{"$f":"IF(M20<=$N$3,INDEX(ورقة1!$M:$M,$N$6+M20-1),\"\")","v":"محمد ايمن ابراهيم امام سليمان"},null,null,null,"الصف",{"$f":"$K$2","v":"الرابع 2"},null,null,null,null,null,3]
[null,"درجات شهر ",null,null,{"$f":"$K$3","v":"أكتوبر"}]
[null,"لغة عربية",{"$f":"IF(M20<=$N$3,INDEX(ورقة1!$A:$AW,$N$6+M20-1,$N$9),\"\")","v":29}]
[]
[null,"رياضيات",{"$f":"IF(M20<=$N$3,INDEX(ورقة1!$A:$AW,$N$6+M20-1,$N$9+1),\"\")","v":30}]
[]
[null,"  لغة إنجليزية ",{"$f":"IF(M20<=$N$3,INDEX(ورقة1!$A:$AW,$N$6+M20-1,$N$9+2),\"\")","v":28}]
[]
[]
["الطالب ",{"$f":"IF(M29<=$N$3,INDEX(ورقة1!$M:$M,$N$6+M29-1),\"\")","v":"محمد طارق محمد السيد أبو الفتوح"},null,null,null,"الصف",{"$f":"$K$2","v":"الرابع 2"},null,null,null,null,null,4]
[null,"درجات شهر ",null,null,{"$f":"$K$3","v":"أكتوبر"}]
[null,"لغة عربية",{"$f":"IF(M29<=$N$3,INDEX(ورقة1!$A:$AW,$N$6+M29-1,$N$9),\"\")","v":28}]
[]
[null,"رياضيات",{"$f":"IF(M29<=$N$3,INDEX(ورقة1!$A:$AW,$N$6+M29-1,$N$9+1),\"\")","v":30}]
[]
[null,"  لغة إنجليزية ",{"$f":"IF(M29<=$N$3,INDEX(ورقة1!$A:$AW,$N$6+M29-1,$N$9+2),\"\")","v":23}]
[]
[null,null,null,null,null,null,null,null,null,null,null,null,null,null,null,null,"يونيو"]
["الطالب ",{"$f":"IF(M38<=$N$3,INDEX(ورقة1!$M:$M,$N$6+M38-1),\"\")","v":"محمد عادل نبيل فهيم"},null,null,null,"الصف",{"$f":"$K$2","v":"الرابع 2"},null,null,null,null,null,5]
[null,"درجات شهر ",null,null,{"$f":"$K$3","v":"أكتوبر"}]
[null,"لغة عربية",{"$f":"IF(M38<=$N$3,INDEX(ورقة1!$A:$AW,$N$6+M38-1,$N$9),\"\")","v":28}]
[]
[null,"رياضيات",{"$f":"IF(M38<=$N$3,INDEX(ورقة1!$A:$AW,$N$6+M38-1,$N$9+1),\"\")","v":30}]
[]
[null,"  لغة إنجليزية ",{"$f":"IF(M38<=$N$3,INDEX(ورقة1!$A:$AW,$N$6+M38-1,$N$9+2),\"\")","v":24}]
[]
[]
["الطالب ",{"$f":"IF(M47<=$N$3,INDEX(ورقة1!$M:$M,$N$6+M47-1),\"\")","v":"محمد عبد المنعم عبد الرازق عبد المنعم محمد"},null,null,null,"الصف",{"$f":"$K$2","v":"الرابع 2"},null,null,null,null,null,6]
[null,"درجات شهر ",null,null,{"$f":"$K$3","v":"أكتوبر"}]
[null,"لغة عربية",{"$f":"IF(M47<=$N$3,INDEX(ورقة1!$A:$AW,$N$6+M47-1,$N$9),\"\")","v":28}]
[]
[null,"رياضيات",{"$f":"IF(M47<=$N$3,INDEX(ورقة1!$A:$AW,$N$6+M47-1,$N$9+1),\"\")","v":28}]
[]
[null,"  لغة إنجليزية ",{"$f":"IF(M47<=$N$3,INDEX(ورقة1!$A:$AW,$N$6+M47-1,$N$9+2),\"\")","v":30}]
[]
[null,null,null,null,null,null,null,null,null,null,null,null,null,null,null,"الرابع1","سبتمبر"]
["الطالب ",{"$f":"IF(M56<=$N$3,INDEX(ورقة1!$M:$M,$N$6+M56-1),\"\")","v":"محمد علي محمد علي حسن"},null,null,null,"الصف",{"$f":"$K$2","v":"الرابع 2"},null,null,null,null,null,7,null,null,"الرابع2","أكتوبر"]
[null,"درجات شهر ",null,null,{"$f":"$K$3","v":"أكتوبر"},null,null,null,null,null,null,null,null,null,null,"الرابع3","نوفمبر"]
[null,"لغة عربية",{"$f":"IF(M56<=$N$3,INDEX(ورقة1!$A:$AW,$N$6+M56-1,$N$9),\"\")","v":29},null,null,null,null,null,null,null,null,null,null,null,null,"الرابع4","ديسمبر"]
[null,null,null,null,null,null,null,null,null,null,null,null,null,null,null,"الرابع5","يناير"]
[null,"رياضيات",{"$f":"IF(M56<=$N$3,INDEX(ورقة1!$A:$AW,$N$6+M56-1,$N$9+1),\"\")","v":30},null,null,null,null,null,null,null,null,null,null,null,null,"الرابع6","فبراير"]
[null,null,null,null,null,null,null,null,null,null,null,null,null,null,null,"الرابع7","مارس"]
[null,"  لغة إنجليزية ",{"$f":"IF(M56<=$N$3,INDEX(ورقة1!$A:$AW,$N$6+M56-1,$N$9+2),\"\")","v":28},null,null,null,null,null,null,null,null,null,null,null,null,"الرابع8","أبريل"]
[null,null,null,null,null,null,null,null,null,null,null,null,null,null,null,null,"مايو"]
[null,null,null,null,null,null,null,null,null,null,null,null,null,null,null,null,"يونيو"]
["الطالب ",{"$f":"IF(M65<=$N$3,INDEX(ورقة1!$M:$M,$N$6+M65-1),\"\")","v":"محمد عماد رمضان محمد عبد الحميد"},null,null,null,"الصف",{"$f":"$K$2","v":"الرابع 2"},null,null,null,null,null,8]
[null,"درجات شهر ",null,null,{"$f":"$K$3","v":"أكتوبر"}]
[null,"لغة عربية",{"$f":"IF(M65<=$N$3,INDEX(ورقة1!$A:$AW,$N$6+M65-1,$N$9),\"\")","v":29}]
[]
[null,"رياضيات",{"$f":"IF(M65<=$N$3,INDEX(ورقة1!$A:$AW,$N$6+M65-1,$N$9+1),\"\")","v":30}]
[]
[null,"  لغة إنجليزية ",{"$f":"IF(M65<=$N$3,INDEX(ورقة1!$A:$AW,$N$6+M65-1,$N$9+2),\"\")","v":27}]
[]
[]
["الطالب ",{"$f":"IF(M74<=$N$3,INDEX(ورقة1!$M:$M,$N$6+M74-1),\"\")","v":"محمد نبيل عبد العزيز بكر"},null,null,null,"الصف",{"$f":"$K$2","v":"الرابع 2"},null,null,null,null,null,9]
[null,"درجات شهر ",null,null,{"$f":"$K$3","v":"أكتوبر"}]
[null,"لغة عربية",{"$f":"IF(M74<=$N$3,INDEX(ورقة1!$A:$AW,$N$6+M74-1,$N$9),\"\")","v":29}]
[]
[null,"رياضيات",{"$f":"IF(M74<=$N$3,INDEX(ورقة1!$A:$AW,$N$6+M74-1,$N$9+1),\"\")","v":30}]
[]
[null,"  لغة إنجليزية ",{"$f":"IF(M74<=$N$3,INDEX(ورقة1!$A:$AW,$N$6+M74-1,$N$9+2),\"\")","v":22}]
{"$rows_left_out":388}
{"sheet":"ورقة1","index":1,"n_rows":144,"n_cols":49,"rows_kept":144,"cut":false,"hidden":false,"merged":[]}
[]
[]
[null,null,null,null,null,null,null,null,null,null,null,null,null,"سبتمبر",null,null,null,null,null,"اكتوبر",null,null,null,null,"نوفمبر",null,null,null,null,"ديسمبر",null,null,null,null,null,"يناير",null,null,null,null,"فبراير",null,null,null,null,null,"مارس"]
[null,null,null,null,null,null,null,null,null,null,"م","الصف ","الاســــــــــــــم","لغة عربية","رياضيات","  لغة إنجليزية ",null,null,null,"لغة عربية","رياضيات","  لغة إنجليزية ",null,null,"لغة عربية","رياضيات","  لغة إنجليزية ",null,null,"لغة عربية","رياضيات","  لغة إنجليزية ",null,null,null,"لغة عربية","رياضيات","  لغة إنجليزية ",null,null,"لغة عربية","رياضيات","  لغة إنجليزية ",null,null,null,"لغة عربية","رياضيات","  لغة إنجليزية "]
[null,null,null,null,null,null,null,null,null,null,null,"الرابع 1","ابراهيم  الحواراني",30,30,30,null,null,null,30,30,30,null,null,30,30,30]
[null,null,null,null,null,null,null,null,null,null,1,"الرابع 1","ابراهيم السيد ",29,25,29,null,null,null,28,30,25,null,null,28,30,25]
[null,null,null,null,null,null,null,null,null,null,2,"الرابع 1","احمد السيد عباس مصلحى",19,21,26,null,null,null,28,30,21,null,null,28,30,21]
[null,null,null,null,null,null,null,null,null,null,3,"الرابع 1","أحمد أيمن السعيد المهدى العليمى",29,30,30,null,null,null,30,30,30,null,null,30,30,30]
[null,null,null,null,null,null,null,null,null,null,4,"الرابع 1","احمد حسين عبدالله مرسى المرادى",19,25,30,null,null,null,29,30,25,null,null,29,30,25]
[null,null,null,null,null,null,null,null,null,null,5,"الرابع 1","أحمد عادل محمد جلالة",28,28,29,null,null,null,30,30,28,null,null,30,30,28]
[null,null,null,null,null,null,null,null,null,null,6,"الرابع 1","أحمد عبد الرازق محمد الهادى عبد الرازق خليل",26,30,29,null,null,null,30,30,30,null,null,30,30,30]
[null,null,null,null,null,null,null,null,null,null,7,"الرابع 1","أحمد عبد المنعم محمد امام المرادى",27,30,28,null,null,null,30,30,30,null,null,30,30,30]
[null,null,null,null,null,null,null,null,null,null,8,"الرابع 1","أحمد كرم أحمد محمد عبد الله",19,25,24,null,null,null,19,28,25,null,null,19,28,25]
[null,null,null,null,null,null,null,null,null,null,9,"الرابع 1","احمد محمد حسن على الدهين",27,26,27,null,null,null,29,30,26,null,null,29,30,26]
[null,null,null,null,null,null,null,null,null,null,10,"الرابع 1","انس محروس عبد الرازق زايد",24,23,23,null,null,null,30,30,23,null,null,30,30,23]
[null,null,null,null,null,null,null,null,null,null,11,"الرابع 1","اياد احمد جبر احمد جبر",23,27,30,null,null,null,30,30,27,null,null,30,30,27]
[null,null,null,null,null,null,null,null,null,null,12,"الرابع 1","باسم السيد عبد المعطى السيد الشربينى",20,25,19,null,null,null,26,28,25,null,null,26,28,25]
[null,null,null,null,null,null,null,null,null,null,13,"الرابع 1","زياد عاطف محمد عبدالمنعم",29,28,30,null,null,null,29,30,28,null,null,29,30,28]
[null,null,null,null,null,null,null,null,null,null,14,"الرابع 1","زياد عبد المنعم السيد محمد زايد",29,30,30,null,null,null,30,29,30,null,null,30,29,30]
[null,null,null,null,null,null,null,null,null,null,15,"الرابع 1","زياد هانى محمد الهادى عبد الرازق خليل",30,29,28,null,null,null,30,30,29,null,null,30,30,29]
[null,null,null,null,null,null,null,null,null,null,16,"الرابع 1","عبد الرحمن أسامة محمود السيد داود",28,28,29,null,null,null,30,30,28,null,null,30,30,28]
[null,null,null,null,null,null,null,null,null,null,17,"الرابع 1","عبد الرحمن وجيه عبد الحليم عنتر السيد",24,15,29,null,null,null,27,28,15,null,null,27,28,15]
[null,null,null,null,null,null,null,null,null,null,18,"الرابع 1","عبد السميع خالد عبد السميع بكر",25,19,25,null,null,null,29,28,19,null,null,29,28,19]
[null,null,null,null,null,null,null,null,null,null,19,"الرابع 1","عبد العزيز السيد عبد العزيز محمد إبراهيم",30,26,29,null,null,null,29,30,26,null,null,29,30,26]
[null,null,null,null,null,null,null,null,null,null,20,"الرابع 1","عبدالرحمن محمد يوسف عبدالله المرادى",29,22,30,null,null,null,29,30,22,null,null,29,30,22]
[null,null,null,null,null,null,null,null,null,null,21,"الرابع 1","على محمد على موسى حسين",26,25,28,null,null,null,28,29,25,null,null,28,29,25]
[null,null,null,null,null,null,null,null,null,null,22,"الرابع 1","عمار سامح عبد الفتاح العونى",29,27,29,null,null,null,29,29,27,null,null,29,29,27]
[null,null,null,null,null,null,null,null,null,null,23,"الرابع 1","عمار محمد عفيفي محمد عيسي",21,24,28,null,null,null,25,29,24,null,null,25,29,24]
[null,null,null,null,null,null,null,null,null,null,24,"الرابع 1","عمر ايهاب محمود محمد يوسف",30,29,30,null,null,null,30,30,29,null,null,30,30,29]
[null,null,null,null,null,null,null,null,null,null,25,"الرابع 1","عمر عفيفى عفيفى قطب حسن",25,27,27,null,null,null,30,30,27,null,null,30,30,27]
[null,null,null,null,null,null,null,null,null,null,26,"الرابع 1","عمر محمد سمير عطية عفيفى الخولى",28,26,29,null,null,null,28,31,26,null,null,28,31,26]
[null,null,null,null,null,null,null,null,null,null,27,"الرابع 1","عمير محمد فهمى احمد الحنفى",25,22,28,null,null,null,29,29,22,null,null,29,29,22]
[null,null,null,null,null,null,null,null,null,null,28,"الرابع 1","فارس مجاهد على الليثى",29,28,29,null,null,null,29,30,28,null,null,29,30,28]
[null,null,null,null,null,null,null,null,null,null,29,"الرابع 1","كريم أحمد عبد الرحمن السيد يوسف",29,26,30,null,null,null,25,29,26,null,null,25,29,26]
[null,null,null,null,null,null,null,null,null,null,30,"الرابع 1","كريم شوقى السيد محمد محمد",23,20,22,null,null,null,27,30,20,null,null,27,30,20]
[null,null,null,null,null,null,null,null,null,null,31,"الرابع 1","ماجد محمد السيد بكر",30,28,29,null,null,null,29,30,28,null,null,29,30,28]
[null,null,null,null,null,null,null,null,null,null,32,"الرابع 1","مازن محمد  حسين عبدالوهاب",29,30,27,null,null,null,30,28,30,null,null,30,28,30]
[]
[]
[]
[]
[]
[null,null,null,null,null,null,null,null,null,null,1,"الرابع 2","محمد أسامه عبد العاطى عبد العزيز موسى",29,30,30,null,null,null,30,30,30,null,null,30,30,30]
[null,null,null,null,null,null,null,null,null,null,2,"الرابع 2","محمد السيد البيومى السيد",24,21,27,null,null,null,27,27,21,null,null,27,27,21]
[null,null,null,null,null,null,null,null,null,null,3,"الرابع 2","محمد ايمن ابراهيم امام سليمان",26,28,30,null,null,null,29,30,28,null,null,29,30,28]
[null,null,null,null,null,null,null,null,null,null,4,"الرابع 2","محمد طارق محمد السيد أبو الفتوح",21,23,28,null,null,null,28,30,23,null,null,28,30,23]
[null,null,null,null,null,null,null,null,null,null,5,"الرابع 2","محمد عادل نبيل فهيم",25,24,26,null,null,null,28,30,24,null,null,28,30,24]
[null,null,null,null,null,null,null,null,null,null,6,"الرابع 2","محمد عبد المنعم عبد الرازق عبد المنعم محمد",19,30,24,null,null,null,28,28,30,null,null,28,28,30]
[null,null,null,null,null,null,null,null,null,null,7,"الرابع 2","محمد علي محمد علي حسن",30,28,30,null,null,null,29,30,28,null,null,29,30,28]
[null,null,null,null,null,null,null,null,null,null,8,"الرابع 2","محمد عماد رمضان محمد عبد الحميد",30,27,30,null,null,null,29,30,27,null,null,29,30,27]
[null,null,null,null,null,null,null,null,null,null,9,"الرابع 2","محمد نبيل عبد العزيز بكر",28,22,29,null,null,null,29,30,22,null,null,29,30,22]
[null,null,null,null,null,null,null,null,null,null,10,"الرابع 2","محمود أحمد ابراهيم متولى السيد",26,30,24,null,null,null,28,26,30,null,null,28,26,30]
[null,null,null,null,null,null,null,null,null,null,11,"الرابع 2","محمود أحمد محروس السيد يكر",29,30,30,null,null,null,29,30,30,null,null,29,30,30]
[null,null,null,null,null,null,null,null,null,null,12,"الرابع 2","محمود زايد عبد المنعم زايد",22,16,24,null,null,null,28,27,16,null,null,28,27,16]
[null,null,null,null,null,null,null,null,null,null,13,"الرابع 2","محمود شوقي الحسيني عثمان",19,26,26,null,null,null,28,28,26,null,null,28,28,26]
[null,null,null,null,null,null,null,null,null,null,14,"الرابع 2","محمود عادل رزق عبد الهادى عطيه",29,29,30,null,null,null,30,30,29,null,null,30,30,29]
[null,null,null,null,null,null,null,null,null,null,15,"الرابع 2","محمود فوزى محمود سعيد سيد احمد",28,29,29,null,null,null,29,30,29,null,null,29,30,29]
[null,null,null,null,null,null,null,null,null,null,16,"الرابع 2","محمود وائل محمود حماد",27,29,27,null,null,null,29,30,29,null,null,29,30,29]
[null,null,null,null,null,null,null,null,null,null,17,"الرابع 2","مروان محمود على الليثى",26,29,28,null,null,null,29,29,29,null,null,29,29,29]
[null,null,null,null,null,null,null,null,null,null,18,"الرابع 2","يوسف احمد فايز عبدالمولى فرج",27,28,26,null,null,null,29,30,28,null,null,29,30,28]
[null,null,null,null,null,null,null,null,null,null,19,"الرابع 2","يوسف الخضرى محمد الخضرى العليمى",27,30,30,null,null,null,30,30,30,null,null,30,30,30]
[null,null,null,null,null,null,null,null,null,null,20,"الرابع 2","يوسف أمير عبدالرازق يوسف عبد الله",25,22,28,null,null,null,29,29,22,null,null,29,29,22]
[null,null,null,null,null,null,null,null,null,null,21,"الرابع 2","يوسف محمد عبد الراضى حسنين أحمد",20,21,28,null,null,null,28,29,21,null,null,28,29,21]
[null,null,null,null,null,null,null,null,null,null,22,"الرابع 2","أمنية عبد الحفيظ عبد الرازق مصطفى",29,30,29,null,null,null,30,30,30,null,null,30,30,30]
[null,null,null,null,null,null,null,null,null,null,23,"الرابع 2","أمنية عبد المنعم عبد المنعم زايد",30,30,30,null,null,null,30,30,30,null,null,30,30,30]
[null,null,null,null,null,null,null,null,null,null,24,"الرابع 2","انجى ايهاب يحيي عبدالحى على",30,29,30,null,null,null,29,30,29,null,null,29,30,29]
[null,null,null,null,null,null,null,null,null,null,25,"الرابع 2","أية ربيع عبد الحفيظ حسن علي",29,28,30,null,null,null,28,30,28,null,null,28,30,28]
[]
[]
[]
[]
[]
[]
[]
[null,null,null,null,null,null,null,null,null,null,1,"الرابع 3","ايمان محمد جمال عبد الحليم المرادى",30,29,30,null,null,null,28,30,29,null,null,28,30,29]
[null,null,null,null,null,null,null,null,null,null,2,"الرابع 3","بسملة اشرف عبد الحليم عنتر عفيفى",21,22,30,null,null,null,28,27,22,null,null,28,27,22]
[null,null,null,null,null,null,null,null,null,null,3,"الرابع 3","تيسير ابراهيم عبدالعليم بيومى عابدين",25,24,30,null,null,null,29,29,24,null,null,29,29,24]
[null,null,null,null,null,null,null,null,null,null,4,"الرابع 3","جنه جمال امام محمد المرادى",28,30,29,null,null,null,29,29,30,null,null,29,29,30]
[null,null,null,null,null,null,null,null,null,null,5,"الرابع 3","جنى أحمد عبد العزيزمحمد عبد الغنى",30,29,30,null,null,null,30,30,29,null,null,30,30,29]
[null,null,null,null,null,null,null,null,null,null,6,"الرابع 3","جنى محمد حسن بازالشريف",30,30,30,null,null,null,29,30,30,null,null,29,30,30]
{"$rows_left_out":64}