{"text_format":"1","workbook":"xlsx","n_sheets":2,"sheets":["الاصناف","الطباعة"],"not_rendered":{"charts":0,"images":0,"macros":1,"external_links":0,"defined_names":2,"comments":0,"pivot_tables":0},"unopened":[],"bounds":{"document_bytes":16777216,"sheet_cells":100000,"rows_first":2000,"rows_last":500,"rows_between":2000,"halvings":0,"cell_chars":16384,"cell_head_chars":4096},"cells_cut":0,"cells_raw":0,"read":"whole","date_system":"1900"}

{"sheet":"الاصناف","index":0,"n_rows":21,"n_cols":8,"rows_kept":21,"cut":false,"hidden":false,"merged":[]}
[]
[null,"تاريخ اليوم :","2019-03-25",null,null,null,"الطابعة :","HP M277"]
[]
[null,"NO","اسم الصنف","كود الصنف","الوزن","المكونــــــــــــــــــــــــــــــــــــــــات","مدة الصلاحية بالايام","عدد نسخ الطباعه"]
[null,1,"صنف 1",82304517,1001,"1 مكون - مكون - مكون - مكون - مكون - مكون - مكون - مكون",12]
[null,2,"صنف 2",82345475,1002,"2 مكون - مكون - مكون - مكون - مكون - مكون - مكون - مكون",15]
[null,3,"صنف 3",82386433,1003,"3 مكون - مكون - مكون - مكون - مكون - مكون - مكون - مكون",18,50]
[null,4,"صنف 4",82427391,1004,"4 مكون - مكون - مكون - مكون - مكون - مكون - مكون - مكون",12]
[null,5,"صنف 5",82468349,1005,"5 مكون - مكون - مكون - مكون - مكون - مكون - مكون - مكون",15,1]
[null,6,"صنف 6",82509307,1006,"6 مكون - مكون - مكون - مكون - مكون - مكون - مكون - مكون",18,1]
[null,7,"صنف 7",82550265,1007,"7 مكون - مكون - مكون - مكون - مكون - مكون - مكون - مكون",12]
[null,8,"صنف 8",82591223,1008,"8 مكون - مكون - مكون - مكون - مكون - مكون - مكون - مكون",15]
[null,9,"صنف 9",82632181,1009,"9 مكون - مكون - مكون - مكون - مكون - مكون - مكون - مكون",18,100]
[null,10,"صنف 10",82673139,1010,"10 مكون - مكون - مكون - مكون - مكون - مكون - مكون - مكون",12]
[null,11,"صنف 11",82714097,1011,"11 مكون - مكون - مكون - مكون - مكون - مكون - مكون - مكون",15]
[null,12,"صنف 12",82755055,1012,"12 مكون - مكون - مكون - مكون - مكون - مكون - مكون - مكون",18]
[null,13,"صنف 13",82796013,1013,"13 مكون - مكون - مكون - مكون - مكون - مكون - مكون - مكون",12]
[null,14,"صنف 14",82836971,1014,"14 مكون - مكون - مكون - مكون - مكون - مكون - مكون - مكون",15,50]
[null,15,"صنف 15",82877929,1015,"15 مكون - مكون - مكون - مكون - مكون - مكون - مكون - مكون",18]
[null,16,"صنف 16",82918887,1016,"16 مكون - مكون - مكون - مكون - مكون - مكون - مكون - مكون",12]
[null,17,"صنف 17",82959845,1017,"17 مكون - مكون - مكون - مكون - مكون - مكون - مكون - مكون",15]

{"sheet":"الطباعة","index":1,"n_rows":17,"n_cols":8,"rows_kept":17,"cut":false,"hidden":false,"merged":[[13,7,17,7],[8,7,10,7],[2,2,3,6],[7,2,11,6],[16,3,16,4],[15,3,15,4],[4,2,6,6]]}
[]
[]
[null,null,"Made specially for ----- company"]
[]
[null,null,"صنف 14"]
[]
[]
[null,null,{"$f":"VLOOKUP(C5,الاصناف!$C$5:$G$38,4,0)","v":"14 مكون - مكون - مكون - مكون - مكون - مكون - مكون - مكون"}]
[]
[]
[]
[]
[]
[null,null,null,"Kg",{"$f":"VLOOKUP(C5,الاصناف!$C$5:$G$38,3,0)","v":1014},"Weight:",null,{"$f":"VLOOKUP(C5,الاصناف!$C$5:$G$38,2,0)","v":82836971}]
[]
[null,null,null,{"$f":"الاصناف!C2","v":"2019-03-25"},null,"Pro Date:"]
[null,null,null,{"$f":"D16+VLOOKUP(C5,الاصناف!$C$5:$G$38,5,0)","v":"2019-04-09"},null,"Ext Date:"]