{"text_format":"1","workbook":"xlsx","n_sheets":4,"sheets":["قاعدة البيانات","الارصدة","Sheet3","Sheet4"],"not_rendered":{"charts":0,"images":0,"macros":1,"external_links":0,"defined_names":0,"comments":0,"pivot_tables":0},"unopened":[],"bounds":{"document_bytes":16777216,"sheet_cells":100000,"rows_first":2000,"rows_last":500,"rows_between":2000,"halvings":0,"cell_chars":16384,"cell_head_chars":4096},"cells_cut":0,"cells_raw":0,"read":"whole","date_system":"1900"}

{"sheet":"قاعدة البيانات","index":0,"n_rows":1575,"n_cols":6,"rows_kept":1575,"cut":false,"hidden":false,"merged":[]}
["التاريخ","كود العميل","الاســـــــــــــــــــــــــــــــــــــــــــم","البيـــــــــــــــــــــــــــــــــــــــــــــــــــــــــــــــــــــــــــــــــان","المبلغ","تنزيلات"]
["2019-03-01",2,{"$f":"VLOOKUP(B2,الارصدة!A:B,2,0)","v":"الاسم 2"}]
[{"$f":"+A2+5","v":"2019-03-06"},4,{"$f":"VLOOKUP(B3,الارصدة!A:B,2,0)","v":"الاسم 4"}]
[{"$f":"+A3+5","v":"2019-03-11"},6,{"$f":"VLOOKUP(B4,الارصدة!A:B,2,0)","v":"الاسم 6"}]
["2019-03-16",8,{"$f":"VLOOKUP(B5,الارصدة!A:B,2,0)","v":"الاسم 8"}]
["2019-03-21",10,{"$f":"VLOOKUP(B6,الارصدة!A:B,2,0)","v":"الاسم 10"}]
["2019-03-26",2,{"$f":"VLOOKUP(B7,الارصدة!A:B,2,0)","v":"الاسم 2"}]
["2019-03-31",4,{"$f":"VLOOKUP(B8,الارصدة!A:B,2,0)","v":"الاسم 4"}]
["2019-04-05",6,{"$f":"VLOOKUP(B9,الارصدة!A:B,2,0)","v":"الاسم 6"}]
["2019-04-10",8,{"$f":"VLOOKUP(B10,الارصدة!A:B,2,0)","v":"الاسم 8"}]
["2019-04-15",9,{"$f":"VLOOKUP(B11,الارصدة!A:B,2,0)","v":"الاسم 9"}]
["2019-04-20",1,{"$f":"VLOOKUP(B12,الارصدة!A:B,2,0)","v":"الاسم 1"}]
["2019-04-25",2,{"$f":"VLOOKUP(B13,الارصدة!A:B,2,0)","v":"الاسم 2"}]
["2019-04-30",5,{"$f":"VLOOKUP(B14,الارصدة!A:B,2,0)","v":"الاسم 5"}]
["2019-05-05",10,{"$f":"VLOOKUP(B15,الارصدة!A:B,2,0)","v":"الاسم 10"}]
["2019-05-10",12,{"$f":"VLOOKUP(B16,الارصدة!A:B,2,0)","v":"الاسم 12"}]
["2019-05-15",18,{"$f":"VLOOKUP(B17,الارصدة!A:B,2,0)","v":"الاسم 18"}]
["2019-05-20",19,{"$f":"VLOOKUP(B18,الارصدة!A:B,2,0)","v":"الاسم 19"}]
["2019-05-25",13,{"$f":"VLOOKUP(B19,الارصدة!A:B,2,0)","v":"الاسم 13"}]
["2019-05-30",2,{"$f":"VLOOKUP(B20,الارصدة!A:B,2,0)","v":"الاسم 2"}]
["2019-06-04",4,{"$f":"VLOOKUP(B21,الارصدة!A:B,2,0)","v":"الاسم 4"}]
["2019-06-09",6,{"$f":"VLOOKUP(B22,الارصدة!A:B,2,0)","v":"الاسم 6"}]
["2019-06-14",8,{"$f":"VLOOKUP(B23,الارصدة!A:B,2,0)","v":"الاسم 8"}]
["2019-06-19",10,{"$f":"VLOOKUP(B24,الارصدة!A:B,2,0)","v":"الاسم 10"}]
["2019-06-24",2,{"$f":"VLOOKUP(B25,الارصدة!A:B,2,0)","v":"الاسم 2"}]
["2019-06-29",4,{"$f":"VLOOKUP(B26,الارصدة!A:B,2,0)","v":"الاسم 4"}]
["2019-07-04",6,{"$f":"VLOOKUP(B27,الارصدة!A:B,2,0)","v":"الاسم 6"}]
["2019-07-09",8,{"$f":"VLOOKUP(B28,الارصدة!A:B,2,0)","v":"الاسم 8"}]
["2019-07-14",9,{"$f":"VLOOKUP(B29,الارصدة!A:B,2,0)","v":"الاسم 9"}]
["2019-07-19",1,{"$f":"VLOOKUP(B30,الارصدة!A:B,2,0)","v":"الاسم 1"}]
["2019-07-24",2,{"$f":"VLOOKUP(B31,الارصدة!A:B,2,0)","v":"الاسم 2"}]
["2019-07-29",5,{"$f":"VLOOKUP(B32,الارصدة!A:B,2,0)","v":"الاسم 5"}]
["2019-08-03",10,{"$f":"VLOOKUP(B33,الارصدة!A:B,2,0)","v":"الاسم 10"}]
["2019-08-08",12,{"$f":"VLOOKUP(B34,الارصدة!A:B,2,0)","v":"الاسم 12"}]
["2019-08-13",18,{"$f":"VLOOKUP(B35,الارصدة!A:B,2,0)","v":"الاسم 18"}]
["2019-08-18",19,{"$f":"VLOOKUP(B36,الارصدة!A:B,2,0)","v":"الاسم 19"}]
["2019-08-23",13,{"$f":"VLOOKUP(B37,الارصدة!A:B,2,0)","v":"الاسم 13"}]
["2019-08-28",null,{"$f":"VLOOKUP(B38,الارصدة!A:B,2,0)","v":{"$error":"#N/A"}}]
["2019-09-02",null,{"$f":"VLOOKUP(B39,الارصدة!A:B,2,0)","v":{"$error":"#N/A"}}]
["2019-09-07",null,{"$f":"VLOOKUP(B40,الارصدة!A:B,2,0)","v":{"$error":"#N/A"}}]
["2019-09-12",null,{"$f":"VLOOKUP(B41,الارصدة!A:B,2,0)","v":{"$error":"#N/A"}}]
["2019-09-17",null,{"$f":"VLOOKUP(B42,الارصدة!A:B,2,0)","v":{"$error":"#N/A"}}]
["2019-09-22",null,{"$f":"VLOOKUP(B43,الارصدة!A:B,2,0)","v":{"$error":"#N/A"}}]
["2019-09-27",null,{"$f":"VLOOKUP(B44,الارصدة!A:B,2,0)","v":{"$error":"#N/A"}}]
["2019-10-02",null,{"$f":"VLOOKUP(B45,الارصدة!A:B,2,0)","v":{"$error":"#N/A"}}]
[null,null,{"$f":"VLOOKUP(B46,الارصدة!A:B,2,0)","v":{"$error":"#N/A"}}]
[null,null,{"$f":"VLOOKUP(B47,الارصدة!A:B,2,0)","v":{"$error":"#N/A"}}]
[null,null,{"$f":"VLOOKUP(B48,الارصدة!A:B,2,0)","v":{"$error":"#N/A"}}]
[null,null,{"$f":"VLOOKUP(B49,الارصدة!A:B,2,0)","v":{"$error":"#N/A"}}]
[null,null,{"$f":"VLOOKUP(B50,الارصدة!A:B,2,0)","v":{"$error":"#N/A"}}]
[null,null,{"$f":"VLOOKUP(B51,الارصدة!A:B,2,0)","v":{"$error":"#N/A"}}]
[null,null,{"$f":"VLOOKUP(B52,الارصدة!A:B,2,0)","v":{"$error":"#N/A"}}]
[null,null,{"$f":"VLOOKUP(B53,الارصدة!A:B,2,0)","v":{"$error":"#N/A"}}]
[null,null,{"$f":"VLOOKUP(B54,الارصدة!A:B,2,0)","v":{"$error":"#N/A"}}]
[null,null,{"$f":"VLOOKUP(B55,الارصدة!A:B,2,0)","v":{"$error":"#N/A"}}]
[null,null,{"$f":"VLOOKUP(B56,الارصدة!A:B,2,0)","v":{"$error":"#N/A"}}]
[null,null,{"$f":"VLOOKUP(B57,الارصدة!A:B,2,0)","v":{"$error":"#N/A"}}]
[null,null,{"$f":"VLOOKUP(B58,الارصدة!A:B,2,0)","v":{"$error":"#N/A"}}]
[null,null,{"$f":"VLOOKUP(B59,الارصدة!A:B,2,0)","v":{"$error":"#N/A"}}]
[null,null,{"$f":"VLOOKUP(B60,الارصدة!A:B,2,0)","v":{"$error":"#N/A"}}]
[null,null,{"$f":"VLOOKUP(B61,الارصدة!A:B,2,0)","v":{"$error":"#N/A"}}]
[null,null,{"$f":"VLOOKUP(B62,الارصدة!A:B,2,0)","v":{"$error":"#N/A"}}]
[null,null,{"$f":"VLOOKUP(B63,الارصدة!A:B,2,0)","v":{"$error":"#N/A"}}]
[null,null,{"$f":"VLOOKUP(B64,الارصدة!A:B,2,0)","v":{"$error":"#N/A"}}]
[null,null,{"$f":"VLOOKUP(B65,الارصدة!A:B,2,0)","v":{"$error":"#N/A"}}]
[null,null,{"$f":"VLOOKUP(B66,الارصدة!A:B,2,0)","v":{"$error":"#N/A"}}]
[null,null,{"$f":"VLOOKUP(B67,الارصدة!A:B,2,0)","v":{"$error":"#N/A"}}]
[null,null,{"$f":"VLOOKUP(B68,الارصدة!A:B,2,0)","v":{"$error":"#N/A"}}]
[null,null,{"$f":"VLOOKUP(B69,الارصدة!A:B,2,0)","v":{"$error":"#N/A"}}]
[null,null,{"$f":"VLOOKUP(B70,الارصدة!A:B,2,0)","v":{"$error":"#N/A"}}]
[null,null,{"$f":"VLOOKUP(B71,الارصدة!A:B,2,0)","v":{"$error":"#N/A"}}]
[null,null,{"$f":"VLOOKUP(B72,الارصدة!A:B,2,0)","v":{"$error":"#N/A"}}]
[null,null,{"$f":"VLOOKUP(B73,الارصدة!A:B,2,0)","v":{"$error":"#N/A"}}]
[null,null,{"$f":"VLOOKUP(B74,الارصدة!A:B,2,0)","v":{"$error":"#N/A"}}]
[null,null,{"$f":"VLOOKUP(B75,الارصدة!A:B,2,0)","v":{"$error":"#N/A"}}]
[null,null,{"$f":"VLOOKUP(B76,الارصدة!A:B,2,0)","v":{"$error":"#N/A"}}]
[null,null,{"$f":"VLOOKUP(B77,الارصدة!A:B,2,0)","v":{"$error":"#N/A"}}]
[null,null,{"$f":"VLOOKUP(B78,الارصدة!A:B,2,0)","v":{"$error":"#N/A"}}]
[null,null,{"$f":"VLOOKUP(B79,الارصدة!A:B,2,0)","v":{"$error":"#N/A"}}]
[null,null,{"$f":"VLOOKUP(B80,الارصدة!A:B,2,0)","v":{"$error":"#N/A"}}]
[null,null,{"$f":"VLOOKUP(B81,الارصدة!A:B,2,0)","v":{"$error":"#N/A"}}]
[null,null,{"$f":"VLOOKUP(B82,الارصدة!A:B,2,0)","v":{"$error":"#N/A"}}]
[null,null,{"$f":"VLOOKUP(B83,الارصدة!A:B,2,0)","v":{"$error":"#N/A"}}]
[null,null,{"$f":"VLOOKUP(B84,الارصدة!A:B,2,0)","v":{"$error":"#N/A"}}]
[null,null,{"$f":"VLOOKUP(B85,الارصدة!A:B,2,0)","v":{"$error":"#N/A"}}]
[null,null,{"$f":"VLOOKUP(B86,الارصدة!A:B,2,0)","v":{"$error":"#N/A"}}]
[null,null,{"$f":"VLOOKUP(B87,الارصدة!A:B,2,0)","v":{"$error":"#N/A"}}]
[null,null,{"$f":"VLOOKUP(B88,الارصدة!A:B,2,0)","v":{"$error":"#N/A"}}]
[null,null,{"$f":"VLOOKUP(B89,الارصدة!A:B,2,0)","v":{"$error":"#N/A"}}]
[null,null,{"$f":"VLOOKUP(B90,الارصدة!A:B,2,0)","v":{"$error":"#N/A"}}]
[null,null,{"$f":"VLOOKUP(B91,الارصدة!A:B,2,0)","v":{"$error":"#N/A"}}]
[null,null,{"$f":"VLOOKUP(B92,الارصدة!A:B,2,0)","v":{"$error":"#N/A"}}]
[null,null,{"$f":"VLOOKUP(B93,الارصدة!A:B,2,0)","v":{"$error":"#N/A"}}]
[null,null,{"$f":"VLOOKUP(B94,الارصدة!A:B,2,0)","v":{"$error":"#N/A"}}]
[null,null,{"$f":"VLOOKUP(B95,الارصدة!A:B,2,0)","v":{"$error":"#N/A"}}]
[null,null,{"$f":"VLOOKUP(B96,الارصدة!A:B,2,0)","v":{"$error":"#N/A"}}]
[null,null,{"$f":"VLOOKUP(B97,الارصدة!A:B,2,0)","v":{"$error":"#N/A"}}]
[null,null,{"$f":"VLOOKUP(B98,الارصدة!A:B,2,0)","v":{"$error":"#N/A"}}]
[null,null,{"$f":"VLOOKUP(B99,الارصدة!A:B,2,0)","v":{"$error":"#N/A"}}]
[null,null,{"$f":"VLOOKUP(B100,الارصدة!A:B,2,0)","v":{"$error":"#N/A"}}]
[null,null,{"$f":"VLOOKUP(B101,الارصدة!A:B,2,0)","v":{"$error":"#N/A"}}]
[null,null,{"$f":"VLOOKUP(B102,الارصدة!A:B,2,0)","v":{"$error":"#N/A"}}]
[null,null,{"$f":"VLOOKUP(B103,الارصدة!A:B,2,0)","v":{"$error":"#N/A"}}]
[null,null,{"$f":"VLOOKUP(B104,الارصدة!A:B,2,0)","v":{"$error":"#N/A"}}]
[null,null,{"$f":"VLOOKUP(B105,الارصدة!A:B,2,0)","v":{"$error":"#N/A"}}]
[null,null,{"$f":"VLOOKUP(B106,الارصدة!A:B,2,0)","v":{"$error":"#N/A"}}]
[null,null,{"$f":"VLOOKUP(B107,الارصدة!A:B,2,0)","v":{"$error":"#N/A"}}]
[null,null,{"$f":"VLOOKUP(B108,الارصدة!A:B,2,0)","v":{"$error":"#N/A"}}]
[null,null,{"$f":"VLOOKUP(B109,الارصدة!A:B,2,0)","v":{"$error":"#N/A"}}]
[null,null,{"$f":"VLOOKUP(B110,الارصدة!A:B,2,0)","v":{"$error":"#N/A"}}]
[null,null,{"$f":"VLOOKUP(B111,الارصدة!A:B,2,0)","v":{"$error":"#N/A"}}]
[null,null,{"$f":"VLOOKUP(B112,الارصدة!A:B,2,0)","v":{"$error":"#N/A"}}]
[null,null,{"$f":"VLOOKUP(B113,الارصدة!A:B,2,0)","v":{"$error":"#N/A"}}]
[null,null,{"$f":"VLOOKUP(B114,الارصدة!A:B,2,0)","v":{"$error":"#N/A"}}]
[null,null,{"$f":"VLOOKUP(B115,الارصدة!A:B,2,0)","v":{"$error":"#N/A"}}]
[null,null,{"$f":"VLOOKUP(B116,الارصدة!A:B,2,0)","v":{"$error":"#N/A"}}]
[null,null,{"$f":"VLOOKUP(B117,الارصدة!A:B,2,0)","v":{"$error":"#N/A"}}]
[null,null,{"$f":"VLOOKUP(B118,الارصدة!A:B,2,0)","v":{"$error":"#N/A"}}]
[null,null,{"$f":"VLOOKUP(B119,الارصدة!A:B,2,0)","v":{"$error":"#N/A"}}]
[null,null,{"$f":"VLOOKUP(B120,الارصدة!A:B,2,0)","v":{"$error":"#N/A"}}]
[null,null,{"$f":"VLOOKUP(B121,الارصدة!A:B,2,0)","v":{"$error":"#N/A"}}]
[null,null,{"$f":"VLOOKUP(B122,الارصدة!A:B,2,0)","v":{"$error":"#N/A"}}]
[null,null,{"$f":"VLOOKUP(B123,الارصدة!A:B,2,0)","v":{"$error":"#N/A"}}]
[null,null,{"$f":"VLOOKUP(B124,الارصدة!A:B,2,0)","v":{"$error":"#N/A"}}]
[null,null,{"$f":"VLOOKUP(B125,الارصدة!A:B,2,0)","v":{"$error":"#N/A"}}]
[null,null,{"$f":"VLOOKUP(B126,الارصدة!A:B,2,0)","v":{"$error":"#N/A"}}]
[null,null,{"$f":"VLOOKUP(B127,الارصدة!A:B,2,0)","v":{"$error":"#N/A"}}]
[null,null,{"$f":"VLOOKUP(B128,الارصدة!A:B,2,0)","v":{"$error":"#N/A"}}]
[null,null,{"$f":"VLOOKUP(B129,الارصدة!A:B,2,0)","v":{"$error":"#N/A"}}]
[null,null,{"$f":"VLOOKUP(B130,الارصدة!A:B,2,0)","v":{"$error":"#N/A"}}]
[null,null,{"$f":"VLOOKUP(B131,الارصدة!A:B,2,0)","v":{"$error":"#N/A"}}]
[null,null,{"$f":"VLOOKUP(B132,الارصدة!A:B,2,0)","v":{"$error":"#N/A"}}]
[null,null,{"$f":"VLOOKUP(B133,الارصدة!A:B,2,0)","v":{"$error":"#N/A"}}]
[null,null,{"$f":"VLOOKUP(B134,الارصدة!A:B,2,0)","v":{"$error":"#N/A"}}]
[null,null,{"$f":"VLOOKUP(B135,الارصدة!A:B,2,0)","v":{"$error":"#N/A"}}]
[null,null,{"$f":"VLOOKUP(B136,الارصدة!A:B,2,0)","v":{"$error":"#N/A"}}]
[null,null,{"$f":"VLOOKUP(B137,الارصدة!A:B,2,0)","v":{"$error":"#N/A"}}]
[null,null,{"$f":"VLOOKUP(B138,الارصدة!A:B,2,0)","v":{"$error":"#N/A"}}]
[null,null,{"$f":"VLOOKUP(B139,الارصدة!A:B,2,0)","v":{"$error":"#N/A"}}]
[null,null,{"$f":"VLOOKUP(B140,الارصدة!A:B,2,0)","v":{"$error":"#N/A"}}]
[null,null,{"$f":"VLOOKUP(B141,الارصدة!A:B,2,0)","v":{"$error":"#N/A"}}]
[null,null,{"$f":"VLOOKUP(B142,الارصدة!A:B,2,0)","v":{"$error":"#N/A"}}]
[null,null,{"$f":"VLOOKUP(B143,الارصدة!A:B,2,0)","v":{"$error":"#N/A"}}]
[null,null,{"$f":"VLOOKUP(B144,الارصدة!A:B,2,0)","v":{"$error":"#N/A"}}]
[null,null,{"$f":"VLOOKUP(B145,الارصدة!A:B,2,0)","v":{"$error":"#N/A"}}]
[null,null,{"$f":"VLOOKUP(B146,الارصدة!A:B,2,0)","v":{"$error":"#N/A"}}]
[null,null,{"$f":"VLOOKUP(B147,الارصدة!A:B,2,0)","v":{"$error":"#N/A"}}]
[null,null,{"$f":"VLOOKUP(B148,الارصدة!A:B,2,0)","v":{"$error":"#N/A"}}]
[null,null,{"$f":"VLOOKUP(B149,الارصدة!A:B,2,0)","v":{"$error":"#N/A"}}]
[null,null,{"$f":"VLOOKUP(B150,الارصدة!A:B,2,0)","v":{"$error":"#N/A"}}]
[null,null,{"$f":"VLOOKUP(B151,الارصدة!A:B,2,0)","v":{"$error":"#N/A"}}]
[null,null,{"$f":"VLOOKUP(B152,الارصدة!A:B,2,0)","v":{"$error":"#N/A"}}]
[null,null,{"$f":"VLOOKUP(B153,الارصدة!A:B,2,0)","v":{"$error":"#N/A"}}]
[null,null,{"$f":"VLOOKUP(B154,الارصدة!A:B,2,0)","v":{"$error":"#N/A"}}]
[null,null,{"$f":"VLOOKUP(B155,الارصدة!A:B,2,0)","v":{"$error":"#N/A"}}]
[null,null,{"$f":"VLOOKUP(B156,الارصدة!A:B,2,0)","v":{"$error":"#N/A"}}]
[null,null,{"$f":"VLOOKUP(B157,الارصدة!A:B,2,0)","v":{"$error":"#N/A"}}]
[null,null,{"$f":"VLOOKUP(B158,الارصدة!A:B,2,0)","v":{"$error":"#N/A"}}]
[null,null,{"$f":"VLOOKUP(B159,الارصدة!A:B,2,0)","v":{"$error":"#N/A"}}]
[null,null,{"$f":"VLOOKUP(B160,الارصدة!A:B,2,0)","v":{"$error":"#N/A"}}]
[null,null,{"$f":"VLOOKUP(B161,الارصدة!A:B,2,0)","v":{"$error":"#N/A"}}]
[null,null,{"$f":"VLOOKUP(B162,الارصدة!A:B,2,0)","v":{"$error":"#N/A"}}]
[null,null,{"$f":"VLOOKUP(B163,الارصدة!A:B,2,0)","v":{"$error":"#N/A"}}]
[null,null,{"$f":"VLOOKUP(B164,الارصدة!A:B,2,0)","v":{"$error":"#N/A"}}]
[null,null,{"$f":"VLOOKUP(B165,الارصدة!A:B,2,0)","v":{"$error":"#N/A"}}]
[null,null,{"$f":"VLOOKUP(B166,الارصدة!A:B,2,0)","v":{"$error":"#N/A"}}]
[null,null,{"$f":"VLOOKUP(B167,الارصدة!A:B,2,0)","v":{"$error":"#N/A"}}]
[null,null,{"$f":"VLOOKUP(B168,الارصدة!A:B,2,0)","v":{"$error":"#N/A"}}]
[null,null,{"$f":"VLOOKUP(B169,الارصدة!A:B,2,0)","v":{"$error":"#N/A"}}]
[null,null,{"$f":"VLOOKUP(B170,الارصدة!A:B,2,0)","v":{"$error":"#N/A"}}]
[null,null,{"$f":"VLOOKUP(B171,الارصدة!A:B,2,0)","v":{"$error":"#N/A"}}]
[null,null,{"$f":"VLOOKUP(B172,الارصدة!A:B,2,0)","v":{"$error":"#N/A"}}]
[null,null,{"$f":"VLOOKUP(B173,الارصدة!A:B,2,0)","v":{"$error":"#N/A"}}]
[null,null,{"$f":"VLOOKUP(B174,الارصدة!A:B,2,0)","v":{"$error":"#N/A"}}]
[null,null,{"$f":"VLOOKUP(B175,الارصدة!A:B,2,0)","v":{"$error":"#N/A"}}]
[null,null,{"$f":"VLOOKUP(B176,الارصدة!A:B,2,0)","v":{"$error":"#N/A"}}]
[null,null,{"$f":"VLOOKUP(B177,الارصدة!A:B,2,0)","v":{"$error":"#N/A"}}]
[null,null,{"$f":"VLOOKUP(B178,الارصدة!A:B,2,0)","v":{"$error":"#N/A"}}]
[null,null,{"$f":"VLOOKUP(B179,الارصدة!A:B,2,0)","v":{"$error":"#N/A"}}]
[null,null,{"$f":"VLOOKUP(B180,الارصدة!A:B,2,0)","v":{"$error":"#N/A"}}]
[null,null,{"$f":"VLOOKUP(B181,الارصدة!A:B,2,0)","v":{"$error":"#N/A"}}]
[null,null,{"$f":"VLOOKUP(B182,الارصدة!A:B,2,0)","v":{"$error":"#N/A"}}]
[null,null,{"$f":"VLOOKUP(B183,الارصدة!A:B,2,0)","v":{"$error":"#N/A"}}]
[null,null,{"$f":"VLOOKUP(B184,الارصدة!A:B,2,0)","v":{"$error":"#N/A"}}]
[null,null,{"$f":"VLOOKUP(B185,الارصدة!A:B,2,0)","v":{"$error":"#N/A"}}]
[null,null,{"$f":"VLOOKUP(B186,الارصدة!A:B,2,0)","v":{"$error":"#N/A"}}]
[null,null,{"$f":"VLOOKUP(B187,الارصدة!A:B,2,0)","v":{"$error":"#N/A"}}]
[null,null,{"$f":"VLOOKUP(B188,الارصدة!A:B,2,0)","v":{"$error":"#N/A"}}]
[null,null,{"$f":"VLOOKUP(B189,الارصدة!A:B,2,0)","v":{"$error":"#N/A"}}]
[null,null,{"$f":"VLOOKUP(B190,الارصدة!A:B,2,0)","v":{"$error":"#N/A"}}]
[null,null,{"$f":"VLOOKUP(B191,الارصدة!A:B,2,0)","v":{"$error":"#N/A"}}]
[null,null,{"$f":"VLOOKUP(B192,الارصدة!A:B,2,0)","v":{"$error":"#N/A"}}]
[null,null,{"$f":"VLOOKUP(B193,الارصدة!A:B,2,0)","v":{"$error":"#N/A"}}]
[null,null,{"$f":"VLOOKUP(B194,الارصدة!A:B,2,0)","v":{"$error":"#N/A"}}]
[null,null,{"$f":"VLOOKUP(B195,الارصدة!A:B,2,0)","v":{"$error":"#N/A"}}]
[null,null,{"$f":"VLOOKUP(B196,الارصدة!A:B,2,0)","v":{"$error":"#N/A"}}]
[null,null,{"$f":"VLOOKUP(B197,الارصدة!A:B,2,0)","v":{"$error":"#N/A"}}]
[null,null,{"$f":"VLOOKUP(B198,الارصدة!A:B,2,0)","v":{"$error":"#N/A"}}]
[null,null,{"$f":"VLOOKUP(B199,الارصدة!A:B,2,0)","v":{"$error":"#N/A"}}]
[null,null,{"$f":"VLOOKUP(B200,الارصدة!A:B,2,0)","v":{"$error":"#N/A"}}]
{"$rows_left_out":1376}
{"sheet":"الارصدة","index":1,"n_rows":26,"n_cols":6,"rows_kept":26,"cut":false,"hidden":false,"merged":[]}
["كود العميل ","الاســــــــــــــــــــــــــــــــم","الحساب السابق","إضافة ","اجمالى المدفوع","الرصيد النهائى"]
[1,"الاسم 1",0,{"$f":"SUMIF('قاعدة البيانات'!B:B,A2,'قاعدة البيانات'!E:E)","v":0},{"$f":"SUMIF('قاعدة البيانات'!B:B,A2,'قاعدة البيانات'!F:F)","v":0},{"$f":"C2+D2-E2","v":0}]
[2,"الاسم 2",120,{"$f":"SUMIF('قاعدة البيانات'!B:B,A3,'قاعدة البيانات'!E:E)","v":0},{"$f":"SUMIF('قاعدة البيانات'!B:B,A3,'قاعدة البيانات'!F:F)","v":0},120]
[3,"الاسم 3",100,{"$f":"SUMIF('قاعدة البيانات'!B:B,A4,'قاعدة البيانات'!E:E)","v":0},{"$f":"SUMIF('قاعدة البيانات'!B:B,A4,'قاعدة البيانات'!F:F)","v":0},100]
[4,"الاسم 4",200,{"$f":"SUMIF('قاعدة البيانات'!B:B,A5,'قاعدة البيانات'!E:E)","v":0},{"$f":"SUMIF('قاعدة البيانات'!B:B,A5,'قاعدة البيانات'!F:F)","v":0},200]
[5,"الاسم 5",300,{"$f":"SUMIF('قاعدة البيانات'!B:B,A6,'قاعدة البيانات'!E:E)","v":0},{"$f":"SUMIF('قاعدة البيانات'!B:B,A6,'قاعدة البيانات'!F:F)","v":0},300]
[6,"الاسم 6",0,{"$f":"SUMIF('قاعدة البيانات'!B:B,A7,'قاعدة البيانات'!E:E)","v":0},{"$f":"SUMIF('قاعدة البيانات'!B:B,A7,'قاعدة البيانات'!F:F)","v":0},0]
[7,"الاسم 7",200,{"$f":"SUMIF('قاعدة البيانات'!B:B,A8,'قاعدة البيانات'!E:E)","v":0},{"$f":"SUMIF('قاعدة البيانات'!B:B,A8,'قاعدة البيانات'!F:F)","v":0},200]
[8,"الاسم 8",0,{"$f":"SUMIF('قاعدة البيانات'!B:B,A9,'قاعدة البيانات'!E:E)","v":0},{"$f":"SUMIF('قاعدة البيانات'!B:B,A9,'قاعدة البيانات'!F:F)","v":0},0]
[9,"الاسم 9",120,{"$f":"SUMIF('قاعدة البيانات'!B:B,A10,'قاعدة البيانات'!E:E)","v":0},{"$f":"SUMIF('قاعدة البيانات'!B:B,A10,'قاعدة البيانات'!F:F)","v":0},120]
[10,"الاسم 10",100,{"$f":"SUMIF('قاعدة البيانات'!B:B,A11,'قاعدة البيانات'!E:E)","v":0},{"$f":"SUMIF('قاعدة البيانات'!B:B,A11,'قاعدة البيانات'!F:F)","v":0},100]
[11,"الاسم 11",200,{"$f":"SUMIF('قاعدة البيانات'!B:B,A12,'قاعدة البيانات'!E:E)","v":0},{"$f":"SUMIF('قاعدة البيانات'!B:B,A12,'قاعدة البيانات'!F:F)","v":0},200]
[12,"الاسم 12",300,{"$f":"SUMIF('قاعدة البيانات'!B:B,A13,'قاعدة البيانات'!E:E)","v":0},{"$f":"SUMIF('قاعدة البيانات'!B:B,A13,'قاعدة البيانات'!F:F)","v":0},300]
[13,"الاسم 13",0,{"$f":"SUMIF('قاعدة البيانات'!B:B,A14,'قاعدة البيانات'!E:E)","v":0},{"$f":"SUMIF('قاعدة البيانات'!B:B,A14,'قاعدة البيانات'!F:F)","v":0},0]
[14,"الاسم 14",200,{"$f":"SUMIF('قاعدة البيانات'!B:B,A15,'قاعدة البيانات'!E:E)","v":0},{"$f":"SUMIF('قاعدة البيانات'!B:B,A15,'قاعدة البيانات'!F:F)","v":0},200]
[15,"الاسم 15",0,{"$f":"SUMIF('قاعدة البيانات'!B:B,A16,'قاعدة البيانات'!E:E)","v":0},{"$f":"SUMIF('قاعدة البيانات'!B:B,A16,'قاعدة البيانات'!F:F)","v":0},0]
[16,"الاسم 16",120,{"$f":"SUMIF('قاعدة البيانات'!B:B,A17,'قاعدة البيانات'!E:E)","v":0},{"$f":"SUMIF('قاعدة البيانات'!B:B,A17,'قاعدة البيانات'!F:F)","v":0},120]
[17,"الاسم 17",100,{"$f":"SUMIF('قاعدة البيانات'!B:B,A18,'قاعدة البيانات'!E:E)","v":0},{"$f":"SUMIF('قاعدة البيانات'!B:B,A18,'قاعدة البيانات'!F:F)","v":0},100]
[18,"الاسم 18",200,{"$f":"SUMIF('قاعدة البيانات'!B:B,A19,'قاعدة البيانات'!E:E)","v":0},{"$f":"SUMIF('قاعدة البيانات'!B:B,A19,'قاعدة البيانات'!F:F)","v":0},200]
[19,"الاسم 19",300,{"$f":"SUMIF('قاعدة البيانات'!B:B,A20,'قاعدة البيانات'!E:E)","v":0},{"$f":"SUMIF('قاعدة البيانات'!B:B,A20,'قاعدة البيانات'!F:F)","v":0},300]
[20,"الاسم 20",0,{"$f":"SUMIF('قاعدة البيانات'!B:B,A21,'قاعدة البيانات'!E:E)","v":0},{"$f":"SUMIF('قاعدة البيانات'!B:B,A21,'قاعدة البيانات'!F:F)","v":0},0]
[21,"الاسم 21",200,{"$f":"SUMIF('قاعدة البيانات'!B:B,A22,'قاعدة البيانات'!E:E)","v":0},{"$f":"SUMIF('قاعدة البيانات'!B:B,A22,'قاعدة البيانات'!F:F)","v":0},200]
[22,"الاسم 22",0,{"$f":"SUMIF('قاعدة البيانات'!B:B,A23,'قاعدة البيانات'!E:E)","v":0},{"$f":"SUMIF('قاعدة البيانات'!B:B,A23,'قاعدة البيانات'!F:F)","v":0},0]
[23,"الاسم 23",120,{"$f":"SUMIF('قاعدة البيانات'!B:B,A24,'قاعدة البيانات'!E:E)","v":0},{"$f":"SUMIF('قاعدة البيانات'!B:B,A24,'قاعدة البيانات'!F:F)","v":0},120]
[24,"الاسم 24",100,{"$f":"SUMIF('قاعدة البيانات'!B:B,A25,'قاعدة البيانات'!E:E)","v":0},{"$f":"SUMIF('قاعدة البيانات'!B:B,A25,'قاعدة البيانات'!F:F)","v":0},100]
[25,"الاسم 25",200,{"$f":"SUMIF('قاعدة البيانات'!B:B,A26,'قاعدة البيانات'!E:E)","v":0},{"$f":"SUMIF('قاعدة البيانات'!B:B,A26,'قاعدة البيانات'!F:F)","v":0},200]

{"sheet":"Sheet3","index":2,"n_rows":0,"n_cols":0,"rows_kept":0,"cut":false,"hidden":false,"merged":[]}

{"sheet":"Sheet4","index":3,"n_rows":0,"n_cols":0,"rows_kept":0,"cut":false,"hidden":false,"merged":[]}