{"text_format":"1","workbook":"xlsx","n_sheets":3,"sheets":["الارصدة","DATA","قاعدة البيانات"],"not_rendered":{"charts":0,"images":0,"macros":1,"external_links":0,"defined_names":2,"comments":1,"pivot_tables":0},"unopened":[],"bounds":{"document_bytes":16777216,"sheet_cells":100000,"rows_first":2000,"rows_last":500,"rows_between":2000,"halvings":0,"cell_chars":16384,"cell_head_chars":4096},"cells_cut":0,"cells_raw":0,"read":"whole","date_system":"1900"}

{"sheet":"الارصدة","index":0,"n_rows":85,"n_cols":5,"rows_kept":85,"cut":false,"hidden":false,"merged":[]}
["كود","الاسم","بداية المدة","تنزيلات","المتبقى"]
[27,"سماح",{"$f":"SUMIF('قاعدة البيانات'!B:B,A2,'قاعدة البيانات'!E:E)","v":2115},{"$f":"SUMIF('قاعدة البيانات'!B:B,A2,'قاعدة البيانات'!F:F)","v":1410},{"$f":"C2-D2","v":705}]
[29,"سلف",{"$f":"SUMIF('قاعدة البيانات'!B:B,A3,'قاعدة البيانات'!E:E)","v":4500},{"$f":"SUMIF('قاعدة البيانات'!B:B,A3,'قاعدة البيانات'!F:F)","v":2000},{"$f":"C3-D3","v":2500}]
[50,"ام سحر",{"$f":"SUMIF('قاعدة البيانات'!B:B,A4,'قاعدة البيانات'!E:E)","v":6660},{"$f":"SUMIF('قاعدة البيانات'!B:B,A4,'قاعدة البيانات'!F:F)","v":1000},{"$f":"C4-D4","v":5660}]
[55,"دعاء سلام",{"$f":"SUMIF('قاعدة البيانات'!B:B,A5,'قاعدة البيانات'!E:E)","v":2000},{"$f":"SUMIF('قاعدة البيانات'!B:B,A5,'قاعدة البيانات'!F:F)","v":1500},{"$f":"C5-D5","v":500}]
[57,"بسام درويش",{"$f":"SUMIF('قاعدة البيانات'!B:B,A6,'قاعدة البيانات'!E:E)","v":2300},{"$f":"SUMIF('قاعدة البيانات'!B:B,A6,'قاعدة البيانات'!F:F)","v":1600},700]
[59,"تامر",{"$f":"SUMIF('قاعدة البيانات'!B:B,A7,'قاعدة البيانات'!E:E)","v":1800},{"$f":"SUMIF('قاعدة البيانات'!B:B,A7,'قاعدة البيانات'!F:F)","v":1600},{"$f":"C7-D7","v":200}]
[60,"سعاد وهيب",{"$f":"SUMIF('قاعدة البيانات'!B:B,A8,'قاعدة البيانات'!E:E)","v":180},{"$f":"SUMIF('قاعدة البيانات'!B:B,A8,'قاعدة البيانات'!F:F)","v":80},100]
[61,"مايكل 2",{"$f":"SUMIF('قاعدة البيانات'!B:B,A9,'قاعدة البيانات'!E:E)","v":3400},{"$f":"SUMIF('قاعدة البيانات'!B:B,A9,'قاعدة البيانات'!F:F)","v":3100},300]
[66,"موسى محمد عبدالغنى /كيسة",{"$f":"SUMIF('قاعدة البيانات'!B:B,A10,'قاعدة البيانات'!E:E)","v":2430},{"$f":"SUMIF('قاعدة البيانات'!B:B,A10,'قاعدة البيانات'!F:F)","v":1800},{"$f":"C10-D10","v":630}]
[68,"موسى محمد عبدالغنى/جراند نيو",{"$f":"SUMIF('قاعدة البيانات'!B:B,A11,'قاعدة البيانات'!E:E)","v":6400},{"$f":"SUMIF('قاعدة البيانات'!B:B,A11,'قاعدة البيانات'!F:F)","v":3400},3000]
[70,"موسى محمد عبدالغنى /جراند2",{"$f":"SUMIF('قاعدة البيانات'!B:B,A12,'قاعدة البيانات'!E:E)","v":2500},{"$f":"SUMIF('قاعدة البيانات'!B:B,A12,'قاعدة البيانات'!F:F)","v":1400},1100]
[71,"دعاء سيد احمد",{"$f":"SUMIF('قاعدة البيانات'!B:B,A13,'قاعدة البيانات'!E:E)","v":2550},{"$f":"SUMIF('قاعدة البيانات'!B:B,A13,'قاعدة البيانات'!F:F)","v":1850},700]
[72,"صالح محمود 2",{"$f":"SUMIF('قاعدة البيانات'!B:B,A14,'قاعدة البيانات'!E:E)","v":1575},{"$f":"SUMIF('قاعدة البيانات'!B:B,A14,'قاعدة البيانات'!F:F)","v":1235},{"$f":"C14-D14","v":340}]
[73,"موسى محمد عبدالغنى- جراند باير",{"$f":"SUMIF('قاعدة البيانات'!B:B,A15,'قاعدة البيانات'!E:E)","v":2300},{"$f":"SUMIF('قاعدة البيانات'!B:B,A15,'قاعدة البيانات'!F:F)","v":1300},1000]
[74,"موسى محمد عبدالغنى /2موبايل",{"$f":"SUMIF('قاعدة البيانات'!B:B,A16,'قاعدة البيانات'!E:E)","v":4550},{"$f":"SUMIF('قاعدة البيانات'!B:B,A16,'قاعدة البيانات'!F:F)","v":2300},2250]
[75,"موسى محمد عبدالغنى- جراند باير2",{"$f":"SUMIF('قاعدة البيانات'!B:B,A17,'قاعدة البيانات'!E:E)","v":2450},{"$f":"SUMIF('قاعدة البيانات'!B:B,A17,'قاعدة البيانات'!F:F)","v":1500},950]
[77,"موسى جراند -بدون مقدم",{"$f":"SUMIF('قاعدة البيانات'!B:B,A18,'قاعدة البيانات'!E:E)","v":2550},{"$f":"SUMIF('قاعدة البيانات'!B:B,A18,'قاعدة البيانات'!F:F)","v":1200},1350]
[78,"موسى جراند -بدون مقدم2",{"$f":"SUMIF('قاعدة البيانات'!B:B,A19,'قاعدة البيانات'!E:E)","v":3150},{"$f":"SUMIF('قاعدة البيانات'!B:B,A19,'قاعدة البيانات'!F:F)","v":1400},{"$f":"C19-D19","v":1750}]
[80,"اخت ام عمرو",700,{"$f":"SUMIF('قاعدة البيانات'!B:B,A20,'قاعدة البيانات'!F:F)","v":0},{"$f":"C20-D20","v":700}]
[81,"موسى محمد - نود4 - عبدالرازق",{"$f":"SUMIF('قاعدة البيانات'!B:B,A21,'قاعدة البيانات'!E:E)","v":7500},{"$f":"SUMIF('قاعدة البيانات'!B:B,A21,'قاعدة البيانات'!F:F)","v":4240},3260]
[82,"موسى محمد - نود2",{"$f":"SUMIF('قاعدة البيانات'!B:B,A22,'قاعدة البيانات'!E:E)","v":2500},{"$f":"SUMIF('قاعدة البيانات'!B:B,A22,'قاعدة البيانات'!F:F)","v":1260},1240]
[83," نهاد حجازى",{"$f":"SUMIF('قاعدة البيانات'!B:B,A23,'قاعدة البيانات'!E:E)","v":1300},{"$f":"SUMIF('قاعدة البيانات'!B:B,A23,'قاعدة البيانات'!F:F)","v":1150},150]
[84,"رشا-اكسبيريا z-r",{"$f":"SUMIF('قاعدة البيانات'!B:B,A24,'قاعدة البيانات'!E:E)","v":2350},{"$f":"SUMIF('قاعدة البيانات'!B:B,A24,'قاعدة البيانات'!F:F)","v":1300},{"$f":"C24-D24","v":1050}]
[85,"نود2- عبدالرازق",{"$f":"SUMIF('قاعدة البيانات'!B:B,A25,'قاعدة البيانات'!E:E)","v":5200},{"$f":"SUMIF('قاعدة البيانات'!B:B,A25,'قاعدة البيانات'!F:F)","v":2750},2450]
[86,"موسى S3new",{"$f":"SUMIF('قاعدة البيانات'!B:B,A26,'قاعدة البيانات'!E:E)","v":2425},{"$f":"SUMIF('قاعدة البيانات'!B:B,A26,'قاعدة البيانات'!F:F)","v":1350},1075]
[88,"دعاء-اكسبيرياz-r",{"$f":"SUMIF('قاعدة البيانات'!B:B,A27,'قاعدة البيانات'!E:E)","v":1350},{"$f":"SUMIF('قاعدة البيانات'!B:B,A27,'قاعدة البيانات'!F:F)","v":1100},250]
[89,"موسى- تكنو",{"$f":"SUMIF('قاعدة البيانات'!B:B,A28,'قاعدة البيانات'!E:E)","v":800},{"$f":"SUMIF('قاعدة البيانات'!B:B,A28,'قاعدة البيانات'!F:F)","v":350},450]
[90,"محمد الحنفى",{"$f":"SUMIF('قاعدة البيانات'!B:B,A29,'قاعدة البيانات'!E:E)","v":2800},{"$f":"SUMIF('قاعدة البيانات'!B:B,A29,'قاعدة البيانات'!F:F)","v":2200},{"$f":"C29-D29","v":600}]
[91,"عاطف شوقى الشيخ",{"$f":"SUMIF('قاعدة البيانات'!B:B,A30,'قاعدة البيانات'!E:E)","v":480},{"$f":"SUMIF('قاعدة البيانات'!B:B,A30,'قاعدة البيانات'!F:F)","v":250},230]
[92,"صلاح محمود 2",{"$f":"SUMIF('قاعدة البيانات'!B:B,A31,'قاعدة البيانات'!E:E)","v":1950},{"$f":"SUMIF('قاعدة البيانات'!B:B,A31,'قاعدة البيانات'!F:F)","v":700},1250]
[93,"موسى 2مروحة",{"$f":"SUMIF('قاعدة البيانات'!B:B,A32,'قاعدة البيانات'!E:E)","v":960},{"$f":"SUMIF('قاعدة البيانات'!B:B,A32,'قاعدة البيانات'!F:F)","v":300},660]
[95,"محمد حبيب",{"$f":"SUMIF('قاعدة البيانات'!B:B,A33,'قاعدة البيانات'!E:E)","v":1800},{"$f":"SUMIF('قاعدة البيانات'!B:B,A33,'قاعدة البيانات'!F:F)","v":800},1000]
[96,"محمد الفولى",{"$f":"SUMIF('قاعدة البيانات'!B:B,A34,'قاعدة البيانات'!E:E)","v":2800},{"$f":"SUMIF('قاعدة البيانات'!B:B,A34,'قاعدة البيانات'!F:F)","v":2300},{"$f":"C34-D34","v":500}]
[97,"ساندى",{"$f":"SUMIF('قاعدة البيانات'!B:B,A35,'قاعدة البيانات'!E:E)","v":600},{"$f":"SUMIF('قاعدة البيانات'!B:B,A35,'قاعدة البيانات'!F:F)","v":300},300]
[98,"s3 - موسى محمد",{"$f":"SUMIF('قاعدة البيانات'!B:B,A36,'قاعدة البيانات'!E:E)","v":4550},{"$f":"SUMIF('قاعدة البيانات'!B:B,A36,'قاعدة البيانات'!F:F)","v":1300},3250]
[99,"موسى محمد - جلاكسى كور",{"$f":"SUMIF('قاعدة البيانات'!B:B,A37,'قاعدة البيانات'!E:E)","v":1500},{"$f":"SUMIF('قاعدة البيانات'!B:B,A37,'قاعدة البيانات'!F:F)","v":530},970]
[100,"موسى محمد - جلاكسى ",{"$f":"SUMIF('قاعدة البيانات'!B:B,A38,'قاعدة البيانات'!E:E)","v":1270},{"$f":"SUMIF('قاعدة البيانات'!B:B,A38,'قاعدة البيانات'!F:F)","v":450},820]
[101,"موسى محمد - جراند2",{"$f":"SUMIF('قاعدة البيانات'!B:B,A39,'قاعدة البيانات'!E:E)","v":2310},{"$f":"SUMIF('قاعدة البيانات'!B:B,A39,'قاعدة البيانات'!F:F)","v":840},1470]
[102,"حنان الحنفى",{"$f":"SUMIF('قاعدة البيانات'!B:B,A40,'قاعدة البيانات'!E:E)","v":350},{"$f":"SUMIF('قاعدة البيانات'!B:B,A40,'قاعدة البيانات'!F:F)","v":200},{"$f":"C40-D40","v":150}]
[103,"تامر2",{"$f":"SUMIF('قاعدة البيانات'!B:B,A41,'قاعدة البيانات'!E:E)","v":650},{"$f":"SUMIF('قاعدة البيانات'!B:B,A41,'قاعدة البيانات'!F:F)","v":300},350]
[105,"موسى مكنسة",{"$f":"SUMIF('قاعدة البيانات'!B:B,A42,'قاعدة البيانات'!E:E)","v":650},{"$f":"SUMIF('قاعدة البيانات'!B:B,A42,'قاعدة البيانات'!F:F)","v":100},550]
[106,"s3new-musa",{"$f":"SUMIF('قاعدة البيانات'!B:B,A43,'قاعدة البيانات'!E:E)","v":2320},{"$f":"SUMIF('قاعدة البيانات'!B:B,A43,'قاعدة البيانات'!F:F)","v":800},1520]
[107,"not2-2",{"$f":"SUMIF('قاعدة البيانات'!B:B,A44,'قاعدة البيانات'!E:E)","v":2450},{"$f":"SUMIF('قاعدة البيانات'!B:B,A44,'قاعدة البيانات'!F:F)","v":830},1620]
[108,"not2-3",{"$f":"SUMIF('قاعدة البيانات'!B:B,A45,'قاعدة البيانات'!E:E)","v":2450},{"$f":"SUMIF('قاعدة البيانات'!B:B,A45,'قاعدة البيانات'!F:F)","v":830},1620]
[109,"not3-2",{"$f":"SUMIF('قاعدة البيانات'!B:B,A46,'قاعدة البيانات'!E:E)","v":3380},{"$f":"SUMIF('قاعدة البيانات'!B:B,A46,'قاعدة البيانات'!F:F)","v":900},2480]
[110,"e5",{"$f":"SUMIF('قاعدة البيانات'!B:B,A47,'قاعدة البيانات'!E:E)","v":3575},{"$f":"SUMIF('قاعدة البيانات'!B:B,A47,'قاعدة البيانات'!F:F)","v":1075},2500]
[112,"محمد السيسى",{"$f":"SUMIF('قاعدة البيانات'!B:B,A48,'قاعدة البيانات'!E:E)","v":300},{"$f":"SUMIF('قاعدة البيانات'!B:B,A48,'قاعدة البيانات'!F:F)","v":150},{"$f":"C48-D48","v":150}]
[113,"ام عمرو G1",{"$f":"SUMIF('قاعدة البيانات'!B:B,A49,'قاعدة البيانات'!E:E)","v":1300},{"$f":"SUMIF('قاعدة البيانات'!B:B,A49,'قاعدة البيانات'!F:F)","v":400},900]
[114,"ام عمرو3000",{"$f":"SUMIF('قاعدة البيانات'!B:B,A50,'قاعدة البيانات'!E:E)","v":4000},{"$f":"SUMIF('قاعدة البيانات'!B:B,A50,'قاعدة البيانات'!F:F)","v":800},3200]
[115,"musa-note4",{"$f":"SUMIF('قاعدة البيانات'!B:B,A51,'قاعدة البيانات'!E:E)","v":6760},{"$f":"SUMIF('قاعدة البيانات'!B:B,A51,'قاعدة البيانات'!F:F)","v":1550},5210]
[116,"musa-note3-3",{"$f":"SUMIF('قاعدة البيانات'!B:B,A52,'قاعدة البيانات'!E:E)","v":4875},{"$f":"SUMIF('قاعدة البيانات'!B:B,A52,'قاعدة البيانات'!F:F)","v":1010},3865]
[117,"musa-amr",{"$f":"SUMIF('قاعدة البيانات'!B:B,A53,'قاعدة البيانات'!E:E)","v":1200},{"$f":"SUMIF('قاعدة البيانات'!B:B,A53,'قاعدة البيانات'!F:F)","v":75},1125]
[118,"عبير موسى",{"$f":"SUMIF('قاعدة البيانات'!B:B,A54,'قاعدة البيانات'!E:E)","v":935},{"$f":"SUMIF('قاعدة البيانات'!B:B,A54,'قاعدة البيانات'!F:F)","v":250},685]
[119,"جراند نيو بلص-أيمن",{"$f":"SUMIF('قاعدة البيانات'!B:B,A55,'قاعدة البيانات'!E:E)","v":1600},{"$f":"SUMIF('قاعدة البيانات'!B:B,A55,'قاعدة البيانات'!F:F)","v":400},1200]
[120,"محمد طعيمة",{"$f":"SUMIF('قاعدة البيانات'!B:B,A56,'قاعدة البيانات'!E:E)","v":850},{"$f":"SUMIF('قاعدة البيانات'!B:B,A56,'قاعدة البيانات'!F:F)","v":700},150]
[121,"موسى j7",{"$f":"SUMIF('قاعدة البيانات'!B:B,A57,'قاعدة البيانات'!E:E)","v":5850},{"$f":"SUMIF('قاعدة البيانات'!B:B,A57,'قاعدة البيانات'!F:F)","v":0},5850]
[122,"موسى j5",{"$f":"SUMIF('قاعدة البيانات'!B:B,A58,'قاعدة البيانات'!E:E)","v":2340},{"$f":"SUMIF('قاعدة البيانات'!B:B,A58,'قاعدة البيانات'!F:F)","v":500},1840]
[123,"ابراهيم شوقى بدر",{"$f":"SUMIF('قاعدة البيانات'!B:B,A59,'قاعدة البيانات'!E:E)","v":1150},{"$f":"SUMIF('قاعدة البيانات'!B:B,A59,'قاعدة البيانات'!F:F)","v":800},350]
[124,"محمد ثروت",{"$f":"SUMIF('قاعدة البيانات'!B:B,A60,'قاعدة البيانات'!E:E)","v":1650},{"$f":"SUMIF('قاعدة البيانات'!B:B,A60,'قاعدة البيانات'!F:F)","v":0},1650]
[125,"musa-note3-4",{"$f":"SUMIF('قاعدة البيانات'!B:B,A61,'قاعدة البيانات'!E:E)","v":2750},{"$f":"SUMIF('قاعدة البيانات'!B:B,A61,'قاعدة البيانات'!F:F)","v":0},2750]
[126,"musa-note3-5",{"$f":"SUMIF('قاعدة البيانات'!B:B,A62,'قاعدة البيانات'!E:E)","v":2000},{"$f":"SUMIF('قاعدة البيانات'!B:B,A62,'قاعدة البيانات'!F:F)","v":0},2000]
[128,"منى",{"$f":"SUMIF('قاعدة البيانات'!B:B,A63,'قاعدة البيانات'!E:E)","v":650},{"$f":"SUMIF('قاعدة البيانات'!B:B,A63,'قاعدة البيانات'!F:F)","v":0},650]
[129,"جى1-حلامشة",{"$f":"SUMIF('قاعدة البيانات'!B:B,A64,'قاعدة البيانات'!E:E)","v":1300},{"$f":"SUMIF('قاعدة البيانات'!B:B,A64,'قاعدة البيانات'!F:F)","v":0},1300]
[130,"محمد طعيمة-صب",{"$f":"SUMIF('قاعدة البيانات'!B:B,A65,'قاعدة البيانات'!E:E)","v":350},{"$f":"SUMIF('قاعدة البيانات'!B:B,A65,'قاعدة البيانات'!F:F)","v":150},200]
[131,"دنيا سونى اكسبيريا2",{"$f":"SUMIF('قاعدة البيانات'!B:B,A66,'قاعدة البيانات'!E:E)","v":2800},{"$f":"SUMIF('قاعدة البيانات'!B:B,A66,'قاعدة البيانات'!F:F)","v":1000},1800]
[132,"MUSA2-J7",{"$f":"SUMIF('قاعدة البيانات'!B:B,A67,'قاعدة البيانات'!E:E)","v":5850},{"$f":"SUMIF('قاعدة البيانات'!B:B,A67,'قاعدة البيانات'!F:F)","v":1000},4850]
[133,"NOKIA225-2",{"$f":"SUMIF('قاعدة البيانات'!B:B,A68,'قاعدة البيانات'!E:E)","v":800},{"$f":"SUMIF('قاعدة البيانات'!B:B,A68,'قاعدة البيانات'!F:F)","v":0},800]
[134,"om amr",{"$f":"SUMIF('قاعدة البيانات'!B:B,A69,'قاعدة البيانات'!E:E)","v":6600},{"$f":"SUMIF('قاعدة البيانات'!B:B,A69,'قاعدة البيانات'!F:F)","v":300},6300]
[135,"ثروت",{"$f":"SUMIF('قاعدة البيانات'!B:B,A70,'قاعدة البيانات'!E:E)","v":510},{"$f":"SUMIF('قاعدة البيانات'!B:B,A70,'قاعدة البيانات'!F:F)","v":0},510]
[136,"musa-j1--1/11",{"$f":"SUMIF('قاعدة البيانات'!B:B,A71,'قاعدة البيانات'!E:E)","v":1300},{"$f":"SUMIF('قاعدة البيانات'!B:B,A71,'قاعدة البيانات'!F:F)","v":0},1300]
[137,"G130",{"$f":"SUMIF('قاعدة البيانات'!B:B,A72,'قاعدة البيانات'!E:E)","v":775},{"$f":"SUMIF('قاعدة البيانات'!B:B,A72,'قاعدة البيانات'!F:F)","v":0},775]
[138,"nokIA225-3",{"$f":"SUMIF('قاعدة البيانات'!B:B,A73,'قاعدة البيانات'!E:E)","v":800},{"$f":"SUMIF('قاعدة البيانات'!B:B,A73,'قاعدة البيانات'!F:F)","v":0},800]
[139,"عزيزة",{"$f":"SUMIF('قاعدة البيانات'!B:B,A74,'قاعدة البيانات'!E:E)","v":420},{"$f":"SUMIF('قاعدة البيانات'!B:B,A74,'قاعدة البيانات'!F:F)","v":100},320]
[140,"رامى شوقى عبده",{"$f":"SUMIF('قاعدة البيانات'!B:B,A75,'قاعدة البيانات'!E:E)","v":1900},{"$f":"SUMIF('قاعدة البيانات'!B:B,A75,'قاعدة البيانات'!F:F)","v":500},1400]
[141,"دنيا سونى اكسبيريا2-2",{"$f":"SUMIF('قاعدة البيانات'!B:B,A76,'قاعدة البيانات'!E:E)","v":2450},{"$f":"SUMIF('قاعدة البيانات'!B:B,A76,'قاعدة البيانات'!F:F)","v":800},1650]
[142,"السيدG5",{"$f":"SUMIF('قاعدة البيانات'!B:B,A77,'قاعدة البيانات'!E:E)","v":2300},{"$f":"SUMIF('قاعدة البيانات'!B:B,A77,'قاعدة البيانات'!F:F)","v":500},1800]
[143,"رشا هاواوىb8",{"$f":"SUMIF('قاعدة البيانات'!B:B,A78,'قاعدة البيانات'!E:E)","v":2550},{"$f":"SUMIF('قاعدة البيانات'!B:B,A78,'قاعدة البيانات'!F:F)","v":500},2050]
[144,"ام عمرو جى7",{"$f":"SUMIF('قاعدة البيانات'!B:B,A79,'قاعدة البيانات'!E:E)","v":3250},{"$f":"SUMIF('قاعدة البيانات'!B:B,A79,'قاعدة البيانات'!F:F)","v":0},3250]
[145,"شاشة   عمرو ",{"$f":"SUMIF('قاعدة البيانات'!B:B,A80,'قاعدة البيانات'!E:E)","v":350},{"$f":"SUMIF('قاعدة البيانات'!B:B,A80,'قاعدة البيانات'!F:F)","v":0},350]
{"$rows_left_out":6}
{"sheet":"DATA","index":1,"n_rows":186,"n_cols":2,"rows_kept":186,"cut":false,"hidden":false,"merged":[]}
["كود العميل","الاسم"]
[1," محمد  1"]
[2," محمد  2"]
[3," محمد  3"]
[4," محمد  4"]
[5,"حمادة بسام"]
[6," محمد  6"]
[7," محمد  7"]
[8," محمد  8"]
[9,"علياء"]
[10," محمد  10"]
[11," محمد  11"]
[12," محمد  12"]
[13," محمد  13"]
[14," محمد  14"]
[15,"هانى صلاح"]
[16," محمد  16"]
[17," محمد  17"]
[18," محمد  18"]
[19," محمد  19"]
[20," محمد  20"]
[21,"مصطفى ليلة"]
[22," محمد  22"]
[23," محمد  23"]
[24," محمد  24"]
[25,"نهاد"]
[26," محمد  26"]
[27,"سماح"]
[28," محمد  28"]
[29,"سلف"]
[30," محمد  30"]
[31," محمد  31"]
[32," محمد  32"]
[33," محمد  33"]
[34,"باسم النجار"]
[35," محمد  35"]
[36," محمد  36"]
[37," محمد  37"]
[38," محمد  38"]
[39," محمد  39"]
[40," محمد  40"]
[41," محمد  41"]
[42," محمد  42"]
[43," محمد  43"]
[44," محمد  44"]
[45," محمد  45"]
[46," محمد  46"]
[47," محمد  47"]
[48," محمد  48"]
[49," محمد  49"]
[50,"ام سحر"]
[51," محمد  51"]
[52," محمد  52"]
[53," محمد  53"]
[54," محمد  54"]
[55,"دعاء سلام"]
[56," محمد  56"]
[57,"بسام درويش"]
[58," محمد  58"]
[59,"تامر"]
[60,"سعاد وهيب"]
[61,"مايكل 2"]
[62," محمد  62"]
[63," محمد  63"]
[64," محمد  64"]
[65," محمد  65"]
[66,"موسى محمد عبدالغنى /كيسة"]
[67," محمد  67"]
[68,"موسى محمد عبدالغنى/جراند نيو"]
[69," محمد  69"]
[70,"موسى محمد عبدالغنى /جراند2"]
[71,"دعاء سيد احمد"]
[72,"صالح محمود 2"]
[73,"موسى محمد عبدالغنى- جراند باير"]
[74,"موسى محمد عبدالغنى /2موبايل"]
[75,"موسى محمد عبدالغنى- جراند باير2"]
[76," محمد  76"]
[77,"موسى جراند -بدون مقدم"]
[78,"موسى جراند -بدون مقدم2"]
[79," محمد  79"]
{"$rows_left_out":107}
{"sheet":"قاعدة البيانات","index":2,"n_rows":1986,"n_cols":6,"rows_kept":1986,"cut":false,"hidden":false,"merged":[]}
["التاريخ","كود ","الاسم","البيان","المبلغ","الاقساط"]
["2014-05-03",1,{"$f":"VLOOKUP(B2,DATA!A:B,2,0)","v":" محمد  1"},"المبلغ",900]
["2014-05-03",1,{"$f":"VLOOKUP(B3,DATA!A:B,2,0)","v":" محمد  1"},"اقساط",null,250]
["2014-05-15",1,{"$f":"VLOOKUP(B4,DATA!A:B,2,0)","v":" محمد  1"},"قسط",null,100]
["2014-07-17",1,{"$f":"VLOOKUP(B5,DATA!A:B,2,0)","v":" محمد  1"},"قسط",null,300]
["2014-07-25",1,{"$f":"VLOOKUP(B6,DATA!A:B,2,0)","v":" محمد  1"},"قسط",null,250]
["2014-05-03",2,{"$f":"VLOOKUP(B7,DATA!A:B,2,0)","v":" محمد  2"},"المبلغ",200]
["2014-05-03",2,{"$f":"VLOOKUP(B8,DATA!A:B,2,0)","v":" محمد  2"},"اقساط",null,75]
["2014-05-04",2,{"$f":"VLOOKUP(B9,DATA!A:B,2,0)","v":" محمد  2"},"قسط",null,50]
["2014-10-07",2,{"$f":"VLOOKUP(B10,DATA!A:B,2,0)","v":" محمد  2"},"قسط",null,50]
["2014-05-03",3,{"$f":"VLOOKUP(B11,DATA!A:B,2,0)","v":" محمد  3"},"المبلغ",650]
["2014-05-03",3,{"$f":"VLOOKUP(B12,DATA!A:B,2,0)","v":" محمد  3"},"اقساط",null,200]
["2014-05-26",3,{"$f":"VLOOKUP(B13,DATA!A:B,2,0)","v":" محمد  3"},"قسط",null,100]
["2014-06-27",3,{"$f":"VLOOKUP(B14,DATA!A:B,2,0)","v":" محمد  3"},"قسط",null,100]
["2014-09-05",3,{"$f":"VLOOKUP(B15,DATA!A:B,2,0)","v":" محمد  3"},"قسط",null,100]
["2014-08-07",3,{"$f":"VLOOKUP(B16,DATA!A:B,2,0)","v":" محمد  3"},"قسط",null,100]
["2014-09-24",3,{"$f":"VLOOKUP(B17,DATA!A:B,2,0)","v":" محمد  3"},"قسط",null,50]
["2014-05-03",4,{"$f":"VLOOKUP(B18,DATA!A:B,2,0)","v":" محمد  4"},"المبلغ",400]
["2014-05-03",4,{"$f":"VLOOKUP(B19,DATA!A:B,2,0)","v":" محمد  4"},"اقساط",null,100]
["2014-05-26",4,{"$f":"VLOOKUP(B20,DATA!A:B,2,0)","v":" محمد  4"},"قسط",null,50]
["2014-06-27",4,{"$f":"VLOOKUP(B21,DATA!A:B,2,0)","v":" محمد  4"},"قسط",null,50]
["2014-09-05",4,{"$f":"VLOOKUP(B22,DATA!A:B,2,0)","v":" محمد  4"},"قسط",null,50]
["2014-10-07",4,{"$f":"VLOOKUP(B23,DATA!A:B,2,0)","v":" محمد  4"},"قسط",null,50]
["2014-10-31",4,{"$f":"VLOOKUP(B24,DATA!A:B,2,0)","v":" محمد  4"},"قسط",null,50]
["2014-11-21",4,{"$f":"VLOOKUP(B25,DATA!A:B,2,0)","v":" محمد  4"},"قسط",null,50]
["2014-05-03",5,{"$f":"VLOOKUP(B26,DATA!A:B,2,0)","v":"حمادة بسام"},"المبلغ",2450]
["2014-05-04",5,{"$f":"VLOOKUP(B27,DATA!A:B,2,0)","v":"حمادة بسام"},"قسط",null,150]
["2014-05-03",5,{"$f":"VLOOKUP(B28,DATA!A:B,2,0)","v":"حمادة بسام"},"اقساط",null,600]
["2014-06-27",5,{"$f":"VLOOKUP(B29,DATA!A:B,2,0)","v":"حمادة بسام"},"قسط",null,150]
["2014-07-11",5,{"$f":"VLOOKUP(B30,DATA!A:B,2,0)","v":"حمادة بسام"},"قسط",null,150]
["2014-08-05",5,{"$f":"VLOOKUP(B31,DATA!A:B,2,0)","v":"حمادة بسام"},"قسط",null,150]
["2014-09-05",5,{"$f":"VLOOKUP(B32,DATA!A:B,2,0)","v":"حمادة بسام"},"قسط",null,150]
["2014-11-07",5,{"$f":"VLOOKUP(B33,DATA!A:B,2,0)","v":"حمادة بسام"},"قسط",null,150]
["2014-12-18",5,{"$f":"VLOOKUP(B34,DATA!A:B,2,0)","v":"حمادة بسام"},"قسط",null,150]
["2015-01-16",5,{"$f":"VLOOKUP(B35,DATA!A:B,2,0)","v":"حمادة بسام"},"قسط",null,150]
["2015-02-22",5,{"$f":"VLOOKUP(B36,DATA!A:B,2,0)","v":"حمادة بسام"},"قسط",null,150]
["2015-05-08",5,{"$f":"VLOOKUP(B37,DATA!A:B,2,0)","v":"حمادة بسام"},"قسط",null,150]
["2015-05-28",5,{"$f":"VLOOKUP(B38,DATA!A:B,2,0)","v":"حمادة بسام"},null,null,150]
["2014-05-03",6,{"$f":"VLOOKUP(B39,DATA!A:B,2,0)","v":" محمد  6"},"المبلغ",2030]
["2014-05-03",6,{"$f":"VLOOKUP(B40,DATA!A:B,2,0)","v":" محمد  6"},"اقساط",null,450]
["2014-05-26",6,{"$f":"VLOOKUP(B41,DATA!A:B,2,0)","v":" محمد  6"},"قسط",null,350]
["2014-06-27",6,{"$f":"VLOOKUP(B42,DATA!A:B,2,0)","v":" محمد  6"},"قسط",null,100]
["2014-07-11",6,{"$f":"VLOOKUP(B43,DATA!A:B,2,0)","v":" محمد  6"},"قسط",null,125]
["2014-08-07",6,{"$f":"VLOOKUP(B44,DATA!A:B,2,0)","v":" محمد  6"},"قسط",null,100]
["2014-09-05",6,{"$f":"VLOOKUP(B45,DATA!A:B,2,0)","v":" محمد  6"},"قسط",null,150]
["2014-09-24",6,{"$f":"VLOOKUP(B46,DATA!A:B,2,0)","v":" محمد  6"},"قسط",null,175]
["2014-10-31",6,{"$f":"VLOOKUP(B47,DATA!A:B,2,0)","v":" محمد  6"},"قسط",null,200]
["2014-11-21",6,{"$f":"VLOOKUP(B48,DATA!A:B,2,0)","v":" محمد  6"},"قسط",null,200]
["2014-12-24",6,{"$f":"VLOOKUP(B49,DATA!A:B,2,0)","v":" محمد  6"},null,null,180]
["2014-05-03",7,{"$f":"VLOOKUP(B50,DATA!A:B,2,0)","v":" محمد  7"},"المبلغ",450]
["2014-05-03",7,{"$f":"VLOOKUP(B51,DATA!A:B,2,0)","v":" محمد  7"},"اقساط",null,200]
["2014-06-27",7,{"$f":"VLOOKUP(B52,DATA!A:B,2,0)","v":" محمد  7"},"قسط",null,50]
["2014-07-17",7,{"$f":"VLOOKUP(B53,DATA!A:B,2,0)","v":" محمد  7"},"قسط",null,50]
["2014-08-15",7,{"$f":"VLOOKUP(B54,DATA!A:B,2,0)","v":" محمد  7"}," قسط",null,50]
["2014-09-19",7,{"$f":"VLOOKUP(B55,DATA!A:B,2,0)","v":" محمد  7"},"قسط",null,100]
["2014-05-03",8,{"$f":"VLOOKUP(B56,DATA!A:B,2,0)","v":" محمد  8"},"المبلغ",210]
["2014-05-03",8,{"$f":"VLOOKUP(B57,DATA!A:B,2,0)","v":" محمد  8"},"اقساط",null,80]
["2014-06-27",8,{"$f":"VLOOKUP(B58,DATA!A:B,2,0)","v":" محمد  8"},"قسط",null,20]
["2014-07-17",8,{"$f":"VLOOKUP(B59,DATA!A:B,2,0)","v":" محمد  8"},"قسط",null,20]
["2014-08-15",8,{"$f":"VLOOKUP(B60,DATA!A:B,2,0)","v":" محمد  8"},"قسط",null,20]
["2014-05-03",9,{"$f":"VLOOKUP(B61,DATA!A:B,2,0)","v":"علياء"},"اقساط",null,200]
["2014-05-15",9,{"$f":"VLOOKUP(B62,DATA!A:B,2,0)","v":"علياء"},"قسط",null,100]
["2014-05-03",9,{"$f":"VLOOKUP(B63,DATA!A:B,2,0)","v":"علياء"},"المبلغ",525]
["2014-06-27",9,{"$f":"VLOOKUP(B64,DATA!A:B,2,0)","v":"علياء"},"قسط",null,100]
["2014-08-05",9,{"$f":"VLOOKUP(B65,DATA!A:B,2,0)","v":"علياء"},"قسط",null,125]
["2014-05-03",10,{"$f":"VLOOKUP(B66,DATA!A:B,2,0)","v":" محمد  10"},"المبلغ",2500]
["2014-05-03",10,{"$f":"VLOOKUP(B67,DATA!A:B,2,0)","v":" محمد  10"},"اقساط",null,400]
["2014-05-10",10,{"$f":"VLOOKUP(B68,DATA!A:B,2,0)","v":" محمد  10"},"قسط",null,200]
["2014-06-25",10,{"$f":"VLOOKUP(B69,DATA!A:B,2,0)","v":" محمد  10"},"قسط",null,200]
["2014-07-25",10,{"$f":"VLOOKUP(B70,DATA!A:B,2,0)","v":" محمد  10"},"قسط",null,200]
["2014-06-12",11,{"$f":"VLOOKUP(B71,DATA!A:B,2,0)","v":" محمد  11"}]
["2014-05-03",11,{"$f":"VLOOKUP(B72,DATA!A:B,2,0)","v":" محمد  11"}]
["2014-05-03",12,{"$f":"VLOOKUP(B73,DATA!A:B,2,0)","v":" محمد  12"},"باقى صيانة لاب",80]
["2014-05-03",13,{"$f":"VLOOKUP(B74,DATA!A:B,2,0)","v":" محمد  13"},"المبلغ",2000]
["2014-05-03",14,{"$f":"VLOOKUP(B75,DATA!A:B,2,0)","v":" محمد  14"},"المبلغ",2500]
["2014-05-03",15,{"$f":"VLOOKUP(B76,DATA!A:B,2,0)","v":"هانى صلاح"},"مقدم",null,225]
["2014-05-03",15,{"$f":"VLOOKUP(B77,DATA!A:B,2,0)","v":"هانى صلاح"},"المبلغ",825]
["2014-05-30",15,{"$f":"VLOOKUP(B78,DATA!A:B,2,0)","v":"هانى صلاح"},"قسط",null,50]
["2014-07-01",15,{"$f":"VLOOKUP(B79,DATA!A:B,2,0)","v":"هانى صلاح"},"قسط",null,75]
["2014-08-08",15,{"$f":"VLOOKUP(B80,DATA!A:B,2,0)","v":"هانى صلاح"},"قسط",null,50]
{"$rows_left_out":1906}