{"text_format":"1","workbook":"xlsx","n_sheets":3,"sheets":["الارصدة","DATA","قاعدة البيانات"],"not_rendered":{"charts":0,"images":0,"macros":1,"external_links":0,"defined_names":2,"comments":1,"pivot_tables":0},"unopened":[],"bounds":{"document_bytes":16777216,"sheet_cells":100000,"rows_first":2000,"rows_last":500,"rows_between":2000,"halvings":0,"cell_chars":16384,"cell_head_chars":4096},"cells_cut":0,"cells_raw":0,"read":"whole","date_system":"1900"}

{"sheet":"الارصدة","index":0,"n_rows":85,"n_cols":5,"rows_kept":85,"cut":false,"hidden":false,"merged":[]}
["كود","الاسم","بداية المدة","تنزيلات","المتبقى"]
[27,"سماح",{"$f":"SUMIF('قاعدة البيانات'!B:B,A2,'قاعدة البيانات'!E:E)","v":2115},{"$f":"SUMIF('قاعدة البيانات'!B:B,A2,'قاعدة البيانات'!F:F)","v":1410},{"$f":"C2-D2","v":705}]
[29,"سلف",{"$f":"SUMIF('قاعدة البيانات'!B:B,A3,'قاعدة البيانات'!E:E)","v":4500},{"$f":"SUMIF('قاعدة البيانات'!B:B,A3,'قاعدة البيانات'!F:F)","v":2000},{"$f":"C3-D3","v":2500}]
[50,"ام سحر",{"$f":"SUMIF('قاعدة البيانات'!B:B,A4,'قاعدة البيانات'!E:E)","v":6660},{"$f":"SUMIF('قاعدة البيانات'!B:B,A4,'قاعدة البيانات'!F:F)","v":1000},{"$f":"C4-D4","v":5660}]
[55,"دعاء سلام",{"$f":"SUMIF('قاعدة البيانات'!B:B,A5,'قاعدة البيانات'!E:E)","v":2000},{"$f":"SUMIF('قاعدة البيانات'!B:B,A5,'قاعدة البيانات'!F:F)","v":1500},{"$f":"C5-D5","v":500}]
[57,"بسام درويش",{"$f":"SUMIF('قاعدة البيانات'!B:B,A6,'قاعدة البيانات'!E:E)","v":2300},{"$f":"SUMIF('قاعدة البيانات'!B:B,A6,'قاعدة البيانات'!F:F)","v":1600},700]
[59,"تامر",{"$f":"SUMIF('قاعدة البيانات'!B:B,A7,'قاعدة البيانات'!E:E)","v":1800},{"$f":"SUMIF('قاعدة البيانات'!B:B,A7,'قاعدة البيانات'!F:F)","v":1600},{"$f":"C7-D7","v":200}]
[60,"سعاد وهيب",{"$f":"SUMIF('قاعدة البيانات'!B:B,A8,'قاعدة البيانات'!E:E)","v":180},{"$f":"SUMIF('قاعدة البيانات'!B:B,A8,'قاعدة البيانات'!F:F)","v":80},100]
[61,"مايكل 2",{"$f":"SUMIF('قاعدة البيانات'!B:B,A9,'قاعدة البيانات'!E:E)","v":3400},{"$f":"SUMIF('قاعدة البيانات'!B:B,A9,'قاعدة البيانات'!F:F)","v":3100},300]
[66,"موسى محمد عبدالغنى /كيسة",{"$f":"SUMIF('قاعدة البيانات'!B:B,A10,'قاعدة البيانات'!E:E)","v":2430},{"$f":"SUMIF('قاعدة البيانات'!B:B,A10,'قاعدة البيانات'!F:F)","v":1800},{"$f":"C10-D10","v":630}]
[68,"موسى محمد عبدالغنى/جراند نيو",{"$f":"SUMIF('قاعدة البيانات'!B:B,A11,'قاعدة البيانات'!E:E)","v":6400},{"$f":"SUMIF('قاعدة البيانات'!B:B,A11,'قاعدة البيانات'!F:F)","v":3400},3000]
[70,"موسى محمد عبدالغنى /جراند2",{"$f":"SUMIF('قاعدة البيانات'!B:B,A12,'قاعدة البيانات'!E:E)","v":2500},{"$f":"SUMIF('قاعدة البيانات'!B:B,A12,'قاعدة البيانات'!F:F)","v":1400},1100]
[71,"دعاء سيد احمد",{"$f":"SUMIF('قاعدة البيانات'!B:B,A13,'قاعدة البيانات'!E:E)","v":2550},{"$f":"SUMIF('قاعدة البيانات'!B:B,A13,'قاعدة البيانات'!F:F)","v":1850},700]
[72,"صالح محمود 2",{"$f":"SUMIF('قاعدة البيانات'!B:B,A14,'قاعدة البيانات'!E:E)","v":1575},{"$f":"SUMIF('قاعدة البيانات'!B:B,A14,'قاعدة البيانات'!F:F)","v":1235},{"$f":"C14-D14","v":340}]
[73,"موسى محمد عبدالغنى- جراند باير",{"$f":"SUMIF('قاعدة البيانات'!B:B,A15,'قاعدة البيانات'!E:E)","v":2300},{"$f":"SUMIF('قاعدة البيانات'!B:B,A15,'قاعدة البيانات'!F:F)","v":1300},1000]
[74,"موسى محمد عبدالغنى /2موبايل",{"$f":"SUMIF('قاعدة البيانات'!B:B,A16,'قاعدة البيانات'!E:E)","v":4550},{"$f":"SUMIF('قاعدة البيانات'!B:B,A16,'قاعدة البيانات'!F:F)","v":2300},2250]
[75,"موسى محمد عبدالغنى- جراند باير2",{"$f":"SUMIF('قاعدة البيانات'!B:B,A17,'قاعدة البيانات'!E:E)","v":2450},{"$f":"SUMIF('قاعدة البيانات'!B:B,A17,'قاعدة البيانات'!F:F)","v":1500},950]
[77,"موسى جراند -بدون مقدم",{"$f":"SUMIF('قاعدة البيانات'!B:B,A18,'قاعدة البيانات'!E:E)","v":2550},{"$f":"SUMIF('قاعدة البيانات'!B:B,A18,'قاعدة البيانات'!F:F)","v":1200},1350]
[78,"موسى جراند -بدون مقدم2",{"$f":"SUMIF('قاعدة البيانات'!B:B,A19,'قاعدة البيانات'!E:E)","v":3150},{"$f":"SUMIF('قاعدة البيانات'!B:B,A19,'قاعدة البيانات'!F:F)","v":1400},{"$f":"C19-D19","v":1750}]
[80,"اخت ام عمرو",700,{"$f":"SUMIF('قاعدة البيانات'!B:B,A20,'قاعدة البيانات'!F:F)","v":0},{"$f":"C20-D20","v":700}]
[81,"موسى محمد - نود4 - عبدالرازق",{"$f":"SUMIF('قاعدة البيانات'!B:B,A21,'قاعدة البيانات'!E:E)","v":7500},{"$f":"SUMIF('قاعدة البيانات'!B:B,A21,'قاعدة البيانات'!F:F)","v":4240},3260]
[82,"موسى محمد - نود2",{"$f":"SUMIF('قاعدة البيانات'!B:B,A22,'قاعدة البيانات'!E:E)","v":2500},{"$f":"SUMIF('قاعدة البيانات'!B:B,A22,'قاعدة البيانات'!F:F)","v":1260},1240]
[83," نهاد حجازى",{"$f":"SUMIF('قاعدة البيانات'!B:B,A23,'قاعدة البيانات'!E:E)","v":1300},{"$f":"SUMIF('قاعدة البيانات'!B:B,A23,'قاعدة البيانات'!F:F)","v":1150},150]
[84,"رشا-اكسبيريا z-r",{"$f":"SUMIF('قاعدة البيانات'!B:B,A24,'قاعدة البيانات'!E:E)","v":2350},{"$f":"SUMIF('قاعدة البيانات'!B:B,A24,'قاعدة البيانات'!F:F)","v":1300},{"$f":"C24-D24","v":1050}]
[85,"نود2- عبدالرازق",{"$f":"SUMIF('قاعدة البيانات'!B:B,A25,'قاعدة البيانات'!E:E)","v":5200},{"$f":"SUMIF('قاعدة البيانات'!B:B,A25,'قاعدة البيانات'!F:F)","v":2750},2450]
[86,"موسى S3new",{"$f":"SUMIF('قاعدة البيانات'!B:B,A26,'قاعدة البيانات'!E:E)","v":2425},{"$f":"SUMIF('قاعدة البيانات'!B:B,A26,'قاعدة البيانات'!F:F)","v":1350},1075]
[88,"دعاء-اكسبيرياz-r",{"$f":"SUMIF('قاعدة البيانات'!B:B,A27,'قاعدة البيانات'!E:E)","v":1350},{"$f":"SUMIF('قاعدة البيانات'!B:B,A27,'قاعدة البيانات'!F:F)","v":1100},250]
[89,"موسى- تكنو",{"$f":"SUMIF('قاعدة البيانات'!B:B,A28,'قاعدة البيانات'!E:E)","v":800},{"$f":"SUMIF('قاعدة البيانات'!B:B,A28,'قاعدة البيانات'!F:F)","v":350},450]
[90,"محمد الحنفى",{"$f":"SUMIF('قاعدة البيانات'!B:B,A29,'قاعدة البيانات'!E:E)","v":2800},{"$f":"SUMIF('قاعدة البيانات'!B:B,A29,'قاعدة البيانات'!F:F)","v":2200},{"$f":"C29-D29","v":600}]
[91,"عاطف شوقى الشيخ",{"$f":"SUMIF('قاعدة البيانات'!B:B,A30,'قاعدة البيانات'!E:E)","v":480},{"$f":"SUMIF('قاعدة البيانات'!B:B,A30,'قاعدة البيانات'!F:F)","v":250},230]
[92,"صلاح محمود 2",{"$f":"SUMIF('قاعدة البيانات'!B:B,A31,'قاعدة البيانات'!E:E)","v":1950},{"$f":"SUMIF('قاعدة البيانات'!B:B,A31,'قاعدة البيانات'!F:F)","v":700},1250]
[93,"موسى 2مروحة",{"$f":"SUMIF('قاعدة البيانات'!B:B,A32,'قاعدة البيانات'!E:E)","v":960},{"$f":"SUMIF('قاعدة البيانات'!B:B,A32,'قاعدة البيانات'!F:F)","v":300},660]
[95,"محمد حبيب",{"$f":"SUMIF('قاعدة البيانات'!B:B,A33,'قاعدة البيانات'!E:E)","v":1800},{"$f":"SUMIF('قاعدة البيانات'!B:B,A33,'قاعدة البيانات'!F:F)","v":800},1000]
[96,"محمد الفولى",{"$f":"SUMIF('قاعدة البيانات'!B:B,A34,'قاعدة البيانات'!E:E)","v":2800},{"$f":"SUMIF('قاعدة البيانات'!B:B,A34,'قاعدة البيانات'!F:F)","v":2300},{"$f":"C34-D34","v":500}]
[97,"ساندى",{"$f":"SUMIF('قاعدة البيانات'!B:B,A35,'قاعدة البيانات'!E:E)","v":600},{"$f":"SUMIF('قاعدة البيانات'!B:B,A35,'قاعدة البيانات'!F:F)","v":300},300]
[98,"s3 - موسى محمد",{"$f":"SUMIF('قاعدة البيانات'!B:B,A36,'قاعدة البيانات'!E:E)","v":4550},{"$f":"SUMIF('قاعدة البيانات'!B:B,A36,'قاعدة البيانات'!F:F)","v":1300},3250]
[99,"موسى محمد - جلاكسى كور",{"$f":"SUMIF('قاعدة البيانات'!B:B,A37,'قاعدة البيانات'!E:E)","v":1500},{"$f":"SUMIF('قاعدة البيانات'!B:B,A37,'قاعدة البيانات'!F:F)","v":530},970]
[100,"موسى محمد - جلاكسى ",{"$f":"SUMIF('قاعدة البيانات'!B:B,A38,'قاعدة البيانات'!E:E)","v":1270},{"$f":"SUMIF('قاعدة البيانات'!B:B,A38,'قاعدة البيانات'!F:F)","v":450},820]
[101,"موسى محمد - جراند2",{"$f":"SUMIF('قاعدة البيانات'!B:B,A39,'قاعدة البيانات'!E:E)","v":2310},{"$f":"SUMIF('قاعدة البيانات'!B:B,A39,'قاعدة البيانات'!F:F)","v":840},1470]
[102,"حنان الحنفى",{"$f":"SUMIF('قاعدة البيانات'!B:B,A40,'قاعدة البيانات'!E:E)","v":350},{"$f":"SUMIF('قاعدة البيانات'!B:B,A40,'قاعدة البيانات'!F:F)","v":200},{"$f":"C40-D40","v":150}]
[103,"تامر2",{"$f":"SUMIF('قاعدة البيانات'!B:B,A41,'قاعدة البيانات'!E:E)","v":650},{"$f":"SUMIF('قاعدة البيانات'!B:B,A41,'قاعدة البيانات'!F:F)","v":300},350]
[105,"موسى مكنسة",{"$f":"SUMIF('قاعدة البيانات'!B:B,A42,'قاعدة البيانات'!E:E)","v":650},{"$f":"SUMIF('قاعدة البيانات'!B:B,A42,'قاعدة البيانات'!F:F)","v":100},550]
[106,"s3new-musa",{"$f":"SUMIF('قاعدة البيانات'!B:B,A43,'قاعدة البيانات'!E:E)","v":2320},{"$f":"SUMIF('قاعدة البيانات'!B:B,A43,'قاعدة البيانات'!F:F)","v":800},1520]
[107,"not2-2",{"$f":"SUMIF('قاعدة البيانات'!B:B,A44,'قاعدة البيانات'!E:E)","v":2450},{"$f":"SUMIF('قاعدة البيانات'!B:B,A44,'قاعدة البيانات'!F:F)","v":830},1620]
[108,"not2-3",{"$f":"SUMIF('قاعدة البيانات'!B:B,A45,'قاعدة البيانات'!E:E)","v":2450},{"$f":"SUMIF('قاعدة البيانات'!B:B,A45,'قاعدة البيانات'!F:F)","v":830},1620]
[109,"not3-2",{"$f":"SUMIF('قاعدة البيانات'!B:B,A46,'قاعدة البيانات'!E:E)","v":3380},{"$f":"SUMIF('قاعدة البيانات'!B:B,A46,'قاعدة البيانات'!F:F)","v":900},2480]
[110,"e5",{"$f":"SUMIF('قاعدة البيانات'!B:B,A47,'قاعدة البيانات'!E:E)","v":3575},{"$f":"SUMIF('قاعدة البيانات'!B:B,A47,'قاعدة البيانات'!F:F)","v":1075},2500]
[112,"محمد السيسى",{"$f":"SUMIF('قاعدة البيانات'!B:B,A48,'قاعدة البيانات'!E:E)","v":300},{"$f":"SUMIF('قاعدة البيانات'!B:B,A48,'قاعدة البيانات'!F:F)","v":150},{"$f":"C48-D48","v":150}]
[113,"ام عمرو G1",{"$f":"SUMIF('قاعدة البيانات'!B:B,A49,'قاعدة البيانات'!E:E)","v":1300},{"$f":"SUMIF('قاعدة البيانات'!B:B,A49,'قاعدة البيانات'!F:F)","v":400},900]
[114,"ام عمرو3000",{"$f":"SUMIF('قاعدة البيانات'!B:B,A50,'قاعدة البيانات'!E:E)","v":4000},{"$f":"SUMIF('قاعدة البيانات'!B:B,A50,'قاعدة البيانات'!F:F)","v":800},3200]
[115,"musa-note4",{"$f":"SUMIF('قاعدة البيانات'!B:B,A51,'قاعدة البيانات'!E:E)","v":6760},{"$f":"SUMIF('قاعدة البيانات'!B:B,A51,'قاعدة البيانات'!F:F)","v":1550},5210]
[116,"musa-note3-3",{"$f":"SUMIF('قاعدة البيانات'!B:B,A52,'قاعدة البيانات'!E:E)","v":4875},{"$f":"SUMIF('قاعدة البيانات'!B:B,A52,'قاعدة البيانات'!F:F)","v":1010},3865]
[117,"musa-amr",{"$f":"SUMIF('قاعدة البيانات'!B:B,A53,'قاعدة البيانات'!E:E)","v":1200},{"$f":"SUMIF('قاعدة البيانات'!B:B,A53,'قاعدة البيانات'!F:F)","v":75},1125]
[118,"عبير موسى",{"$f":"SUMIF('قاعدة البيانات'!B:B,A54,'قاعدة البيانات'!E:E)","v":935},{"$f":"SUMIF('قاعدة البيانات'!B:B,A54,'قاعدة البيانات'!F:F)","v":250},685]
[119,"جراند نيو بلص-أيمن",{"$f":"SUMIF('قاعدة البيانات'!B:B,A55,'قاعدة البيانات'!E:E)","v":1600},{"$f":"SUMIF('قاعدة البيانات'!B:B,A55,'قاعدة البيانات'!F:F)","v":400},1200]
[120,"محمد طعيمة",{"$f":"SUMIF('قاعدة البيانات'!B:B,A56,'قاعدة البيانات'!E:E)","v":850},{"$f":"SUMIF('قاعدة البيانات'!B:B,A56,'قاعدة البيانات'!F:F)","v":700},150]
[121,"موسى j7",{"$f":"SUMIF('قاعدة البيانات'!B:B,A57,'قاعدة البيانات'!E:E)","v":5850},{"$f":"SUMIF('قاعدة البيانات'!B:B,A57,'قاعدة البيانات'!F:F)","v":0},5850]
[122,"موسى j5",{"$f":"SUMIF('قاعدة البيانات'!B:B,A58,'قاعدة البيانات'!E:E)","v":2340},{"$f":"SUMIF('قاعدة البيانات'!B:B,A58,'قاعدة البيانات'!F:F)","v":500},1840]
[123,"ابراهيم شوقى بدر",{"$f":"SUMIF('قاعدة البيانات'!B:B,A59,'قاعدة البيانات'!E:E)","v":1150},{"$f":"SUMIF('قاعدة البيانات'!B:B,A59,'قاعدة البيانات'!F:F)","v":800},350]
[124,"محمد ثروت",{"$f":"SUMIF('قاعدة البيانات'!B:B,A60,'قاعدة البيانات'!E:E)","v":1650},{"$f":"SUMIF('قاعدة البيانات'!B:B,A60,'قاعدة البيانات'!F:F)","v":0},1650]
[125,"musa-note3-4",{"$f":"SUMIF('قاعدة البيانات'!B:B,A61,'قاعدة البيانات'!E:E)","v":2750},{"$f":"SUMIF('قاعدة البيانات'!B:B,A61,'قاعدة البيانات'!F:F)","v":0},2750]
[126,"musa-note3-5",{"$f":"SUMIF('قاعدة البيانات'!B:B,A62,'قاعدة البيانات'!E:E)","v":2000},{"$f":"SUMIF('قاعدة البيانات'!B:B,A62,'قاعدة البيانات'!F:F)","v":0},2000]
[128,"منى",{"$f":"SUMIF('قاعدة البيانات'!B:B,A63,'قاعدة البيانات'!E:E)","v":650},{"$f":"SUMIF('قاعدة البيانات'!B:B,A63,'قاعدة البيانات'!F:F)","v":0},650]
[129,"جى1-حلامشة",{"$f":"SUMIF('قاعدة البيانات'!B:B,A64,'قاعدة البيانات'!E:E)","v":1300},{"$f":"SUMIF('قاعدة البيانات'!B:B,A64,'قاعدة البيانات'!F:F)","v":0},1300]
[130,"محمد طعيمة-صب",{"$f":"SUMIF('قاعدة البيانات'!B:B,A65,'قاعدة البيانات'!E:E)","v":350},{"$f":"SUMIF('قاعدة البيانات'!B:B,A65,'قاعدة البيانات'!F:F)","v":150},200]
[131,"دنيا سونى اكسبيريا2",{"$f":"SUMIF('قاعدة البيانات'!B:B,A66,'قاعدة البيانات'!E:E)","v":2800},{"$f":"SUMIF('قاعدة البيانات'!B:B,A66,'قاعدة البيانات'!F:F)","v":1000},1800]
[132,"MUSA2-J7",{"$f":"SUMIF('قاعدة البيانات'!B:B,A67,'قاعدة البيانات'!E:E)","v":5850},{"$f":"SUMIF('قاعدة البيانات'!B:B,A67,'قاعدة البيانات'!F:F)","v":1000},4850]
[133,"NOKIA225-2",{"$f":"SUMIF('قاعدة البيانات'!B:B,A68,'قاعدة البيانات'!E:E)","v":800},{"$f":"SUMIF('قاعدة البيانات'!B:B,A68,'قاعدة البيانات'!F:F)","v":0},800]
[134,"om amr",{"$f":"SUMIF('قاعدة البيانات'!B:B,A69,'قاعدة البيانات'!E:E)","v":6600},{"$f":"SUMIF('قاعدة البيانات'!B:B,A69,'قاعدة البيانات'!F:F)","v":300},6300]
[135,"ثروت",{"$f":"SUMIF('قاعدة البيانات'!B:B,A70,'قاعدة البيانات'!E:E)","v":510},{"$f":"SUMIF('قاعدة البيانات'!B:B,A70,'قاعدة البيانات'!F:F)","v":0},510]
[136,"musa-j1--1/11",{"$f":"SUMIF('قاعدة البيانات'!B:B,A71,'قاعدة البيانات'!E:E)","v":1300},{"$f":"SUMIF('قاعدة البيانات'!B:B,A71,'قاعدة البيانات'!F:F)","v":0},1300]
[137,"G130",{"$f":"SUMIF('قاعدة البيانات'!B:B,A72,'قاعدة البيانات'!E:E)","v":775},{"$f":"SUMIF('قاعدة البيانات'!B:B,A72,'قاعدة البيانات'!F:F)","v":0},775]
[138,"nokIA225-3",{"$f":"SUMIF('قاعدة البيانات'!B:B,A73,'قاعدة البيانات'!E:E)","v":800},{"$f":"SUMIF('قاعدة البيانات'!B:B,A73,'قاعدة البيانات'!F:F)","v":0},800]
[139,"عزيزة",{"$f":"SUMIF('قاعدة البيانات'!B:B,A74,'قاعدة البيانات'!E:E)","v":420},{"$f":"SUMIF('قاعدة البيانات'!B:B,A74,'قاعدة البيانات'!F:F)","v":100},320]
[140,"رامى شوقى عبده",{"$f":"SUMIF('قاعدة البيانات'!B:B,A75,'قاعدة البيانات'!E:E)","v":1900},{"$f":"SUMIF('قاعدة البيانات'!B:B,A75,'قاعدة البيانات'!F:F)","v":500},1400]
[141,"دنيا سونى اكسبيريا2-2",{"$f":"SUMIF('قاعدة البيانات'!B:B,A76,'قاعدة البيانات'!E:E)","v":2450},{"$f":"SUMIF('قاعدة البيانات'!B:B,A76,'قاعدة البيانات'!F:F)","v":800},1650]
[142,"السيدG5",{"$f":"SUMIF('قاعدة البيانات'!B:B,A77,'قاعدة البيانات'!E:E)","v":2300},{"$f":"SUMIF('قاعدة البيانات'!B:B,A77,'قاعدة البيانات'!F:F)","v":500},1800]
[143,"رشا هاواوىb8",{"$f":"SUMIF('قاعدة البيانات'!B:B,A78,'قاعدة البيانات'!E:E)","v":2550},{"$f":"SUMIF('قاعدة البيانات'!B:B,A78,'قاعدة البيانات'!F:F)","v":500},2050]
[144,"ام عمرو جى7",{"$f":"SUMIF('قاعدة البيانات'!B:B,A79,'قاعدة البيانات'!E:E)","v":3250},{"$f":"SUMIF('قاعدة البيانات'!B:B,A79,'قاعدة البيانات'!F:F)","v":0},3250]
[145,"شاشة   عمرو ",{"$f":"SUMIF('قاعدة البيانات'!B:B,A80,'قاعدة البيانات'!E:E)","v":350},{"$f":"SUMIF('قاعدة البيانات'!B:B,A80,'قاعدة البيانات'!F:F)","v":0},350]
[146,"نوكيا 225اسبوعى",{"$f":"SUMIF('قاعدة البيانات'!B:B,A81,'قاعدة البيانات'!E:E)","v":400},{"$f":"SUMIF('قاعدة البيانات'!B:B,A81,'قاعدة البيانات'!F:F)","v":0},400]
[147,null,{"$f":"SUMIF('قاعدة البيانات'!B:B,A82,'قاعدة البيانات'!E:E)","v":0},{"$f":"SUMIF('قاعدة البيانات'!B:B,A82,'قاعدة البيانات'!F:F)","v":0},0]
[148,null,{"$f":"SUMIF('قاعدة البيانات'!B:B,A83,'قاعدة البيانات'!E:E)","v":0},{"$f":"SUMIF('قاعدة البيانات'!B:B,A83,'قاعدة البيانات'!F:F)","v":0},0]
[149,null,{"$f":"SUMIF('قاعدة البيانات'!B:B,A84,'قاعدة البيانات'!E:E)","v":0},{"$f":"SUMIF('قاعدة البيانات'!B:B,A84,'قاعدة البيانات'!F:F)","v":0},0]
[150,null,{"$f":"SUMIF('قاعدة البيانات'!B:B,A85,'قاعدة البيانات'!E:E)","v":0},{"$f":"SUMIF('قاعدة البيانات'!B:B,A85,'قاعدة البيانات'!F:F)","v":0},0]

{"sheet":"DATA","index":1,"n_rows":186,"n_cols":2,"rows_kept":186,"cut":false,"hidden":false,"merged":[]}
["كود العميل","الاسم"]
[1," محمد  1"]
[2," محمد  2"]
[3," محمد  3"]
[4," محمد  4"]
[5,"حمادة بسام"]
[6," محمد  6"]
[7," محمد  7"]
[8," محمد  8"]
[9,"علياء"]
[10," محمد  10"]
[11," محمد  11"]
[12," محمد  12"]
[13," محمد  13"]
[14," محمد  14"]
[15,"هانى صلاح"]
[16," محمد  16"]
[17," محمد  17"]
[18," محمد  18"]
[19," محمد  19"]
[20," محمد  20"]
[21,"مصطفى ليلة"]
[22," محمد  22"]
[23," محمد  23"]
[24," محمد  24"]
[25,"نهاد"]
[26," محمد  26"]
[27,"سماح"]
[28," محمد  28"]
[29,"سلف"]
[30," محمد  30"]
[31," محمد  31"]
[32," محمد  32"]
[33," محمد  33"]
[34,"باسم النجار"]
[35," محمد  35"]
[36," محمد  36"]
[37," محمد  37"]
[38," محمد  38"]
[39," محمد  39"]
[40," محمد  40"]
[41," محمد  41"]
[42," محمد  42"]
[43," محمد  43"]
[44," محمد  44"]
[45," محمد  45"]
[46," محمد  46"]
[47," محمد  47"]
[48," محمد  48"]
[49," محمد  49"]
[50,"ام سحر"]
[51," محمد  51"]
[52," محمد  52"]
[53," محمد  53"]
[54," محمد  54"]
[55,"دعاء سلام"]
[56," محمد  56"]
[57,"بسام درويش"]
[58," محمد  58"]
[59,"تامر"]
[60,"سعاد وهيب"]
[61,"مايكل 2"]
[62," محمد  62"]
[63," محمد  63"]
[64," محمد  64"]
[65," محمد  65"]
[66,"موسى محمد عبدالغنى /كيسة"]
[67," محمد  67"]
[68,"موسى محمد عبدالغنى/جراند نيو"]
[69," محمد  69"]
[70,"موسى محمد عبدالغنى /جراند2"]
[71,"دعاء سيد احمد"]
[72,"صالح محمود 2"]
[73,"موسى محمد عبدالغنى- جراند باير"]
[74,"موسى محمد عبدالغنى /2موبايل"]
[75,"موسى محمد عبدالغنى- جراند باير2"]
[76," محمد  76"]
[77,"موسى جراند -بدون مقدم"]
[78,"موسى جراند -بدون مقدم2"]
[79," محمد  79"]
[80,"اخت ام عمرو"]
[81,"موسى محمد - نود4 - عبدالرازق"]
[82,"موسى محمد - نود2"]
[83," نهاد حجازى"]
[84,"رشا-اكسبيريا z-r"]
[85,"نود2- عبدالرازق"]
[86,"موسى S3new"]
[87," محمد  87"]
[88,"دعاء-اكسبيرياz-r"]
[89,"موسى- تكنو"]
[90,"محمد الحنفى"]
[91,"عاطف شوقى الشيخ"]
[92,"صلاح محمود 2"]
[93,"موسى 2مروحة"]
[94," محمد  94"]
[95,"محمد حبيب"]
[96,"محمد الفولى"]
[97,"ساندى"]
[98,"s3 - موسى محمد"]
[99,"موسى محمد - جلاكسى كور"]
[100,"موسى محمد - جلاكسى "]
[101,"موسى محمد - جراند2"]
[102,"حنان الحنفى"]
[103,"تامر2"]
[104," محمد  104"]
[105,"موسى مكنسة"]
[106,"s3new-musa"]
[107,"not2-2"]
[108,"not2-3"]
[109,"not3-2"]
[110,"e5"]
[111," محمد  111"]
[112,"محمد السيسى"]
[113,"ام عمرو G1"]
[114,"ام عمرو3000"]
[115,"musa-note4"]
[116,"musa-note3-3"]
[117,"musa-amr"]
[118,"عبير موسى"]
[119,"جراند نيو بلص-أيمن"]
[120,"محمد طعيمة"]
[121,"موسى j7"]
[122,"موسى j5"]
[123,"ابراهيم شوقى بدر"]
[124,"محمد ثروت"]
[125,"musa-note3-4"]
[126,"musa-note3-5"]
[127," محمد  127"]
[128,"منى"]
[129,"جى1-حلامشة"]
[130,"محمد طعيمة-صب"]
[131,"دنيا سونى اكسبيريا2"]
[132,"MUSA2-J7"]
[133,"NOKIA225-2"]
[134,"om amr"]
[135,"ثروت"]
[136,"musa-j1--1/11"]
[137,"G130"]
[138,"nokIA225-3"]
[139,"عزيزة"]
[140,"رامى شوقى عبده"]
[141,"دنيا سونى اكسبيريا2-2"]
[142,"السيدG5"]
[143,"رشا هاواوىb8"]
[144,"ام عمرو جى7"]
[145,"شاشة   عمرو "]
[146,"نوكيا 225اسبوعى"]
[147," محمد  147"]
[148," محمد  148"]
[149," محمد  149"]
[150," محمد  150"]
[151," محمد  151"]
[152," محمد  152"]
[153," محمد  153"]
[154," محمد  154"]
[155," محمد  155"]
[156," محمد  156"]
[157," محمد  157"]
[158," محمد  158"]
[159," محمد  159"]
[160," محمد  160"]
[161," محمد  161"]
[162," محمد  162"]
[163," محمد  163"]
[164," محمد  164"]
[165," محمد  165"]
[166," محمد  166"]
[167," محمد  167"]
[168," محمد  168"]
[169," محمد  169"]
[170," محمد  170"]
[171," محمد  171"]
[172," محمد  172"]
[173," محمد  173"]
[174," محمد  174"]
[175," محمد  175"]
[176," محمد  176"]
[177," محمد  177"]
[178," محمد  178"]
[179," محمد  179"]
[180," محمد  180"]
[181," محمد  181"]
[182," محمد  182"]
[183," محمد  183"]
[184," محمد  184"]
[185," محمد  185"]

{"sheet":"قاعدة البيانات","index":2,"n_rows":1986,"n_cols":6,"rows_kept":1986,"cut":false,"hidden":false,"merged":[]}
["التاريخ","كود ","الاسم","البيان","المبلغ","الاقساط"]
["2014-05-03",1,{"$f":"VLOOKUP(B2,DATA!A:B,2,0)","v":" محمد  1"},"المبلغ",900]
["2014-05-03",1,{"$f":"VLOOKUP(B3,DATA!A:B,2,0)","v":" محمد  1"},"اقساط",null,250]
["2014-05-15",1,{"$f":"VLOOKUP(B4,DATA!A:B,2,0)","v":" محمد  1"},"قسط",null,100]
["2014-07-17",1,{"$f":"VLOOKUP(B5,DATA!A:B,2,0)","v":" محمد  1"},"قسط",null,300]
["2014-07-25",1,{"$f":"VLOOKUP(B6,DATA!A:B,2,0)","v":" محمد  1"},"قسط",null,250]
["2014-05-03",2,{"$f":"VLOOKUP(B7,DATA!A:B,2,0)","v":" محمد  2"},"المبلغ",200]
["2014-05-03",2,{"$f":"VLOOKUP(B8,DATA!A:B,2,0)","v":" محمد  2"},"اقساط",null,75]
["2014-05-04",2,{"$f":"VLOOKUP(B9,DATA!A:B,2,0)","v":" محمد  2"},"قسط",null,50]
["2014-10-07",2,{"$f":"VLOOKUP(B10,DATA!A:B,2,0)","v":" محمد  2"},"قسط",null,50]
["2014-05-03",3,{"$f":"VLOOKUP(B11,DATA!A:B,2,0)","v":" محمد  3"},"المبلغ",650]
["2014-05-03",3,{"$f":"VLOOKUP(B12,DATA!A:B,2,0)","v":" محمد  3"},"اقساط",null,200]
["2014-05-26",3,{"$f":"VLOOKUP(B13,DATA!A:B,2,0)","v":" محمد  3"},"قسط",null,100]
["2014-06-27",3,{"$f":"VLOOKUP(B14,DATA!A:B,2,0)","v":" محمد  3"},"قسط",null,100]
["2014-09-05",3,{"$f":"VLOOKUP(B15,DATA!A:B,2,0)","v":" محمد  3"},"قسط",null,100]
["2014-08-07",3,{"$f":"VLOOKUP(B16,DATA!A:B,2,0)","v":" محمد  3"},"قسط",null,100]
["2014-09-24",3,{"$f":"VLOOKUP(B17,DATA!A:B,2,0)","v":" محمد  3"},"قسط",null,50]
["2014-05-03",4,{"$f":"VLOOKUP(B18,DATA!A:B,2,0)","v":" محمد  4"},"المبلغ",400]
["2014-05-03",4,{"$f":"VLOOKUP(B19,DATA!A:B,2,0)","v":" محمد  4"},"اقساط",null,100]
["2014-05-26",4,{"$f":"VLOOKUP(B20,DATA!A:B,2,0)","v":" محمد  4"},"قسط",null,50]
["2014-06-27",4,{"$f":"VLOOKUP(B21,DATA!A:B,2,0)","v":" محمد  4"},"قسط",null,50]
["2014-09-05",4,{"$f":"VLOOKUP(B22,DATA!A:B,2,0)","v":" محمد  4"},"قسط",null,50]
["2014-10-07",4,{"$f":"VLOOKUP(B23,DATA!A:B,2,0)","v":" محمد  4"},"قسط",null,50]
["2014-10-31",4,{"$f":"VLOOKUP(B24,DATA!A:B,2,0)","v":" محمد  4"},"قسط",null,50]
["2014-11-21",4,{"$f":"VLOOKUP(B25,DATA!A:B,2,0)","v":" محمد  4"},"قسط",null,50]
["2014-05-03",5,{"$f":"VLOOKUP(B26,DATA!A:B,2,0)","v":"حمادة بسام"},"المبلغ",2450]
["2014-05-04",5,{"$f":"VLOOKUP(B27,DATA!A:B,2,0)","v":"حمادة بسام"},"قسط",null,150]
["2014-05-03",5,{"$f":"VLOOKUP(B28,DATA!A:B,2,0)","v":"حمادة بسام"},"اقساط",null,600]
["2014-06-27",5,{"$f":"VLOOKUP(B29,DATA!A:B,2,0)","v":"حمادة بسام"},"قسط",null,150]
["2014-07-11",5,{"$f":"VLOOKUP(B30,DATA!A:B,2,0)","v":"حمادة بسام"},"قسط",null,150]
["2014-08-05",5,{"$f":"VLOOKUP(B31,DATA!A:B,2,0)","v":"حمادة بسام"},"قسط",null,150]
["2014-09-05",5,{"$f":"VLOOKUP(B32,DATA!A:B,2,0)","v":"حمادة بسام"},"قسط",null,150]
["2014-11-07",5,{"$f":"VLOOKUP(B33,DATA!A:B,2,0)","v":"حمادة بسام"},"قسط",null,150]
["2014-12-18",5,{"$f":"VLOOKUP(B34,DATA!A:B,2,0)","v":"حمادة بسام"},"قسط",null,150]
["2015-01-16",5,{"$f":"VLOOKUP(B35,DATA!A:B,2,0)","v":"حمادة بسام"},"قسط",null,150]
["2015-02-22",5,{"$f":"VLOOKUP(B36,DATA!A:B,2,0)","v":"حمادة بسام"},"قسط",null,150]
["2015-05-08",5,{"$f":"VLOOKUP(B37,DATA!A:B,2,0)","v":"حمادة بسام"},"قسط",null,150]
["2015-05-28",5,{"$f":"VLOOKUP(B38,DATA!A:B,2,0)","v":"حمادة بسام"},null,null,150]
["2014-05-03",6,{"$f":"VLOOKUP(B39,DATA!A:B,2,0)","v":" محمد  6"},"المبلغ",2030]
["2014-05-03",6,{"$f":"VLOOKUP(B40,DATA!A:B,2,0)","v":" محمد  6"},"اقساط",null,450]
["2014-05-26",6,{"$f":"VLOOKUP(B41,DATA!A:B,2,0)","v":" محمد  6"},"قسط",null,350]
["2014-06-27",6,{"$f":"VLOOKUP(B42,DATA!A:B,2,0)","v":" محمد  6"},"قسط",null,100]
["2014-07-11",6,{"$f":"VLOOKUP(B43,DATA!A:B,2,0)","v":" محمد  6"},"قسط",null,125]
["2014-08-07",6,{"$f":"VLOOKUP(B44,DATA!A:B,2,0)","v":" محمد  6"},"قسط",null,100]
["2014-09-05",6,{"$f":"VLOOKUP(B45,DATA!A:B,2,0)","v":" محمد  6"},"قسط",null,150]
["2014-09-24",6,{"$f":"VLOOKUP(B46,DATA!A:B,2,0)","v":" محمد  6"},"قسط",null,175]
["2014-10-31",6,{"$f":"VLOOKUP(B47,DATA!A:B,2,0)","v":" محمد  6"},"قسط",null,200]
["2014-11-21",6,{"$f":"VLOOKUP(B48,DATA!A:B,2,0)","v":" محمد  6"},"قسط",null,200]
["2014-12-24",6,{"$f":"VLOOKUP(B49,DATA!A:B,2,0)","v":" محمد  6"},null,null,180]
["2014-05-03",7,{"$f":"VLOOKUP(B50,DATA!A:B,2,0)","v":" محمد  7"},"المبلغ",450]
["2014-05-03",7,{"$f":"VLOOKUP(B51,DATA!A:B,2,0)","v":" محمد  7"},"اقساط",null,200]
["2014-06-27",7,{"$f":"VLOOKUP(B52,DATA!A:B,2,0)","v":" محمد  7"},"قسط",null,50]
["2014-07-17",7,{"$f":"VLOOKUP(B53,DATA!A:B,2,0)","v":" محمد  7"},"قسط",null,50]
["2014-08-15",7,{"$f":"VLOOKUP(B54,DATA!A:B,2,0)","v":" محمد  7"}," قسط",null,50]
["2014-09-19",7,{"$f":"VLOOKUP(B55,DATA!A:B,2,0)","v":" محمد  7"},"قسط",null,100]
["2014-05-03",8,{"$f":"VLOOKUP(B56,DATA!A:B,2,0)","v":" محمد  8"},"المبلغ",210]
["2014-05-03",8,{"$f":"VLOOKUP(B57,DATA!A:B,2,0)","v":" محمد  8"},"اقساط",null,80]
["2014-06-27",8,{"$f":"VLOOKUP(B58,DATA!A:B,2,0)","v":" محمد  8"},"قسط",null,20]
["2014-07-17",8,{"$f":"VLOOKUP(B59,DATA!A:B,2,0)","v":" محمد  8"},"قسط",null,20]
["2014-08-15",8,{"$f":"VLOOKUP(B60,DATA!A:B,2,0)","v":" محمد  8"},"قسط",null,20]
["2014-05-03",9,{"$f":"VLOOKUP(B61,DATA!A:B,2,0)","v":"علياء"},"اقساط",null,200]
["2014-05-15",9,{"$f":"VLOOKUP(B62,DATA!A:B,2,0)","v":"علياء"},"قسط",null,100]
["2014-05-03",9,{"$f":"VLOOKUP(B63,DATA!A:B,2,0)","v":"علياء"},"المبلغ",525]
["2014-06-27",9,{"$f":"VLOOKUP(B64,DATA!A:B,2,0)","v":"علياء"},"قسط",null,100]
["2014-08-05",9,{"$f":"VLOOKUP(B65,DATA!A:B,2,0)","v":"علياء"},"قسط",null,125]
["2014-05-03",10,{"$f":"VLOOKUP(B66,DATA!A:B,2,0)","v":" محمد  10"},"المبلغ",2500]
["2014-05-03",10,{"$f":"VLOOKUP(B67,DATA!A:B,2,0)","v":" محمد  10"},"اقساط",null,400]
["2014-05-10",10,{"$f":"VLOOKUP(B68,DATA!A:B,2,0)","v":" محمد  10"},"قسط",null,200]
["2014-06-25",10,{"$f":"VLOOKUP(B69,DATA!A:B,2,0)","v":" محمد  10"},"قسط",null,200]
["2014-07-25",10,{"$f":"VLOOKUP(B70,DATA!A:B,2,0)","v":" محمد  10"},"قسط",null,200]
["2014-06-12",11,{"$f":"VLOOKUP(B71,DATA!A:B,2,0)","v":" محمد  11"}]
["2014-05-03",11,{"$f":"VLOOKUP(B72,DATA!A:B,2,0)","v":" محمد  11"}]
["2014-05-03",12,{"$f":"VLOOKUP(B73,DATA!A:B,2,0)","v":" محمد  12"},"باقى صيانة لاب",80]
["2014-05-03",13,{"$f":"VLOOKUP(B74,DATA!A:B,2,0)","v":" محمد  13"},"المبلغ",2000]
["2014-05-03",14,{"$f":"VLOOKUP(B75,DATA!A:B,2,0)","v":" محمد  14"},"المبلغ",2500]
["2014-05-03",15,{"$f":"VLOOKUP(B76,DATA!A:B,2,0)","v":"هانى صلاح"},"مقدم",null,225]
["2014-05-03",15,{"$f":"VLOOKUP(B77,DATA!A:B,2,0)","v":"هانى صلاح"},"المبلغ",825]
["2014-05-30",15,{"$f":"VLOOKUP(B78,DATA!A:B,2,0)","v":"هانى صلاح"},"قسط",null,50]
["2014-07-01",15,{"$f":"VLOOKUP(B79,DATA!A:B,2,0)","v":"هانى صلاح"},"قسط",null,75]
["2014-08-08",15,{"$f":"VLOOKUP(B80,DATA!A:B,2,0)","v":"هانى صلاح"},"قسط",null,50]
["2014-10-01",15,{"$f":"VLOOKUP(B81,DATA!A:B,2,0)","v":"هانى صلاح"},"قسط",null,50]
["2014-05-03",16,{"$f":"VLOOKUP(B82,DATA!A:B,2,0)","v":" محمد  16"},"المبلغ",1050]
["2014-05-03",16,{"$f":"VLOOKUP(B83,DATA!A:B,2,0)","v":" محمد  16"},"مقدم",null,250]
["2014-05-30",16,{"$f":"VLOOKUP(B84,DATA!A:B,2,0)","v":" محمد  16"},"قسط",null,75]
["2014-07-01",16,{"$f":"VLOOKUP(B85,DATA!A:B,2,0)","v":" محمد  16"},"قسط",null,50]
["2014-08-08",16,{"$f":"VLOOKUP(B86,DATA!A:B,2,0)","v":" محمد  16"},"قسط",null,75]
["2014-10-01",16,{"$f":"VLOOKUP(B87,DATA!A:B,2,0)","v":" محمد  16"},"قسط",null,75]
["2014-05-21",17,{"$f":"VLOOKUP(B88,DATA!A:B,2,0)","v":" محمد  17"},"موبايل",600]
["2014-05-03",17,{"$f":"VLOOKUP(B89,DATA!A:B,2,0)","v":" محمد  17"},"المبلغ",550]
["2014-05-03",17,{"$f":"VLOOKUP(B90,DATA!A:B,2,0)","v":" محمد  17"},"اقساط",null,150]
["2014-08-04",17,{"$f":"VLOOKUP(B91,DATA!A:B,2,0)","v":" محمد  17"},"قسط",null,150]
["2014-09-30",17,{"$f":"VLOOKUP(B92,DATA!A:B,2,0)","v":" محمد  17"},"قسط",null,150]
["2014-05-03",18,{"$f":"VLOOKUP(B93,DATA!A:B,2,0)","v":" محمد  18"},"المبلغ",550]
["2014-05-30",18,{"$f":"VLOOKUP(B94,DATA!A:B,2,0)","v":" محمد  18"},"قسط",null,100]
["2014-07-01",18,{"$f":"VLOOKUP(B95,DATA!A:B,2,0)","v":" محمد  18"},"قسط",null,100]
["2014-08-08",18,{"$f":"VLOOKUP(B96,DATA!A:B,2,0)","v":" محمد  18"},"قسط",null,100]
["2014-08-08",18,{"$f":"VLOOKUP(B97,DATA!A:B,2,0)","v":" محمد  18"},"قسط",null,100]
["2014-05-03",19,{"$f":"VLOOKUP(B98,DATA!A:B,2,0)","v":" محمد  19"},"المبلغ",850]
["2014-05-03",20,{"$f":"VLOOKUP(B99,DATA!A:B,2,0)","v":" محمد  20"},"المبلغ",4000]
["2014-05-03",20,{"$f":"VLOOKUP(B100,DATA!A:B,2,0)","v":" محمد  20"},"اقساط",null,500]
["2014-06-07",20,{"$f":"VLOOKUP(B101,DATA!A:B,2,0)","v":" محمد  20"},"قسط",null,250]
["2014-07-25",20,{"$f":"VLOOKUP(B102,DATA!A:B,2,0)","v":" محمد  20"},"قسط",null,250]
["2014-05-03",21,{"$f":"VLOOKUP(B103,DATA!A:B,2,0)","v":"مصطفى ليلة"},"المبلغ",300]
["2014-05-03",21,{"$f":"VLOOKUP(B104,DATA!A:B,2,0)","v":"مصطفى ليلة"},"اقساط",null,100]
["2014-05-06",21,{"$f":"VLOOKUP(B105,DATA!A:B,2,0)","v":"مصطفى ليلة"},"قسط",null,50]
["2014-05-12",21,{"$f":"VLOOKUP(B106,DATA!A:B,2,0)","v":"مصطفى ليلة"},"صب تايجر+فلاشة",310]
["2014-05-25",21,{"$f":"VLOOKUP(B107,DATA!A:B,2,0)","v":"مصطفى ليلة"},"قسط",null,50]
["2014-06-01",21,{"$f":"VLOOKUP(B108,DATA!A:B,2,0)","v":"مصطفى ليلة"},"قسط",null,100]
["2014-06-29",21,{"$f":"VLOOKUP(B109,DATA!A:B,2,0)","v":"مصطفى ليلة"},"قسط",null,50]
["2014-07-12",21,{"$f":"VLOOKUP(B110,DATA!A:B,2,0)","v":"مصطفى ليلة"},"قسط",null,50]
["2014-07-25",21,{"$f":"VLOOKUP(B111,DATA!A:B,2,0)","v":"مصطفى ليلة"},"قسط",null,50]
["2014-08-11",21,{"$f":"VLOOKUP(B112,DATA!A:B,2,0)","v":"مصطفى ليلة"},"قسط",null,50]
["2014-09-01",21,{"$f":"VLOOKUP(B113,DATA!A:B,2,0)","v":"مصطفى ليلة"},"قسط",null,50]
["2014-10-01",21,{"$f":"VLOOKUP(B114,DATA!A:B,2,0)","v":"مصطفى ليلة"},"قسط",null,60]
["2014-05-03",22,{"$f":"VLOOKUP(B115,DATA!A:B,2,0)","v":" محمد  22"},"المبلغ",1100]
["2014-05-03",22,{"$f":"VLOOKUP(B116,DATA!A:B,2,0)","v":" محمد  22"},"اقساط",null,300]
["2014-06-27",22,{"$f":"VLOOKUP(B117,DATA!A:B,2,0)","v":" محمد  22"},"قسط",null,100]
["2014-07-11",22,{"$f":"VLOOKUP(B118,DATA!A:B,2,0)","v":" محمد  22"},"قسط",null,100]
["2014-08-05",22,{"$f":"VLOOKUP(B119,DATA!A:B,2,0)","v":" محمد  22"},null,null,100]
["2014-09-19",22,{"$f":"VLOOKUP(B120,DATA!A:B,2,0)","v":" محمد  22"},"قسط",null,100]
["2014-10-24",22,{"$f":"VLOOKUP(B121,DATA!A:B,2,0)","v":" محمد  22"},"قسط",null,100]
["2014-11-21",22,{"$f":"VLOOKUP(B122,DATA!A:B,2,0)","v":" محمد  22"},"قسط",null,100]
["2014-12-18",22,{"$f":"VLOOKUP(B123,DATA!A:B,2,0)","v":" محمد  22"},"قسط",null,100]
["2015-01-23",22,{"$f":"VLOOKUP(B124,DATA!A:B,2,0)","v":" محمد  22"},"قسط",null,100]
["2014-05-03",23,{"$f":"VLOOKUP(B125,DATA!A:B,2,0)","v":" محمد  23"},"المبلغ",700]
["2014-05-03",23,{"$f":"VLOOKUP(B126,DATA!A:B,2,0)","v":" محمد  23"},"اقساط",null,150]
["2014-05-04",23,{"$f":"VLOOKUP(B127,DATA!A:B,2,0)","v":" محمد  23"},"قسط",null,50]
["2014-05-26",23,{"$f":"VLOOKUP(B128,DATA!A:B,2,0)","v":" محمد  23"},"قسط",null,50]
["2014-06-27",23,{"$f":"VLOOKUP(B129,DATA!A:B,2,0)","v":" محمد  23"},"قسط",null,50]
["2014-07-25",23,{"$f":"VLOOKUP(B130,DATA!A:B,2,0)","v":" محمد  23"},"قسط",null,50]
["2014-08-29",23,{"$f":"VLOOKUP(B131,DATA!A:B,2,0)","v":" محمد  23"},"قسط",null,50]
["2014-09-19",23,{"$f":"VLOOKUP(B132,DATA!A:B,2,0)","v":" محمد  23"},"قسط",null,50]
["2014-09-24",23,{"$f":"VLOOKUP(B133,DATA!A:B,2,0)","v":" محمد  23"},"قسط",null,50]
["2014-10-24",23,{"$f":"VLOOKUP(B134,DATA!A:B,2,0)","v":" محمد  23"},"قسط",null,50]
["2014-12-18",23,{"$f":"VLOOKUP(B135,DATA!A:B,2,0)","v":" محمد  23"},"قسط",null,50]
["2015-01-23",23,{"$f":"VLOOKUP(B136,DATA!A:B,2,0)","v":" محمد  23"},"قسط",null,50]
["2015-03-14",23,{"$f":"VLOOKUP(B137,DATA!A:B,2,0)","v":" محمد  23"},"قسط",null,50]
["2014-05-03",24,{"$f":"VLOOKUP(B138,DATA!A:B,2,0)","v":" محمد  24"},"المبلغ",1250]
["2014-05-03",24,{"$f":"VLOOKUP(B139,DATA!A:B,2,0)","v":" محمد  24"},"اقساط",null,200]
["2014-06-09",24,{"$f":"VLOOKUP(B140,DATA!A:B,2,0)","v":" محمد  24"},"قسط",null,100]
["2014-07-04",24,{"$f":"VLOOKUP(B141,DATA!A:B,2,0)","v":" محمد  24"},"قسط",null,100]
["2014-07-17",24,{"$f":"VLOOKUP(B142,DATA!A:B,2,0)","v":" محمد  24"},"قسط",null,100]
["2014-07-04",24,{"$f":"VLOOKUP(B143,DATA!A:B,2,0)","v":" محمد  24"},"قسط"]
["2014-08-31",24,{"$f":"VLOOKUP(B144,DATA!A:B,2,0)","v":" محمد  24"},"قسط",null,100]
["2014-10-09",24,{"$f":"VLOOKUP(B145,DATA!A:B,2,0)","v":" محمد  24"},"قسط",null,100]
["2014-10-28",24,{"$f":"VLOOKUP(B146,DATA!A:B,2,0)","v":" محمد  24"},"قسط",null,100]
["2014-12-07",24,{"$f":"VLOOKUP(B147,DATA!A:B,2,0)","v":" محمد  24"},"قسط",null,100]
["2014-12-07",24,{"$f":"VLOOKUP(B148,DATA!A:B,2,0)","v":" محمد  24"},null,null,100]
["2015-03-26",24,{"$f":"VLOOKUP(B149,DATA!A:B,2,0)","v":" محمد  24"},"قسط",null,100]
["2015-04-05",24,{"$f":"VLOOKUP(B150,DATA!A:B,2,0)","v":" محمد  24"},"قسط",null,150]
["2014-05-03",25,{"$f":"VLOOKUP(B151,DATA!A:B,2,0)","v":"نهاد"},"اقساط",null,200]
["2014-05-03",25,{"$f":"VLOOKUP(B152,DATA!A:B,2,0)","v":"نهاد"},"المبلغ",1450]
["2014-05-04",25,{"$f":"VLOOKUP(B153,DATA!A:B,2,0)","v":"نهاد"},"قسط",null,100]
["2014-05-26",25,{"$f":"VLOOKUP(B154,DATA!A:B,2,0)","v":"نهاد"},"قسط",null,100]
["2014-06-27",25,{"$f":"VLOOKUP(B155,DATA!A:B,2,0)","v":"نهاد"},"قسط",null,100]
["2014-07-25",25,{"$f":"VLOOKUP(B156,DATA!A:B,2,0)","v":"نهاد"},"قسط",null,100]
["2014-08-06",25,{"$f":"VLOOKUP(B157,DATA!A:B,2,0)","v":"نهاد"},"مقدم",null,400]
["2014-08-29",25,{"$f":"VLOOKUP(B158,DATA!A:B,2,0)","v":"نهاد"},"قسط",null,100]
["2014-09-24",25,{"$f":"VLOOKUP(B159,DATA!A:B,2,0)","v":"نهاد"},"قسط",null,100]
["2014-11-21",25,{"$f":"VLOOKUP(B160,DATA!A:B,2,0)","v":"نهاد"},"قسط",null,150]
["2014-05-03",26,{"$f":"VLOOKUP(B161,DATA!A:B,2,0)","v":" محمد  26"}]
["2014-05-03",27,{"$f":"VLOOKUP(B162,DATA!A:B,2,0)","v":"سماح"},"المبلغ",500]
["2014-05-13",27,{"$f":"VLOOKUP(B163,DATA!A:B,2,0)","v":"سماح"},"باقى سلك النت -ماوس",35]
["2014-12-07",27,{"$f":"VLOOKUP(B164,DATA!A:B,2,0)","v":"سماح"},"هيدفون ",35]
["2014-06-01",27,{"$f":"VLOOKUP(B165,DATA!A:B,2,0)","v":"سماح"},"ماوس",20]
["2014-06-26",27,{"$f":"VLOOKUP(B166,DATA!A:B,2,0)","v":"سماح"},"صب",110]
["2014-06-27",27,{"$f":"VLOOKUP(B167,DATA!A:B,2,0)","v":"سماح"},"موبايل جلاكسى",1300]
["2014-08-12",27,{"$f":"VLOOKUP(B168,DATA!A:B,2,0)","v":"سماح"},"تنزيل",null,1410]
["2014-08-12",27,{"$f":"VLOOKUP(B169,DATA!A:B,2,0)","v":"سماح"},"ماوس",10]
["2014-08-22",27,{"$f":"VLOOKUP(B170,DATA!A:B,2,0)","v":"سماح"},"فلاشة 8 كينج ستون",45]
["2015-05-30",27,{"$f":"VLOOKUP(B171,DATA!A:B,2,0)","v":"سماح"},"2لوحة مفاتيح",60]
[null,27,{"$f":"VLOOKUP(B172,DATA!A:B,2,0)","v":"سماح"}]
["2014-05-03",28,{"$f":"VLOOKUP(B173,DATA!A:B,2,0)","v":" محمد  28"},"المبلغ",560]
["2014-05-03",28,{"$f":"VLOOKUP(B174,DATA!A:B,2,0)","v":" محمد  28"},"اقساط",null,210]
["2014-05-26",28,{"$f":"VLOOKUP(B175,DATA!A:B,2,0)","v":" محمد  28"},"قسط",null,50]
["2014-08-02",28,{"$f":"VLOOKUP(B176,DATA!A:B,2,0)","v":" محمد  28"},"قسط",null,100]
["2014-08-30",28,{"$f":"VLOOKUP(B177,DATA!A:B,2,0)","v":" محمد  28"},"قسط",null,100]
["2014-10-30",28,{"$f":"VLOOKUP(B178,DATA!A:B,2,0)","v":" محمد  28"},null,1000]
["2014-11-18",28,{"$f":"VLOOKUP(B179,DATA!A:B,2,0)","v":" محمد  28"},null,1000]
["2014-12-22",28,{"$f":"VLOOKUP(B180,DATA!A:B,2,0)","v":" محمد  28"},null,null,1000]
["2015-04-28",28,{"$f":"VLOOKUP(B181,DATA!A:B,2,0)","v":" محمد  28"},null,null,1000]
["2014-05-03",29,{"$f":"VLOOKUP(B182,DATA!A:B,2,0)","v":"سلف"},"سلف",4500]
["2014-07-19",29,{"$f":"VLOOKUP(B183,DATA!A:B,2,0)","v":"سلف"},null,null,2000]
["2014-05-10",30,{"$f":"VLOOKUP(B184,DATA!A:B,2,0)","v":" محمد  30"},"موبايل",1450]
["2014-05-10",30,{"$f":"VLOOKUP(B185,DATA!A:B,2,0)","v":" محمد  30"},"مقدم",null,150]
["2014-08-08",30,{"$f":"VLOOKUP(B186,DATA!A:B,2,0)","v":" محمد  30"},"قسط",null,200]
["2014-10-01",30,{"$f":"VLOOKUP(B187,DATA!A:B,2,0)","v":" محمد  30"},"قسط",null,100]
["2014-05-14",31,{"$f":"VLOOKUP(B188,DATA!A:B,2,0)","v":" محمد  31"}]
["2014-05-13",33,{"$f":"VLOOKUP(B189,DATA!A:B,2,0)","v":" محمد  33"},"مبرد لاب+كسوة غسالة+كابل شاشة+نسخه",160]
["2014-12-17",33,{"$f":"VLOOKUP(B190,DATA!A:B,2,0)","v":" محمد  33"},"قسط",null,100]
[null,34,{"$f":"VLOOKUP(B191,DATA!A:B,2,0)","v":"باسم النجار"},"باقى صب",60]
[null,36,{"$f":"VLOOKUP(B192,DATA!A:B,2,0)","v":" محمد  36"},"باقى صب صاحبه",90]
["2014-05-22",36,{"$f":"VLOOKUP(B193,DATA!A:B,2,0)","v":" محمد  36"},"قسط",null,40]
["2014-10-28",36,{"$f":"VLOOKUP(B194,DATA!A:B,2,0)","v":" محمد  36"},"قسط",null,50]
["2014-05-20",37,{"$f":"VLOOKUP(B195,DATA!A:B,2,0)","v":" محمد  37"},"موبايل",1800]
["2014-07-01",37,{"$f":"VLOOKUP(B196,DATA!A:B,2,0)","v":" محمد  37"},"قسط",null,150]
["2014-06-01",38,{"$f":"VLOOKUP(B197,DATA!A:B,2,0)","v":" محمد  38"},"كريازى 6درج",4000]
["2014-06-01",38,{"$f":"VLOOKUP(B198,DATA!A:B,2,0)","v":" محمد  38"},"مقدم",null,1000]
["2014-06-29",38,{"$f":"VLOOKUP(B199,DATA!A:B,2,0)","v":" محمد  38"},"قسط",null,200]
["2014-08-05",38,{"$f":"VLOOKUP(B200,DATA!A:B,2,0)","v":" محمد  38"},"قسط",null,200]
["2014-09-05",38,{"$f":"VLOOKUP(B201,DATA!A:B,2,0)","v":" محمد  38"},"قسط",null,200]
["2014-10-24",38,{"$f":"VLOOKUP(B202,DATA!A:B,2,0)","v":" محمد  38"},"قسط",null,200]
["2014-11-07",38,{"$f":"VLOOKUP(B203,DATA!A:B,2,0)","v":" محمد  38"},"قسط",null,200]
["2014-12-18",38,{"$f":"VLOOKUP(B204,DATA!A:B,2,0)","v":" محمد  38"},"قسط",null,200]
["2015-01-02",38,{"$f":"VLOOKUP(B205,DATA!A:B,2,0)","v":" محمد  38"},"قسط",null,200]
["2015-02-06",38,{"$f":"VLOOKUP(B206,DATA!A:B,2,0)","v":" محمد  38"},"قسط",null,200]
["2015-04-08",38,{"$f":"VLOOKUP(B207,DATA!A:B,2,0)","v":" محمد  38"},"قسط",null,400]
["2015-05-08",38,{"$f":"VLOOKUP(B208,DATA!A:B,2,0)","v":" محمد  38"},"قسط",null,200]
["2015-06-14",38,{"$f":"VLOOKUP(B209,DATA!A:B,2,0)","v":" محمد  38"},"قسط",null,200]
["2015-09-04",38,{"$f":"VLOOKUP(B210,DATA!A:B,2,0)","v":" محمد  38"},"قسط",null,200]
["2015-09-11",38,{"$f":"VLOOKUP(B211,DATA!A:B,2,0)","v":" محمد  38"},"قسط",null,200]
["2014-06-29",39,{"$f":"VLOOKUP(B212,DATA!A:B,2,0)","v":" محمد  39"},"تليفزيون",650]
["2014-06-29",39,{"$f":"VLOOKUP(B213,DATA!A:B,2,0)","v":" محمد  39"},"مقدم",null,100]
["2014-08-01",39,{"$f":"VLOOKUP(B214,DATA!A:B,2,0)","v":" محمد  39"},"قسط",null,50]
["2014-08-29",39,{"$f":"VLOOKUP(B215,DATA!A:B,2,0)","v":" محمد  39"},"قسط",null,50]
["2014-09-24",39,{"$f":"VLOOKUP(B216,DATA!A:B,2,0)","v":" محمد  39"},"قسط",null,50]
["2014-10-24",39,{"$f":"VLOOKUP(B217,DATA!A:B,2,0)","v":" محمد  39"},"قسط",null,50]
["2014-12-19",39,{"$f":"VLOOKUP(B218,DATA!A:B,2,0)","v":" محمد  39"},"قسط",null,50]
["2015-01-23",39,{"$f":"VLOOKUP(B219,DATA!A:B,2,0)","v":" محمد  39"},"قسط",null,50]
["2015-02-22",39,{"$f":"VLOOKUP(B220,DATA!A:B,2,0)","v":" محمد  39"},"قسط",null,50]
["2015-03-21",39,{"$f":"VLOOKUP(B221,DATA!A:B,2,0)","v":" محمد  39"},"قسط",null,50]
["2015-05-22",39,{"$f":"VLOOKUP(B222,DATA!A:B,2,0)","v":" محمد  39"},"قسط",null,50]
["2015-06-19",39,{"$f":"VLOOKUP(B223,DATA!A:B,2,0)","v":" محمد  39"},"قسط",null,50]
["2015-07-20",39,{"$f":"VLOOKUP(B224,DATA!A:B,2,0)","v":" محمد  39"},"قسط",null,50]
["2014-06-30",40,{"$f":"VLOOKUP(B225,DATA!A:B,2,0)","v":" محمد  40"},"فلاشة كينج ستون 8",45]
["2014-06-30",40,{"$f":"VLOOKUP(B226,DATA!A:B,2,0)","v":" محمد  40"},"دفع 20",null,20]
["2015-02-09",40,{"$f":"VLOOKUP(B227,DATA!A:B,2,0)","v":" محمد  40"},"قسط",null,25]
["2014-07-10",41,{"$f":"VLOOKUP(B228,DATA!A:B,2,0)","v":" محمد  41"},"2ماكينة كهرباء",4800]
["2014-07-12",42,{"$f":"VLOOKUP(B229,DATA!A:B,2,0)","v":" محمد  42"},"ماكينة كهرباء",2400]
["2014-07-12",42,{"$f":"VLOOKUP(B230,DATA!A:B,2,0)","v":" محمد  42"},"مقدم-قسط شهرى 150جنيه",null,500]
["2014-07-14",43,{"$f":"VLOOKUP(B231,DATA!A:B,2,0)","v":" محمد  43"},"ماكينة كهرباء",2500]
["2014-07-14",43,{"$f":"VLOOKUP(B232,DATA!A:B,2,0)","v":" محمد  43"},"مقدم-قسط شهرى 150جنيه",null,400]
["2014-07-14",44,{"$f":"VLOOKUP(B233,DATA!A:B,2,0)","v":" محمد  44"},"ماكينة كهرباء",2500]
["2014-07-14",44,{"$f":"VLOOKUP(B234,DATA!A:B,2,0)","v":" محمد  44"},"مقدم-قسط شهرى 150جنيه",null,400]
["2014-07-25",44,{"$f":"VLOOKUP(B235,DATA!A:B,2,0)","v":" محمد  44"},"ماكينة كهرباء",2500]
["2014-07-25",44,{"$f":"VLOOKUP(B236,DATA!A:B,2,0)","v":" محمد  44"},null,null,500]
["2014-07-17",45,{"$f":"VLOOKUP(B237,DATA!A:B,2,0)","v":" محمد  45"},"ماكينة كهرباء",2500]
["2014-07-17",45,{"$f":"VLOOKUP(B238,DATA!A:B,2,0)","v":" محمد  45"},"مقدم-قسط شهرى 150جنيه",null,500]
["2014-07-17",46,{"$f":"VLOOKUP(B239,DATA!A:B,2,0)","v":" محمد  46"},"ماكينة كهرباء",2500]
["2014-07-17",46,{"$f":"VLOOKUP(B240,DATA!A:B,2,0)","v":" محمد  46"},"مقدم-قسط شهرى 150جنيه",null,500]
["2014-07-17",47,{"$f":"VLOOKUP(B241,DATA!A:B,2,0)","v":" محمد  47"},"ماكينة كهرباء",2500]
["2014-07-17",47,{"$f":"VLOOKUP(B242,DATA!A:B,2,0)","v":" محمد  47"},"مقدم-قسط شهرى 150جنيه",null,500]
["2014-07-25",48,{"$f":"VLOOKUP(B243,DATA!A:B,2,0)","v":" محمد  48"},"موبايل جلاكسى",1800]
["2014-07-25",48,{"$f":"VLOOKUP(B244,DATA!A:B,2,0)","v":" محمد  48"},"مقدم",null,400]
["2014-11-02",48,{"$f":"VLOOKUP(B245,DATA!A:B,2,0)","v":" محمد  48"},"قسط",null,100]
["2014-08-02",49,{"$f":"VLOOKUP(B246,DATA!A:B,2,0)","v":" محمد  49"},"مبلغ مجمد",-3060]
["2014-08-02",49,{"$f":"VLOOKUP(B247,DATA!A:B,2,0)","v":" محمد  49"},null,null,-45]
["2014-08-02",49,{"$f":"VLOOKUP(B248,DATA!A:B,2,0)","v":" محمد  49"},null,null,-30]
["2014-08-02",49,{"$f":"VLOOKUP(B249,DATA!A:B,2,0)","v":" محمد  49"},null,null,-35]
["2014-08-02",49,{"$f":"VLOOKUP(B250,DATA!A:B,2,0)","v":" محمد  49"},null,null,-500]
["2014-08-02",49,{"$f":"VLOOKUP(B251,DATA!A:B,2,0)","v":" محمد  49"},null,null,-220]
["2014-08-03",49,{"$f":"VLOOKUP(B252,DATA!A:B,2,0)","v":" محمد  49"},null,null,-5]
["2014-08-04",49,{"$f":"VLOOKUP(B253,DATA!A:B,2,0)","v":" محمد  49"},null,null,-80]
["2014-08-05",49,{"$f":"VLOOKUP(B254,DATA!A:B,2,0)","v":" محمد  49"},null,null,-140]
["2014-08-06",49,{"$f":"VLOOKUP(B255,DATA!A:B,2,0)","v":" محمد  49"},null,null,-620]
["2014-08-07",49,{"$f":"VLOOKUP(B256,DATA!A:B,2,0)","v":" محمد  49"},null,null,-40]
["2014-08-08",49,{"$f":"VLOOKUP(B257,DATA!A:B,2,0)","v":" محمد  49"},null,null,-30]
["2014-08-09",49,{"$f":"VLOOKUP(B258,DATA!A:B,2,0)","v":" محمد  49"},null,null,-290]
["2014-08-12",49,{"$f":"VLOOKUP(B259,DATA!A:B,2,0)","v":" محمد  49"},null,null,-65]
["2014-08-14",49,{"$f":"VLOOKUP(B260,DATA!A:B,2,0)","v":" محمد  49"},null,null,-275]
["2014-08-18",49,{"$f":"VLOOKUP(B261,DATA!A:B,2,0)","v":" محمد  49"},null,null,50]
["2014-08-19",49,{"$f":"VLOOKUP(B262,DATA!A:B,2,0)","v":" محمد  49"},null,null,-30]
["2014-08-21",49,{"$f":"VLOOKUP(B263,DATA!A:B,2,0)","v":" محمد  49"},"رسيفر",null,-190]
["2014-08-28",49,{"$f":"VLOOKUP(B264,DATA!A:B,2,0)","v":" محمد  49"},"مروحة نيو",null,-100]
["2014-08-28",49,{"$f":"VLOOKUP(B265,DATA!A:B,2,0)","v":" محمد  49"},"ريموت",null,-20]
["2014-08-30",49,{"$f":"VLOOKUP(B266,DATA!A:B,2,0)","v":" محمد  49"},"المال",null,-35]
["2014-10-11",49,{"$f":"VLOOKUP(B267,DATA!A:B,2,0)","v":" محمد  49"},null,null,-30]
["2014-12-11",49,{"$f":"VLOOKUP(B268,DATA!A:B,2,0)","v":" محمد  49"},"سيارة  ",null,-300]
[null,49,{"$f":"VLOOKUP(B269,DATA!A:B,2,0)","v":" محمد  49"},null,null,-10]
[null,49,{"$f":"VLOOKUP(B270,DATA!A:B,2,0)","v":" محمد  49"},null,null,40]
["2015-01-08",49,{"$f":"VLOOKUP(B271,DATA!A:B,2,0)","v":" محمد  49"},"كسر محمد",null,500]
[null,50,{"$f":"VLOOKUP(B272,DATA!A:B,2,0)","v":"ام سحر"},"سلف",3685]
["2014-08-06",50,{"$f":"VLOOKUP(B273,DATA!A:B,2,0)","v":"ام سحر"},null,null,1000]
["2014-08-17",50,{"$f":"VLOOKUP(B274,DATA!A:B,2,0)","v":"ام سحر"},null,200]
["2014-08-21",50,{"$f":"VLOOKUP(B275,DATA!A:B,2,0)","v":"ام سحر"},null,200]
["2014-10-02",50,{"$f":"VLOOKUP(B276,DATA!A:B,2,0)","v":"ام سحر"},null,200]
["2014-10-09",50,{"$f":"VLOOKUP(B277,DATA!A:B,2,0)","v":"ام سحر"},"كسوة مراتب",690]
["2014-10-15",50,{"$f":"VLOOKUP(B278,DATA!A:B,2,0)","v":"ام سحر"},"فاتورة",95]
["2014-10-19",50,{"$f":"VLOOKUP(B279,DATA!A:B,2,0)","v":"ام سحر"},null,500]
[null,50,{"$f":"VLOOKUP(B280,DATA!A:B,2,0)","v":"ام سحر"},"موبايل هند",190]
["2014-11-14",50,{"$f":"VLOOKUP(B281,DATA!A:B,2,0)","v":"ام سحر"},null,600]
["2014-11-16",50,{"$f":"VLOOKUP(B282,DATA!A:B,2,0)","v":"ام سحر"},null,100]
["2015-01-07",50,{"$f":"VLOOKUP(B283,DATA!A:B,2,0)","v":"ام سحر"},null,200]
[null,51,{"$f":"VLOOKUP(B284,DATA!A:B,2,0)","v":" محمد  51"},"عليه ليه",-4000]
["2014-08-08",51,{"$f":"VLOOKUP(B285,DATA!A:B,2,0)","v":" محمد  51"},null,null,1000]
["2014-09-04",51,{"$f":"VLOOKUP(B286,DATA!A:B,2,0)","v":" محمد  51"},"تنزيل",null,-3000]
["2014-09-12",51,{"$f":"VLOOKUP(B287,DATA!A:B,2,0)","v":" محمد  51"},null,null,-2000]
[null,52,{"$f":"VLOOKUP(B288,DATA!A:B,2,0)","v":" محمد  52"},null,-3000]
["2014-08-21",52,{"$f":"VLOOKUP(B289,DATA!A:B,2,0)","v":" محمد  52"},null,null,-1000]
["2014-09-19",52,{"$f":"VLOOKUP(B290,DATA!A:B,2,0)","v":" محمد  52"},null,null,-1000]
["2014-10-20",52,{"$f":"VLOOKUP(B291,DATA!A:B,2,0)","v":" محمد  52"},null,null,-1000]
["2014-08-03",53,{"$f":"VLOOKUP(B292,DATA!A:B,2,0)","v":" محمد  53"},"موبايل سونى اكسبيريا v ",2400]
["2014-08-03",53,{"$f":"VLOOKUP(B293,DATA!A:B,2,0)","v":" محمد  53"},"مقدم-قسط شهرى 150جنيه",null,400]
["2014-10-09",53,{"$f":"VLOOKUP(B294,DATA!A:B,2,0)","v":" محمد  53"},"قسط",null,150]
["2014-10-28",53,{"$f":"VLOOKUP(B295,DATA!A:B,2,0)","v":" محمد  53"},"قسط",null,150]
["2014-12-07",53,{"$f":"VLOOKUP(B296,DATA!A:B,2,0)","v":" محمد  53"},"قسط",null,150]
["2015-02-06",53,{"$f":"VLOOKUP(B297,DATA!A:B,2,0)","v":" محمد  53"},"قسط",null,150]
["2015-01-06",53,{"$f":"VLOOKUP(B298,DATA!A:B,2,0)","v":" محمد  53"},"قسط",null,150]
["2015-03-07",53,{"$f":"VLOOKUP(B299,DATA!A:B,2,0)","v":" محمد  53"},"قسط",null,150]
["2015-04-05",53,{"$f":"VLOOKUP(B300,DATA!A:B,2,0)","v":" محمد  53"},"قسط",null,150]
["2015-05-09",53,{"$f":"VLOOKUP(B301,DATA!A:B,2,0)","v":" محمد  53"},"قسط",null,150]
["2015-06-15",53,{"$f":"VLOOKUP(B302,DATA!A:B,2,0)","v":" محمد  53"},"قسط",null,150]
["2014-08-16",54,{"$f":"VLOOKUP(B303,DATA!A:B,2,0)","v":" محمد  54"},"ماكينة كهرباء",2500]
["2014-08-16",54,{"$f":"VLOOKUP(B304,DATA!A:B,2,0)","v":" محمد  54"},"مقدم-قسط شهرى 150جنيه",null,500]
["2014-08-09",55,{"$f":"VLOOKUP(B305,DATA!A:B,2,0)","v":"دعاء سلام"},"2موبايل ستار بلص دوز",2000]
["2014-08-09",55,{"$f":"VLOOKUP(B306,DATA!A:B,2,0)","v":"دعاء سلام"},"مقدم",null,300]
["2014-09-05",55,{"$f":"VLOOKUP(B307,DATA!A:B,2,0)","v":"دعاء سلام"},"قسط",null,100]
["2014-10-07",55,{"$f":"VLOOKUP(B308,DATA!A:B,2,0)","v":"دعاء سلام"},"قسط",null,100]
["2014-10-31",55,{"$f":"VLOOKUP(B309,DATA!A:B,2,0)","v":"دعاء سلام"},"قسط",null,100]
["2014-12-18",55,{"$f":"VLOOKUP(B310,DATA!A:B,2,0)","v":"دعاء سلام"},"قسط",null,100]
["2015-01-02",55,{"$f":"VLOOKUP(B311,DATA!A:B,2,0)","v":"دعاء سلام"},"قسط",null,50]
["2015-01-23",55,{"$f":"VLOOKUP(B312,DATA!A:B,2,0)","v":"دعاء سلام"},"قسط",null,50]
["2015-03-14",55,{"$f":"VLOOKUP(B313,DATA!A:B,2,0)","v":"دعاء سلام"},"قسط",null,100]
["2015-04-24",55,{"$f":"VLOOKUP(B314,DATA!A:B,2,0)","v":"دعاء سلام"},"قسط",null,100]
["2015-06-19",55,{"$f":"VLOOKUP(B315,DATA!A:B,2,0)","v":"دعاء سلام"},"قسط",null,100]
["2015-09-11",55,{"$f":"VLOOKUP(B316,DATA!A:B,2,0)","v":"دعاء سلام"},"قسط",null,100]
["2015-10-02",55,{"$f":"VLOOKUP(B317,DATA!A:B,2,0)","v":"دعاء سلام"},"قسط",null,100]
["2015-10-30",55,{"$f":"VLOOKUP(B318,DATA!A:B,2,0)","v":"دعاء سلام"},"قسط",null,100]
["2015-11-26",55,{"$f":"VLOOKUP(B319,DATA!A:B,2,0)","v":"دعاء سلام"},"قسط",null,100]
["2014-08-16",56,{"$f":"VLOOKUP(B320,DATA!A:B,2,0)","v":" محمد  56"},"ماكينة كهرباء",2500]
["2014-08-16",56,{"$f":"VLOOKUP(B321,DATA!A:B,2,0)","v":" محمد  56"},"مقدم-قسط شهرى 150جنيه",null,500]
["2014-08-18",57,{"$f":"VLOOKUP(B322,DATA!A:B,2,0)","v":"بسام درويش"},"ماكينة كهرباء",2300]
["2014-08-18",57,{"$f":"VLOOKUP(B323,DATA!A:B,2,0)","v":"بسام درويش"},"مقدم",null,500]
["2014-09-24",57,{"$f":"VLOOKUP(B324,DATA!A:B,2,0)","v":"بسام درويش"},"قسط",null,100]
["2014-10-24",57,{"$f":"VLOOKUP(B325,DATA!A:B,2,0)","v":"بسام درويش"},"قسط",null,100]
["2014-12-19",57,{"$f":"VLOOKUP(B326,DATA!A:B,2,0)","v":"بسام درويش"},"قسط",null,100]
["2015-01-23",57,{"$f":"VLOOKUP(B327,DATA!A:B,2,0)","v":"بسام درويش"},"قسط",null,100]
["2015-02-22",57,{"$f":"VLOOKUP(B328,DATA!A:B,2,0)","v":"بسام درويش"},"قسط",null,100]
["2015-03-21",57,{"$f":"VLOOKUP(B329,DATA!A:B,2,0)","v":"بسام درويش"},"قسط",null,100]
["2015-05-22",57,{"$f":"VLOOKUP(B330,DATA!A:B,2,0)","v":"بسام درويش"},"قسط",null,100]
["2015-06-19",57,{"$f":"VLOOKUP(B331,DATA!A:B,2,0)","v":"بسام درويش"},"قسط",null,100]
["2015-07-20",57,{"$f":"VLOOKUP(B332,DATA!A:B,2,0)","v":"بسام درويش"},"قسط",null,100]
["2015-09-04",57,{"$f":"VLOOKUP(B333,DATA!A:B,2,0)","v":"بسام درويش"},"قسط",null,100]
["2015-10-30",57,{"$f":"VLOOKUP(B334,DATA!A:B,2,0)","v":"بسام درويش"},"قسط",null,100]
["2014-08-24",58,{"$f":"VLOOKUP(B335,DATA!A:B,2,0)","v":" محمد  58"},"موبايل",600]
["2014-08-24",58,{"$f":"VLOOKUP(B336,DATA!A:B,2,0)","v":" محمد  58"},"مقدم",null,100]
["2014-10-24",58,{"$f":"VLOOKUP(B337,DATA!A:B,2,0)","v":" محمد  58"},"قسط",null,50]
["2014-11-21",58,{"$f":"VLOOKUP(B338,DATA!A:B,2,0)","v":" محمد  58"},"قسط",null,50]
["2014-12-18",58,{"$f":"VLOOKUP(B339,DATA!A:B,2,0)","v":" محمد  58"},"قسط",null,50]
["2015-01-02",58,{"$f":"VLOOKUP(B340,DATA!A:B,2,0)","v":" محمد  58"},"قسط",null,50]
["2015-01-23",58,{"$f":"VLOOKUP(B341,DATA!A:B,2,0)","v":" محمد  58"},"قسط",null,50]
["2015-03-14",58,{"$f":"VLOOKUP(B342,DATA!A:B,2,0)","v":" محمد  58"},"قسط",null,50]
["2015-04-24",58,{"$f":"VLOOKUP(B343,DATA!A:B,2,0)","v":" محمد  58"},"قسط",null,150]
["2014-08-31",59,{"$f":"VLOOKUP(B344,DATA!A:B,2,0)","v":"تامر"},"موبايل اكسبيريا m",1800]
["2014-08-31",59,{"$f":"VLOOKUP(B345,DATA!A:B,2,0)","v":"تامر"},"مقدم",null,400]
["2014-10-07",59,{"$f":"VLOOKUP(B346,DATA!A:B,2,0)","v":"تامر"},"قسط",null,100]
["2014-10-24",59,{"$f":"VLOOKUP(B347,DATA!A:B,2,0)","v":"تامر"},"قسط",null,100]
["2014-11-21",59,{"$f":"VLOOKUP(B348,DATA!A:B,2,0)","v":"تامر"},"قسط",null,100]
["2015-01-02",59,{"$f":"VLOOKUP(B349,DATA!A:B,2,0)","v":"تامر"},"قسط",null,100]
["2015-01-23",59,{"$f":"VLOOKUP(B350,DATA!A:B,2,0)","v":"تامر"},"قسط",null,100]
["2015-02-22",59,{"$f":"VLOOKUP(B351,DATA!A:B,2,0)","v":"تامر"},"قسط",null,100]
["2015-03-21",59,{"$f":"VLOOKUP(B352,DATA!A:B,2,0)","v":"تامر"},"قسط",null,100]
["2015-05-08",59,{"$f":"VLOOKUP(B353,DATA!A:B,2,0)","v":"تامر"},"قسط",null,100]
["2015-09-11",59,{"$f":"VLOOKUP(B354,DATA!A:B,2,0)","v":"تامر"},"قسط",null,100]
["2015-10-30",59,{"$f":"VLOOKUP(B355,DATA!A:B,2,0)","v":"تامر"},"قسط",null,100]
["2015-11-26",59,{"$f":"VLOOKUP(B356,DATA!A:B,2,0)","v":"تامر"},"قسط",null,100]
["2015-07-06",59,{"$f":"VLOOKUP(B357,DATA!A:B,2,0)","v":"تامر"},"قسط",null,100]
["2014-09-18",60,{"$f":"VLOOKUP(B358,DATA!A:B,2,0)","v":"سعاد وهيب"},"موبايل",180]
["2014-10-06",60,{"$f":"VLOOKUP(B359,DATA!A:B,2,0)","v":"سعاد وهيب"},"قسط",null,20]
["2014-12-03",60,{"$f":"VLOOKUP(B360,DATA!A:B,2,0)","v":"سعاد وهيب"},null,null,30]
["2015-03-07",60,{"$f":"VLOOKUP(B361,DATA!A:B,2,0)","v":"سعاد وهيب"},"قسط",null,30]
["2014-10-08",61,{"$f":"VLOOKUP(B362,DATA!A:B,2,0)","v":"مايكل 2"},"بوتاجاز يونيفرسال",3400]
["2014-10-08",61,{"$f":"VLOOKUP(B363,DATA!A:B,2,0)","v":"مايكل 2"},"مقدم-قسط شهرى 150جنيه",null,1000]
["2014-11-07",61,{"$f":"VLOOKUP(B364,DATA!A:B,2,0)","v":"مايكل 2"},"قسط",null,150]
["2014-12-18",61,{"$f":"VLOOKUP(B365,DATA!A:B,2,0)","v":"مايكل 2"},"قسط",null,150]
["2015-01-02",61,{"$f":"VLOOKUP(B366,DATA!A:B,2,0)","v":"مايكل 2"},"قسط",null,150]
["2015-02-06",61,{"$f":"VLOOKUP(B367,DATA!A:B,2,0)","v":"مايكل 2"},"قسط",null,150]
["2015-04-08",61,{"$f":"VLOOKUP(B368,DATA!A:B,2,0)","v":"مايكل 2"},"قسط",null,300]
["2015-05-08",61,{"$f":"VLOOKUP(B369,DATA!A:B,2,0)","v":"مايكل 2"},"قسط",null,150]
["2015-06-14",61,{"$f":"VLOOKUP(B370,DATA!A:B,2,0)","v":"مايكل 2"},"قسط",null,150]
["2015-09-04",61,{"$f":"VLOOKUP(B371,DATA!A:B,2,0)","v":"مايكل 2"},"قسط",null,150]
["2015-09-11",61,{"$f":"VLOOKUP(B372,DATA!A:B,2,0)","v":"مايكل 2"},"قسط",null,150]
["2015-11-08",61,{"$f":"VLOOKUP(B373,DATA!A:B,2,0)","v":"مايكل 2"},"قسط",null,300]
["2015-12-04",61,{"$f":"VLOOKUP(B374,DATA!A:B,2,0)","v":"مايكل 2"},"قسط",null,150]
["2015-07-06",61,{"$f":"VLOOKUP(B375,DATA!A:B,2,0)","v":"مايكل 2"},"قسط",null,150]
["2014-10-29",62,{"$f":"VLOOKUP(B376,DATA!A:B,2,0)","v":" محمد  62"},"فلاشة 8 كينج ستون",50]
["2014-11-02",63,{"$f":"VLOOKUP(B377,DATA!A:B,2,0)","v":" محمد  63"},"موبايل جران2 + جراب",2550]
["2014-11-02",63,{"$f":"VLOOKUP(B378,DATA!A:B,2,0)","v":" محمد  63"},"مقدم - قسط شهرى150",null,400]
["2014-12-18",63,{"$f":"VLOOKUP(B379,DATA!A:B,2,0)","v":" محمد  63"},"قسط",null,150]
["2015-01-23",63,{"$f":"VLOOKUP(B380,DATA!A:B,2,0)","v":" محمد  63"},"قسط",null,150]
["2015-02-22",63,{"$f":"VLOOKUP(B381,DATA!A:B,2,0)","v":" محمد  63"},"قسط",null,150]
["2015-03-21",63,{"$f":"VLOOKUP(B382,DATA!A:B,2,0)","v":" محمد  63"},"قسط",null,150]
["2015-04-17",63,{"$f":"VLOOKUP(B383,DATA!A:B,2,0)","v":" محمد  63"},"قسط",null,150]
["2015-05-08",63,{"$f":"VLOOKUP(B384,DATA!A:B,2,0)","v":" محمد  63"},"قسط",null,150]
["2015-06-19",63,{"$f":"VLOOKUP(B385,DATA!A:B,2,0)","v":" محمد  63"},"قسط",null,150]
["2015-07-24",63,{"$f":"VLOOKUP(B386,DATA!A:B,2,0)","v":" محمد  63"},"قسط",null,150]
["2015-09-18",63,{"$f":"VLOOKUP(B387,DATA!A:B,2,0)","v":" محمد  63"},"قسط",null,250]
["2015-10-02",63,{"$f":"VLOOKUP(B388,DATA!A:B,2,0)","v":" محمد  63"},"قسط",null,50]
["2015-11-13",63,{"$f":"VLOOKUP(B389,DATA!A:B,2,0)","v":" محمد  63"},"قسط",null,150]
["2015-12-04",63,{"$f":"VLOOKUP(B390,DATA!A:B,2,0)","v":" محمد  63"},"قسط",null,150]
["2014-11-11",64,{"$f":"VLOOKUP(B391,DATA!A:B,2,0)","v":" محمد  64"},"رصيد",3600]
["2014-11-15",65,{"$f":"VLOOKUP(B392,DATA!A:B,2,0)","v":" محمد  65"},"كمبيوتر استعمال",1650]
["2014-11-15",65,{"$f":"VLOOKUP(B393,DATA!A:B,2,0)","v":" محمد  65"},"تنزيل",null,400]
["2014-11-22",65,{"$f":"VLOOKUP(B394,DATA!A:B,2,0)","v":" محمد  65"},"قسط",null,150]
["2014-12-22",65,{"$f":"VLOOKUP(B395,DATA!A:B,2,0)","v":" محمد  65"},"قسط",null,500]
["2015-02-07",65,{"$f":"VLOOKUP(B396,DATA!A:B,2,0)","v":" محمد  65"},"قسط",null,600]
["2014-11-15",66,{"$f":"VLOOKUP(B397,DATA!A:B,2,0)","v":"موسى محمد عبدالغنى /كيسة"},"كيسة",2200]
[null,66,{"$f":"VLOOKUP(B398,DATA!A:B,2,0)","v":"موسى محمد عبدالغنى /كيسة"},"رسيفر+طبق+ox",230]
["2014-12-19",66,{"$f":"VLOOKUP(B399,DATA!A:B,2,0)","v":"موسى محمد عبدالغنى /كيسة"},"قسط",null,200]
["2015-01-20",66,{"$f":"VLOOKUP(B400,DATA!A:B,2,0)","v":"موسى محمد عبدالغنى /كيسة"},"قسط",null,200]
["2015-03-06",66,{"$f":"VLOOKUP(B401,DATA!A:B,2,0)","v":"موسى محمد عبدالغنى /كيسة"},"قسط",null,200]
["2015-04-04",66,{"$f":"VLOOKUP(B402,DATA!A:B,2,0)","v":"موسى محمد عبدالغنى /كيسة"},"قسط",null,200]
["2015-05-02",66,{"$f":"VLOOKUP(B403,DATA!A:B,2,0)","v":"موسى محمد عبدالغنى /كيسة"},"قسط",null,200]
["2015-06-02",66,{"$f":"VLOOKUP(B404,DATA!A:B,2,0)","v":"موسى محمد عبدالغنى /كيسة"},"قسط",null,200]
["2015-07-01",66,{"$f":"VLOOKUP(B405,DATA!A:B,2,0)","v":"موسى محمد عبدالغنى /كيسة"},"قسط",null,200]
["2015-08-07",66,{"$f":"VLOOKUP(B406,DATA!A:B,2,0)","v":"موسى محمد عبدالغنى /كيسة"},"قسط",null,200]
["2015-09-05",66,{"$f":"VLOOKUP(B407,DATA!A:B,2,0)","v":"موسى محمد عبدالغنى /كيسة"},"قسط",null,200]
["2014-12-02",67,{"$f":"VLOOKUP(B408,DATA!A:B,2,0)","v":" محمد  67"},"شاحن - كى - ماوس -نسخة - ريموت",100]
["2014-12-02",67,{"$f":"VLOOKUP(B409,DATA!A:B,2,0)","v":" محمد  67"},null,null,40]
[null,67,{"$f":"VLOOKUP(B410,DATA!A:B,2,0)","v":" محمد  67"},"قسط",null,20]
["2014-12-21",67,{"$f":"VLOOKUP(B411,DATA!A:B,2,0)","v":" محمد  67"},null,null,20]
["2015-04-20",67,{"$f":"VLOOKUP(B412,DATA!A:B,2,0)","v":" محمد  67"},"قسط",null,20]
["2014-12-13",68,{"$f":"VLOOKUP(B413,DATA!A:B,2,0)","v":"موسى محمد عبدالغنى/جراند نيو"},"موبايل جراند نيو",3200]
["2014-12-13",68,{"$f":"VLOOKUP(B414,DATA!A:B,2,0)","v":"موسى محمد عبدالغنى/جراند نيو"},"مقدم-قسط شهرى 150جنيه",null,500]
["2014-12-17",68,{"$f":"VLOOKUP(B415,DATA!A:B,2,0)","v":"موسى محمد عبدالغنى/جراند نيو"},"موبايل جراند نيو",3200]
["2014-12-17",68,{"$f":"VLOOKUP(B416,DATA!A:B,2,0)","v":"موسى محمد عبدالغنى/جراند نيو"},"مقدم - قسط شهرى150",null,500]
["2015-01-09",68,{"$f":"VLOOKUP(B417,DATA!A:B,2,0)","v":"موسى محمد عبدالغنى/جراند نيو"},"قسط",null,300]
["2015-03-06",68,{"$f":"VLOOKUP(B418,DATA!A:B,2,0)","v":"موسى محمد عبدالغنى/جراند نيو"},"قسط",null,300]
["2015-04-04",68,{"$f":"VLOOKUP(B419,DATA!A:B,2,0)","v":"موسى محمد عبدالغنى/جراند نيو"},"قسط",null,300]
["2015-05-02",68,{"$f":"VLOOKUP(B420,DATA!A:B,2,0)","v":"موسى محمد عبدالغنى/جراند نيو"},"قسط",null,300]
["2015-06-02",68,{"$f":"VLOOKUP(B421,DATA!A:B,2,0)","v":"موسى محمد عبدالغنى/جراند نيو"},"قسط",null,300]
["2015-07-01",68,{"$f":"VLOOKUP(B422,DATA!A:B,2,0)","v":"موسى محمد عبدالغنى/جراند نيو"},"قسط",null,300]
["2015-08-07",68,{"$f":"VLOOKUP(B423,DATA!A:B,2,0)","v":"موسى محمد عبدالغنى/جراند نيو"},"قسط",null,300]
["2015-09-05",68,{"$f":"VLOOKUP(B424,DATA!A:B,2,0)","v":"موسى محمد عبدالغنى/جراند نيو"},"قسط",null,300]
["2014-12-18",69,{"$f":"VLOOKUP(B425,DATA!A:B,2,0)","v":" محمد  69"},"رصيد",2300]
["2014-12-20",70,{"$f":"VLOOKUP(B426,DATA!A:B,2,0)","v":"موسى محمد عبدالغنى /جراند2"},"موبايل جراند2",2500]
["2014-12-20",70,{"$f":"VLOOKUP(B427,DATA!A:B,2,0)","v":"موسى محمد عبدالغنى /جراند2"},"مقدم - قسط شهرى100 جنيه",null,500]
["2015-01-09",70,{"$f":"VLOOKUP(B428,DATA!A:B,2,0)","v":"موسى محمد عبدالغنى /جراند2"},"قسط",null,100]
["2015-03-06",70,{"$f":"VLOOKUP(B429,DATA!A:B,2,0)","v":"موسى محمد عبدالغنى /جراند2"},"قسط",null,100]
["2015-04-04",70,{"$f":"VLOOKUP(B430,DATA!A:B,2,0)","v":"موسى محمد عبدالغنى /جراند2"},"قسط",null,100]
["2015-05-02",70,{"$f":"VLOOKUP(B431,DATA!A:B,2,0)","v":"موسى محمد عبدالغنى /جراند2"},"قسط",null,100]
["2015-06-02",70,{"$f":"VLOOKUP(B432,DATA!A:B,2,0)","v":"موسى محمد عبدالغنى /جراند2"},"قسط",null,100]
["2015-07-01",70,{"$f":"VLOOKUP(B433,DATA!A:B,2,0)","v":"موسى محمد عبدالغنى /جراند2"},"قسط",null,100]
["2015-08-07",70,{"$f":"VLOOKUP(B434,DATA!A:B,2,0)","v":"موسى محمد عبدالغنى /جراند2"},"قسط",null,100]
["2015-09-05",70,{"$f":"VLOOKUP(B435,DATA!A:B,2,0)","v":"موسى محمد عبدالغنى /جراند2"},"قسط",null,100]
["2015-10-10",70,{"$f":"VLOOKUP(B436,DATA!A:B,2,0)","v":"موسى محمد عبدالغنى /جراند2"},"قسط",null,100]
["2014-12-24",71,{"$f":"VLOOKUP(B437,DATA!A:B,2,0)","v":"دعاء سيد احمد"},"موبايل جراند 2 - 5شهور200-قسط150",2550]
["2015-01-23",71,{"$f":"VLOOKUP(B438,DATA!A:B,2,0)","v":"دعاء سيد احمد"},"قسط",null,200]
["2015-02-22",71,{"$f":"VLOOKUP(B439,DATA!A:B,2,0)","v":"دعاء سيد احمد"},"قسط",null,200]
["2015-03-23",71,{"$f":"VLOOKUP(B440,DATA!A:B,2,0)","v":"دعاء سيد احمد"},"قسط",null,200]
["2015-04-24",71,{"$f":"VLOOKUP(B441,DATA!A:B,2,0)","v":"دعاء سيد احمد"},"قسط",null,200]
["2015-05-28",71,{"$f":"VLOOKUP(B442,DATA!A:B,2,0)","v":"دعاء سيد احمد"},"قسط",null,200]
["2015-06-19",71,{"$f":"VLOOKUP(B443,DATA!A:B,2,0)","v":"دعاء سيد احمد"},"قسط",null,100]
["2015-07-24",71,{"$f":"VLOOKUP(B444,DATA!A:B,2,0)","v":"دعاء سيد احمد"},"قسط",null,200]
["2015-09-18",71,{"$f":"VLOOKUP(B445,DATA!A:B,2,0)","v":"دعاء سيد احمد"},"قسط",null,150]
["2015-10-02",71,{"$f":"VLOOKUP(B446,DATA!A:B,2,0)","v":"دعاء سيد احمد"},"قسط",null,150]
["2015-12-04",71,{"$f":"VLOOKUP(B447,DATA!A:B,2,0)","v":"دعاء سيد احمد"},"قسط",null,250]
["2014-12-24",72,{"$f":"VLOOKUP(B448,DATA!A:B,2,0)","v":"صالح محمود 2"},"موبايل",1575]
["2014-12-24",72,{"$f":"VLOOKUP(B449,DATA!A:B,2,0)","v":"صالح محمود 2"},"مقدم",null,275]
["2015-03-06",72,{"$f":"VLOOKUP(B450,DATA!A:B,2,0)","v":"صالح محمود 2"},"قسط",null,120]
["2015-04-04",72,{"$f":"VLOOKUP(B451,DATA!A:B,2,0)","v":"صالح محمود 2"},"قسط",null,120]
["2015-05-02",72,{"$f":"VLOOKUP(B452,DATA!A:B,2,0)","v":"صالح محمود 2"},"قسط",null,120]
["2015-06-02",72,{"$f":"VLOOKUP(B453,DATA!A:B,2,0)","v":"صالح محمود 2"},"قسط",null,120]
["2015-07-01",72,{"$f":"VLOOKUP(B454,DATA!A:B,2,0)","v":"صالح محمود 2"},"قسط",null,120]
["2015-08-07",72,{"$f":"VLOOKUP(B455,DATA!A:B,2,0)","v":"صالح محمود 2"},"قسط",null,120]
["2015-09-09",72,{"$f":"VLOOKUP(B456,DATA!A:B,2,0)","v":"صالح محمود 2"},"قسط",null,120]
["2015-10-10",72,{"$f":"VLOOKUP(B457,DATA!A:B,2,0)","v":"صالح محمود 2"},"قسط",null,120]
["2015-01-14",73,{"$f":"VLOOKUP(B458,DATA!A:B,2,0)","v":"موسى محمد عبدالغنى- جراند باير"},"موبايل جراند - باير",2300]
["2015-01-14",73,{"$f":"VLOOKUP(B459,DATA!A:B,2,0)","v":"موسى محمد عبدالغنى- جراند باير"},"مقدم - قسط125 جنيه",null,300]
["2015-03-06",73,{"$f":"VLOOKUP(B460,DATA!A:B,2,0)","v":"موسى محمد عبدالغنى- جراند باير"},"قسط",null,125]
["2015-04-10",73,{"$f":"VLOOKUP(B461,DATA!A:B,2,0)","v":"موسى محمد عبدالغنى- جراند باير"},"قسط",null,125]
["2015-05-02",73,{"$f":"VLOOKUP(B462,DATA!A:B,2,0)","v":"موسى محمد عبدالغنى- جراند باير"},"قسط",null,125]
["2015-06-02",73,{"$f":"VLOOKUP(B463,DATA!A:B,2,0)","v":"موسى محمد عبدالغنى- جراند باير"},"قسط",null,125]
["2015-07-01",73,{"$f":"VLOOKUP(B464,DATA!A:B,2,0)","v":"موسى محمد عبدالغنى- جراند باير"},"قسط",null,125]
["2015-08-07",73,{"$f":"VLOOKUP(B465,DATA!A:B,2,0)","v":"موسى محمد عبدالغنى- جراند باير"},"قسط",null,125]
["2015-09-09",73,{"$f":"VLOOKUP(B466,DATA!A:B,2,0)","v":"موسى محمد عبدالغنى- جراند باير"},"قسط",null,125]
["2015-10-10",73,{"$f":"VLOOKUP(B467,DATA!A:B,2,0)","v":"موسى محمد عبدالغنى- جراند باير"},"قسط",null,125]
["2015-01-20",74,{"$f":"VLOOKUP(B468,DATA!A:B,2,0)","v":"موسى محمد عبدالغنى /2موبايل"},"2موبايل جلاكسى",4550]
["2015-01-20",74,{"$f":"VLOOKUP(B469,DATA!A:B,2,0)","v":"موسى محمد عبدالغنى /2موبايل"},"مقدم -قسط 200جنيه /19 شهر",null,700]
["2015-03-06",74,{"$f":"VLOOKUP(B470,DATA!A:B,2,0)","v":"موسى محمد عبدالغنى /2موبايل"},"قسط",null,200]
["2015-04-04",74,{"$f":"VLOOKUP(B471,DATA!A:B,2,0)","v":"موسى محمد عبدالغنى /2موبايل"},"قسط",null,200]
["2015-05-02",74,{"$f":"VLOOKUP(B472,DATA!A:B,2,0)","v":"موسى محمد عبدالغنى /2موبايل"},"قسط",null,200]
["2015-06-02",74,{"$f":"VLOOKUP(B473,DATA!A:B,2,0)","v":"موسى محمد عبدالغنى /2موبايل"},"قسط",null,200]
["2015-07-01",74,{"$f":"VLOOKUP(B474,DATA!A:B,2,0)","v":"موسى محمد عبدالغنى /2موبايل"},"قسط",null,200]
["2015-08-07",74,{"$f":"VLOOKUP(B475,DATA!A:B,2,0)","v":"موسى محمد عبدالغنى /2موبايل"},"قسط",null,200]
["2015-09-05",74,{"$f":"VLOOKUP(B476,DATA!A:B,2,0)","v":"موسى محمد عبدالغنى /2موبايل"},"قسط",null,200]
["2015-10-10",74,{"$f":"VLOOKUP(B477,DATA!A:B,2,0)","v":"موسى محمد عبدالغنى /2موبايل"},"قسط",null,200]
["2015-01-31",75,{"$f":"VLOOKUP(B478,DATA!A:B,2,0)","v":"موسى محمد عبدالغنى- جراند باير2"},"موبايل جراند نيو2",2450]
["2015-01-31",75,{"$f":"VLOOKUP(B479,DATA!A:B,2,0)","v":"موسى محمد عبدالغنى- جراند باير2"},"مقدم-قسط شهرى 150جنيه-اخر شهر200جنيه",null,300]
["2015-03-06",75,{"$f":"VLOOKUP(B480,DATA!A:B,2,0)","v":"موسى محمد عبدالغنى- جراند باير2"},"قسط",null,150]
["2015-04-04",75,{"$f":"VLOOKUP(B481,DATA!A:B,2,0)","v":"موسى محمد عبدالغنى- جراند باير2"},"قسط",null,150]
["2015-05-02",75,{"$f":"VLOOKUP(B482,DATA!A:B,2,0)","v":"موسى محمد عبدالغنى- جراند باير2"},"قسط",null,150]
["2015-06-02",75,{"$f":"VLOOKUP(B483,DATA!A:B,2,0)","v":"موسى محمد عبدالغنى- جراند باير2"},"قسط",null,150]
["2015-07-01",75,{"$f":"VLOOKUP(B484,DATA!A:B,2,0)","v":"موسى محمد عبدالغنى- جراند باير2"},"قسط",null,150]
["2015-08-07",75,{"$f":"VLOOKUP(B485,DATA!A:B,2,0)","v":"موسى محمد عبدالغنى- جراند باير2"},"قسط",null,150]
["2015-09-05",75,{"$f":"VLOOKUP(B486,DATA!A:B,2,0)","v":"موسى محمد عبدالغنى- جراند باير2"},"قسط",null,150]
["2015-10-10",75,{"$f":"VLOOKUP(B487,DATA!A:B,2,0)","v":"موسى محمد عبدالغنى- جراند باير2"},"قسط",null,150]
["2015-01-28",76,{"$f":"VLOOKUP(B488,DATA!A:B,2,0)","v":" محمد  76"},"كيسة",600]
["2015-02-02",76,{"$f":"VLOOKUP(B489,DATA!A:B,2,0)","v":" محمد  76"},"قسط",null,400]
["2015-02-08",76,{"$f":"VLOOKUP(B490,DATA!A:B,2,0)","v":" محمد  76"},"قسط",null,100]
[null,76,{"$f":"VLOOKUP(B491,DATA!A:B,2,0)","v":" محمد  76"},"قسط",null,100]
["2015-04-01",76,{"$f":"VLOOKUP(B492,DATA!A:B,2,0)","v":" محمد  76"},"قسط",null,100]
["2015-02-03",77,{"$f":"VLOOKUP(B493,DATA!A:B,2,0)","v":"موسى جراند -بدون مقدم"},"موبايل جراند بدون مقدم -150 شهرى",2550]
["2015-03-06",77,{"$f":"VLOOKUP(B494,DATA!A:B,2,0)","v":"موسى جراند -بدون مقدم"},"قسط",null,150]
["2015-04-10",77,{"$f":"VLOOKUP(B495,DATA!A:B,2,0)","v":"موسى جراند -بدون مقدم"},"قسط",null,150]
["2015-05-02",77,{"$f":"VLOOKUP(B496,DATA!A:B,2,0)","v":"موسى جراند -بدون مقدم"},"قسط",null,150]
["2015-06-02",77,{"$f":"VLOOKUP(B497,DATA!A:B,2,0)","v":"موسى جراند -بدون مقدم"},"قسط",null,150]
["2015-07-01",77,{"$f":"VLOOKUP(B498,DATA!A:B,2,0)","v":"موسى جراند -بدون مقدم"},"قسط",null,150]
["2015-08-07",77,{"$f":"VLOOKUP(B499,DATA!A:B,2,0)","v":"موسى جراند -بدون مقدم"},"قسط",null,150]
["2015-09-05",77,{"$f":"VLOOKUP(B500,DATA!A:B,2,0)","v":"موسى جراند -بدون مقدم"},"قسط",null,150]
["2015-10-10",77,{"$f":"VLOOKUP(B501,DATA!A:B,2,0)","v":"موسى جراند -بدون مقدم"},"قسط",null,150]
["2015-02-15",78,{"$f":"VLOOKUP(B502,DATA!A:B,2,0)","v":"موسى جراند -بدون مقدم2"},"موبايل جراند بدون مقدم -200 شهرى",3150]
["2015-04-04",78,{"$f":"VLOOKUP(B503,DATA!A:B,2,0)","v":"موسى جراند -بدون مقدم2"},"قسط",null,200]
["2015-05-14",78,{"$f":"VLOOKUP(B504,DATA!A:B,2,0)","v":"موسى جراند -بدون مقدم2"},"قسط",null,200]
["2015-06-02",78,{"$f":"VLOOKUP(B505,DATA!A:B,2,0)","v":"موسى جراند -بدون مقدم2"},"قسط",null,200]
["2015-07-01",78,{"$f":"VLOOKUP(B506,DATA!A:B,2,0)","v":"موسى جراند -بدون مقدم2"},"قسط",null,200]
["2015-08-07",78,{"$f":"VLOOKUP(B507,DATA!A:B,2,0)","v":"موسى جراند -بدون مقدم2"},"قسط",null,200]
["2015-09-05",78,{"$f":"VLOOKUP(B508,DATA!A:B,2,0)","v":"موسى جراند -بدون مقدم2"},"قسط",null,200]
["2015-10-10",78,{"$f":"VLOOKUP(B509,DATA!A:B,2,0)","v":"موسى جراند -بدون مقدم2"},"قسط",null,200]
["2015-02-15",79,{"$f":"VLOOKUP(B510,DATA!A:B,2,0)","v":" محمد  79"},"لاب توب ديل",7000]
["2015-02-15",79,{"$f":"VLOOKUP(B511,DATA!A:B,2,0)","v":" محمد  79"},"مقدم",null,1000]
["2015-03-23",79,{"$f":"VLOOKUP(B512,DATA!A:B,2,0)","v":" محمد  79"},"قسط",null,300]
["2015-04-06",79,{"$f":"VLOOKUP(B513,DATA!A:B,2,0)","v":" محمد  79"},"قسط",null,300]
["2015-05-22",79,{"$f":"VLOOKUP(B514,DATA!A:B,2,0)","v":" محمد  79"},"قسط",null,300]
["2015-03-10",80,{"$f":"VLOOKUP(B515,DATA!A:B,2,0)","v":"اخت ام عمرو"},"ماكينة فورى / 200كل اسبوع",6250]
["2015-03-16",81,{"$f":"VLOOKUP(B516,DATA!A:B,2,0)","v":"موسى محمد - نود4 - عبدالرازق"},"نود فور",7500]
["2015-03-16",81,{"$f":"VLOOKUP(B517,DATA!A:B,2,0)","v":"موسى محمد - نود4 - عبدالرازق"},"مقدم - 540 قسط شهرى",null,1000]
["2015-04-16",81,{"$f":"VLOOKUP(B518,DATA!A:B,2,0)","v":"موسى محمد - نود4 - عبدالرازق"},"قسط",null,540]
["2015-05-17",81,{"$f":"VLOOKUP(B519,DATA!A:B,2,0)","v":"موسى محمد - نود4 - عبدالرازق"},"قسط",null,540]
["2015-06-18",81,{"$f":"VLOOKUP(B520,DATA!A:B,2,0)","v":"موسى محمد - نود4 - عبدالرازق"},"ق",null,540]
["2015-07-17",81,{"$f":"VLOOKUP(B521,DATA!A:B,2,0)","v":"موسى محمد - نود4 - عبدالرازق"},"قسط",null,540]
["2015-08-16",81,{"$f":"VLOOKUP(B522,DATA!A:B,2,0)","v":"موسى محمد - نود4 - عبدالرازق"},"قسط",null,540]
["2015-10-19",81,{"$f":"VLOOKUP(B523,DATA!A:B,2,0)","v":"موسى محمد - نود4 - عبدالرازق"},"قسط",null,540]
["2015-03-22",82,{"$f":"VLOOKUP(B524,DATA!A:B,2,0)","v":"موسى محمد - نود2"},"نود2 - محمد صبحى 12 شهر",2500]
["2015-05-02",82,{"$f":"VLOOKUP(B525,DATA!A:B,2,0)","v":"موسى محمد - نود2"},"قسط",null,210]
["2015-06-02",82,{"$f":"VLOOKUP(B526,DATA!A:B,2,0)","v":"موسى محمد - نود2"},"قسط",null,210]
["2015-07-01",82,{"$f":"VLOOKUP(B527,DATA!A:B,2,0)","v":"موسى محمد - نود2"},"قسط",null,210]
["2015-08-07",82,{"$f":"VLOOKUP(B528,DATA!A:B,2,0)","v":"موسى محمد - نود2"},"قسط",null,210]
["2015-09-09",82,{"$f":"VLOOKUP(B529,DATA!A:B,2,0)","v":"موسى محمد - نود2"},"قسط",null,210]
["2015-10-10",82,{"$f":"VLOOKUP(B530,DATA!A:B,2,0)","v":"موسى محمد - نود2"},"قسط",null,210]
["2015-03-24",83,{"$f":"VLOOKUP(B531,DATA!A:B,2,0)","v":" نهاد حجازى"},"موبايل الكاتل",1300]
["2015-03-24",83,{"$f":"VLOOKUP(B532,DATA!A:B,2,0)","v":" نهاد حجازى"},"مقدم قسط 100 شهرى",null,250]
["2015-04-24",83,{"$f":"VLOOKUP(B533,DATA!A:B,2,0)","v":" نهاد حجازى"},"قسط",null,100]
["2015-05-22",83,{"$f":"VLOOKUP(B534,DATA!A:B,2,0)","v":" نهاد حجازى"},"قسط",null,100]
["2015-06-19",83,{"$f":"VLOOKUP(B535,DATA!A:B,2,0)","v":" نهاد حجازى"},"قسط",null,100]
["2015-07-24",83,{"$f":"VLOOKUP(B536,DATA!A:B,2,0)","v":" نهاد حجازى"},"قسط",null,100]
["2015-09-11",83,{"$f":"VLOOKUP(B537,DATA!A:B,2,0)","v":" نهاد حجازى"},"قسط",null,100]
["2015-10-02",83,{"$f":"VLOOKUP(B538,DATA!A:B,2,0)","v":" نهاد حجازى"},"قسط",null,100]
["2015-10-30",83,{"$f":"VLOOKUP(B539,DATA!A:B,2,0)","v":" نهاد حجازى"},"قسط",null,100]
["2015-11-13",83,{"$f":"VLOOKUP(B540,DATA!A:B,2,0)","v":" نهاد حجازى"},"قسط",null,100]
["2015-12-04",83,{"$f":"VLOOKUP(B541,DATA!A:B,2,0)","v":" نهاد حجازى"},"قسط",null,100]
["2015-03-30",84,{"$f":"VLOOKUP(B542,DATA!A:B,2,0)","v":"رشا-اكسبيريا z-r"},"موبايل اكسبيريا z-r---150قسط",2350]
["30/30/2015",84,{"$f":"VLOOKUP(B543,DATA!A:B,2,0)","v":"رشا-اكسبيريا z-r"},"مقدم - قسط شهرى 150 جنيه",null,400]
["2015-05-08",84,{"$f":"VLOOKUP(B544,DATA!A:B,2,0)","v":"رشا-اكسبيريا z-r"},"قسط",null,150]
["2015-06-14",84,{"$f":"VLOOKUP(B545,DATA!A:B,2,0)","v":"رشا-اكسبيريا z-r"},"قسط",null,150]
["2015-07-24",84,{"$f":"VLOOKUP(B546,DATA!A:B,2,0)","v":"رشا-اكسبيريا z-r"},"قسط",null,150]
["2015-10-02",84,{"$f":"VLOOKUP(B547,DATA!A:B,2,0)","v":"رشا-اكسبيريا z-r"},"قسط",null,150]
["2015-11-13",84,{"$f":"VLOOKUP(B548,DATA!A:B,2,0)","v":"رشا-اكسبيريا z-r"},"قسط",null,300]
["2015-04-04",85,{"$f":"VLOOKUP(B549,DATA!A:B,2,0)","v":"نود2- عبدالرازق"},"نود2 - عبدالرازق 12 شهر",5200]
["2015-04-04",85,{"$f":"VLOOKUP(B550,DATA!A:B,2,0)","v":"نود2- عبدالرازق"},"مقدم - 350 شهرى",null,1000]
["2015-06-02",85,{"$f":"VLOOKUP(B551,DATA!A:B,2,0)","v":"نود2- عبدالرازق"},"قسط",null,350]
["2015-07-01",85,{"$f":"VLOOKUP(B552,DATA!A:B,2,0)","v":"نود2- عبدالرازق"},"قسط",null,350]
["2015-08-13",85,{"$f":"VLOOKUP(B553,DATA!A:B,2,0)","v":"نود2- عبدالرازق"},"قسط",null,350]
["2015-09-05",85,{"$f":"VLOOKUP(B554,DATA!A:B,2,0)","v":"نود2- عبدالرازق"},"قسط",null,350]
["2015-10-08",85,{"$f":"VLOOKUP(B555,DATA!A:B,2,0)","v":"نود2- عبدالرازق"},"قسط",null,350]
["2015-04-08",86,{"$f":"VLOOKUP(B556,DATA!A:B,2,0)","v":"موسى S3new"},"موبايل S3new",2425]
["2015-04-08",86,{"$f":"VLOOKUP(B557,DATA!A:B,2,0)","v":"موسى S3new"},"مقدم - 175 قسط شهرى",null,475]
["2015-06-02",86,{"$f":"VLOOKUP(B558,DATA!A:B,2,0)","v":"موسى S3new"},"قسط",null,175]
["2015-07-01",86,{"$f":"VLOOKUP(B559,DATA!A:B,2,0)","v":"موسى S3new"},"قسط",null,175]
["2015-08-07",86,{"$f":"VLOOKUP(B560,DATA!A:B,2,0)","v":"موسى S3new"},"قسط",null,175]
["2015-09-09",86,{"$f":"VLOOKUP(B561,DATA!A:B,2,0)","v":"موسى S3new"},"قسط",null,175]
["2015-10-10",86,{"$f":"VLOOKUP(B562,DATA!A:B,2,0)","v":"موسى S3new"},"قسط",null,175]
["2015-04-12",87,{"$f":"VLOOKUP(B563,DATA!A:B,2,0)","v":" محمد  87"},"موبايل نوكيا",400]
["2015-04-12",87,{"$f":"VLOOKUP(B564,DATA!A:B,2,0)","v":" محمد  87"},"مقدم - قسط 50 جنيه شهرى",null,100]
["2015-05-15",87,{"$f":"VLOOKUP(B565,DATA!A:B,2,0)","v":" محمد  87"},"قسط",null,50]
["2015-06-19",87,{"$f":"VLOOKUP(B566,DATA!A:B,2,0)","v":" محمد  87"},"قسط",null,50]
["2015-07-24",87,{"$f":"VLOOKUP(B567,DATA!A:B,2,0)","v":" محمد  87"},"قسط",null,50]
["2015-09-18",87,{"$f":"VLOOKUP(B568,DATA!A:B,2,0)","v":" محمد  87"},"قسط",null,50]
["2015-10-02",87,{"$f":"VLOOKUP(B569,DATA!A:B,2,0)","v":" محمد  87"},"قسط",null,50]
["2015-12-04",87,{"$f":"VLOOKUP(B570,DATA!A:B,2,0)","v":" محمد  87"},"قسط",null,50]
["2015-04-16",88,{"$f":"VLOOKUP(B571,DATA!A:B,2,0)","v":"دعاء-اكسبيرياz-r"},"موبايل اكسبيريا z-r",1350]
["2015-05-28",88,{"$f":"VLOOKUP(B572,DATA!A:B,2,0)","v":"دعاء-اكسبيرياz-r"},"قسط",null,200]
["2015-06-19",88,{"$f":"VLOOKUP(B573,DATA!A:B,2,0)","v":"دعاء-اكسبيرياz-r"},"قسط",null,100]
["2015-07-24",88,{"$f":"VLOOKUP(B574,DATA!A:B,2,0)","v":"دعاء-اكسبيرياz-r"},"قسط",null,200]
["2015-09-18",88,{"$f":"VLOOKUP(B575,DATA!A:B,2,0)","v":"دعاء-اكسبيرياz-r"},"قسط",null,100]
["2015-10-02",88,{"$f":"VLOOKUP(B576,DATA!A:B,2,0)","v":"دعاء-اكسبيرياz-r"},"قسط",null,100]
["2015-12-04",88,{"$f":"VLOOKUP(B577,DATA!A:B,2,0)","v":"دعاء-اكسبيرياz-r"},"قسط",null,200]
["2015-04-16",88,{"$f":"VLOOKUP(B578,DATA!A:B,2,0)","v":"دعاء-اكسبيرياz-r"},"قسط",null,200]
["2015-04-16",89,{"$f":"VLOOKUP(B579,DATA!A:B,2,0)","v":"موسى- تكنو"},"موبايل تكنو - 70 قسط شهرى",800]
["2015-06-02",89,{"$f":"VLOOKUP(B580,DATA!A:B,2,0)","v":"موسى- تكنو"},"قسط",null,70]
["2015-07-01",89,{"$f":"VLOOKUP(B581,DATA!A:B,2,0)","v":"موسى- تكنو"},"قسط",null,70]
["2015-08-07",89,{"$f":"VLOOKUP(B582,DATA!A:B,2,0)","v":"موسى- تكنو"},"قسط",null,70]
["2015-09-09",89,{"$f":"VLOOKUP(B583,DATA!A:B,2,0)","v":"موسى- تكنو"},"قسط",null,70]
["2015-10-10",89,{"$f":"VLOOKUP(B584,DATA!A:B,2,0)","v":"موسى- تكنو"},"قسط",null,70]
["2015-04-23",90,{"$f":"VLOOKUP(B585,DATA!A:B,2,0)","v":"محمد الحنفى"},"موبايل",2800]
["2015-02-23",90,{"$f":"VLOOKUP(B586,DATA!A:B,2,0)","v":"محمد الحنفى"},"مقدم - قسط 200 جنيه",null,1000]
["2015-06-05",90,{"$f":"VLOOKUP(B587,DATA!A:B,2,0)","v":"محمد الحنفى"},"قسط",null,200]
["2015-06-21",90,{"$f":"VLOOKUP(B588,DATA!A:B,2,0)","v":"محمد الحنفى"},"قسط",null,200]
["2015-07-05",90,{"$f":"VLOOKUP(B589,DATA!A:B,2,0)","v":"محمد الحنفى"},"قسط",null,200]
["2015-09-11",90,{"$f":"VLOOKUP(B590,DATA!A:B,2,0)","v":"محمد الحنفى"},"قسط",null,200]
["2015-11-08",90,{"$f":"VLOOKUP(B591,DATA!A:B,2,0)","v":"محمد الحنفى"},"قسط",null,200]
["2015-12-04",90,{"$f":"VLOOKUP(B592,DATA!A:B,2,0)","v":"محمد الحنفى"},"قسط",null,200]
["2015-04-28",91,{"$f":"VLOOKUP(B593,DATA!A:B,2,0)","v":"عاطف شوقى الشيخ"},"تايجر 5500+ فلاشة 4 جيجا",480]
["2015-04-28",91,{"$f":"VLOOKUP(B594,DATA!A:B,2,0)","v":"عاطف شوقى الشيخ"},"مقدم",null,50]
["2015-05-22",91,{"$f":"VLOOKUP(B595,DATA!A:B,2,0)","v":"عاطف شوقى الشيخ"},"قسط",null,50]
["2015-06-24",91,{"$f":"VLOOKUP(B596,DATA!A:B,2,0)","v":"عاطف شوقى الشيخ"},"قسط",null,50]
["2015-09-26",91,{"$f":"VLOOKUP(B597,DATA!A:B,2,0)","v":"عاطف شوقى الشيخ"},"قسط",null,50]
["2015-12-10",91,{"$f":"VLOOKUP(B598,DATA!A:B,2,0)","v":"عاطف شوقى الشيخ"},"قسط",null,50]
["2015-05-08",92,{"$f":"VLOOKUP(B599,DATA!A:B,2,0)","v":"صلاح محمود 2"},"موبايل - قسط شهرى- 175",1950]
["2015-07-01",92,{"$f":"VLOOKUP(B600,DATA!A:B,2,0)","v":"صلاح محمود 2"},"قسط",null,175]
["2015-08-13",92,{"$f":"VLOOKUP(B601,DATA!A:B,2,0)","v":"صلاح محمود 2"},"قسط",null,175]
["2015-09-09",92,{"$f":"VLOOKUP(B602,DATA!A:B,2,0)","v":"صلاح محمود 2"},"قسط",null,175]
["2015-10-10",92,{"$f":"VLOOKUP(B603,DATA!A:B,2,0)","v":"صلاح محمود 2"},"قسط",null,175]
["2015-05-21",93,{"$f":"VLOOKUP(B604,DATA!A:B,2,0)","v":"موسى 2مروحة"},"2مروحة توشيبا 48 سقف",600]
["2015-07-01",93,{"$f":"VLOOKUP(B605,DATA!A:B,2,0)","v":"موسى 2مروحة"},"قسط",null,50]
["2015-07-30",93,{"$f":"VLOOKUP(B606,DATA!A:B,2,0)","v":"موسى 2مروحة"},"مروحة العربى 56",360]
["2015-08-07",93,{"$f":"VLOOKUP(B607,DATA!A:B,2,0)","v":"موسى 2مروحة"},"قسط",null,50]
["2015-09-05",93,{"$f":"VLOOKUP(B608,DATA!A:B,2,0)","v":"موسى 2مروحة"},"قسط",null,50]
["2015-10-10",93,{"$f":"VLOOKUP(B609,DATA!A:B,2,0)","v":"موسى 2مروحة"},"قسط",null,75]
["2015-09-08",93,{"$f":"VLOOKUP(B610,DATA!A:B,2,0)","v":"موسى 2مروحة"},"قسط",null,75]
["2015-05-25",94,{"$f":"VLOOKUP(B611,DATA!A:B,2,0)","v":" محمد  94"},"موبايل",950]
["2015-05-25",94,{"$f":"VLOOKUP(B612,DATA!A:B,2,0)","v":" محمد  94"},"مقدم - قسط 75 شهرى",null,200]
["2015-06-15",94,{"$f":"VLOOKUP(B613,DATA!A:B,2,0)","v":" محمد  94"},"قسط",null,75]
["2015-05-24",95,{"$f":"VLOOKUP(B614,DATA!A:B,2,0)","v":"محمد حبيب"},"ماكينة تصوير",1800]
["2015-06-01",95,{"$f":"VLOOKUP(B615,DATA!A:B,2,0)","v":"محمد حبيب"},"من المقدم",null,200]
["2015-06-14",95,{"$f":"VLOOKUP(B616,DATA!A:B,2,0)","v":"محمد حبيب"},"باقى مقدم",null,200]
["2015-07-24",95,{"$f":"VLOOKUP(B617,DATA!A:B,2,0)","v":"محمد حبيب"},"قسط",null,100]
["2015-08-31",95,{"$f":"VLOOKUP(B618,DATA!A:B,2,0)","v":"محمد حبيب"},"قسط",null,100]
["2015-10-27",95,{"$f":"VLOOKUP(B619,DATA!A:B,2,0)","v":"محمد حبيب"},"قسط",null,100]
["2015-11-19",95,{"$f":"VLOOKUP(B620,DATA!A:B,2,0)","v":"محمد حبيب"},"قسط",null,100]
["2015-05-28",96,{"$f":"VLOOKUP(B621,DATA!A:B,2,0)","v":"محمد الفولى"},"موبايل",2800]
["2015-05-28",96,{"$f":"VLOOKUP(B622,DATA!A:B,2,0)","v":"محمد الفولى"},"قسط200جنيه",null,500]
["2015-06-05",96,{"$f":"VLOOKUP(B623,DATA!A:B,2,0)","v":"محمد الفولى"},"باقى مقدم",null,500]
["2015-06-19",96,{"$f":"VLOOKUP(B624,DATA!A:B,2,0)","v":"محمد الفولى"},"قسط",null,200]
["2015-07-20",96,{"$f":"VLOOKUP(B625,DATA!A:B,2,0)","v":"محمد الفولى"},"قسط",null,200]
["2015-09-04",96,{"$f":"VLOOKUP(B626,DATA!A:B,2,0)","v":"محمد الفولى"},"قسط",null,200]
["2015-10-30",96,{"$f":"VLOOKUP(B627,DATA!A:B,2,0)","v":"محمد الفولى"},"قسط",null,200]
["2015-11-19",96,{"$f":"VLOOKUP(B628,DATA!A:B,2,0)","v":"محمد الفولى"},"قسط",null,300]
["2015-09-25",96,{"$f":"VLOOKUP(B629,DATA!A:B,2,0)","v":"محمد الفولى"},"قسط",null,200]
["2015-05-30",97,{"$f":"VLOOKUP(B630,DATA!A:B,2,0)","v":"ساندى"},"موبايل تكنو y4",600]
["2015-05-30",97,{"$f":"VLOOKUP(B631,DATA!A:B,2,0)","v":"ساندى"},"من الموبايل",null,300]
["2015-06-04",98,{"$f":"VLOOKUP(B632,DATA!A:B,2,0)","v":"s3 - موسى محمد"},"موبايل",4550]
["2015-06-04",98,{"$f":"VLOOKUP(B633,DATA!A:B,2,0)","v":"s3 - موسى محمد"},"مقدم",null,650]
["2015-08-13",98,{"$f":"VLOOKUP(B634,DATA!A:B,2,0)","v":"s3 - موسى محمد"},"قسط",null,325]
["2015-09-09",98,{"$f":"VLOOKUP(B635,DATA!A:B,2,0)","v":"s3 - موسى محمد"},"قسط",null,325]
["2015-06-18",99,{"$f":"VLOOKUP(B636,DATA!A:B,2,0)","v":"موسى محمد - جلاكسى كور"},"موبايل جلاكسى كور برايم",1500]
["2015-06-18",99,{"$f":"VLOOKUP(B637,DATA!A:B,2,0)","v":"موسى محمد - جلاكسى كور"},"مقدم - قسط110 شهرى",null,200]
["2015-08-13",99,{"$f":"VLOOKUP(B638,DATA!A:B,2,0)","v":"موسى محمد - جلاكسى كور"},"قسط",null,110]
["2015-09-09",99,{"$f":"VLOOKUP(B639,DATA!A:B,2,0)","v":"موسى محمد - جلاكسى كور"},"قسط",null,110]
["2015-10-10",99,{"$f":"VLOOKUP(B640,DATA!A:B,2,0)","v":"موسى محمد - جلاكسى كور"},"قسط",null,110]
["2015-06-18",100,{"$f":"VLOOKUP(B641,DATA!A:B,2,0)","v":"موسى محمد - جلاكسى "},"موبايل جلاكسى",1270]
["2015-06-18",100,{"$f":"VLOOKUP(B642,DATA!A:B,2,0)","v":"موسى محمد - جلاكسى "},"مقدم - قسط شهرى 100",null,150]
["2015-08-07",100,{"$f":"VLOOKUP(B643,DATA!A:B,2,0)","v":"موسى محمد - جلاكسى "},"قسط",null,100]
["2015-09-09",100,{"$f":"VLOOKUP(B644,DATA!A:B,2,0)","v":"موسى محمد - جلاكسى "},"قسط",null,100]
["2015-10-10",100,{"$f":"VLOOKUP(B645,DATA!A:B,2,0)","v":"موسى محمد - جلاكسى "},"قسط",null,100]
["2015-06-19",101,{"$f":"VLOOKUP(B646,DATA!A:B,2,0)","v":"موسى محمد - جراند2"},"موبايل جراند 2",2310]
["2015-06-19",101,{"$f":"VLOOKUP(B647,DATA!A:B,2,0)","v":"موسى محمد - جراند2"},"مقدم - قسط شهرى 160",null,360]
["2015-08-13",101,{"$f":"VLOOKUP(B648,DATA!A:B,2,0)","v":"موسى محمد - جراند2"},"قسط",null,160]
["2015-09-09",101,{"$f":"VLOOKUP(B649,DATA!A:B,2,0)","v":"موسى محمد - جراند2"},"قسط",null,160]
["2015-10-10",101,{"$f":"VLOOKUP(B650,DATA!A:B,2,0)","v":"موسى محمد - جراند2"},"قسط",null,160]
["2015-06-21",102,{"$f":"VLOOKUP(B651,DATA!A:B,2,0)","v":"حنان الحنفى"},"موبايل 4G",350]
["2015-06-21",102,{"$f":"VLOOKUP(B652,DATA!A:B,2,0)","v":"حنان الحنفى"},"مقدم",null,100]
["2015-07-20",102,{"$f":"VLOOKUP(B653,DATA!A:B,2,0)","v":"حنان الحنفى"},"قسط",null,25]
["2015-09-11",102,{"$f":"VLOOKUP(B654,DATA!A:B,2,0)","v":"حنان الحنفى"},"قسط",null,25]
["2015-10-30",102,{"$f":"VLOOKUP(B655,DATA!A:B,2,0)","v":"حنان الحنفى"},"قسط",null,50]
["2015-06-21",103,{"$f":"VLOOKUP(B656,DATA!A:B,2,0)","v":"تامر2"},"موبايل",650]
["2015-06-21",103,{"$f":"VLOOKUP(B657,DATA!A:B,2,0)","v":"تامر2"},"مقدم قسط50 جنيه شهرى",null,150]
["2015-10-30",103,{"$f":"VLOOKUP(B658,DATA!A:B,2,0)","v":"تامر2"},"قسط",null,150]
["2015-06-23",104,{"$f":"VLOOKUP(B659,DATA!A:B,2,0)","v":" محمد  104"},"موبايل s3new",3900]
["2015-06-23",104,{"$f":"VLOOKUP(B660,DATA!A:B,2,0)","v":" محمد  104"},"مقدم",null,700]
["2015-08-09",104,{"$f":"VLOOKUP(B661,DATA!A:B,2,0)","v":" محمد  104"},"قسط",null,1600]
["2015-09-17",104,{"$f":"VLOOKUP(B662,DATA!A:B,2,0)","v":" محمد  104"},"قسط",null,1600]
["2015-06-26",105,{"$f":"VLOOKUP(B663,DATA!A:B,2,0)","v":"موسى مكنسة"},null,650]
["2015-09-05",105,{"$f":"VLOOKUP(B664,DATA!A:B,2,0)","v":"موسى مكنسة"},"قسط",null,50]
["2015-10-10",105,{"$f":"VLOOKUP(B665,DATA!A:B,2,0)","v":"موسى مكنسة"},"قسط",null,50]
["2015-07-06",106,{"$f":"VLOOKUP(B666,DATA!A:B,2,0)","v":"s3new-musa"},"s3new",2320]
["2015-07-06",106,{"$f":"VLOOKUP(B667,DATA!A:B,2,0)","v":"s3new-musa"},"مقدم- قسط شهرى 150جنيه",null,500]
["2015-09-09",106,{"$f":"VLOOKUP(B668,DATA!A:B,2,0)","v":"s3new-musa"},"قسط",null,150]
["2015-10-10",106,{"$f":"VLOOKUP(B669,DATA!A:B,2,0)","v":"s3new-musa"},"قسط",null,150]
["2015-07-06",107,{"$f":"VLOOKUP(B670,DATA!A:B,2,0)","v":"not2-2"},"not2",2450]
["2015-07-06",107,{"$f":"VLOOKUP(B671,DATA!A:B,2,0)","v":"not2-2"},"مقدم-قسط شهرى165جنيه",null,500]
["2015-09-09",107,{"$f":"VLOOKUP(B672,DATA!A:B,2,0)","v":"not2-2"},"قسط",null,165]
["2015-10-10",107,{"$f":"VLOOKUP(B673,DATA!A:B,2,0)","v":"not2-2"},"قسط",null,165]
["2015-07-06",108,{"$f":"VLOOKUP(B674,DATA!A:B,2,0)","v":"not2-3"},"not2",2450]
["2015-07-06",108,{"$f":"VLOOKUP(B675,DATA!A:B,2,0)","v":"not2-3"},"مقدم- قسط شهرى 165جنيه",null,500]
["2015-09-09",108,{"$f":"VLOOKUP(B676,DATA!A:B,2,0)","v":"not2-3"},"قسط",null,165]
["2015-10-10",108,{"$f":"VLOOKUP(B677,DATA!A:B,2,0)","v":"not2-3"},"قسط",null,165]
["2015-07-13",109,{"$f":"VLOOKUP(B678,DATA!A:B,2,0)","v":"not3-2"},"not3",3380]
["2015-07-13",109,{"$f":"VLOOKUP(B679,DATA!A:B,2,0)","v":"not3-2"},"مقدم - قسط شهرى 150 جنيه",null,600]
["2015-09-05",109,{"$f":"VLOOKUP(B680,DATA!A:B,2,0)","v":"not3-2"},"قسط",null,150]
["2015-10-10",109,{"$f":"VLOOKUP(B681,DATA!A:B,2,0)","v":"not3-2"},"قسط",null,150]
["2015-07-26",110,{"$f":"VLOOKUP(B682,DATA!A:B,2,0)","v":"e5"},"موبايل ",3575]
["2015-07-26",110,{"$f":"VLOOKUP(B683,DATA!A:B,2,0)","v":"e5"},"مقدم - قسط 150 شهرى",null,775]
["2015-09-05",110,{"$f":"VLOOKUP(B684,DATA!A:B,2,0)","v":"e5"},"قسط",null,150]
["2015-10-10",110,{"$f":"VLOOKUP(B685,DATA!A:B,2,0)","v":"e5"},"قسط",null,150]
["2015-08-07",112,{"$f":"VLOOKUP(B686,DATA!A:B,2,0)","v":"محمد السيسى"},"نوكيا 108",300]
["2015-08-07",112,{"$f":"VLOOKUP(B687,DATA!A:B,2,0)","v":"محمد السيسى"},"مقدم الباقى 4 شهور",null,100]
["2015-10-10",112,{"$f":"VLOOKUP(B688,DATA!A:B,2,0)","v":"محمد السيسى"},"قسط",null,50]
["2015-08-09",113,{"$f":"VLOOKUP(B689,DATA!A:B,2,0)","v":"ام عمرو G1"},"موبايل g1 - قسط شهرى 100",1300]
["2015-09-10",113,{"$f":"VLOOKUP(B690,DATA!A:B,2,0)","v":"ام عمرو G1"},"قسط",null,100]
["2015-10-18",113,{"$f":"VLOOKUP(B691,DATA!A:B,2,0)","v":"ام عمرو G1"},"قسط",null,100]
["2015-11-07",113,{"$f":"VLOOKUP(B692,DATA!A:B,2,0)","v":"ام عمرو G1"},"قسط",null,100]
["2015-12-10",113,{"$f":"VLOOKUP(B693,DATA!A:B,2,0)","v":"ام عمرو G1"},"قسط",null,100]
["2015-08-09",114,{"$f":"VLOOKUP(B694,DATA!A:B,2,0)","v":"ام عمرو3000"},"موبايل قسط شهرى 200",4000]
["2015-09-10",114,{"$f":"VLOOKUP(B695,DATA!A:B,2,0)","v":"ام عمرو3000"},"قسط",null,200]
["2015-10-18",114,{"$f":"VLOOKUP(B696,DATA!A:B,2,0)","v":"ام عمرو3000"},"قسط",null,200]
["2015-11-07",114,{"$f":"VLOOKUP(B697,DATA!A:B,2,0)","v":"ام عمرو3000"},"قسط",null,200]
["2015-12-10",114,{"$f":"VLOOKUP(B698,DATA!A:B,2,0)","v":"ام عمرو3000"},"قسط",null,200]
["2015-08-13",115,{"$f":"VLOOKUP(B699,DATA!A:B,2,0)","v":"musa-note4"},"note4",6760]
["2015-08-13",115,{"$f":"VLOOKUP(B700,DATA!A:B,2,0)","v":"musa-note4"},"مقدم/350قسط شهرى/16 شهر",null,1200]
["2015-10-10",115,{"$f":"VLOOKUP(B701,DATA!A:B,2,0)","v":"musa-note4"},"قسط",null,350]
["2015-08-13",116,{"$f":"VLOOKUP(B702,DATA!A:B,2,0)","v":"musa-note3-3"},"نوت3",4875]
["2015-08-13",116,{"$f":"VLOOKUP(B703,DATA!A:B,2,0)","v":"musa-note3-3"},"مقدم260قسط شهرى/16شهر",null,750]
["2015-10-10",116,{"$f":"VLOOKUP(B704,DATA!A:B,2,0)","v":"musa-note3-3"},"قسط",null,260]
["2015-08-13",117,{"$f":"VLOOKUP(B705,DATA!A:B,2,0)","v":"musa-amr"},"موبايل/قسط شهرى75/18شهر",1200]
["2015-10-10",117,{"$f":"VLOOKUP(B706,DATA!A:B,2,0)","v":"musa-amr"},"قسط",null,75]
["2015-08-14",118,{"$f":"VLOOKUP(B707,DATA!A:B,2,0)","v":"عبير موسى"},"موبايل تكنو y6",935]
["2015-08-14",118,{"$f":"VLOOKUP(B708,DATA!A:B,2,0)","v":"عبير موسى"},"مقدم-قسط50جنيه شهرى",null,200]
["2015-10-10",118,{"$f":"VLOOKUP(B709,DATA!A:B,2,0)","v":"عبير موسى"},"قسط",null,50]
["2015-08-21",119,{"$f":"VLOOKUP(B710,DATA!A:B,2,0)","v":"جراند نيو بلص-أيمن"},"موبايل جراند نيو بلص",1600]
["2015-08-21",119,{"$f":"VLOOKUP(B711,DATA!A:B,2,0)","v":"جراند نيو بلص-أيمن"},"مقدم - قسط 100 شهرى",null,300]
["2015-10-10",119,{"$f":"VLOOKUP(B712,DATA!A:B,2,0)","v":"جراند نيو بلص-أيمن"},"قسط",null,100]
["2015-09-08",120,{"$f":"VLOOKUP(B713,DATA!A:B,2,0)","v":"محمد طعيمة"},"موبايل/على شهرين",850]
["2015-09-08",120,{"$f":"VLOOKUP(B714,DATA!A:B,2,0)","v":"محمد طعيمة"},"مقدم",null,300]
["2015-09-19",120,{"$f":"VLOOKUP(B715,DATA!A:B,2,0)","v":"محمد طعيمة"},"قسط",null,50]
["2015-09-24",120,{"$f":"VLOOKUP(B716,DATA!A:B,2,0)","v":"محمد طعيمة"},"قسط",null,50]
["2015-10-08",120,{"$f":"VLOOKUP(B717,DATA!A:B,2,0)","v":"محمد طعيمة"},"قسط",null,50]
["2015-10-18",120,{"$f":"VLOOKUP(B718,DATA!A:B,2,0)","v":"محمد طعيمة"},"قسط",null,50]
["2015-10-27",120,{"$f":"VLOOKUP(B719,DATA!A:B,2,0)","v":"محمد طعيمة"},"قسط",null,50]
["2015-11-07",120,{"$f":"VLOOKUP(B720,DATA!A:B,2,0)","v":"محمد طعيمة"},"قسط",null,50]
["2015-12-05",120,{"$f":"VLOOKUP(B721,DATA!A:B,2,0)","v":"محمد طعيمة"},"قسط",null,100]
["2015-09-09",121,{"$f":"VLOOKUP(B722,DATA!A:B,2,0)","v":"موسى j7"},"2موبيل j7/2000-15-1-2016-240 قسط",5850]
["2015-09-09",122,{"$f":"VLOOKUP(B723,DATA!A:B,2,0)","v":"موسى j5"},"موبايلj5",2340]
["2015-09-09",122,{"$f":"VLOOKUP(B724,DATA!A:B,2,0)","v":"موسى j5"},"مقدم",null,500]
["2015-09-12",123,{"$f":"VLOOKUP(B725,DATA!A:B,2,0)","v":"ابراهيم شوقى بدر"},"كيسة +شاشة",1150]
["2015-09-12",123,{"$f":"VLOOKUP(B726,DATA!A:B,2,0)","v":"ابراهيم شوقى بدر"},"مقدم",null,400]
["2015-10-11",123,{"$f":"VLOOKUP(B727,DATA!A:B,2,0)","v":"ابراهيم شوقى بدر"},"قسط",null,200]
["2015-11-11",123,{"$f":"VLOOKUP(B728,DATA!A:B,2,0)","v":"ابراهيم شوقى بدر"},"قسط",null,200]
["2015-09-13",124,{"$f":"VLOOKUP(B729,DATA!A:B,2,0)","v":"محمد ثروت"},"موبايل -قسط شهرى 100جنيه",1650]
["2015-09-15",125,{"$f":"VLOOKUP(B730,DATA!A:B,2,0)","v":"musa-note3-4"},"موبايل نوت 3-4 - قسط شهرى 170جنيه",2750]
["2015-09-24",126,{"$f":"VLOOKUP(B731,DATA!A:B,2,0)","v":"musa-note3-5"},"موبايل نوت محمد صبحى 340شهرى",2000]
["2015-10-06",128,{"$f":"VLOOKUP(B732,DATA!A:B,2,0)","v":"منى"},"موبايل على شهرين",650]
["2015-10-01",129,{"$f":"VLOOKUP(B733,DATA!A:B,2,0)","v":"جى1-حلامشة"},"موبايل/12شهر",1300]
["2015-10-11",130,{"$f":"VLOOKUP(B734,DATA!A:B,2,0)","v":"محمد طعيمة-صب"},"صب تايجر",350]
["2015-10-11",130,{"$f":"VLOOKUP(B735,DATA!A:B,2,0)","v":"محمد طعيمة-صب"},"مقدم",null,50]
["2015-11-03",130,{"$f":"VLOOKUP(B736,DATA!A:B,2,0)","v":"محمد طعيمة-صب"},"قسط",null,50]
["2015-12-07",130,{"$f":"VLOOKUP(B737,DATA!A:B,2,0)","v":"محمد طعيمة-صب"},"قسط",null,50]
["2015-10-12",131,{"$f":"VLOOKUP(B738,DATA!A:B,2,0)","v":"دنيا سونى اكسبيريا2"},"موبايل ",2800]
["2015-10-12",131,{"$f":"VLOOKUP(B739,DATA!A:B,2,0)","v":"دنيا سونى اكسبيريا2"},"مقدم - قسط شهرى 200جنيه",null,800]
["2015-11-13",131,{"$f":"VLOOKUP(B740,DATA!A:B,2,0)","v":"دنيا سونى اكسبيريا2"},"قسط",null,200]
["2015-10-14",132,{"$f":"VLOOKUP(B741,DATA!A:B,2,0)","v":"MUSA2-J7"},"2موبايل J7",5850]
["2015-10-14",132,{"$f":"VLOOKUP(B742,DATA!A:B,2,0)","v":"MUSA2-J7"},"الباقى على 16شهر",null,1000]
["2015-10-21",133,{"$f":"VLOOKUP(B743,DATA!A:B,2,0)","v":"NOKIA225-2"},"قسط شهرى 50جنيه",800]
["2015-10-28",134,{"$f":"VLOOKUP(B744,DATA!A:B,2,0)","v":"om amr"},"2موبايل- قسط شهرى 300جنيه",5300]
["2015-11-13",134,{"$f":"VLOOKUP(B745,DATA!A:B,2,0)","v":"om amr"},"استكمال عدد",1300]
["2015-12-05",134,{"$f":"VLOOKUP(B746,DATA!A:B,2,0)","v":"om amr"},"قسط",null,300]
["2015-10-26",135,{"$f":"VLOOKUP(B747,DATA!A:B,2,0)","v":"ثروت"},null,510]
["2015-11-01",136,{"$f":"VLOOKUP(B748,DATA!A:B,2,0)","v":"musa-j1--1/11"},"موبايل j1قسط100جنيه",1300]
["2015-11-01",137,{"$f":"VLOOKUP(B749,DATA!A:B,2,0)","v":"G130"},"موبايل قسط شهرى 75جنيه",775]
["2015-11-01",138,{"$f":"VLOOKUP(B750,DATA!A:B,2,0)","v":"nokIA225-3"},"موبايل قسط شهرى 50جنيه",800]
["2015-11-17",139,{"$f":"VLOOKUP(B751,DATA!A:B,2,0)","v":"عزيزة"},"موبايل",420]
["2015-11-17",139,{"$f":"VLOOKUP(B752,DATA!A:B,2,0)","v":"عزيزة"},"مقدم-قسط50جنيه شهرى",null,100]
["2015-11-21",140,{"$f":"VLOOKUP(B753,DATA!A:B,2,0)","v":"رامى شوقى عبده"},"موبايل",1900]
["2015-11-21",140,{"$f":"VLOOKUP(B754,DATA!A:B,2,0)","v":"رامى شوقى عبده"},"مقدم-قسط شهرى100جنيه",null,400]
["2015-12-20",140,{"$f":"VLOOKUP(B755,DATA!A:B,2,0)","v":"رامى شوقى عبده"},"قسط",null,100]
["2015-11-26",141,{"$f":"VLOOKUP(B756,DATA!A:B,2,0)","v":"دنيا سونى اكسبيريا2-2"},"موبايل سونى اكسبيريا v ",2450]
["2015-11-26",141,{"$f":"VLOOKUP(B757,DATA!A:B,2,0)","v":"دنيا سونى اكسبيريا2-2"},"800جنيه مقدم-200 قسط شهرى",null,800]
["2015-11-26",142,{"$f":"VLOOKUP(B758,DATA!A:B,2,0)","v":"السيدG5"},"موبايلG5",2300]
["2015-11-26",142,{"$f":"VLOOKUP(B759,DATA!A:B,2,0)","v":"السيدG5"},"مقدم-قسط شهرى150جنيه",null,500]
["2015-12-01",143,{"$f":"VLOOKUP(B760,DATA!A:B,2,0)","v":"رشا هاواوىb8"},"موبايل",2550]
["2015-12-01",143,{"$f":"VLOOKUP(B761,DATA!A:B,2,0)","v":"رشا هاواوىb8"},"500مقدم-150قسط شهرى",null,500]
["2015-12-16",144,{"$f":"VLOOKUP(B762,DATA!A:B,2,0)","v":"ام عمرو جى7"},"موبايل -قسط شهرى 175جنيه",3250]
["2015-12-21",145,{"$f":"VLOOKUP(B763,DATA!A:B,2,0)","v":"شاشة   عمرو "},null,350]
["2015-12-21",146,{"$f":"VLOOKUP(B764,DATA!A:B,2,0)","v":"نوكيا 225اسبوعى"},null,400]
[null,null,{"$f":"VLOOKUP(B765,DATA!A:B,2,0)","v":{"$error":"#N/A"}}]
[null,null,{"$f":"VLOOKUP(B766,DATA!A:B,2,0)","v":{"$error":"#N/A"}}]
[null,null,{"$f":"VLOOKUP(B767,DATA!A:B,2,0)","v":{"$error":"#N/A"}}]
[null,null,{"$f":"VLOOKUP(B768,DATA!A:B,2,0)","v":{"$error":"#N/A"}}]
[null,null,{"$f":"VLOOKUP(B769,DATA!A:B,2,0)","v":{"$error":"#N/A"}}]
[null,null,{"$f":"VLOOKUP(B770,DATA!A:B,2,0)","v":{"$error":"#N/A"}}]
[null,null,{"$f":"VLOOKUP(B771,DATA!A:B,2,0)","v":{"$error":"#N/A"}}]
[null,null,{"$f":"VLOOKUP(B772,DATA!A:B,2,0)","v":{"$error":"#N/A"}}]
[null,null,{"$f":"VLOOKUP(B773,DATA!A:B,2,0)","v":{"$error":"#N/A"}}]
[null,null,{"$f":"VLOOKUP(B774,DATA!A:B,2,0)","v":{"$error":"#N/A"}}]
[null,null,{"$f":"VLOOKUP(B775,DATA!A:B,2,0)","v":{"$error":"#N/A"}}]
[null,null,{"$f":"VLOOKUP(B776,DATA!A:B,2,0)","v":{"$error":"#N/A"}}]
[null,null,{"$f":"VLOOKUP(B777,DATA!A:B,2,0)","v":{"$error":"#N/A"}}]
[null,null,{"$f":"VLOOKUP(B778,DATA!A:B,2,0)","v":{"$error":"#N/A"}}]
[null,null,{"$f":"VLOOKUP(B779,DATA!A:B,2,0)","v":{"$error":"#N/A"}}]
[null,null,{"$f":"VLOOKUP(B780,DATA!A:B,2,0)","v":{"$error":"#N/A"}}]
[null,null,{"$f":"VLOOKUP(B781,DATA!A:B,2,0)","v":{"$error":"#N/A"}}]
[null,null,{"$f":"VLOOKUP(B782,DATA!A:B,2,0)","v":{"$error":"#N/A"}}]
[null,null,{"$f":"VLOOKUP(B783,DATA!A:B,2,0)","v":{"$error":"#N/A"}}]
[null,null,{"$f":"VLOOKUP(B784,DATA!A:B,2,0)","v":{"$error":"#N/A"}}]
[null,null,{"$f":"VLOOKUP(B785,DATA!A:B,2,0)","v":{"$error":"#N/A"}}]
[null,null,{"$f":"VLOOKUP(B786,DATA!A:B,2,0)","v":{"$error":"#N/A"}}]
[null,null,{"$f":"VLOOKUP(B787,DATA!A:B,2,0)","v":{"$error":"#N/A"}}]
[null,null,{"$f":"VLOOKUP(B788,DATA!A:B,2,0)","v":{"$error":"#N/A"}}]
[null,null,{"$f":"VLOOKUP(B789,DATA!A:B,2,0)","v":{"$error":"#N/A"}}]
[null,null,{"$f":"VLOOKUP(B790,DATA!A:B,2,0)","v":{"$error":"#N/A"}}]
[null,null,{"$f":"VLOOKUP(B791,DATA!A:B,2,0)","v":{"$error":"#N/A"}}]
[null,null,{"$f":"VLOOKUP(B792,DATA!A:B,2,0)","v":{"$error":"#N/A"}}]
[null,null,{"$f":"VLOOKUP(B793,DATA!A:B,2,0)","v":{"$error":"#N/A"}}]
[null,null,{"$f":"VLOOKUP(B794,DATA!A:B,2,0)","v":{"$error":"#N/A"}}]
[null,null,{"$f":"VLOOKUP(B795,DATA!A:B,2,0)","v":{"$error":"#N/A"}}]
[null,null,{"$f":"VLOOKUP(B796,DATA!A:B,2,0)","v":{"$error":"#N/A"}}]
[null,null,{"$f":"VLOOKUP(B797,DATA!A:B,2,0)","v":{"$error":"#N/A"}}]
[null,null,{"$f":"VLOOKUP(B798,DATA!A:B,2,0)","v":{"$error":"#N/A"}}]
[null,null,{"$f":"VLOOKUP(B799,DATA!A:B,2,0)","v":{"$error":"#N/A"}}]
[null,null,{"$f":"VLOOKUP(B800,DATA!A:B,2,0)","v":{"$error":"#N/A"}}]
[null,null,{"$f":"VLOOKUP(B801,DATA!A:B,2,0)","v":{"$error":"#N/A"}}]
[null,null,{"$f":"VLOOKUP(B802,DATA!A:B,2,0)","v":{"$error":"#N/A"}}]
[null,null,{"$f":"VLOOKUP(B803,DATA!A:B,2,0)","v":{"$error":"#N/A"}}]
[null,null,{"$f":"VLOOKUP(B804,DATA!A:B,2,0)","v":{"$error":"#N/A"}}]
[null,null,{"$f":"VLOOKUP(B805,DATA!A:B,2,0)","v":{"$error":"#N/A"}}]
[null,null,{"$f":"VLOOKUP(B806,DATA!A:B,2,0)","v":{"$error":"#N/A"}}]
[null,null,{"$f":"VLOOKUP(B807,DATA!A:B,2,0)","v":{"$error":"#N/A"}}]
[null,null,{"$f":"VLOOKUP(B808,DATA!A:B,2,0)","v":{"$error":"#N/A"}}]
[null,null,{"$f":"VLOOKUP(B809,DATA!A:B,2,0)","v":{"$error":"#N/A"}}]
[null,null,{"$f":"VLOOKUP(B810,DATA!A:B,2,0)","v":{"$error":"#N/A"}}]
[null,null,{"$f":"VLOOKUP(B811,DATA!A:B,2,0)","v":{"$error":"#N/A"}}]
[null,null,{"$f":"VLOOKUP(B812,DATA!A:B,2,0)","v":{"$error":"#N/A"}}]
[null,null,{"$f":"VLOOKUP(B813,DATA!A:B,2,0)","v":{"$error":"#N/A"}}]
[null,null,{"$f":"VLOOKUP(B814,DATA!A:B,2,0)","v":{"$error":"#N/A"}}]
[null,null,{"$f":"VLOOKUP(B815,DATA!A:B,2,0)","v":{"$error":"#N/A"}}]
[null,null,{"$f":"VLOOKUP(B816,DATA!A:B,2,0)","v":{"$error":"#N/A"}}]
[null,null,{"$f":"VLOOKUP(B817,DATA!A:B,2,0)","v":{"$error":"#N/A"}}]
[null,null,{"$f":"VLOOKUP(B818,DATA!A:B,2,0)","v":{"$error":"#N/A"}}]
[null,null,{"$f":"VLOOKUP(B819,DATA!A:B,2,0)","v":{"$error":"#N/A"}}]
[null,null,{"$f":"VLOOKUP(B820,DATA!A:B,2,0)","v":{"$error":"#N/A"}}]
[null,null,{"$f":"VLOOKUP(B821,DATA!A:B,2,0)","v":{"$error":"#N/A"}}]
[null,null,{"$f":"VLOOKUP(B822,DATA!A:B,2,0)","v":{"$error":"#N/A"}}]
[null,null,{"$f":"VLOOKUP(B823,DATA!A:B,2,0)","v":{"$error":"#N/A"}}]
[null,null,{"$f":"VLOOKUP(B824,DATA!A:B,2,0)","v":{"$error":"#N/A"}}]
[null,null,{"$f":"VLOOKUP(B825,DATA!A:B,2,0)","v":{"$error":"#N/A"}}]
[null,null,{"$f":"VLOOKUP(B826,DATA!A:B,2,0)","v":{"$error":"#N/A"}}]
[null,null,{"$f":"VLOOKUP(B827,DATA!A:B,2,0)","v":{"$error":"#N/A"}}]
[null,null,{"$f":"VLOOKUP(B828,DATA!A:B,2,0)","v":{"$error":"#N/A"}}]
[null,null,{"$f":"VLOOKUP(B829,DATA!A:B,2,0)","v":{"$error":"#N/A"}}]
[null,null,{"$f":"VLOOKUP(B830,DATA!A:B,2,0)","v":{"$error":"#N/A"}}]
[null,null,{"$f":"VLOOKUP(B831,DATA!A:B,2,0)","v":{"$error":"#N/A"}}]
[null,null,{"$f":"VLOOKUP(B832,DATA!A:B,2,0)","v":{"$error":"#N/A"}}]
[null,null,{"$f":"VLOOKUP(B833,DATA!A:B,2,0)","v":{"$error":"#N/A"}}]
[null,null,{"$f":"VLOOKUP(B834,DATA!A:B,2,0)","v":{"$error":"#N/A"}}]
[null,null,{"$f":"VLOOKUP(B835,DATA!A:B,2,0)","v":{"$error":"#N/A"}}]
[null,null,{"$f":"VLOOKUP(B836,DATA!A:B,2,0)","v":{"$error":"#N/A"}}]
[null,null,{"$f":"VLOOKUP(B837,DATA!A:B,2,0)","v":{"$error":"#N/A"}}]
[null,null,{"$f":"VLOOKUP(B838,DATA!A:B,2,0)","v":{"$error":"#N/A"}}]
[null,null,{"$f":"VLOOKUP(B839,DATA!A:B,2,0)","v":{"$error":"#N/A"}}]
[null,null,{"$f":"VLOOKUP(B840,DATA!A:B,2,0)","v":{"$error":"#N/A"}}]
[null,null,{"$f":"VLOOKUP(B841,DATA!A:B,2,0)","v":{"$error":"#N/A"}}]
[null,null,{"$f":"VLOOKUP(B842,DATA!A:B,2,0)","v":{"$error":"#N/A"}}]
[null,null,{"$f":"VLOOKUP(B843,DATA!A:B,2,0)","v":{"$error":"#N/A"}}]
[null,null,{"$f":"VLOOKUP(B844,DATA!A:B,2,0)","v":{"$error":"#N/A"}}]
[null,null,{"$f":"VLOOKUP(B845,DATA!A:B,2,0)","v":{"$error":"#N/A"}}]
[null,null,{"$f":"VLOOKUP(B846,DATA!A:B,2,0)","v":{"$error":"#N/A"}}]
[null,null,{"$f":"VLOOKUP(B847,DATA!A:B,2,0)","v":{"$error":"#N/A"}}]
[null,null,{"$f":"VLOOKUP(B848,DATA!A:B,2,0)","v":{"$error":"#N/A"}}]
[null,null,{"$f":"VLOOKUP(B849,DATA!A:B,2,0)","v":{"$error":"#N/A"}}]
[null,null,{"$f":"VLOOKUP(B850,DATA!A:B,2,0)","v":{"$error":"#N/A"}}]
[null,null,{"$f":"VLOOKUP(B851,DATA!A:B,2,0)","v":{"$error":"#N/A"}}]
[null,null,{"$f":"VLOOKUP(B852,DATA!A:B,2,0)","v":{"$error":"#N/A"}}]
[null,null,{"$f":"VLOOKUP(B853,DATA!A:B,2,0)","v":{"$error":"#N/A"}}]
[null,null,{"$f":"VLOOKUP(B854,DATA!A:B,2,0)","v":{"$error":"#N/A"}}]
[null,null,{"$f":"VLOOKUP(B855,DATA!A:B,2,0)","v":{"$error":"#N/A"}}]
[null,null,{"$f":"VLOOKUP(B856,DATA!A:B,2,0)","v":{"$error":"#N/A"}}]
[null,null,{"$f":"VLOOKUP(B857,DATA!A:B,2,0)","v":{"$error":"#N/A"}}]
[null,null,{"$f":"VLOOKUP(B858,DATA!A:B,2,0)","v":{"$error":"#N/A"}}]
[null,null,{"$f":"VLOOKUP(B859,DATA!A:B,2,0)","v":{"$error":"#N/A"}}]
[null,null,{"$f":"VLOOKUP(B860,DATA!A:B,2,0)","v":{"$error":"#N/A"}}]
[null,null,{"$f":"VLOOKUP(B861,DATA!A:B,2,0)","v":{"$error":"#N/A"}}]
[null,null,{"$f":"VLOOKUP(B862,DATA!A:B,2,0)","v":{"$error":"#N/A"}}]
[null,null,{"$f":"VLOOKUP(B863,DATA!A:B,2,0)","v":{"$error":"#N/A"}}]
[null,null,{"$f":"VLOOKUP(B864,DATA!A:B,2,0)","v":{"$error":"#N/A"}}]
[null,null,{"$f":"VLOOKUP(B865,DATA!A:B,2,0)","v":{"$error":"#N/A"}}]
[null,null,{"$f":"VLOOKUP(B866,DATA!A:B,2,0)","v":{"$error":"#N/A"}}]
[null,null,{"$f":"VLOOKUP(B867,DATA!A:B,2,0)","v":{"$error":"#N/A"}}]
[null,null,{"$f":"VLOOKUP(B868,DATA!A:B,2,0)","v":{"$error":"#N/A"}}]
[null,null,{"$f":"VLOOKUP(B869,DATA!A:B,2,0)","v":{"$error":"#N/A"}}]
[null,null,{"$f":"VLOOKUP(B870,DATA!A:B,2,0)","v":{"$error":"#N/A"}}]
[null,null,{"$f":"VLOOKUP(B871,DATA!A:B,2,0)","v":{"$error":"#N/A"}}]
[null,null,{"$f":"VLOOKUP(B872,DATA!A:B,2,0)","v":{"$error":"#N/A"}}]
[null,null,{"$f":"VLOOKUP(B873,DATA!A:B,2,0)","v":{"$error":"#N/A"}}]
[null,null,{"$f":"VLOOKUP(B874,DATA!A:B,2,0)","v":{"$error":"#N/A"}}]
[null,null,{"$f":"VLOOKUP(B875,DATA!A:B,2,0)","v":{"$error":"#N/A"}}]
[null,null,{"$f":"VLOOKUP(B876,DATA!A:B,2,0)","v":{"$error":"#N/A"}}]
[null,null,{"$f":"VLOOKUP(B877,DATA!A:B,2,0)","v":{"$error":"#N/A"}}]
[null,null,{"$f":"VLOOKUP(B878,DATA!A:B,2,0)","v":{"$error":"#N/A"}}]
[null,null,{"$f":"VLOOKUP(B879,DATA!A:B,2,0)","v":{"$error":"#N/A"}}]
[null,null,{"$f":"VLOOKUP(B880,DATA!A:B,2,0)","v":{"$error":"#N/A"}}]
[null,null,{"$f":"VLOOKUP(B881,DATA!A:B,2,0)","v":{"$error":"#N/A"}}]
[null,null,{"$f":"VLOOKUP(B882,DATA!A:B,2,0)","v":{"$error":"#N/A"}}]
[null,null,{"$f":"VLOOKUP(B883,DATA!A:B,2,0)","v":{"$error":"#N/A"}}]
[null,null,{"$f":"VLOOKUP(B884,DATA!A:B,2,0)","v":{"$error":"#N/A"}}]
[null,null,{"$f":"VLOOKUP(B885,DATA!A:B,2,0)","v":{"$error":"#N/A"}}]
[null,null,{"$f":"VLOOKUP(B886,DATA!A:B,2,0)","v":{"$error":"#N/A"}}]
[null,null,{"$f":"VLOOKUP(B887,DATA!A:B,2,0)","v":{"$error":"#N/A"}}]
[null,null,{"$f":"VLOOKUP(B888,DATA!A:B,2,0)","v":{"$error":"#N/A"}}]
[null,null,{"$f":"VLOOKUP(B889,DATA!A:B,2,0)","v":{"$error":"#N/A"}}]
[null,null,{"$f":"VLOOKUP(B890,DATA!A:B,2,0)","v":{"$error":"#N/A"}}]
[null,null,{"$f":"VLOOKUP(B891,DATA!A:B,2,0)","v":{"$error":"#N/A"}}]
[null,null,{"$f":"VLOOKUP(B892,DATA!A:B,2,0)","v":{"$error":"#N/A"}}]
[null,null,{"$f":"VLOOKUP(B893,DATA!A:B,2,0)","v":{"$error":"#N/A"}}]
[null,null,{"$f":"VLOOKUP(B894,DATA!A:B,2,0)","v":{"$error":"#N/A"}}]
[null,null,{"$f":"VLOOKUP(B895,DATA!A:B,2,0)","v":{"$error":"#N/A"}}]
[null,null,{"$f":"VLOOKUP(B896,DATA!A:B,2,0)","v":{"$error":"#N/A"}}]
[null,null,{"$f":"VLOOKUP(B897,DATA!A:B,2,0)","v":{"$error":"#N/A"}}]
[null,null,{"$f":"VLOOKUP(B898,DATA!A:B,2,0)","v":{"$error":"#N/A"}}]
[null,null,{"$f":"VLOOKUP(B899,DATA!A:B,2,0)","v":{"$error":"#N/A"}}]
[null,null,{"$f":"VLOOKUP(B900,DATA!A:B,2,0)","v":{"$error":"#N/A"}}]
[null,null,{"$f":"VLOOKUP(B901,DATA!A:B,2,0)","v":{"$error":"#N/A"}}]
[null,null,{"$f":"VLOOKUP(B902,DATA!A:B,2,0)","v":{"$error":"#N/A"}}]
[null,null,{"$f":"VLOOKUP(B903,DATA!A:B,2,0)","v":{"$error":"#N/A"}}]
[null,null,{"$f":"VLOOKUP(B904,DATA!A:B,2,0)","v":{"$error":"#N/A"}}]
[null,null,{"$f":"VLOOKUP(B905,DATA!A:B,2,0)","v":{"$error":"#N/A"}}]
[null,null,{"$f":"VLOOKUP(B906,DATA!A:B,2,0)","v":{"$error":"#N/A"}}]
[null,null,{"$f":"VLOOKUP(B907,DATA!A:B,2,0)","v":{"$error":"#N/A"}}]
[null,null,{"$f":"VLOOKUP(B908,DATA!A:B,2,0)","v":{"$error":"#N/A"}}]
[null,null,{"$f":"VLOOKUP(B909,DATA!A:B,2,0)","v":{"$error":"#N/A"}}]
[null,null,{"$f":"VLOOKUP(B910,DATA!A:B,2,0)","v":{"$error":"#N/A"}}]
[null,null,{"$f":"VLOOKUP(B911,DATA!A:B,2,0)","v":{"$error":"#N/A"}}]
[null,null,{"$f":"VLOOKUP(B912,DATA!A:B,2,0)","v":{"$error":"#N/A"}}]
[null,null,{"$f":"VLOOKUP(B913,DATA!A:B,2,0)","v":{"$error":"#N/A"}}]
[null,null,{"$f":"VLOOKUP(B914,DATA!A:B,2,0)","v":{"$error":"#N/A"}}]
[null,null,{"$f":"VLOOKUP(B915,DATA!A:B,2,0)","v":{"$error":"#N/A"}}]
[null,null,{"$f":"VLOOKUP(B916,DATA!A:B,2,0)","v":{"$error":"#N/A"}}]
[null,null,{"$f":"VLOOKUP(B917,DATA!A:B,2,0)","v":{"$error":"#N/A"}}]
[null,null,{"$f":"VLOOKUP(B918,DATA!A:B,2,0)","v":{"$error":"#N/A"}}]
[null,null,{"$f":"VLOOKUP(B919,DATA!A:B,2,0)","v":{"$error":"#N/A"}}]
[null,null,{"$f":"VLOOKUP(B920,DATA!A:B,2,0)","v":{"$error":"#N/A"}}]
[null,null,{"$f":"VLOOKUP(B921,DATA!A:B,2,0)","v":{"$error":"#N/A"}}]
[null,null,{"$f":"VLOOKUP(B922,DATA!A:B,2,0)","v":{"$error":"#N/A"}}]
[null,null,{"$f":"VLOOKUP(B923,DATA!A:B,2,0)","v":{"$error":"#N/A"}}]
[null,null,{"$f":"VLOOKUP(B924,DATA!A:B,2,0)","v":{"$error":"#N/A"}}]
[null,null,{"$f":"VLOOKUP(B925,DATA!A:B,2,0)","v":{"$error":"#N/A"}}]
[null,null,{"$f":"VLOOKUP(B926,DATA!A:B,2,0)","v":{"$error":"#N/A"}}]
[null,null,{"$f":"VLOOKUP(B927,DATA!A:B,2,0)","v":{"$error":"#N/A"}}]
[null,null,{"$f":"VLOOKUP(B928,DATA!A:B,2,0)","v":{"$error":"#N/A"}}]
[null,null,{"$f":"VLOOKUP(B929,DATA!A:B,2,0)","v":{"$error":"#N/A"}}]
[null,null,{"$f":"VLOOKUP(B930,DATA!A:B,2,0)","v":{"$error":"#N/A"}}]
[null,null,{"$f":"VLOOKUP(B931,DATA!A:B,2,0)","v":{"$error":"#N/A"}}]
[null,null,{"$f":"VLOOKUP(B932,DATA!A:B,2,0)","v":{"$error":"#N/A"}}]
[null,null,{"$f":"VLOOKUP(B933,DATA!A:B,2,0)","v":{"$error":"#N/A"}}]
[null,null,{"$f":"VLOOKUP(B934,DATA!A:B,2,0)","v":{"$error":"#N/A"}}]
[null,null,{"$f":"VLOOKUP(B935,DATA!A:B,2,0)","v":{"$error":"#N/A"}}]
[null,null,{"$f":"VLOOKUP(B936,DATA!A:B,2,0)","v":{"$error":"#N/A"}}]
[null,null,{"$f":"VLOOKUP(B937,DATA!A:B,2,0)","v":{"$error":"#N/A"}}]
[null,null,{"$f":"VLOOKUP(B938,DATA!A:B,2,0)","v":{"$error":"#N/A"}}]
[null,null,{"$f":"VLOOKUP(B939,DATA!A:B,2,0)","v":{"$error":"#N/A"}}]
[null,null,{"$f":"VLOOKUP(B940,DATA!A:B,2,0)","v":{"$error":"#N/A"}}]
[null,null,{"$f":"VLOOKUP(B941,DATA!A:B,2,0)","v":{"$error":"#N/A"}}]
[null,null,{"$f":"VLOOKUP(B942,DATA!A:B,2,0)","v":{"$error":"#N/A"}}]
[null,null,{"$f":"VLOOKUP(B943,DATA!A:B,2,0)","v":{"$error":"#N/A"}}]
[null,null,{"$f":"VLOOKUP(B944,DATA!A:B,2,0)","v":{"$error":"#N/A"}}]
[null,null,{"$f":"VLOOKUP(B945,DATA!A:B,2,0)","v":{"$error":"#N/A"}}]
[null,null,{"$f":"VLOOKUP(B946,DATA!A:B,2,0)","v":{"$error":"#N/A"}}]
[null,null,{"$f":"VLOOKUP(B947,DATA!A:B,2,0)","v":{"$error":"#N/A"}}]
[null,null,{"$f":"VLOOKUP(B948,DATA!A:B,2,0)","v":{"$error":"#N/A"}}]
[null,null,{"$f":"VLOOKUP(B949,DATA!A:B,2,0)","v":{"$error":"#N/A"}}]
[null,null,{"$f":"VLOOKUP(B950,DATA!A:B,2,0)","v":{"$error":"#N/A"}}]
[null,null,{"$f":"VLOOKUP(B951,DATA!A:B,2,0)","v":{"$error":"#N/A"}}]
[null,null,{"$f":"VLOOKUP(B952,DATA!A:B,2,0)","v":{"$error":"#N/A"}}]
[null,null,{"$f":"VLOOKUP(B953,DATA!A:B,2,0)","v":{"$error":"#N/A"}}]
[null,null,{"$f":"VLOOKUP(B954,DATA!A:B,2,0)","v":{"$error":"#N/A"}}]
[null,null,{"$f":"VLOOKUP(B955,DATA!A:B,2,0)","v":{"$error":"#N/A"}}]
[null,null,{"$f":"VLOOKUP(B956,DATA!A:B,2,0)","v":{"$error":"#N/A"}}]
[null,null,{"$f":"VLOOKUP(B957,DATA!A:B,2,0)","v":{"$error":"#N/A"}}]
[null,null,{"$f":"VLOOKUP(B958,DATA!A:B,2,0)","v":{"$error":"#N/A"}}]
[null,null,{"$f":"VLOOKUP(B959,DATA!A:B,2,0)","v":{"$error":"#N/A"}}]
[null,null,{"$f":"VLOOKUP(B960,DATA!A:B,2,0)","v":{"$error":"#N/A"}}]
[null,null,{"$f":"VLOOKUP(B961,DATA!A:B,2,0)","v":{"$error":"#N/A"}}]
[null,null,{"$f":"VLOOKUP(B962,DATA!A:B,2,0)","v":{"$error":"#N/A"}}]
[null,null,{"$f":"VLOOKUP(B963,DATA!A:B,2,0)","v":{"$error":"#N/A"}}]
[null,null,{"$f":"VLOOKUP(B964,DATA!A:B,2,0)","v":{"$error":"#N/A"}}]
[null,null,{"$f":"VLOOKUP(B965,DATA!A:B,2,0)","v":{"$error":"#N/A"}}]
[null,null,{"$f":"VLOOKUP(B966,DATA!A:B,2,0)","v":{"$error":"#N/A"}}]
[null,null,{"$f":"VLOOKUP(B967,DATA!A:B,2,0)","v":{"$error":"#N/A"}}]
[null,null,{"$f":"VLOOKUP(B968,DATA!A:B,2,0)","v":{"$error":"#N/A"}}]
[null,null,{"$f":"VLOOKUP(B969,DATA!A:B,2,0)","v":{"$error":"#N/A"}}]
[null,null,{"$f":"VLOOKUP(B970,DATA!A:B,2,0)","v":{"$error":"#N/A"}}]
[null,null,{"$f":"VLOOKUP(B971,DATA!A:B,2,0)","v":{"$error":"#N/A"}}]
[null,null,{"$f":"VLOOKUP(B972,DATA!A:B,2,0)","v":{"$error":"#N/A"}}]
[null,null,{"$f":"VLOOKUP(B973,DATA!A:B,2,0)","v":{"$error":"#N/A"}}]
[null,null,{"$f":"VLOOKUP(B974,DATA!A:B,2,0)","v":{"$error":"#N/A"}}]
[null,null,{"$f":"VLOOKUP(B975,DATA!A:B,2,0)","v":{"$error":"#N/A"}}]
[null,null,{"$f":"VLOOKUP(B976,DATA!A:B,2,0)","v":{"$error":"#N/A"}}]
[null,null,{"$f":"VLOOKUP(B977,DATA!A:B,2,0)","v":{"$error":"#N/A"}}]
[null,null,{"$f":"VLOOKUP(B978,DATA!A:B,2,0)","v":{"$error":"#N/A"}}]
[null,null,{"$f":"VLOOKUP(B979,DATA!A:B,2,0)","v":{"$error":"#N/A"}}]
[null,null,{"$f":"VLOOKUP(B980,DATA!A:B,2,0)","v":{"$error":"#N/A"}}]
[null,null,{"$f":"VLOOKUP(B981,DATA!A:B,2,0)","v":{"$error":"#N/A"}}]
[null,null,{"$f":"VLOOKUP(B982,DATA!A:B,2,0)","v":{"$error":"#N/A"}}]
[null,null,{"$f":"VLOOKUP(B983,DATA!A:B,2,0)","v":{"$error":"#N/A"}}]
[null,null,{"$f":"VLOOKUP(B984,DATA!A:B,2,0)","v":{"$error":"#N/A"}}]
[null,null,{"$f":"VLOOKUP(B985,DATA!A:B,2,0)","v":{"$error":"#N/A"}}]
[null,null,{"$f":"VLOOKUP(B986,DATA!A:B,2,0)","v":{"$error":"#N/A"}}]
[null,null,{"$f":"VLOOKUP(B987,DATA!A:B,2,0)","v":{"$error":"#N/A"}}]
[null,null,{"$f":"VLOOKUP(B988,DATA!A:B,2,0)","v":{"$error":"#N/A"}}]
[null,null,{"$f":"VLOOKUP(B989,DATA!A:B,2,0)","v":{"$error":"#N/A"}}]
[null,null,{"$f":"VLOOKUP(B990,DATA!A:B,2,0)","v":{"$error":"#N/A"}}]
[null,null,{"$f":"VLOOKUP(B991,DATA!A:B,2,0)","v":{"$error":"#N/A"}}]
[null,null,{"$f":"VLOOKUP(B992,DATA!A:B,2,0)","v":{"$error":"#N/A"}}]
[null,null,{"$f":"VLOOKUP(B993,DATA!A:B,2,0)","v":{"$error":"#N/A"}}]
[null,null,{"$f":"VLOOKUP(B994,DATA!A:B,2,0)","v":{"$error":"#N/A"}}]
[null,null,{"$f":"VLOOKUP(B995,DATA!A:B,2,0)","v":{"$error":"#N/A"}}]
[null,null,{"$f":"VLOOKUP(B996,DATA!A:B,2,0)","v":{"$error":"#N/A"}}]
[null,null,{"$f":"VLOOKUP(B997,DATA!A:B,2,0)","v":{"$error":"#N/A"}}]
[null,null,{"$f":"VLOOKUP(B998,DATA!A:B,2,0)","v":{"$error":"#N/A"}}]
[null,null,{"$f":"VLOOKUP(B999,DATA!A:B,2,0)","v":{"$error":"#N/A"}}]
[null,null,{"$f":"VLOOKUP(B1000,DATA!A:B,2,0)","v":{"$error":"#N/A"}}]
[null,null,{"$f":"VLOOKUP(B1001,DATA!A:B,2,0)","v":{"$error":"#N/A"}}]
[null,null,{"$f":"VLOOKUP(B1002,DATA!A:B,2,0)","v":{"$error":"#N/A"}}]
[null,null,{"$f":"VLOOKUP(B1003,DATA!A:B,2,0)","v":{"$error":"#N/A"}}]
[null,null,{"$f":"VLOOKUP(B1004,DATA!A:B,2,0)","v":{"$error":"#N/A"}}]
[null,null,{"$f":"VLOOKUP(B1005,DATA!A:B,2,0)","v":{"$error":"#N/A"}}]
[null,null,{"$f":"VLOOKUP(B1006,DATA!A:B,2,0)","v":{"$error":"#N/A"}}]
[null,null,{"$f":"VLOOKUP(B1007,DATA!A:B,2,0)","v":{"$error":"#N/A"}}]
[null,null,{"$f":"VLOOKUP(B1008,DATA!A:B,2,0)","v":{"$error":"#N/A"}}]
[null,null,{"$f":"VLOOKUP(B1009,DATA!A:B,2,0)","v":{"$error":"#N/A"}}]
[null,null,{"$f":"VLOOKUP(B1010,DATA!A:B,2,0)","v":{"$error":"#N/A"}}]
[null,null,{"$f":"VLOOKUP(B1011,DATA!A:B,2,0)","v":{"$error":"#N/A"}}]
[null,null,{"$f":"VLOOKUP(B1012,DATA!A:B,2,0)","v":{"$error":"#N/A"}}]
[null,null,{"$f":"VLOOKUP(B1013,DATA!A:B,2,0)","v":{"$error":"#N/A"}}]
[null,null,{"$f":"VLOOKUP(B1014,DATA!A:B,2,0)","v":{"$error":"#N/A"}}]
[null,null,{"$f":"VLOOKUP(B1015,DATA!A:B,2,0)","v":{"$error":"#N/A"}}]
[null,null,{"$f":"VLOOKUP(B1016,DATA!A:B,2,0)","v":{"$error":"#N/A"}}]
[null,null,{"$f":"VLOOKUP(B1017,DATA!A:B,2,0)","v":{"$error":"#N/A"}}]
[null,null,{"$f":"VLOOKUP(B1018,DATA!A:B,2,0)","v":{"$error":"#N/A"}}]
[null,null,{"$f":"VLOOKUP(B1019,DATA!A:B,2,0)","v":{"$error":"#N/A"}}]
[null,null,{"$f":"VLOOKUP(B1020,DATA!A:B,2,0)","v":{"$error":"#N/A"}}]
[null,null,{"$f":"VLOOKUP(B1021,DATA!A:B,2,0)","v":{"$error":"#N/A"}}]
[null,null,{"$f":"VLOOKUP(B1022,DATA!A:B,2,0)","v":{"$error":"#N/A"}}]
[null,null,{"$f":"VLOOKUP(B1023,DATA!A:B,2,0)","v":{"$error":"#N/A"}}]
[null,null,{"$f":"VLOOKUP(B1024,DATA!A:B,2,0)","v":{"$error":"#N/A"}}]
[null,null,{"$f":"VLOOKUP(B1025,DATA!A:B,2,0)","v":{"$error":"#N/A"}}]
[null,null,{"$f":"VLOOKUP(B1026,DATA!A:B,2,0)","v":{"$error":"#N/A"}}]
[null,null,{"$f":"VLOOKUP(B1027,DATA!A:B,2,0)","v":{"$error":"#N/A"}}]
[null,null,{"$f":"VLOOKUP(B1028,DATA!A:B,2,0)","v":{"$error":"#N/A"}}]
[null,null,{"$f":"VLOOKUP(B1029,DATA!A:B,2,0)","v":{"$error":"#N/A"}}]
[null,null,{"$f":"VLOOKUP(B1030,DATA!A:B,2,0)","v":{"$error":"#N/A"}}]
[null,null,{"$f":"VLOOKUP(B1031,DATA!A:B,2,0)","v":{"$error":"#N/A"}}]
[null,null,{"$f":"VLOOKUP(B1032,DATA!A:B,2,0)","v":{"$error":"#N/A"}}]
[null,null,{"$f":"VLOOKUP(B1033,DATA!A:B,2,0)","v":{"$error":"#N/A"}}]
[null,null,{"$f":"VLOOKUP(B1034,DATA!A:B,2,0)","v":{"$error":"#N/A"}}]
[null,null,{"$f":"VLOOKUP(B1035,DATA!A:B,2,0)","v":{"$error":"#N/A"}}]
[null,null,{"$f":"VLOOKUP(B1036,DATA!A:B,2,0)","v":{"$error":"#N/A"}}]
[null,null,{"$f":"VLOOKUP(B1037,DATA!A:B,2,0)","v":{"$error":"#N/A"}}]
[null,null,{"$f":"VLOOKUP(B1038,DATA!A:B,2,0)","v":{"$error":"#N/A"}}]
[null,null,{"$f":"VLOOKUP(B1039,DATA!A:B,2,0)","v":{"$error":"#N/A"}}]
[null,null,{"$f":"VLOOKUP(B1040,DATA!A:B,2,0)","v":{"$error":"#N/A"}}]
[null,null,{"$f":"VLOOKUP(B1041,DATA!A:B,2,0)","v":{"$error":"#N/A"}}]
[null,null,{"$f":"VLOOKUP(B1042,DATA!A:B,2,0)","v":{"$error":"#N/A"}}]
[null,null,{"$f":"VLOOKUP(B1043,DATA!A:B,2,0)","v":{"$error":"#N/A"}}]
[null,null,{"$f":"VLOOKUP(B1044,DATA!A:B,2,0)","v":{"$error":"#N/A"}}]
[null,null,{"$f":"VLOOKUP(B1045,DATA!A:B,2,0)","v":{"$error":"#N/A"}}]
[null,null,{"$f":"VLOOKUP(B1046,DATA!A:B,2,0)","v":{"$error":"#N/A"}}]
[null,null,{"$f":"VLOOKUP(B1047,DATA!A:B,2,0)","v":{"$error":"#N/A"}}]
[null,null,{"$f":"VLOOKUP(B1048,DATA!A:B,2,0)","v":{"$error":"#N/A"}}]
[null,null,{"$f":"VLOOKUP(B1049,DATA!A:B,2,0)","v":{"$error":"#N/A"}}]
[null,null,{"$f":"VLOOKUP(B1050,DATA!A:B,2,0)","v":{"$error":"#N/A"}}]
[null,null,{"$f":"VLOOKUP(B1051,DATA!A:B,2,0)","v":{"$error":"#N/A"}}]
[null,null,{"$f":"VLOOKUP(B1052,DATA!A:B,2,0)","v":{"$error":"#N/A"}}]
[null,null,{"$f":"VLOOKUP(B1053,DATA!A:B,2,0)","v":{"$error":"#N/A"}}]
[null,null,{"$f":"VLOOKUP(B1054,DATA!A:B,2,0)","v":{"$error":"#N/A"}}]
[null,null,{"$f":"VLOOKUP(B1055,DATA!A:B,2,0)","v":{"$error":"#N/A"}}]
[null,null,{"$f":"VLOOKUP(B1056,DATA!A:B,2,0)","v":{"$error":"#N/A"}}]
[null,null,{"$f":"VLOOKUP(B1057,DATA!A:B,2,0)","v":{"$error":"#N/A"}}]
[null,null,{"$f":"VLOOKUP(B1058,DATA!A:B,2,0)","v":{"$error":"#N/A"}}]
[null,null,{"$f":"VLOOKUP(B1059,DATA!A:B,2,0)","v":{"$error":"#N/A"}}]
[null,null,{"$f":"VLOOKUP(B1060,DATA!A:B,2,0)","v":{"$error":"#N/A"}}]
[null,null,{"$f":"VLOOKUP(B1061,DATA!A:B,2,0)","v":{"$error":"#N/A"}}]
[null,null,{"$f":"VLOOKUP(B1062,DATA!A:B,2,0)","v":{"$error":"#N/A"}}]
[null,null,{"$f":"VLOOKUP(B1063,DATA!A:B,2,0)","v":{"$error":"#N/A"}}]
[null,null,{"$f":"VLOOKUP(B1064,DATA!A:B,2,0)","v":{"$error":"#N/A"}}]
[null,null,{"$f":"VLOOKUP(B1065,DATA!A:B,2,0)","v":{"$error":"#N/A"}}]
[null,null,{"$f":"VLOOKUP(B1066,DATA!A:B,2,0)","v":{"$error":"#N/A"}}]
[null,null,{"$f":"VLOOKUP(B1067,DATA!A:B,2,0)","v":{"$error":"#N/A"}}]
[null,null,{"$f":"VLOOKUP(B1068,DATA!A:B,2,0)","v":{"$error":"#N/A"}}]
[null,null,{"$f":"VLOOKUP(B1069,DATA!A:B,2,0)","v":{"$error":"#N/A"}}]
[null,null,{"$f":"VLOOKUP(B1070,DATA!A:B,2,0)","v":{"$error":"#N/A"}}]
[null,null,{"$f":"VLOOKUP(B1071,DATA!A:B,2,0)","v":{"$error":"#N/A"}}]
[null,null,{"$f":"VLOOKUP(B1072,DATA!A:B,2,0)","v":{"$error":"#N/A"}}]
[null,null,{"$f":"VLOOKUP(B1073,DATA!A:B,2,0)","v":{"$error":"#N/A"}}]
[null,null,{"$f":"VLOOKUP(B1074,DATA!A:B,2,0)","v":{"$error":"#N/A"}}]
[null,null,{"$f":"VLOOKUP(B1075,DATA!A:B,2,0)","v":{"$error":"#N/A"}}]
[null,null,{"$f":"VLOOKUP(B1076,DATA!A:B,2,0)","v":{"$error":"#N/A"}}]
[null,null,{"$f":"VLOOKUP(B1077,DATA!A:B,2,0)","v":{"$error":"#N/A"}}]
[null,null,{"$f":"VLOOKUP(B1078,DATA!A:B,2,0)","v":{"$error":"#N/A"}}]
[null,null,{"$f":"VLOOKUP(B1079,DATA!A:B,2,0)","v":{"$error":"#N/A"}}]
[null,null,{"$f":"VLOOKUP(B1080,DATA!A:B,2,0)","v":{"$error":"#N/A"}}]
[null,null,{"$f":"VLOOKUP(B1081,DATA!A:B,2,0)","v":{"$error":"#N/A"}}]
[null,null,{"$f":"VLOOKUP(B1082,DATA!A:B,2,0)","v":{"$error":"#N/A"}}]
[null,null,{"$f":"VLOOKUP(B1083,DATA!A:B,2,0)","v":{"$error":"#N/A"}}]
[null,null,{"$f":"VLOOKUP(B1084,DATA!A:B,2,0)","v":{"$error":"#N/A"}}]
[null,null,{"$f":"VLOOKUP(B1085,DATA!A:B,2,0)","v":{"$error":"#N/A"}}]
[null,null,{"$f":"VLOOKUP(B1086,DATA!A:B,2,0)","v":{"$error":"#N/A"}}]
[null,null,{"$f":"VLOOKUP(B1087,DATA!A:B,2,0)","v":{"$error":"#N/A"}}]
[null,null,{"$f":"VLOOKUP(B1088,DATA!A:B,2,0)","v":{"$error":"#N/A"}}]
[null,null,{"$f":"VLOOKUP(B1089,DATA!A:B,2,0)","v":{"$error":"#N/A"}}]
[null,null,{"$f":"VLOOKUP(B1090,DATA!A:B,2,0)","v":{"$error":"#N/A"}}]
[null,null,{"$f":"VLOOKUP(B1091,DATA!A:B,2,0)","v":{"$error":"#N/A"}}]
[null,null,{"$f":"VLOOKUP(B1092,DATA!A:B,2,0)","v":{"$error":"#N/A"}}]
[null,null,{"$f":"VLOOKUP(B1093,DATA!A:B,2,0)","v":{"$error":"#N/A"}}]
[null,null,{"$f":"VLOOKUP(B1094,DATA!A:B,2,0)","v":{"$error":"#N/A"}}]
[null,null,{"$f":"VLOOKUP(B1095,DATA!A:B,2,0)","v":{"$error":"#N/A"}}]
[null,null,{"$f":"VLOOKUP(B1096,DATA!A:B,2,0)","v":{"$error":"#N/A"}}]
[null,null,{"$f":"VLOOKUP(B1097,DATA!A:B,2,0)","v":{"$error":"#N/A"}}]
[null,null,{"$f":"VLOOKUP(B1098,DATA!A:B,2,0)","v":{"$error":"#N/A"}}]
[null,null,{"$f":"VLOOKUP(B1099,DATA!A:B,2,0)","v":{"$error":"#N/A"}}]
[null,null,{"$f":"VLOOKUP(B1100,DATA!A:B,2,0)","v":{"$error":"#N/A"}}]
[null,null,{"$f":"VLOOKUP(B1101,DATA!A:B,2,0)","v":{"$error":"#N/A"}}]
[null,null,{"$f":"VLOOKUP(B1102,DATA!A:B,2,0)","v":{"$error":"#N/A"}}]
[null,null,{"$f":"VLOOKUP(B1103,DATA!A:B,2,0)","v":{"$error":"#N/A"}}]
[null,null,{"$f":"VLOOKUP(B1104,DATA!A:B,2,0)","v":{"$error":"#N/A"}}]
[null,null,{"$f":"VLOOKUP(B1105,DATA!A:B,2,0)","v":{"$error":"#N/A"}}]
[null,null,{"$f":"VLOOKUP(B1106,DATA!A:B,2,0)","v":{"$error":"#N/A"}}]
[null,null,{"$f":"VLOOKUP(B1107,DATA!A:B,2,0)","v":{"$error":"#N/A"}}]
[null,null,{"$f":"VLOOKUP(B1108,DATA!A:B,2,0)","v":{"$error":"#N/A"}}]
[null,null,{"$f":"VLOOKUP(B1109,DATA!A:B,2,0)","v":{"$error":"#N/A"}}]
[null,null,{"$f":"VLOOKUP(B1110,DATA!A:B,2,0)","v":{"$error":"#N/A"}}]
[null,null,{"$f":"VLOOKUP(B1111,DATA!A:B,2,0)","v":{"$error":"#N/A"}}]
[null,null,{"$f":"VLOOKUP(B1112,DATA!A:B,2,0)","v":{"$error":"#N/A"}}]
[null,null,{"$f":"VLOOKUP(B1113,DATA!A:B,2,0)","v":{"$error":"#N/A"}}]
[null,null,{"$f":"VLOOKUP(B1114,DATA!A:B,2,0)","v":{"$error":"#N/A"}}]
[null,null,{"$f":"VLOOKUP(B1115,DATA!A:B,2,0)","v":{"$error":"#N/A"}}]
[null,null,{"$f":"VLOOKUP(B1116,DATA!A:B,2,0)","v":{"$error":"#N/A"}}]
[null,null,{"$f":"VLOOKUP(B1117,DATA!A:B,2,0)","v":{"$error":"#N/A"}}]
[null,null,{"$f":"VLOOKUP(B1118,DATA!A:B,2,0)","v":{"$error":"#N/A"}}]
[null,null,{"$f":"VLOOKUP(B1119,DATA!A:B,2,0)","v":{"$error":"#N/A"}}]
[null,null,{"$f":"VLOOKUP(B1120,DATA!A:B,2,0)","v":{"$error":"#N/A"}}]
[null,null,{"$f":"VLOOKUP(B1121,DATA!A:B,2,0)","v":{"$error":"#N/A"}}]
[null,null,{"$f":"VLOOKUP(B1122,DATA!A:B,2,0)","v":{"$error":"#N/A"}}]
[null,null,{"$f":"VLOOKUP(B1123,DATA!A:B,2,0)","v":{"$error":"#N/A"}}]
[null,null,{"$f":"VLOOKUP(B1124,DATA!A:B,2,0)","v":{"$error":"#N/A"}}]
[null,null,{"$f":"VLOOKUP(B1125,DATA!A:B,2,0)","v":{"$error":"#N/A"}}]
[null,null,{"$f":"VLOOKUP(B1126,DATA!A:B,2,0)","v":{"$error":"#N/A"}}]
[null,null,{"$f":"VLOOKUP(B1127,DATA!A:B,2,0)","v":{"$error":"#N/A"}}]
[null,null,{"$f":"VLOOKUP(B1128,DATA!A:B,2,0)","v":{"$error":"#N/A"}}]
[null,null,{"$f":"VLOOKUP(B1129,DATA!A:B,2,0)","v":{"$error":"#N/A"}}]
[null,null,{"$f":"VLOOKUP(B1130,DATA!A:B,2,0)","v":{"$error":"#N/A"}}]
[null,null,{"$f":"VLOOKUP(B1131,DATA!A:B,2,0)","v":{"$error":"#N/A"}}]
[null,null,{"$f":"VLOOKUP(B1132,DATA!A:B,2,0)","v":{"$error":"#N/A"}}]
[null,null,{"$f":"VLOOKUP(B1133,DATA!A:B,2,0)","v":{"$error":"#N/A"}}]
[null,null,{"$f":"VLOOKUP(B1134,DATA!A:B,2,0)","v":{"$error":"#N/A"}}]
[null,null,{"$f":"VLOOKUP(B1135,DATA!A:B,2,0)","v":{"$error":"#N/A"}}]
[null,null,{"$f":"VLOOKUP(B1136,DATA!A:B,2,0)","v":{"$error":"#N/A"}}]
[null,null,{"$f":"VLOOKUP(B1137,DATA!A:B,2,0)","v":{"$error":"#N/A"}}]
[null,null,{"$f":"VLOOKUP(B1138,DATA!A:B,2,0)","v":{"$error":"#N/A"}}]
[null,null,{"$f":"VLOOKUP(B1139,DATA!A:B,2,0)","v":{"$error":"#N/A"}}]
[null,null,{"$f":"VLOOKUP(B1140,DATA!A:B,2,0)","v":{"$error":"#N/A"}}]
[null,null,{"$f":"VLOOKUP(B1141,DATA!A:B,2,0)","v":{"$error":"#N/A"}}]
[null,null,{"$f":"VLOOKUP(B1142,DATA!A:B,2,0)","v":{"$error":"#N/A"}}]
[null,null,{"$f":"VLOOKUP(B1143,DATA!A:B,2,0)","v":{"$error":"#N/A"}}]
[null,null,{"$f":"VLOOKUP(B1144,DATA!A:B,2,0)","v":{"$error":"#N/A"}}]
[null,null,{"$f":"VLOOKUP(B1145,DATA!A:B,2,0)","v":{"$error":"#N/A"}}]
[null,null,{"$f":"VLOOKUP(B1146,DATA!A:B,2,0)","v":{"$error":"#N/A"}}]
[null,null,{"$f":"VLOOKUP(B1147,DATA!A:B,2,0)","v":{"$error":"#N/A"}}]
[null,null,{"$f":"VLOOKUP(B1148,DATA!A:B,2,0)","v":{"$error":"#N/A"}}]
[null,null,{"$f":"VLOOKUP(B1149,DATA!A:B,2,0)","v":{"$error":"#N/A"}}]
[null,null,{"$f":"VLOOKUP(B1150,DATA!A:B,2,0)","v":{"$error":"#N/A"}}]
[null,null,{"$f":"VLOOKUP(B1151,DATA!A:B,2,0)","v":{"$error":"#N/A"}}]
[null,null,{"$f":"VLOOKUP(B1152,DATA!A:B,2,0)","v":{"$error":"#N/A"}}]
[null,null,{"$f":"VLOOKUP(B1153,DATA!A:B,2,0)","v":{"$error":"#N/A"}}]
[null,null,{"$f":"VLOOKUP(B1154,DATA!A:B,2,0)","v":{"$error":"#N/A"}}]
[null,null,{"$f":"VLOOKUP(B1155,DATA!A:B,2,0)","v":{"$error":"#N/A"}}]
[null,null,{"$f":"VLOOKUP(B1156,DATA!A:B,2,0)","v":{"$error":"#N/A"}}]
[null,null,{"$f":"VLOOKUP(B1157,DATA!A:B,2,0)","v":{"$error":"#N/A"}}]
[null,null,{"$f":"VLOOKUP(B1158,DATA!A:B,2,0)","v":{"$error":"#N/A"}}]
[null,null,{"$f":"VLOOKUP(B1159,DATA!A:B,2,0)","v":{"$error":"#N/A"}}]
[null,null,{"$f":"VLOOKUP(B1160,DATA!A:B,2,0)","v":{"$error":"#N/A"}}]
[null,null,{"$f":"VLOOKUP(B1161,DATA!A:B,2,0)","v":{"$error":"#N/A"}}]
[null,null,{"$f":"VLOOKUP(B1162,DATA!A:B,2,0)","v":{"$error":"#N/A"}}]
[null,null,{"$f":"VLOOKUP(B1163,DATA!A:B,2,0)","v":{"$error":"#N/A"}}]
[null,null,{"$f":"VLOOKUP(B1164,DATA!A:B,2,0)","v":{"$error":"#N/A"}}]
[null,null,{"$f":"VLOOKUP(B1165,DATA!A:B,2,0)","v":{"$error":"#N/A"}}]
[null,null,{"$f":"VLOOKUP(B1166,DATA!A:B,2,0)","v":{"$error":"#N/A"}}]
[null,null,{"$f":"VLOOKUP(B1167,DATA!A:B,2,0)","v":{"$error":"#N/A"}}]
[null,null,{"$f":"VLOOKUP(B1168,DATA!A:B,2,0)","v":{"$error":"#N/A"}}]
[null,null,{"$f":"VLOOKUP(B1169,DATA!A:B,2,0)","v":{"$error":"#N/A"}}]
[null,null,{"$f":"VLOOKUP(B1170,DATA!A:B,2,0)","v":{"$error":"#N/A"}}]
[null,null,{"$f":"VLOOKUP(B1171,DATA!A:B,2,0)","v":{"$error":"#N/A"}}]
[null,null,{"$f":"VLOOKUP(B1172,DATA!A:B,2,0)","v":{"$error":"#N/A"}}]
[null,null,{"$f":"VLOOKUP(B1173,DATA!A:B,2,0)","v":{"$error":"#N/A"}}]
[null,null,{"$f":"VLOOKUP(B1174,DATA!A:B,2,0)","v":{"$error":"#N/A"}}]
[null,null,{"$f":"VLOOKUP(B1175,DATA!A:B,2,0)","v":{"$error":"#N/A"}}]
[null,null,{"$f":"VLOOKUP(B1176,DATA!A:B,2,0)","v":{"$error":"#N/A"}}]
[null,null,{"$f":"VLOOKUP(B1177,DATA!A:B,2,0)","v":{"$error":"#N/A"}}]
[null,null,{"$f":"VLOOKUP(B1178,DATA!A:B,2,0)","v":{"$error":"#N/A"}}]
[null,null,{"$f":"VLOOKUP(B1179,DATA!A:B,2,0)","v":{"$error":"#N/A"}}]
[null,null,{"$f":"VLOOKUP(B1180,DATA!A:B,2,0)","v":{"$error":"#N/A"}}]
[null,null,{"$f":"VLOOKUP(B1181,DATA!A:B,2,0)","v":{"$error":"#N/A"}}]
[null,null,{"$f":"VLOOKUP(B1182,DATA!A:B,2,0)","v":{"$error":"#N/A"}}]
[null,null,{"$f":"VLOOKUP(B1183,DATA!A:B,2,0)","v":{"$error":"#N/A"}}]
[null,null,{"$f":"VLOOKUP(B1184,DATA!A:B,2,0)","v":{"$error":"#N/A"}}]
[null,null,{"$f":"VLOOKUP(B1185,DATA!A:B,2,0)","v":{"$error":"#N/A"}}]
[null,null,{"$f":"VLOOKUP(B1186,DATA!A:B,2,0)","v":{"$error":"#N/A"}}]
[null,null,{"$f":"VLOOKUP(B1187,DATA!A:B,2,0)","v":{"$error":"#N/A"}}]
[null,null,{"$f":"VLOOKUP(B1188,DATA!A:B,2,0)","v":{"$error":"#N/A"}}]
[null,null,{"$f":"VLOOKUP(B1189,DATA!A:B,2,0)","v":{"$error":"#N/A"}}]
[null,null,{"$f":"VLOOKUP(B1190,DATA!A:B,2,0)","v":{"$error":"#N/A"}}]
[null,null,{"$f":"VLOOKUP(B1191,DATA!A:B,2,0)","v":{"$error":"#N/A"}}]
[null,null,{"$f":"VLOOKUP(B1192,DATA!A:B,2,0)","v":{"$error":"#N/A"}}]
[null,null,{"$f":"VLOOKUP(B1193,DATA!A:B,2,0)","v":{"$error":"#N/A"}}]
[null,null,{"$f":"VLOOKUP(B1194,DATA!A:B,2,0)","v":{"$error":"#N/A"}}]
[null,null,{"$f":"VLOOKUP(B1195,DATA!A:B,2,0)","v":{"$error":"#N/A"}}]
[null,null,{"$f":"VLOOKUP(B1196,DATA!A:B,2,0)","v":{"$error":"#N/A"}}]
[null,null,{"$f":"VLOOKUP(B1197,DATA!A:B,2,0)","v":{"$error":"#N/A"}}]
[null,null,{"$f":"VLOOKUP(B1198,DATA!A:B,2,0)","v":{"$error":"#N/A"}}]
[null,null,{"$f":"VLOOKUP(B1199,DATA!A:B,2,0)","v":{"$error":"#N/A"}}]
[null,null,{"$f":"VLOOKUP(B1200,DATA!A:B,2,0)","v":{"$error":"#N/A"}}]
[null,null,{"$f":"VLOOKUP(B1201,DATA!A:B,2,0)","v":{"$error":"#N/A"}}]
[null,null,{"$f":"VLOOKUP(B1202,DATA!A:B,2,0)","v":{"$error":"#N/A"}}]
[null,null,{"$f":"VLOOKUP(B1203,DATA!A:B,2,0)","v":{"$error":"#N/A"}}]
[null,null,{"$f":"VLOOKUP(B1204,DATA!A:B,2,0)","v":{"$error":"#N/A"}}]
[null,null,{"$f":"VLOOKUP(B1205,DATA!A:B,2,0)","v":{"$error":"#N/A"}}]
[null,null,{"$f":"VLOOKUP(B1206,DATA!A:B,2,0)","v":{"$error":"#N/A"}}]
[null,null,{"$f":"VLOOKUP(B1207,DATA!A:B,2,0)","v":{"$error":"#N/A"}}]
[null,null,{"$f":"VLOOKUP(B1208,DATA!A:B,2,0)","v":{"$error":"#N/A"}}]
[null,null,{"$f":"VLOOKUP(B1209,DATA!A:B,2,0)","v":{"$error":"#N/A"}}]
[null,null,{"$f":"VLOOKUP(B1210,DATA!A:B,2,0)","v":{"$error":"#N/A"}}]
[null,null,{"$f":"VLOOKUP(B1211,DATA!A:B,2,0)","v":{"$error":"#N/A"}}]
[null,null,{"$f":"VLOOKUP(B1212,DATA!A:B,2,0)","v":{"$error":"#N/A"}}]
[null,null,{"$f":"VLOOKUP(B1213,DATA!A:B,2,0)","v":{"$error":"#N/A"}}]
[null,null,{"$f":"VLOOKUP(B1214,DATA!A:B,2,0)","v":{"$error":"#N/A"}}]
[null,null,{"$f":"VLOOKUP(B1215,DATA!A:B,2,0)","v":{"$error":"#N/A"}}]
[null,null,{"$f":"VLOOKUP(B1216,DATA!A:B,2,0)","v":{"$error":"#N/A"}}]
[null,null,{"$f":"VLOOKUP(B1217,DATA!A:B,2,0)","v":{"$error":"#N/A"}}]
[null,null,{"$f":"VLOOKUP(B1218,DATA!A:B,2,0)","v":{"$error":"#N/A"}}]
[null,null,{"$f":"VLOOKUP(B1219,DATA!A:B,2,0)","v":{"$error":"#N/A"}}]
[null,null,{"$f":"VLOOKUP(B1220,DATA!A:B,2,0)","v":{"$error":"#N/A"}}]
[null,null,{"$f":"VLOOKUP(B1221,DATA!A:B,2,0)","v":{"$error":"#N/A"}}]
[null,null,{"$f":"VLOOKUP(B1222,DATA!A:B,2,0)","v":{"$error":"#N/A"}}]
[null,null,{"$f":"VLOOKUP(B1223,DATA!A:B,2,0)","v":{"$error":"#N/A"}}]
[null,null,{"$f":"VLOOKUP(B1224,DATA!A:B,2,0)","v":{"$error":"#N/A"}}]
[null,null,{"$f":"VLOOKUP(B1225,DATA!A:B,2,0)","v":{"$error":"#N/A"}}]
[null,null,{"$f":"VLOOKUP(B1226,DATA!A:B,2,0)","v":{"$error":"#N/A"}}]
[null,null,{"$f":"VLOOKUP(B1227,DATA!A:B,2,0)","v":{"$error":"#N/A"}}]
[null,null,{"$f":"VLOOKUP(B1228,DATA!A:B,2,0)","v":{"$error":"#N/A"}}]
[null,null,{"$f":"VLOOKUP(B1229,DATA!A:B,2,0)","v":{"$error":"#N/A"}}]
[null,null,{"$f":"VLOOKUP(B1230,DATA!A:B,2,0)","v":{"$error":"#N/A"}}]
[null,null,{"$f":"VLOOKUP(B1231,DATA!A:B,2,0)","v":{"$error":"#N/A"}}]
[null,null,{"$f":"VLOOKUP(B1232,DATA!A:B,2,0)","v":{"$error":"#N/A"}}]
[null,null,{"$f":"VLOOKUP(B1233,DATA!A:B,2,0)","v":{"$error":"#N/A"}}]
[null,null,{"$f":"VLOOKUP(B1234,DATA!A:B,2,0)","v":{"$error":"#N/A"}}]
[null,null,{"$f":"VLOOKUP(B1235,DATA!A:B,2,0)","v":{"$error":"#N/A"}}]
[null,null,{"$f":"VLOOKUP(B1236,DATA!A:B,2,0)","v":{"$error":"#N/A"}}]
[null,null,{"$f":"VLOOKUP(B1237,DATA!A:B,2,0)","v":{"$error":"#N/A"}}]
[null,null,{"$f":"VLOOKUP(B1238,DATA!A:B,2,0)","v":{"$error":"#N/A"}}]
[null,null,{"$f":"VLOOKUP(B1239,DATA!A:B,2,0)","v":{"$error":"#N/A"}}]
[null,null,{"$f":"VLOOKUP(B1240,DATA!A:B,2,0)","v":{"$error":"#N/A"}}]
[null,null,{"$f":"VLOOKUP(B1241,DATA!A:B,2,0)","v":{"$error":"#N/A"}}]
[null,null,{"$f":"VLOOKUP(B1242,DATA!A:B,2,0)","v":{"$error":"#N/A"}}]
[null,null,{"$f":"VLOOKUP(B1243,DATA!A:B,2,0)","v":{"$error":"#N/A"}}]
[null,null,{"$f":"VLOOKUP(B1244,DATA!A:B,2,0)","v":{"$error":"#N/A"}}]
[null,null,{"$f":"VLOOKUP(B1245,DATA!A:B,2,0)","v":{"$error":"#N/A"}}]
[null,null,{"$f":"VLOOKUP(B1246,DATA!A:B,2,0)","v":{"$error":"#N/A"}}]
[null,null,{"$f":"VLOOKUP(B1247,DATA!A:B,2,0)","v":{"$error":"#N/A"}}]
[null,null,{"$f":"VLOOKUP(B1248,DATA!A:B,2,0)","v":{"$error":"#N/A"}}]
[null,null,{"$f":"VLOOKUP(B1249,DATA!A:B,2,0)","v":{"$error":"#N/A"}}]
[null,null,{"$f":"VLOOKUP(B1250,DATA!A:B,2,0)","v":{"$error":"#N/A"}}]
[null,null,{"$f":"VLOOKUP(B1251,DATA!A:B,2,0)","v":{"$error":"#N/A"}}]
[null,null,{"$f":"VLOOKUP(B1252,DATA!A:B,2,0)","v":{"$error":"#N/A"}}]
[null,null,{"$f":"VLOOKUP(B1253,DATA!A:B,2,0)","v":{"$error":"#N/A"}}]
[null,null,{"$f":"VLOOKUP(B1254,DATA!A:B,2,0)","v":{"$error":"#N/A"}}]
[null,null,{"$f":"VLOOKUP(B1255,DATA!A:B,2,0)","v":{"$error":"#N/A"}}]
[null,null,{"$f":"VLOOKUP(B1256,DATA!A:B,2,0)","v":{"$error":"#N/A"}}]
[null,null,{"$f":"VLOOKUP(B1257,DATA!A:B,2,0)","v":{"$error":"#N/A"}}]
[null,null,{"$f":"VLOOKUP(B1258,DATA!A:B,2,0)","v":{"$error":"#N/A"}}]
[null,null,{"$f":"VLOOKUP(B1259,DATA!A:B,2,0)","v":{"$error":"#N/A"}}]
[null,null,{"$f":"VLOOKUP(B1260,DATA!A:B,2,0)","v":{"$error":"#N/A"}}]
[null,null,{"$f":"VLOOKUP(B1261,DATA!A:B,2,0)","v":{"$error":"#N/A"}}]
[null,null,{"$f":"VLOOKUP(B1262,DATA!A:B,2,0)","v":{"$error":"#N/A"}}]
[null,null,{"$f":"VLOOKUP(B1263,DATA!A:B,2,0)","v":{"$error":"#N/A"}}]
[null,null,{"$f":"VLOOKUP(B1264,DATA!A:B,2,0)","v":{"$error":"#N/A"}}]
[null,null,{"$f":"VLOOKUP(B1265,DATA!A:B,2,0)","v":{"$error":"#N/A"}}]
[null,null,{"$f":"VLOOKUP(B1266,DATA!A:B,2,0)","v":{"$error":"#N/A"}}]
[null,null,{"$f":"VLOOKUP(B1267,DATA!A:B,2,0)","v":{"$error":"#N/A"}}]
[null,null,{"$f":"VLOOKUP(B1268,DATA!A:B,2,0)","v":{"$error":"#N/A"}}]
[null,null,{"$f":"VLOOKUP(B1269,DATA!A:B,2,0)","v":{"$error":"#N/A"}}]
[null,null,{"$f":"VLOOKUP(B1270,DATA!A:B,2,0)","v":{"$error":"#N/A"}}]
[null,null,{"$f":"VLOOKUP(B1271,DATA!A:B,2,0)","v":{"$error":"#N/A"}}]
[null,null,{"$f":"VLOOKUP(B1272,DATA!A:B,2,0)","v":{"$error":"#N/A"}}]
[null,null,{"$f":"VLOOKUP(B1273,DATA!A:B,2,0)","v":{"$error":"#N/A"}}]
[null,null,{"$f":"VLOOKUP(B1274,DATA!A:B,2,0)","v":{"$error":"#N/A"}}]
[null,null,{"$f":"VLOOKUP(B1275,DATA!A:B,2,0)","v":{"$error":"#N/A"}}]
[null,null,{"$f":"VLOOKUP(B1276,DATA!A:B,2,0)","v":{"$error":"#N/A"}}]
[null,null,{"$f":"VLOOKUP(B1277,DATA!A:B,2,0)","v":{"$error":"#N/A"}}]
[null,null,{"$f":"VLOOKUP(B1278,DATA!A:B,2,0)","v":{"$error":"#N/A"}}]
[null,null,{"$f":"VLOOKUP(B1279,DATA!A:B,2,0)","v":{"$error":"#N/A"}}]
[null,null,{"$f":"VLOOKUP(B1280,DATA!A:B,2,0)","v":{"$error":"#N/A"}}]
[null,null,{"$f":"VLOOKUP(B1281,DATA!A:B,2,0)","v":{"$error":"#N/A"}}]
[null,null,{"$f":"VLOOKUP(B1282,DATA!A:B,2,0)","v":{"$error":"#N/A"}}]
[null,null,{"$f":"VLOOKUP(B1283,DATA!A:B,2,0)","v":{"$error":"#N/A"}}]
[null,null,{"$f":"VLOOKUP(B1284,DATA!A:B,2,0)","v":{"$error":"#N/A"}}]
[null,null,{"$f":"VLOOKUP(B1285,DATA!A:B,2,0)","v":{"$error":"#N/A"}}]
[null,null,{"$f":"VLOOKUP(B1286,DATA!A:B,2,0)","v":{"$error":"#N/A"}}]
[null,null,{"$f":"VLOOKUP(B1287,DATA!A:B,2,0)","v":{"$error":"#N/A"}}]
[null,null,{"$f":"VLOOKUP(B1288,DATA!A:B,2,0)","v":{"$error":"#N/A"}}]
[null,null,{"$f":"VLOOKUP(B1289,DATA!A:B,2,0)","v":{"$error":"#N/A"}}]
[null,null,{"$f":"VLOOKUP(B1290,DATA!A:B,2,0)","v":{"$error":"#N/A"}}]
[null,null,{"$f":"VLOOKUP(B1291,DATA!A:B,2,0)","v":{"$error":"#N/A"}}]
[null,null,{"$f":"VLOOKUP(B1292,DATA!A:B,2,0)","v":{"$error":"#N/A"}}]
[null,null,{"$f":"VLOOKUP(B1293,DATA!A:B,2,0)","v":{"$error":"#N/A"}}]
[null,null,{"$f":"VLOOKUP(B1294,DATA!A:B,2,0)","v":{"$error":"#N/A"}}]
[null,null,{"$f":"VLOOKUP(B1295,DATA!A:B,2,0)","v":{"$error":"#N/A"}}]
[null,null,{"$f":"VLOOKUP(B1296,DATA!A:B,2,0)","v":{"$error":"#N/A"}}]
[null,null,{"$f":"VLOOKUP(B1297,DATA!A:B,2,0)","v":{"$error":"#N/A"}}]
[null,null,{"$f":"VLOOKUP(B1298,DATA!A:B,2,0)","v":{"$error":"#N/A"}}]
[null,null,{"$f":"VLOOKUP(B1299,DATA!A:B,2,0)","v":{"$error":"#N/A"}}]
[null,null,{"$f":"VLOOKUP(B1300,DATA!A:B,2,0)","v":{"$error":"#N/A"}}]
[null,null,{"$f":"VLOOKUP(B1301,DATA!A:B,2,0)","v":{"$error":"#N/A"}}]
[null,null,{"$f":"VLOOKUP(B1302,DATA!A:B,2,0)","v":{"$error":"#N/A"}}]
[null,null,{"$f":"VLOOKUP(B1303,DATA!A:B,2,0)","v":{"$error":"#N/A"}}]
[null,null,{"$f":"VLOOKUP(B1304,DATA!A:B,2,0)","v":{"$error":"#N/A"}}]
[null,null,{"$f":"VLOOKUP(B1305,DATA!A:B,2,0)","v":{"$error":"#N/A"}}]
[null,null,{"$f":"VLOOKUP(B1306,DATA!A:B,2,0)","v":{"$error":"#N/A"}}]
[null,null,{"$f":"VLOOKUP(B1307,DATA!A:B,2,0)","v":{"$error":"#N/A"}}]
[null,null,{"$f":"VLOOKUP(B1308,DATA!A:B,2,0)","v":{"$error":"#N/A"}}]
[null,null,{"$f":"VLOOKUP(B1309,DATA!A:B,2,0)","v":{"$error":"#N/A"}}]
[null,null,{"$f":"VLOOKUP(B1310,DATA!A:B,2,0)","v":{"$error":"#N/A"}}]
[null,null,{"$f":"VLOOKUP(B1311,DATA!A:B,2,0)","v":{"$error":"#N/A"}}]
[null,null,{"$f":"VLOOKUP(B1312,DATA!A:B,2,0)","v":{"$error":"#N/A"}}]
[null,null,{"$f":"VLOOKUP(B1313,DATA!A:B,2,0)","v":{"$error":"#N/A"}}]
[null,null,{"$f":"VLOOKUP(B1314,DATA!A:B,2,0)","v":{"$error":"#N/A"}}]
[null,null,{"$f":"VLOOKUP(B1315,DATA!A:B,2,0)","v":{"$error":"#N/A"}}]
[null,null,{"$f":"VLOOKUP(B1316,DATA!A:B,2,0)","v":{"$error":"#N/A"}}]
[null,null,{"$f":"VLOOKUP(B1317,DATA!A:B,2,0)","v":{"$error":"#N/A"}}]
[null,null,{"$f":"VLOOKUP(B1318,DATA!A:B,2,0)","v":{"$error":"#N/A"}}]
[null,null,{"$f":"VLOOKUP(B1319,DATA!A:B,2,0)","v":{"$error":"#N/A"}}]
[null,null,{"$f":"VLOOKUP(B1320,DATA!A:B,2,0)","v":{"$error":"#N/A"}}]
[null,null,{"$f":"VLOOKUP(B1321,DATA!A:B,2,0)","v":{"$error":"#N/A"}}]
[null,null,{"$f":"VLOOKUP(B1322,DATA!A:B,2,0)","v":{"$error":"#N/A"}}]
[null,null,{"$f":"VLOOKUP(B1323,DATA!A:B,2,0)","v":{"$error":"#N/A"}}]
[null,null,{"$f":"VLOOKUP(B1324,DATA!A:B,2,0)","v":{"$error":"#N/A"}}]
[null,null,{"$f":"VLOOKUP(B1325,DATA!A:B,2,0)","v":{"$error":"#N/A"}}]
[null,null,{"$f":"VLOOKUP(B1326,DATA!A:B,2,0)","v":{"$error":"#N/A"}}]
[null,null,{"$f":"VLOOKUP(B1327,DATA!A:B,2,0)","v":{"$error":"#N/A"}}]
[null,null,{"$f":"VLOOKUP(B1328,DATA!A:B,2,0)","v":{"$error":"#N/A"}}]
[null,null,{"$f":"VLOOKUP(B1329,DATA!A:B,2,0)","v":{"$error":"#N/A"}}]
[null,null,{"$f":"VLOOKUP(B1330,DATA!A:B,2,0)","v":{"$error":"#N/A"}}]
[null,null,{"$f":"VLOOKUP(B1331,DATA!A:B,2,0)","v":{"$error":"#N/A"}}]
[null,null,{"$f":"VLOOKUP(B1332,DATA!A:B,2,0)","v":{"$error":"#N/A"}}]
[null,null,{"$f":"VLOOKUP(B1333,DATA!A:B,2,0)","v":{"$error":"#N/A"}}]
[null,null,{"$f":"VLOOKUP(B1334,DATA!A:B,2,0)","v":{"$error":"#N/A"}}]
[null,null,{"$f":"VLOOKUP(B1335,DATA!A:B,2,0)","v":{"$error":"#N/A"}}]
[null,null,{"$f":"VLOOKUP(B1336,DATA!A:B,2,0)","v":{"$error":"#N/A"}}]
[null,null,{"$f":"VLOOKUP(B1337,DATA!A:B,2,0)","v":{"$error":"#N/A"}}]
[null,null,{"$f":"VLOOKUP(B1338,DATA!A:B,2,0)","v":{"$error":"#N/A"}}]
[null,null,{"$f":"VLOOKUP(B1339,DATA!A:B,2,0)","v":{"$error":"#N/A"}}]
[null,null,{"$f":"VLOOKUP(B1340,DATA!A:B,2,0)","v":{"$error":"#N/A"}}]
[null,null,{"$f":"VLOOKUP(B1341,DATA!A:B,2,0)","v":{"$error":"#N/A"}}]
[null,null,{"$f":"VLOOKUP(B1342,DATA!A:B,2,0)","v":{"$error":"#N/A"}}]
[null,null,{"$f":"VLOOKUP(B1343,DATA!A:B,2,0)","v":{"$error":"#N/A"}}]
[null,null,{"$f":"VLOOKUP(B1344,DATA!A:B,2,0)","v":{"$error":"#N/A"}}]
[null,null,{"$f":"VLOOKUP(B1345,DATA!A:B,2,0)","v":{"$error":"#N/A"}}]
[null,null,{"$f":"VLOOKUP(B1346,DATA!A:B,2,0)","v":{"$error":"#N/A"}}]
[null,null,{"$f":"VLOOKUP(B1347,DATA!A:B,2,0)","v":{"$error":"#N/A"}}]
[null,null,{"$f":"VLOOKUP(B1348,DATA!A:B,2,0)","v":{"$error":"#N/A"}}]
[null,null,{"$f":"VLOOKUP(B1349,DATA!A:B,2,0)","v":{"$error":"#N/A"}}]
[null,null,{"$f":"VLOOKUP(B1350,DATA!A:B,2,0)","v":{"$error":"#N/A"}}]
[null,null,{"$f":"VLOOKUP(B1351,DATA!A:B,2,0)","v":{"$error":"#N/A"}}]
[null,null,{"$f":"VLOOKUP(B1352,DATA!A:B,2,0)","v":{"$error":"#N/A"}}]
[null,null,{"$f":"VLOOKUP(B1353,DATA!A:B,2,0)","v":{"$error":"#N/A"}}]
[null,null,{"$f":"VLOOKUP(B1354,DATA!A:B,2,0)","v":{"$error":"#N/A"}}]
[null,null,{"$f":"VLOOKUP(B1355,DATA!A:B,2,0)","v":{"$error":"#N/A"}}]
[null,null,{"$f":"VLOOKUP(B1356,DATA!A:B,2,0)","v":{"$error":"#N/A"}}]
[null,null,{"$f":"VLOOKUP(B1357,DATA!A:B,2,0)","v":{"$error":"#N/A"}}]
[null,null,{"$f":"VLOOKUP(B1358,DATA!A:B,2,0)","v":{"$error":"#N/A"}}]
[null,null,{"$f":"VLOOKUP(B1359,DATA!A:B,2,0)","v":{"$error":"#N/A"}}]
[null,null,{"$f":"VLOOKUP(B1360,DATA!A:B,2,0)","v":{"$error":"#N/A"}}]
[null,null,{"$f":"VLOOKUP(B1361,DATA!A:B,2,0)","v":{"$error":"#N/A"}}]
[null,null,{"$f":"VLOOKUP(B1362,DATA!A:B,2,0)","v":{"$error":"#N/A"}}]
[null,null,{"$f":"VLOOKUP(B1363,DATA!A:B,2,0)","v":{"$error":"#N/A"}}]
[null,null,{"$f":"VLOOKUP(B1364,DATA!A:B,2,0)","v":{"$error":"#N/A"}}]
[null,null,{"$f":"VLOOKUP(B1365,DATA!A:B,2,0)","v":{"$error":"#N/A"}}]
[null,null,{"$f":"VLOOKUP(B1366,DATA!A:B,2,0)","v":{"$error":"#N/A"}}]
[null,null,{"$f":"VLOOKUP(B1367,DATA!A:B,2,0)","v":{"$error":"#N/A"}}]
[null,null,{"$f":"VLOOKUP(B1368,DATA!A:B,2,0)","v":{"$error":"#N/A"}}]
[null,null,{"$f":"VLOOKUP(B1369,DATA!A:B,2,0)","v":{"$error":"#N/A"}}]
[null,null,{"$f":"VLOOKUP(B1370,DATA!A:B,2,0)","v":{"$error":"#N/A"}}]
[null,null,{"$f":"VLOOKUP(B1371,DATA!A:B,2,0)","v":{"$error":"#N/A"}}]
[null,null,{"$f":"VLOOKUP(B1372,DATA!A:B,2,0)","v":{"$error":"#N/A"}}]
[null,null,{"$f":"VLOOKUP(B1373,DATA!A:B,2,0)","v":{"$error":"#N/A"}}]
[null,null,{"$f":"VLOOKUP(B1374,DATA!A:B,2,0)","v":{"$error":"#N/A"}}]
[null,null,{"$f":"VLOOKUP(B1375,DATA!A:B,2,0)","v":{"$error":"#N/A"}}]
[null,null,{"$f":"VLOOKUP(B1376,DATA!A:B,2,0)","v":{"$error":"#N/A"}}]
[null,null,{"$f":"VLOOKUP(B1377,DATA!A:B,2,0)","v":{"$error":"#N/A"}}]
[null,null,{"$f":"VLOOKUP(B1378,DATA!A:B,2,0)","v":{"$error":"#N/A"}}]
[null,null,{"$f":"VLOOKUP(B1379,DATA!A:B,2,0)","v":{"$error":"#N/A"}}]
[null,null,{"$f":"VLOOKUP(B1380,DATA!A:B,2,0)","v":{"$error":"#N/A"}}]
[null,null,{"$f":"VLOOKUP(B1381,DATA!A:B,2,0)","v":{"$error":"#N/A"}}]
[null,null,{"$f":"VLOOKUP(B1382,DATA!A:B,2,0)","v":{"$error":"#N/A"}}]
[null,null,{"$f":"VLOOKUP(B1383,DATA!A:B,2,0)","v":{"$error":"#N/A"}}]
[null,null,{"$f":"VLOOKUP(B1384,DATA!A:B,2,0)","v":{"$error":"#N/A"}}]
[null,null,{"$f":"VLOOKUP(B1385,DATA!A:B,2,0)","v":{"$error":"#N/A"}}]
[null,null,{"$f":"VLOOKUP(B1386,DATA!A:B,2,0)","v":{"$error":"#N/A"}}]
[null,null,{"$f":"VLOOKUP(B1387,DATA!A:B,2,0)","v":{"$error":"#N/A"}}]
[null,null,{"$f":"VLOOKUP(B1388,DATA!A:B,2,0)","v":{"$error":"#N/A"}}]
[null,null,{"$f":"VLOOKUP(B1389,DATA!A:B,2,0)","v":{"$error":"#N/A"}}]
[null,null,{"$f":"VLOOKUP(B1390,DATA!A:B,2,0)","v":{"$error":"#N/A"}}]
[null,null,{"$f":"VLOOKUP(B1391,DATA!A:B,2,0)","v":{"$error":"#N/A"}}]
[null,null,{"$f":"VLOOKUP(B1392,DATA!A:B,2,0)","v":{"$error":"#N/A"}}]
[null,null,{"$f":"VLOOKUP(B1393,DATA!A:B,2,0)","v":{"$error":"#N/A"}}]
[null,null,{"$f":"VLOOKUP(B1394,DATA!A:B,2,0)","v":{"$error":"#N/A"}}]
[null,null,{"$f":"VLOOKUP(B1395,DATA!A:B,2,0)","v":{"$error":"#N/A"}}]
[null,null,{"$f":"VLOOKUP(B1396,DATA!A:B,2,0)","v":{"$error":"#N/A"}}]
[null,null,{"$f":"VLOOKUP(B1397,DATA!A:B,2,0)","v":{"$error":"#N/A"}}]
[null,null,{"$f":"VLOOKUP(B1398,DATA!A:B,2,0)","v":{"$error":"#N/A"}}]
[null,null,{"$f":"VLOOKUP(B1399,DATA!A:B,2,0)","v":{"$error":"#N/A"}}]
[null,null,{"$f":"VLOOKUP(B1400,DATA!A:B,2,0)","v":{"$error":"#N/A"}}]
[null,null,{"$f":"VLOOKUP(B1401,DATA!A:B,2,0)","v":{"$error":"#N/A"}}]
[null,null,{"$f":"VLOOKUP(B1402,DATA!A:B,2,0)","v":{"$error":"#N/A"}}]
[null,null,{"$f":"VLOOKUP(B1403,DATA!A:B,2,0)","v":{"$error":"#N/A"}}]
[null,null,{"$f":"VLOOKUP(B1404,DATA!A:B,2,0)","v":{"$error":"#N/A"}}]
[null,null,{"$f":"VLOOKUP(B1405,DATA!A:B,2,0)","v":{"$error":"#N/A"}}]
[null,null,{"$f":"VLOOKUP(B1406,DATA!A:B,2,0)","v":{"$error":"#N/A"}}]
[null,null,{"$f":"VLOOKUP(B1407,DATA!A:B,2,0)","v":{"$error":"#N/A"}}]
[null,null,{"$f":"VLOOKUP(B1408,DATA!A:B,2,0)","v":{"$error":"#N/A"}}]
[null,null,{"$f":"VLOOKUP(B1409,DATA!A:B,2,0)","v":{"$error":"#N/A"}}]
[null,null,{"$f":"VLOOKUP(B1410,DATA!A:B,2,0)","v":{"$error":"#N/A"}}]
[null,null,{"$f":"VLOOKUP(B1411,DATA!A:B,2,0)","v":{"$error":"#N/A"}}]
[null,null,{"$f":"VLOOKUP(B1412,DATA!A:B,2,0)","v":{"$error":"#N/A"}}]
[null,null,{"$f":"VLOOKUP(B1413,DATA!A:B,2,0)","v":{"$error":"#N/A"}}]
[null,null,{"$f":"VLOOKUP(B1414,DATA!A:B,2,0)","v":{"$error":"#N/A"}}]
[null,null,{"$f":"VLOOKUP(B1415,DATA!A:B,2,0)","v":{"$error":"#N/A"}}]
[null,null,{"$f":"VLOOKUP(B1416,DATA!A:B,2,0)","v":{"$error":"#N/A"}}]
[null,null,{"$f":"VLOOKUP(B1417,DATA!A:B,2,0)","v":{"$error":"#N/A"}}]
[null,null,{"$f":"VLOOKUP(B1418,DATA!A:B,2,0)","v":{"$error":"#N/A"}}]
[null,null,{"$f":"VLOOKUP(B1419,DATA!A:B,2,0)","v":{"$error":"#N/A"}}]
[null,null,{"$f":"VLOOKUP(B1420,DATA!A:B,2,0)","v":{"$error":"#N/A"}}]
[null,null,{"$f":"VLOOKUP(B1421,DATA!A:B,2,0)","v":{"$error":"#N/A"}}]
[null,null,{"$f":"VLOOKUP(B1422,DATA!A:B,2,0)","v":{"$error":"#N/A"}}]
[null,null,{"$f":"VLOOKUP(B1423,DATA!A:B,2,0)","v":{"$error":"#N/A"}}]
[null,null,{"$f":"VLOOKUP(B1424,DATA!A:B,2,0)","v":{"$error":"#N/A"}}]
[null,null,{"$f":"VLOOKUP(B1425,DATA!A:B,2,0)","v":{"$error":"#N/A"}}]
[null,null,{"$f":"VLOOKUP(B1426,DATA!A:B,2,0)","v":{"$error":"#N/A"}}]
[null,null,{"$f":"VLOOKUP(B1427,DATA!A:B,2,0)","v":{"$error":"#N/A"}}]
[null,null,{"$f":"VLOOKUP(B1428,DATA!A:B,2,0)","v":{"$error":"#N/A"}}]
[null,null,{"$f":"VLOOKUP(B1429,DATA!A:B,2,0)","v":{"$error":"#N/A"}}]
[null,null,{"$f":"VLOOKUP(B1430,DATA!A:B,2,0)","v":{"$error":"#N/A"}}]
[null,null,{"$f":"VLOOKUP(B1431,DATA!A:B,2,0)","v":{"$error":"#N/A"}}]
[null,null,{"$f":"VLOOKUP(B1432,DATA!A:B,2,0)","v":{"$error":"#N/A"}}]
[null,null,{"$f":"VLOOKUP(B1433,DATA!A:B,2,0)","v":{"$error":"#N/A"}}]
[null,null,{"$f":"VLOOKUP(B1434,DATA!A:B,2,0)","v":{"$error":"#N/A"}}]
[null,null,{"$f":"VLOOKUP(B1435,DATA!A:B,2,0)","v":{"$error":"#N/A"}}]
[null,null,{"$f":"VLOOKUP(B1436,DATA!A:B,2,0)","v":{"$error":"#N/A"}}]
[null,null,{"$f":"VLOOKUP(B1437,DATA!A:B,2,0)","v":{"$error":"#N/A"}}]
[null,null,{"$f":"VLOOKUP(B1438,DATA!A:B,2,0)","v":{"$error":"#N/A"}}]
[null,null,{"$f":"VLOOKUP(B1439,DATA!A:B,2,0)","v":{"$error":"#N/A"}}]
[null,null,{"$f":"VLOOKUP(B1440,DATA!A:B,2,0)","v":{"$error":"#N/A"}}]
[null,null,{"$f":"VLOOKUP(B1441,DATA!A:B,2,0)","v":{"$error":"#N/A"}}]
[null,null,{"$f":"VLOOKUP(B1442,DATA!A:B,2,0)","v":{"$error":"#N/A"}}]
[null,null,{"$f":"VLOOKUP(B1443,DATA!A:B,2,0)","v":{"$error":"#N/A"}}]
[null,null,{"$f":"VLOOKUP(B1444,DATA!A:B,2,0)","v":{"$error":"#N/A"}}]
[null,null,{"$f":"VLOOKUP(B1445,DATA!A:B,2,0)","v":{"$error":"#N/A"}}]
[null,null,{"$f":"VLOOKUP(B1446,DATA!A:B,2,0)","v":{"$error":"#N/A"}}]
[null,null,{"$f":"VLOOKUP(B1447,DATA!A:B,2,0)","v":{"$error":"#N/A"}}]
[null,null,{"$f":"VLOOKUP(B1448,DATA!A:B,2,0)","v":{"$error":"#N/A"}}]
[null,null,{"$f":"VLOOKUP(B1449,DATA!A:B,2,0)","v":{"$error":"#N/A"}}]
[null,null,{"$f":"VLOOKUP(B1450,DATA!A:B,2,0)","v":{"$error":"#N/A"}}]
[null,null,{"$f":"VLOOKUP(B1451,DATA!A:B,2,0)","v":{"$error":"#N/A"}}]
[null,null,{"$f":"VLOOKUP(B1452,DATA!A:B,2,0)","v":{"$error":"#N/A"}}]
[null,null,{"$f":"VLOOKUP(B1453,DATA!A:B,2,0)","v":{"$error":"#N/A"}}]
[null,null,{"$f":"VLOOKUP(B1454,DATA!A:B,2,0)","v":{"$error":"#N/A"}}]
[null,null,{"$f":"VLOOKUP(B1455,DATA!A:B,2,0)","v":{"$error":"#N/A"}}]
[null,null,{"$f":"VLOOKUP(B1456,DATA!A:B,2,0)","v":{"$error":"#N/A"}}]
[null,null,{"$f":"VLOOKUP(B1457,DATA!A:B,2,0)","v":{"$error":"#N/A"}}]
[null,null,{"$f":"VLOOKUP(B1458,DATA!A:B,2,0)","v":{"$error":"#N/A"}}]
[null,null,{"$f":"VLOOKUP(B1459,DATA!A:B,2,0)","v":{"$error":"#N/A"}}]
[null,null,{"$f":"VLOOKUP(B1460,DATA!A:B,2,0)","v":{"$error":"#N/A"}}]
[null,null,{"$f":"VLOOKUP(B1461,DATA!A:B,2,0)","v":{"$error":"#N/A"}}]
[null,null,{"$f":"VLOOKUP(B1462,DATA!A:B,2,0)","v":{"$error":"#N/A"}}]
[null,null,{"$f":"VLOOKUP(B1463,DATA!A:B,2,0)","v":{"$error":"#N/A"}}]
[null,null,{"$f":"VLOOKUP(B1464,DATA!A:B,2,0)","v":{"$error":"#N/A"}}]
[null,null,{"$f":"VLOOKUP(B1465,DATA!A:B,2,0)","v":{"$error":"#N/A"}}]
[null,null,{"$f":"VLOOKUP(B1466,DATA!A:B,2,0)","v":{"$error":"#N/A"}}]
[null,null,{"$f":"VLOOKUP(B1467,DATA!A:B,2,0)","v":{"$error":"#N/A"}}]
[null,null,{"$f":"VLOOKUP(B1468,DATA!A:B,2,0)","v":{"$error":"#N/A"}}]
[null,null,{"$f":"VLOOKUP(B1469,DATA!A:B,2,0)","v":{"$error":"#N/A"}}]
[null,null,{"$f":"VLOOKUP(B1470,DATA!A:B,2,0)","v":{"$error":"#N/A"}}]
[null,null,{"$f":"VLOOKUP(B1471,DATA!A:B,2,0)","v":{"$error":"#N/A"}}]
[null,null,{"$f":"VLOOKUP(B1472,DATA!A:B,2,0)","v":{"$error":"#N/A"}}]
[null,null,{"$f":"VLOOKUP(B1473,DATA!A:B,2,0)","v":{"$error":"#N/A"}}]
[null,null,{"$f":"VLOOKUP(B1474,DATA!A:B,2,0)","v":{"$error":"#N/A"}}]
[null,null,{"$f":"VLOOKUP(B1475,DATA!A:B,2,0)","v":{"$error":"#N/A"}}]
[null,null,{"$f":"VLOOKUP(B1476,DATA!A:B,2,0)","v":{"$error":"#N/A"}}]
[null,null,{"$f":"VLOOKUP(B1477,DATA!A:B,2,0)","v":{"$error":"#N/A"}}]
[null,null,{"$f":"VLOOKUP(B1478,DATA!A:B,2,0)","v":{"$error":"#N/A"}}]
[null,null,{"$f":"VLOOKUP(B1479,DATA!A:B,2,0)","v":{"$error":"#N/A"}}]
[null,null,{"$f":"VLOOKUP(B1480,DATA!A:B,2,0)","v":{"$error":"#N/A"}}]
[null,null,{"$f":"VLOOKUP(B1481,DATA!A:B,2,0)","v":{"$error":"#N/A"}}]
[null,null,{"$f":"VLOOKUP(B1482,DATA!A:B,2,0)","v":{"$error":"#N/A"}}]
[null,null,{"$f":"VLOOKUP(B1483,DATA!A:B,2,0)","v":{"$error":"#N/A"}}]
[null,null,{"$f":"VLOOKUP(B1484,DATA!A:B,2,0)","v":{"$error":"#N/A"}}]
[null,null,{"$f":"VLOOKUP(B1485,DATA!A:B,2,0)","v":{"$error":"#N/A"}}]
[null,null,{"$f":"VLOOKUP(B1486,DATA!A:B,2,0)","v":{"$error":"#N/A"}}]
[null,null,{"$f":"VLOOKUP(B1487,DATA!A:B,2,0)","v":{"$error":"#N/A"}}]
[null,null,{"$f":"VLOOKUP(B1488,DATA!A:B,2,0)","v":{"$error":"#N/A"}}]
[null,null,{"$f":"VLOOKUP(B1489,DATA!A:B,2,0)","v":{"$error":"#N/A"}}]
[null,null,{"$f":"VLOOKUP(B1490,DATA!A:B,2,0)","v":{"$error":"#N/A"}}]
[null,null,{"$f":"VLOOKUP(B1491,DATA!A:B,2,0)","v":{"$error":"#N/A"}}]
[null,null,{"$f":"VLOOKUP(B1492,DATA!A:B,2,0)","v":{"$error":"#N/A"}}]
[null,null,{"$f":"VLOOKUP(B1493,DATA!A:B,2,0)","v":{"$error":"#N/A"}}]
[null,null,{"$f":"VLOOKUP(B1494,DATA!A:B,2,0)","v":{"$error":"#N/A"}}]
[null,null,{"$f":"VLOOKUP(B1495,DATA!A:B,2,0)","v":{"$error":"#N/A"}}]
[null,null,{"$f":"VLOOKUP(B1496,DATA!A:B,2,0)","v":{"$error":"#N/A"}}]
[null,null,{"$f":"VLOOKUP(B1497,DATA!A:B,2,0)","v":{"$error":"#N/A"}}]
[null,null,{"$f":"VLOOKUP(B1498,DATA!A:B,2,0)","v":{"$error":"#N/A"}}]
[null,null,{"$f":"VLOOKUP(B1499,DATA!A:B,2,0)","v":{"$error":"#N/A"}}]
[null,null,{"$f":"VLOOKUP(B1500,DATA!A:B,2,0)","v":{"$error":"#N/A"}}]
[null,null,{"$f":"VLOOKUP(B1501,DATA!A:B,2,0)","v":{"$error":"#N/A"}}]
[null,null,{"$f":"VLOOKUP(B1502,DATA!A:B,2,0)","v":{"$error":"#N/A"}}]
[null,null,{"$f":"VLOOKUP(B1503,DATA!A:B,2,0)","v":{"$error":"#N/A"}}]
[null,null,{"$f":"VLOOKUP(B1504,DATA!A:B,2,0)","v":{"$error":"#N/A"}}]
[null,null,{"$f":"VLOOKUP(B1505,DATA!A:B,2,0)","v":{"$error":"#N/A"}}]
[null,null,{"$f":"VLOOKUP(B1506,DATA!A:B,2,0)","v":{"$error":"#N/A"}}]
[null,null,{"$f":"VLOOKUP(B1507,DATA!A:B,2,0)","v":{"$error":"#N/A"}}]
[null,null,{"$f":"VLOOKUP(B1508,DATA!A:B,2,0)","v":{"$error":"#N/A"}}]
[null,null,{"$f":"VLOOKUP(B1509,DATA!A:B,2,0)","v":{"$error":"#N/A"}}]
[null,null,{"$f":"VLOOKUP(B1510,DATA!A:B,2,0)","v":{"$error":"#N/A"}}]
[null,null,{"$f":"VLOOKUP(B1511,DATA!A:B,2,0)","v":{"$error":"#N/A"}}]
[null,null,{"$f":"VLOOKUP(B1512,DATA!A:B,2,0)","v":{"$error":"#N/A"}}]
[null,null,{"$f":"VLOOKUP(B1513,DATA!A:B,2,0)","v":{"$error":"#N/A"}}]
[null,null,{"$f":"VLOOKUP(B1514,DATA!A:B,2,0)","v":{"$error":"#N/A"}}]
[null,null,{"$f":"VLOOKUP(B1515,DATA!A:B,2,0)","v":{"$error":"#N/A"}}]
[null,null,{"$f":"VLOOKUP(B1516,DATA!A:B,2,0)","v":{"$error":"#N/A"}}]
[null,null,{"$f":"VLOOKUP(B1517,DATA!A:B,2,0)","v":{"$error":"#N/A"}}]
[null,null,{"$f":"VLOOKUP(B1518,DATA!A:B,2,0)","v":{"$error":"#N/A"}}]
[null,null,{"$f":"VLOOKUP(B1519,DATA!A:B,2,0)","v":{"$error":"#N/A"}}]
[null,null,{"$f":"VLOOKUP(B1520,DATA!A:B,2,0)","v":{"$error":"#N/A"}}]
[null,null,{"$f":"VLOOKUP(B1521,DATA!A:B,2,0)","v":{"$error":"#N/A"}}]
[null,null,{"$f":"VLOOKUP(B1522,DATA!A:B,2,0)","v":{"$error":"#N/A"}}]
[null,null,{"$f":"VLOOKUP(B1523,DATA!A:B,2,0)","v":{"$error":"#N/A"}}]
[null,null,{"$f":"VLOOKUP(B1524,DATA!A:B,2,0)","v":{"$error":"#N/A"}}]
[null,null,{"$f":"VLOOKUP(B1525,DATA!A:B,2,0)","v":{"$error":"#N/A"}}]
[null,null,{"$f":"VLOOKUP(B1526,DATA!A:B,2,0)","v":{"$error":"#N/A"}}]
[null,null,{"$f":"VLOOKUP(B1527,DATA!A:B,2,0)","v":{"$error":"#N/A"}}]
[null,null,{"$f":"VLOOKUP(B1528,DATA!A:B,2,0)","v":{"$error":"#N/A"}}]
[null,null,{"$f":"VLOOKUP(B1529,DATA!A:B,2,0)","v":{"$error":"#N/A"}}]
[null,null,{"$f":"VLOOKUP(B1530,DATA!A:B,2,0)","v":{"$error":"#N/A"}}]
[null,null,{"$f":"VLOOKUP(B1531,DATA!A:B,2,0)","v":{"$error":"#N/A"}}]
[null,null,{"$f":"VLOOKUP(B1532,DATA!A:B,2,0)","v":{"$error":"#N/A"}}]
[null,null,{"$f":"VLOOKUP(B1533,DATA!A:B,2,0)","v":{"$error":"#N/A"}}]
[null,null,{"$f":"VLOOKUP(B1534,DATA!A:B,2,0)","v":{"$error":"#N/A"}}]
[null,null,{"$f":"VLOOKUP(B1535,DATA!A:B,2,0)","v":{"$error":"#N/A"}}]
[null,null,{"$f":"VLOOKUP(B1536,DATA!A:B,2,0)","v":{"$error":"#N/A"}}]
[null,null,{"$f":"VLOOKUP(B1537,DATA!A:B,2,0)","v":{"$error":"#N/A"}}]
[null,null,{"$f":"VLOOKUP(B1538,DATA!A:B,2,0)","v":{"$error":"#N/A"}}]
[null,null,{"$f":"VLOOKUP(B1539,DATA!A:B,2,0)","v":{"$error":"#N/A"}}]
[null,null,{"$f":"VLOOKUP(B1540,DATA!A:B,2,0)","v":{"$error":"#N/A"}}]
[null,null,{"$f":"VLOOKUP(B1541,DATA!A:B,2,0)","v":{"$error":"#N/A"}}]
[null,null,{"$f":"VLOOKUP(B1542,DATA!A:B,2,0)","v":{"$error":"#N/A"}}]
[null,null,{"$f":"VLOOKUP(B1543,DATA!A:B,2,0)","v":{"$error":"#N/A"}}]
[null,null,{"$f":"VLOOKUP(B1544,DATA!A:B,2,0)","v":{"$error":"#N/A"}}]
[null,null,{"$f":"VLOOKUP(B1545,DATA!A:B,2,0)","v":{"$error":"#N/A"}}]
[null,null,{"$f":"VLOOKUP(B1546,DATA!A:B,2,0)","v":{"$error":"#N/A"}}]
[null,null,{"$f":"VLOOKUP(B1547,DATA!A:B,2,0)","v":{"$error":"#N/A"}}]
[null,null,{"$f":"VLOOKUP(B1548,DATA!A:B,2,0)","v":{"$error":"#N/A"}}]
[null,null,{"$f":"VLOOKUP(B1549,DATA!A:B,2,0)","v":{"$error":"#N/A"}}]
[null,null,{"$f":"VLOOKUP(B1550,DATA!A:B,2,0)","v":{"$error":"#N/A"}}]
[null,null,{"$f":"VLOOKUP(B1551,DATA!A:B,2,0)","v":{"$error":"#N/A"}}]
[null,null,{"$f":"VLOOKUP(B1552,DATA!A:B,2,0)","v":{"$error":"#N/A"}}]
[null,null,{"$f":"VLOOKUP(B1553,DATA!A:B,2,0)","v":{"$error":"#N/A"}}]
[null,null,{"$f":"VLOOKUP(B1554,DATA!A:B,2,0)","v":{"$error":"#N/A"}}]
[null,null,{"$f":"VLOOKUP(B1555,DATA!A:B,2,0)","v":{"$error":"#N/A"}}]
[null,null,{"$f":"VLOOKUP(B1556,DATA!A:B,2,0)","v":{"$error":"#N/A"}}]
[null,null,{"$f":"VLOOKUP(B1557,DATA!A:B,2,0)","v":{"$error":"#N/A"}}]
[null,null,{"$f":"VLOOKUP(B1558,DATA!A:B,2,0)","v":{"$error":"#N/A"}}]
[null,null,{"$f":"VLOOKUP(B1559,DATA!A:B,2,0)","v":{"$error":"#N/A"}}]
[null,null,{"$f":"VLOOKUP(B1560,DATA!A:B,2,0)","v":{"$error":"#N/A"}}]
[null,null,{"$f":"VLOOKUP(B1561,DATA!A:B,2,0)","v":{"$error":"#N/A"}}]
[null,null,{"$f":"VLOOKUP(B1562,DATA!A:B,2,0)","v":{"$error":"#N/A"}}]
[null,null,{"$f":"VLOOKUP(B1563,DATA!A:B,2,0)","v":{"$error":"#N/A"}}]
[null,null,{"$f":"VLOOKUP(B1564,DATA!A:B,2,0)","v":{"$error":"#N/A"}}]
[null,null,{"$f":"VLOOKUP(B1565,DATA!A:B,2,0)","v":{"$error":"#N/A"}}]
[null,null,{"$f":"VLOOKUP(B1566,DATA!A:B,2,0)","v":{"$error":"#N/A"}}]
[null,null,{"$f":"VLOOKUP(B1567,DATA!A:B,2,0)","v":{"$error":"#N/A"}}]
[null,null,{"$f":"VLOOKUP(B1568,DATA!A:B,2,0)","v":{"$error":"#N/A"}}]
[null,null,{"$f":"VLOOKUP(B1569,DATA!A:B,2,0)","v":{"$error":"#N/A"}}]
[null,null,{"$f":"VLOOKUP(B1570,DATA!A:B,2,0)","v":{"$error":"#N/A"}}]
[null,null,{"$f":"VLOOKUP(B1571,DATA!A:B,2,0)","v":{"$error":"#N/A"}}]
[null,null,{"$f":"VLOOKUP(B1572,DATA!A:B,2,0)","v":{"$error":"#N/A"}}]
[null,null,{"$f":"VLOOKUP(B1573,DATA!A:B,2,0)","v":{"$error":"#N/A"}}]
[null,null,{"$f":"VLOOKUP(B1574,DATA!A:B,2,0)","v":{"$error":"#N/A"}}]
[null,null,{"$f":"VLOOKUP(B1575,DATA!A:B,2,0)","v":{"$error":"#N/A"}}]
[null,null,{"$f":"VLOOKUP(B1576,DATA!A:B,2,0)","v":{"$error":"#N/A"}}]
[null,null,{"$f":"VLOOKUP(B1577,DATA!A:B,2,0)","v":{"$error":"#N/A"}}]
[null,null,{"$f":"VLOOKUP(B1578,DATA!A:B,2,0)","v":{"$error":"#N/A"}}]
[null,null,{"$f":"VLOOKUP(B1579,DATA!A:B,2,0)","v":{"$error":"#N/A"}}]
[null,null,{"$f":"VLOOKUP(B1580,DATA!A:B,2,0)","v":{"$error":"#N/A"}}]
[null,null,{"$f":"VLOOKUP(B1581,DATA!A:B,2,0)","v":{"$error":"#N/A"}}]
[null,null,{"$f":"VLOOKUP(B1582,DATA!A:B,2,0)","v":{"$error":"#N/A"}}]
[null,null,{"$f":"VLOOKUP(B1583,DATA!A:B,2,0)","v":{"$error":"#N/A"}}]
[null,null,{"$f":"VLOOKUP(B1584,DATA!A:B,2,0)","v":{"$error":"#N/A"}}]
[null,null,{"$f":"VLOOKUP(B1585,DATA!A:B,2,0)","v":{"$error":"#N/A"}}]
[null,null,{"$f":"VLOOKUP(B1586,DATA!A:B,2,0)","v":{"$error":"#N/A"}}]
[null,null,{"$f":"VLOOKUP(B1587,DATA!A:B,2,0)","v":{"$error":"#N/A"}}]
[null,null,{"$f":"VLOOKUP(B1588,DATA!A:B,2,0)","v":{"$error":"#N/A"}}]
[null,null,{"$f":"VLOOKUP(B1589,DATA!A:B,2,0)","v":{"$error":"#N/A"}}]
[null,null,{"$f":"VLOOKUP(B1590,DATA!A:B,2,0)","v":{"$error":"#N/A"}}]
[null,null,{"$f":"VLOOKUP(B1591,DATA!A:B,2,0)","v":{"$error":"#N/A"}}]
[null,null,{"$f":"VLOOKUP(B1592,DATA!A:B,2,0)","v":{"$error":"#N/A"}}]
[null,null,{"$f":"VLOOKUP(B1593,DATA!A:B,2,0)","v":{"$error":"#N/A"}}]
[null,null,{"$f":"VLOOKUP(B1594,DATA!A:B,2,0)","v":{"$error":"#N/A"}}]
[null,null,{"$f":"VLOOKUP(B1595,DATA!A:B,2,0)","v":{"$error":"#N/A"}}]
[null,null,{"$f":"VLOOKUP(B1596,DATA!A:B,2,0)","v":{"$error":"#N/A"}}]
[null,null,{"$f":"VLOOKUP(B1597,DATA!A:B,2,0)","v":{"$error":"#N/A"}}]
[null,null,{"$f":"VLOOKUP(B1598,DATA!A:B,2,0)","v":{"$error":"#N/A"}}]
[null,null,{"$f":"VLOOKUP(B1599,DATA!A:B,2,0)","v":{"$error":"#N/A"}}]
[null,null,{"$f":"VLOOKUP(B1600,DATA!A:B,2,0)","v":{"$error":"#N/A"}}]
[null,null,{"$f":"VLOOKUP(B1601,DATA!A:B,2,0)","v":{"$error":"#N/A"}}]
[null,null,{"$f":"VLOOKUP(B1602,DATA!A:B,2,0)","v":{"$error":"#N/A"}}]
[null,null,{"$f":"VLOOKUP(B1603,DATA!A:B,2,0)","v":{"$error":"#N/A"}}]
[null,null,{"$f":"VLOOKUP(B1604,DATA!A:B,2,0)","v":{"$error":"#N/A"}}]
[null,null,{"$f":"VLOOKUP(B1605,DATA!A:B,2,0)","v":{"$error":"#N/A"}}]
[null,null,{"$f":"VLOOKUP(B1606,DATA!A:B,2,0)","v":{"$error":"#N/A"}}]
[null,null,{"$f":"VLOOKUP(B1607,DATA!A:B,2,0)","v":{"$error":"#N/A"}}]
[null,null,{"$f":"VLOOKUP(B1608,DATA!A:B,2,0)","v":{"$error":"#N/A"}}]
[null,null,{"$f":"VLOOKUP(B1609,DATA!A:B,2,0)","v":{"$error":"#N/A"}}]
[null,null,{"$f":"VLOOKUP(B1610,DATA!A:B,2,0)","v":{"$error":"#N/A"}}]
[null,null,{"$f":"VLOOKUP(B1611,DATA!A:B,2,0)","v":{"$error":"#N/A"}}]
[null,null,{"$f":"VLOOKUP(B1612,DATA!A:B,2,0)","v":{"$error":"#N/A"}}]
[null,null,{"$f":"VLOOKUP(B1613,DATA!A:B,2,0)","v":{"$error":"#N/A"}}]
[null,null,{"$f":"VLOOKUP(B1614,DATA!A:B,2,0)","v":{"$error":"#N/A"}}]
[null,null,{"$f":"VLOOKUP(B1615,DATA!A:B,2,0)","v":{"$error":"#N/A"}}]
[null,null,{"$f":"VLOOKUP(B1616,DATA!A:B,2,0)","v":{"$error":"#N/A"}}]
[null,null,{"$f":"VLOOKUP(B1617,DATA!A:B,2,0)","v":{"$error":"#N/A"}}]
[null,null,{"$f":"VLOOKUP(B1618,DATA!A:B,2,0)","v":{"$error":"#N/A"}}]
[null,null,{"$f":"VLOOKUP(B1619,DATA!A:B,2,0)","v":{"$error":"#N/A"}}]
[null,null,{"$f":"VLOOKUP(B1620,DATA!A:B,2,0)","v":{"$error":"#N/A"}}]
[null,null,{"$f":"VLOOKUP(B1621,DATA!A:B,2,0)","v":{"$error":"#N/A"}}]
[null,null,{"$f":"VLOOKUP(B1622,DATA!A:B,2,0)","v":{"$error":"#N/A"}}]
[null,null,{"$f":"VLOOKUP(B1623,DATA!A:B,2,0)","v":{"$error":"#N/A"}}]
[null,null,{"$f":"VLOOKUP(B1624,DATA!A:B,2,0)","v":{"$error":"#N/A"}}]
[null,null,{"$f":"VLOOKUP(B1625,DATA!A:B,2,0)","v":{"$error":"#N/A"}}]
[null,null,{"$f":"VLOOKUP(B1626,DATA!A:B,2,0)","v":{"$error":"#N/A"}}]
[null,null,{"$f":"VLOOKUP(B1627,DATA!A:B,2,0)","v":{"$error":"#N/A"}}]
[null,null,{"$f":"VLOOKUP(B1628,DATA!A:B,2,0)","v":{"$error":"#N/A"}}]
[null,null,{"$f":"VLOOKUP(B1629,DATA!A:B,2,0)","v":{"$error":"#N/A"}}]
[null,null,{"$f":"VLOOKUP(B1630,DATA!A:B,2,0)","v":{"$error":"#N/A"}}]
[null,null,{"$f":"VLOOKUP(B1631,DATA!A:B,2,0)","v":{"$error":"#N/A"}}]
[null,null,{"$f":"VLOOKUP(B1632,DATA!A:B,2,0)","v":{"$error":"#N/A"}}]
[null,null,{"$f":"VLOOKUP(B1633,DATA!A:B,2,0)","v":{"$error":"#N/A"}}]
[null,null,{"$f":"VLOOKUP(B1634,DATA!A:B,2,0)","v":{"$error":"#N/A"}}]
[null,null,{"$f":"VLOOKUP(B1635,DATA!A:B,2,0)","v":{"$error":"#N/A"}}]
[null,null,{"$f":"VLOOKUP(B1636,DATA!A:B,2,0)","v":{"$error":"#N/A"}}]
[null,null,{"$f":"VLOOKUP(B1637,DATA!A:B,2,0)","v":{"$error":"#N/A"}}]
[null,null,{"$f":"VLOOKUP(B1638,DATA!A:B,2,0)","v":{"$error":"#N/A"}}]
[null,null,{"$f":"VLOOKUP(B1639,DATA!A:B,2,0)","v":{"$error":"#N/A"}}]
[null,null,{"$f":"VLOOKUP(B1640,DATA!A:B,2,0)","v":{"$error":"#N/A"}}]
[null,null,{"$f":"VLOOKUP(B1641,DATA!A:B,2,0)","v":{"$error":"#N/A"}}]
[null,null,{"$f":"VLOOKUP(B1642,DATA!A:B,2,0)","v":{"$error":"#N/A"}}]
[null,null,{"$f":"VLOOKUP(B1643,DATA!A:B,2,0)","v":{"$error":"#N/A"}}]
[null,null,{"$f":"VLOOKUP(B1644,DATA!A:B,2,0)","v":{"$error":"#N/A"}}]
[null,null,{"$f":"VLOOKUP(B1645,DATA!A:B,2,0)","v":{"$error":"#N/A"}}]
[null,null,{"$f":"VLOOKUP(B1646,DATA!A:B,2,0)","v":{"$error":"#N/A"}}]
[null,null,{"$f":"VLOOKUP(B1647,DATA!A:B,2,0)","v":{"$error":"#N/A"}}]
[null,null,{"$f":"VLOOKUP(B1648,DATA!A:B,2,0)","v":{"$error":"#N/A"}}]
[null,null,{"$f":"VLOOKUP(B1649,DATA!A:B,2,0)","v":{"$error":"#N/A"}}]
[null,null,{"$f":"VLOOKUP(B1650,DATA!A:B,2,0)","v":{"$error":"#N/A"}}]
[null,null,{"$f":"VLOOKUP(B1651,DATA!A:B,2,0)","v":{"$error":"#N/A"}}]
[null,null,{"$f":"VLOOKUP(B1652,DATA!A:B,2,0)","v":{"$error":"#N/A"}}]
[null,null,{"$f":"VLOOKUP(B1653,DATA!A:B,2,0)","v":{"$error":"#N/A"}}]
[null,null,{"$f":"VLOOKUP(B1654,DATA!A:B,2,0)","v":{"$error":"#N/A"}}]
[null,null,{"$f":"VLOOKUP(B1655,DATA!A:B,2,0)","v":{"$error":"#N/A"}}]
[null,null,{"$f":"VLOOKUP(B1656,DATA!A:B,2,0)","v":{"$error":"#N/A"}}]
[null,null,{"$f":"VLOOKUP(B1657,DATA!A:B,2,0)","v":{"$error":"#N/A"}}]
[null,null,{"$f":"VLOOKUP(B1658,DATA!A:B,2,0)","v":{"$error":"#N/A"}}]
[null,null,{"$f":"VLOOKUP(B1659,DATA!A:B,2,0)","v":{"$error":"#N/A"}}]
[null,null,{"$f":"VLOOKUP(B1660,DATA!A:B,2,0)","v":{"$error":"#N/A"}}]
[null,null,{"$f":"VLOOKUP(B1661,DATA!A:B,2,0)","v":{"$error":"#N/A"}}]
[null,null,{"$f":"VLOOKUP(B1662,DATA!A:B,2,0)","v":{"$error":"#N/A"}}]
[null,null,{"$f":"VLOOKUP(B1663,DATA!A:B,2,0)","v":{"$error":"#N/A"}}]
[null,null,{"$f":"VLOOKUP(B1664,DATA!A:B,2,0)","v":{"$error":"#N/A"}}]
[null,null,{"$f":"VLOOKUP(B1665,DATA!A:B,2,0)","v":{"$error":"#N/A"}}]
[null,null,{"$f":"VLOOKUP(B1666,DATA!A:B,2,0)","v":{"$error":"#N/A"}}]
[null,null,{"$f":"VLOOKUP(B1667,DATA!A:B,2,0)","v":{"$error":"#N/A"}}]
[null,null,{"$f":"VLOOKUP(B1668,DATA!A:B,2,0)","v":{"$error":"#N/A"}}]
[null,null,{"$f":"VLOOKUP(B1669,DATA!A:B,2,0)","v":{"$error":"#N/A"}}]
[null,null,{"$f":"VLOOKUP(B1670,DATA!A:B,2,0)","v":{"$error":"#N/A"}}]
[null,null,{"$f":"VLOOKUP(B1671,DATA!A:B,2,0)","v":{"$error":"#N/A"}}]
[null,null,{"$f":"VLOOKUP(B1672,DATA!A:B,2,0)","v":{"$error":"#N/A"}}]
[null,null,{"$f":"VLOOKUP(B1673,DATA!A:B,2,0)","v":{"$error":"#N/A"}}]
[null,null,{"$f":"VLOOKUP(B1674,DATA!A:B,2,0)","v":{"$error":"#N/A"}}]
[null,null,{"$f":"VLOOKUP(B1675,DATA!A:B,2,0)","v":{"$error":"#N/A"}}]
[null,null,{"$f":"VLOOKUP(B1676,DATA!A:B,2,0)","v":{"$error":"#N/A"}}]
[null,null,{"$f":"VLOOKUP(B1677,DATA!A:B,2,0)","v":{"$error":"#N/A"}}]
[null,null,{"$f":"VLOOKUP(B1678,DATA!A:B,2,0)","v":{"$error":"#N/A"}}]
[null,null,{"$f":"VLOOKUP(B1679,DATA!A:B,2,0)","v":{"$error":"#N/A"}}]
[null,null,{"$f":"VLOOKUP(B1680,DATA!A:B,2,0)","v":{"$error":"#N/A"}}]
[null,null,{"$f":"VLOOKUP(B1681,DATA!A:B,2,0)","v":{"$error":"#N/A"}}]
[null,null,{"$f":"VLOOKUP(B1682,DATA!A:B,2,0)","v":{"$error":"#N/A"}}]
[null,null,{"$f":"VLOOKUP(B1683,DATA!A:B,2,0)","v":{"$error":"#N/A"}}]
[null,null,{"$f":"VLOOKUP(B1684,DATA!A:B,2,0)","v":{"$error":"#N/A"}}]
[null,null,{"$f":"VLOOKUP(B1685,DATA!A:B,2,0)","v":{"$error":"#N/A"}}]
[null,null,{"$f":"VLOOKUP(B1686,DATA!A:B,2,0)","v":{"$error":"#N/A"}}]
[null,null,{"$f":"VLOOKUP(B1687,DATA!A:B,2,0)","v":{"$error":"#N/A"}}]
[null,null,{"$f":"VLOOKUP(B1688,DATA!A:B,2,0)","v":{"$error":"#N/A"}}]
[null,null,{"$f":"VLOOKUP(B1689,DATA!A:B,2,0)","v":{"$error":"#N/A"}}]
[null,null,{"$f":"VLOOKUP(B1690,DATA!A:B,2,0)","v":{"$error":"#N/A"}}]
[null,null,{"$f":"VLOOKUP(B1691,DATA!A:B,2,0)","v":{"$error":"#N/A"}}]
[null,null,{"$f":"VLOOKUP(B1692,DATA!A:B,2,0)","v":{"$error":"#N/A"}}]
[null,null,{"$f":"VLOOKUP(B1693,DATA!A:B,2,0)","v":{"$error":"#N/A"}}]
[null,null,{"$f":"VLOOKUP(B1694,DATA!A:B,2,0)","v":{"$error":"#N/A"}}]
[null,null,{"$f":"VLOOKUP(B1695,DATA!A:B,2,0)","v":{"$error":"#N/A"}}]
[null,null,{"$f":"VLOOKUP(B1696,DATA!A:B,2,0)","v":{"$error":"#N/A"}}]
[null,null,{"$f":"VLOOKUP(B1697,DATA!A:B,2,0)","v":{"$error":"#N/A"}}]
[null,null,{"$f":"VLOOKUP(B1698,DATA!A:B,2,0)","v":{"$error":"#N/A"}}]
[null,null,{"$f":"VLOOKUP(B1699,DATA!A:B,2,0)","v":{"$error":"#N/A"}}]
[null,null,{"$f":"VLOOKUP(B1700,DATA!A:B,2,0)","v":{"$error":"#N/A"}}]
[null,null,{"$f":"VLOOKUP(B1701,DATA!A:B,2,0)","v":{"$error":"#N/A"}}]
[null,null,{"$f":"VLOOKUP(B1702,DATA!A:B,2,0)","v":{"$error":"#N/A"}}]
[null,null,{"$f":"VLOOKUP(B1703,DATA!A:B,2,0)","v":{"$error":"#N/A"}}]
[null,null,{"$f":"VLOOKUP(B1704,DATA!A:B,2,0)","v":{"$error":"#N/A"}}]
[null,null,{"$f":"VLOOKUP(B1705,DATA!A:B,2,0)","v":{"$error":"#N/A"}}]
[null,null,{"$f":"VLOOKUP(B1706,DATA!A:B,2,0)","v":{"$error":"#N/A"}}]
[null,null,{"$f":"VLOOKUP(B1707,DATA!A:B,2,0)","v":{"$error":"#N/A"}}]
[null,null,{"$f":"VLOOKUP(B1708,DATA!A:B,2,0)","v":{"$error":"#N/A"}}]
[null,null,{"$f":"VLOOKUP(B1709,DATA!A:B,2,0)","v":{"$error":"#N/A"}}]
[null,null,{"$f":"VLOOKUP(B1710,DATA!A:B,2,0)","v":{"$error":"#N/A"}}]
[null,null,{"$f":"VLOOKUP(B1711,DATA!A:B,2,0)","v":{"$error":"#N/A"}}]
[null,null,{"$f":"VLOOKUP(B1712,DATA!A:B,2,0)","v":{"$error":"#N/A"}}]
[null,null,{"$f":"VLOOKUP(B1713,DATA!A:B,2,0)","v":{"$error":"#N/A"}}]
[null,null,{"$f":"VLOOKUP(B1714,DATA!A:B,2,0)","v":{"$error":"#N/A"}}]
[null,null,{"$f":"VLOOKUP(B1715,DATA!A:B,2,0)","v":{"$error":"#N/A"}}]
[null,null,{"$f":"VLOOKUP(B1716,DATA!A:B,2,0)","v":{"$error":"#N/A"}}]
[null,null,{"$f":"VLOOKUP(B1717,DATA!A:B,2,0)","v":{"$error":"#N/A"}}]
[null,null,{"$f":"VLOOKUP(B1718,DATA!A:B,2,0)","v":{"$error":"#N/A"}}]
[null,null,{"$f":"VLOOKUP(B1719,DATA!A:B,2,0)","v":{"$error":"#N/A"}}]
[null,null,{"$f":"VLOOKUP(B1720,DATA!A:B,2,0)","v":{"$error":"#N/A"}}]
[null,null,{"$f":"VLOOKUP(B1721,DATA!A:B,2,0)","v":{"$error":"#N/A"}}]
[null,null,{"$f":"VLOOKUP(B1722,DATA!A:B,2,0)","v":{"$error":"#N/A"}}]
[null,null,{"$f":"VLOOKUP(B1723,DATA!A:B,2,0)","v":{"$error":"#N/A"}}]
[null,null,{"$f":"VLOOKUP(B1724,DATA!A:B,2,0)","v":{"$error":"#N/A"}}]
[null,null,{"$f":"VLOOKUP(B1725,DATA!A:B,2,0)","v":{"$error":"#N/A"}}]
[null,null,{"$f":"VLOOKUP(B1726,DATA!A:B,2,0)","v":{"$error":"#N/A"}}]
[null,null,{"$f":"VLOOKUP(B1727,DATA!A:B,2,0)","v":{"$error":"#N/A"}}]
[null,null,{"$f":"VLOOKUP(B1728,DATA!A:B,2,0)","v":{"$error":"#N/A"}}]
[null,null,{"$f":"VLOOKUP(B1729,DATA!A:B,2,0)","v":{"$error":"#N/A"}}]
[null,null,{"$f":"VLOOKUP(B1730,DATA!A:B,2,0)","v":{"$error":"#N/A"}}]
[null,null,{"$f":"VLOOKUP(B1731,DATA!A:B,2,0)","v":{"$error":"#N/A"}}]
[null,null,{"$f":"VLOOKUP(B1732,DATA!A:B,2,0)","v":{"$error":"#N/A"}}]
[null,null,{"$f":"VLOOKUP(B1733,DATA!A:B,2,0)","v":{"$error":"#N/A"}}]
[null,null,{"$f":"VLOOKUP(B1734,DATA!A:B,2,0)","v":{"$error":"#N/A"}}]
[null,null,{"$f":"VLOOKUP(B1735,DATA!A:B,2,0)","v":{"$error":"#N/A"}}]
[null,null,{"$f":"VLOOKUP(B1736,DATA!A:B,2,0)","v":{"$error":"#N/A"}}]
[null,null,{"$f":"VLOOKUP(B1737,DATA!A:B,2,0)","v":{"$error":"#N/A"}}]
[null,null,{"$f":"VLOOKUP(B1738,DATA!A:B,2,0)","v":{"$error":"#N/A"}}]
[null,null,{"$f":"VLOOKUP(B1739,DATA!A:B,2,0)","v":{"$error":"#N/A"}}]
[null,null,{"$f":"VLOOKUP(B1740,DATA!A:B,2,0)","v":{"$error":"#N/A"}}]
[null,null,{"$f":"VLOOKUP(B1741,DATA!A:B,2,0)","v":{"$error":"#N/A"}}]
[null,null,{"$f":"VLOOKUP(B1742,DATA!A:B,2,0)","v":{"$error":"#N/A"}}]
[null,null,{"$f":"VLOOKUP(B1743,DATA!A:B,2,0)","v":{"$error":"#N/A"}}]
[null,null,{"$f":"VLOOKUP(B1744,DATA!A:B,2,0)","v":{"$error":"#N/A"}}]
[null,null,{"$f":"VLOOKUP(B1745,DATA!A:B,2,0)","v":{"$error":"#N/A"}}]
[null,null,{"$f":"VLOOKUP(B1746,DATA!A:B,2,0)","v":{"$error":"#N/A"}}]
[null,null,{"$f":"VLOOKUP(B1747,DATA!A:B,2,0)","v":{"$error":"#N/A"}}]
[null,null,{"$f":"VLOOKUP(B1748,DATA!A:B,2,0)","v":{"$error":"#N/A"}}]
[null,null,{"$f":"VLOOKUP(B1749,DATA!A:B,2,0)","v":{"$error":"#N/A"}}]
[null,null,{"$f":"VLOOKUP(B1750,DATA!A:B,2,0)","v":{"$error":"#N/A"}}]
[null,null,{"$f":"VLOOKUP(B1751,DATA!A:B,2,0)","v":{"$error":"#N/A"}}]
[null,null,{"$f":"VLOOKUP(B1752,DATA!A:B,2,0)","v":{"$error":"#N/A"}}]
[null,null,{"$f":"VLOOKUP(B1753,DATA!A:B,2,0)","v":{"$error":"#N/A"}}]
[null,null,{"$f":"VLOOKUP(B1754,DATA!A:B,2,0)","v":{"$error":"#N/A"}}]
[null,null,{"$f":"VLOOKUP(B1755,DATA!A:B,2,0)","v":{"$error":"#N/A"}}]
[null,null,{"$f":"VLOOKUP(B1756,DATA!A:B,2,0)","v":{"$error":"#N/A"}}]
[null,null,{"$f":"VLOOKUP(B1757,DATA!A:B,2,0)","v":{"$error":"#N/A"}}]
[null,null,{"$f":"VLOOKUP(B1758,DATA!A:B,2,0)","v":{"$error":"#N/A"}}]
[null,null,{"$f":"VLOOKUP(B1759,DATA!A:B,2,0)","v":{"$error":"#N/A"}}]
[null,null,{"$f":"VLOOKUP(B1760,DATA!A:B,2,0)","v":{"$error":"#N/A"}}]
[null,null,{"$f":"VLOOKUP(B1761,DATA!A:B,2,0)","v":{"$error":"#N/A"}}]
[null,null,{"$f":"VLOOKUP(B1762,DATA!A:B,2,0)","v":{"$error":"#N/A"}}]
[null,null,{"$f":"VLOOKUP(B1763,DATA!A:B,2,0)","v":{"$error":"#N/A"}}]
[null,null,{"$f":"VLOOKUP(B1764,DATA!A:B,2,0)","v":{"$error":"#N/A"}}]
[null,null,{"$f":"VLOOKUP(B1765,DATA!A:B,2,0)","v":{"$error":"#N/A"}}]
[null,null,{"$f":"VLOOKUP(B1766,DATA!A:B,2,0)","v":{"$error":"#N/A"}}]
[null,null,{"$f":"VLOOKUP(B1767,DATA!A:B,2,0)","v":{"$error":"#N/A"}}]
[null,null,{"$f":"VLOOKUP(B1768,DATA!A:B,2,0)","v":{"$error":"#N/A"}}]
[null,null,{"$f":"VLOOKUP(B1769,DATA!A:B,2,0)","v":{"$error":"#N/A"}}]
[null,null,{"$f":"VLOOKUP(B1770,DATA!A:B,2,0)","v":{"$error":"#N/A"}}]
[null,null,{"$f":"VLOOKUP(B1771,DATA!A:B,2,0)","v":{"$error":"#N/A"}}]
[null,null,{"$f":"VLOOKUP(B1772,DATA!A:B,2,0)","v":{"$error":"#N/A"}}]
[null,null,{"$f":"VLOOKUP(B1773,DATA!A:B,2,0)","v":{"$error":"#N/A"}}]
[null,null,{"$f":"VLOOKUP(B1774,DATA!A:B,2,0)","v":{"$error":"#N/A"}}]
[null,null,{"$f":"VLOOKUP(B1775,DATA!A:B,2,0)","v":{"$error":"#N/A"}}]
[null,null,{"$f":"VLOOKUP(B1776,DATA!A:B,2,0)","v":{"$error":"#N/A"}}]
[null,null,{"$f":"VLOOKUP(B1777,DATA!A:B,2,0)","v":{"$error":"#N/A"}}]
[null,null,{"$f":"VLOOKUP(B1778,DATA!A:B,2,0)","v":{"$error":"#N/A"}}]
[null,null,{"$f":"VLOOKUP(B1779,DATA!A:B,2,0)","v":{"$error":"#N/A"}}]
[null,null,{"$f":"VLOOKUP(B1780,DATA!A:B,2,0)","v":{"$error":"#N/A"}}]
[null,null,{"$f":"VLOOKUP(B1781,DATA!A:B,2,0)","v":{"$error":"#N/A"}}]
[null,null,{"$f":"VLOOKUP(B1782,DATA!A:B,2,0)","v":{"$error":"#N/A"}}]
[null,null,{"$f":"VLOOKUP(B1783,DATA!A:B,2,0)","v":{"$error":"#N/A"}}]
[null,null,{"$f":"VLOOKUP(B1784,DATA!A:B,2,0)","v":{"$error":"#N/A"}}]
[null,null,{"$f":"VLOOKUP(B1785,DATA!A:B,2,0)","v":{"$error":"#N/A"}}]
[null,null,{"$f":"VLOOKUP(B1786,DATA!A:B,2,0)","v":{"$error":"#N/A"}}]
[null,null,{"$f":"VLOOKUP(B1787,DATA!A:B,2,0)","v":{"$error":"#N/A"}}]
[null,null,{"$f":"VLOOKUP(B1788,DATA!A:B,2,0)","v":{"$error":"#N/A"}}]
[null,null,{"$f":"VLOOKUP(B1789,DATA!A:B,2,0)","v":{"$error":"#N/A"}}]
[null,null,{"$f":"VLOOKUP(B1790,DATA!A:B,2,0)","v":{"$error":"#N/A"}}]
[null,null,{"$f":"VLOOKUP(B1791,DATA!A:B,2,0)","v":{"$error":"#N/A"}}]
[null,null,{"$f":"VLOOKUP(B1792,DATA!A:B,2,0)","v":{"$error":"#N/A"}}]
[null,null,{"$f":"VLOOKUP(B1793,DATA!A:B,2,0)","v":{"$error":"#N/A"}}]
[null,null,{"$f":"VLOOKUP(B1794,DATA!A:B,2,0)","v":{"$error":"#N/A"}}]
[null,null,{"$f":"VLOOKUP(B1795,DATA!A:B,2,0)","v":{"$error":"#N/A"}}]
[null,null,{"$f":"VLOOKUP(B1796,DATA!A:B,2,0)","v":{"$error":"#N/A"}}]
[null,null,{"$f":"VLOOKUP(B1797,DATA!A:B,2,0)","v":{"$error":"#N/A"}}]
[null,null,{"$f":"VLOOKUP(B1798,DATA!A:B,2,0)","v":{"$error":"#N/A"}}]
[null,null,{"$f":"VLOOKUP(B1799,DATA!A:B,2,0)","v":{"$error":"#N/A"}}]
[null,null,{"$f":"VLOOKUP(B1800,DATA!A:B,2,0)","v":{"$error":"#N/A"}}]
[null,null,{"$f":"VLOOKUP(B1801,DATA!A:B,2,0)","v":{"$error":"#N/A"}}]
[null,null,{"$f":"VLOOKUP(B1802,DATA!A:B,2,0)","v":{"$error":"#N/A"}}]
[null,null,{"$f":"VLOOKUP(B1803,DATA!A:B,2,0)","v":{"$error":"#N/A"}}]
[null,null,{"$f":"VLOOKUP(B1804,DATA!A:B,2,0)","v":{"$error":"#N/A"}}]
[null,null,{"$f":"VLOOKUP(B1805,DATA!A:B,2,0)","v":{"$error":"#N/A"}}]
[null,null,{"$f":"VLOOKUP(B1806,DATA!A:B,2,0)","v":{"$error":"#N/A"}}]
[null,null,{"$f":"VLOOKUP(B1807,DATA!A:B,2,0)","v":{"$error":"#N/A"}}]
[null,null,{"$f":"VLOOKUP(B1808,DATA!A:B,2,0)","v":{"$error":"#N/A"}}]
[null,null,{"$f":"VLOOKUP(B1809,DATA!A:B,2,0)","v":{"$error":"#N/A"}}]
[null,null,{"$f":"VLOOKUP(B1810,DATA!A:B,2,0)","v":{"$error":"#N/A"}}]
[null,null,{"$f":"VLOOKUP(B1811,DATA!A:B,2,0)","v":{"$error":"#N/A"}}]
[null,null,{"$f":"VLOOKUP(B1812,DATA!A:B,2,0)","v":{"$error":"#N/A"}}]
[null,null,{"$f":"VLOOKUP(B1813,DATA!A:B,2,0)","v":{"$error":"#N/A"}}]
[null,null,{"$f":"VLOOKUP(B1814,DATA!A:B,2,0)","v":{"$error":"#N/A"}}]
[null,null,{"$f":"VLOOKUP(B1815,DATA!A:B,2,0)","v":{"$error":"#N/A"}}]
[null,null,{"$f":"VLOOKUP(B1816,DATA!A:B,2,0)","v":{"$error":"#N/A"}}]
[null,null,{"$f":"VLOOKUP(B1817,DATA!A:B,2,0)","v":{"$error":"#N/A"}}]
[null,null,{"$f":"VLOOKUP(B1818,DATA!A:B,2,0)","v":{"$error":"#N/A"}}]
[null,null,{"$f":"VLOOKUP(B1819,DATA!A:B,2,0)","v":{"$error":"#N/A"}}]
[null,null,{"$f":"VLOOKUP(B1820,DATA!A:B,2,0)","v":{"$error":"#N/A"}}]
[null,null,{"$f":"VLOOKUP(B1821,DATA!A:B,2,0)","v":{"$error":"#N/A"}}]
[null,null,{"$f":"VLOOKUP(B1822,DATA!A:B,2,0)","v":{"$error":"#N/A"}}]
[null,null,{"$f":"VLOOKUP(B1823,DATA!A:B,2,0)","v":{"$error":"#N/A"}}]
[null,null,{"$f":"VLOOKUP(B1824,DATA!A:B,2,0)","v":{"$error":"#N/A"}}]
[null,null,{"$f":"VLOOKUP(B1825,DATA!A:B,2,0)","v":{"$error":"#N/A"}}]
[null,null,{"$f":"VLOOKUP(B1826,DATA!A:B,2,0)","v":{"$error":"#N/A"}}]
[null,null,{"$f":"VLOOKUP(B1827,DATA!A:B,2,0)","v":{"$error":"#N/A"}}]
[null,null,{"$f":"VLOOKUP(B1828,DATA!A:B,2,0)","v":{"$error":"#N/A"}}]
[null,null,{"$f":"VLOOKUP(B1829,DATA!A:B,2,0)","v":{"$error":"#N/A"}}]
[null,null,{"$f":"VLOOKUP(B1830,DATA!A:B,2,0)","v":{"$error":"#N/A"}}]
[null,null,{"$f":"VLOOKUP(B1831,DATA!A:B,2,0)","v":{"$error":"#N/A"}}]
[null,null,{"$f":"VLOOKUP(B1832,DATA!A:B,2,0)","v":{"$error":"#N/A"}}]
[null,null,{"$f":"VLOOKUP(B1833,DATA!A:B,2,0)","v":{"$error":"#N/A"}}]
[null,null,{"$f":"VLOOKUP(B1834,DATA!A:B,2,0)","v":{"$error":"#N/A"}}]
[null,null,{"$f":"VLOOKUP(B1835,DATA!A:B,2,0)","v":{"$error":"#N/A"}}]
[null,null,{"$f":"VLOOKUP(B1836,DATA!A:B,2,0)","v":{"$error":"#N/A"}}]
[null,null,{"$f":"VLOOKUP(B1837,DATA!A:B,2,0)","v":{"$error":"#N/A"}}]
[null,null,{"$f":"VLOOKUP(B1838,DATA!A:B,2,0)","v":{"$error":"#N/A"}}]
[null,null,{"$f":"VLOOKUP(B1839,DATA!A:B,2,0)","v":{"$error":"#N/A"}}]
[null,null,{"$f":"VLOOKUP(B1840,DATA!A:B,2,0)","v":{"$error":"#N/A"}}]
[null,null,{"$f":"VLOOKUP(B1841,DATA!A:B,2,0)","v":{"$error":"#N/A"}}]
[null,null,{"$f":"VLOOKUP(B1842,DATA!A:B,2,0)","v":{"$error":"#N/A"}}]
[null,null,{"$f":"VLOOKUP(B1843,DATA!A:B,2,0)","v":{"$error":"#N/A"}}]
[null,null,{"$f":"VLOOKUP(B1844,DATA!A:B,2,0)","v":{"$error":"#N/A"}}]
[null,null,{"$f":"VLOOKUP(B1845,DATA!A:B,2,0)","v":{"$error":"#N/A"}}]
[null,null,{"$f":"VLOOKUP(B1846,DATA!A:B,2,0)","v":{"$error":"#N/A"}}]
[null,null,{"$f":"VLOOKUP(B1847,DATA!A:B,2,0)","v":{"$error":"#N/A"}}]
[null,null,{"$f":"VLOOKUP(B1848,DATA!A:B,2,0)","v":{"$error":"#N/A"}}]
[null,null,{"$f":"VLOOKUP(B1849,DATA!A:B,2,0)","v":{"$error":"#N/A"}}]
[null,null,{"$f":"VLOOKUP(B1850,DATA!A:B,2,0)","v":{"$error":"#N/A"}}]
[null,null,{"$f":"VLOOKUP(B1851,DATA!A:B,2,0)","v":{"$error":"#N/A"}}]
[null,null,{"$f":"VLOOKUP(B1852,DATA!A:B,2,0)","v":{"$error":"#N/A"}}]
[null,null,{"$f":"VLOOKUP(B1853,DATA!A:B,2,0)","v":{"$error":"#N/A"}}]
[null,null,{"$f":"VLOOKUP(B1854,DATA!A:B,2,0)","v":{"$error":"#N/A"}}]
[null,null,{"$f":"VLOOKUP(B1855,DATA!A:B,2,0)","v":{"$error":"#N/A"}}]
[null,null,{"$f":"VLOOKUP(B1856,DATA!A:B,2,0)","v":{"$error":"#N/A"}}]
[null,null,{"$f":"VLOOKUP(B1857,DATA!A:B,2,0)","v":{"$error":"#N/A"}}]
[null,null,{"$f":"VLOOKUP(B1858,DATA!A:B,2,0)","v":{"$error":"#N/A"}}]
[null,null,{"$f":"VLOOKUP(B1859,DATA!A:B,2,0)","v":{"$error":"#N/A"}}]
[null,null,{"$f":"VLOOKUP(B1860,DATA!A:B,2,0)","v":{"$error":"#N/A"}}]
[null,null,{"$f":"VLOOKUP(B1861,DATA!A:B,2,0)","v":{"$error":"#N/A"}}]
[null,null,{"$f":"VLOOKUP(B1862,DATA!A:B,2,0)","v":{"$error":"#N/A"}}]
[null,null,{"$f":"VLOOKUP(B1863,DATA!A:B,2,0)","v":{"$error":"#N/A"}}]
[null,null,{"$f":"VLOOKUP(B1864,DATA!A:B,2,0)","v":{"$error":"#N/A"}}]
[null,null,{"$f":"VLOOKUP(B1865,DATA!A:B,2,0)","v":{"$error":"#N/A"}}]
[null,null,{"$f":"VLOOKUP(B1866,DATA!A:B,2,0)","v":{"$error":"#N/A"}}]
[null,null,{"$f":"VLOOKUP(B1867,DATA!A:B,2,0)","v":{"$error":"#N/A"}}]
[null,null,{"$f":"VLOOKUP(B1868,DATA!A:B,2,0)","v":{"$error":"#N/A"}}]
[null,null,{"$f":"VLOOKUP(B1869,DATA!A:B,2,0)","v":{"$error":"#N/A"}}]
[null,null,{"$f":"VLOOKUP(B1870,DATA!A:B,2,0)","v":{"$error":"#N/A"}}]
[null,null,{"$f":"VLOOKUP(B1871,DATA!A:B,2,0)","v":{"$error":"#N/A"}}]
[null,null,{"$f":"VLOOKUP(B1872,DATA!A:B,2,0)","v":{"$error":"#N/A"}}]
[null,null,{"$f":"VLOOKUP(B1873,DATA!A:B,2,0)","v":{"$error":"#N/A"}}]
[null,null,{"$f":"VLOOKUP(B1874,DATA!A:B,2,0)","v":{"$error":"#N/A"}}]
[null,null,{"$f":"VLOOKUP(B1875,DATA!A:B,2,0)","v":{"$error":"#N/A"}}]
[null,null,{"$f":"VLOOKUP(B1876,DATA!A:B,2,0)","v":{"$error":"#N/A"}}]
[null,null,{"$f":"VLOOKUP(B1877,DATA!A:B,2,0)","v":{"$error":"#N/A"}}]
[null,null,{"$f":"VLOOKUP(B1878,DATA!A:B,2,0)","v":{"$error":"#N/A"}}]
[null,null,{"$f":"VLOOKUP(B1879,DATA!A:B,2,0)","v":{"$error":"#N/A"}}]
[null,null,{"$f":"VLOOKUP(B1880,DATA!A:B,2,0)","v":{"$error":"#N/A"}}]
[null,null,{"$f":"VLOOKUP(B1881,DATA!A:B,2,0)","v":{"$error":"#N/A"}}]
[null,null,{"$f":"VLOOKUP(B1882,DATA!A:B,2,0)","v":{"$error":"#N/A"}}]
[null,null,{"$f":"VLOOKUP(B1883,DATA!A:B,2,0)","v":{"$error":"#N/A"}}]
[null,null,{"$f":"VLOOKUP(B1884,DATA!A:B,2,0)","v":{"$error":"#N/A"}}]
[null,null,{"$f":"VLOOKUP(B1885,DATA!A:B,2,0)","v":{"$error":"#N/A"}}]
[null,null,{"$f":"VLOOKUP(B1886,DATA!A:B,2,0)","v":{"$error":"#N/A"}}]
[null,null,{"$f":"VLOOKUP(B1887,DATA!A:B,2,0)","v":{"$error":"#N/A"}}]
[null,null,{"$f":"VLOOKUP(B1888,DATA!A:B,2,0)","v":{"$error":"#N/A"}}]
[null,null,{"$f":"VLOOKUP(B1889,DATA!A:B,2,0)","v":{"$error":"#N/A"}}]
[null,null,{"$f":"VLOOKUP(B1890,DATA!A:B,2,0)","v":{"$error":"#N/A"}}]
[null,null,{"$f":"VLOOKUP(B1891,DATA!A:B,2,0)","v":{"$error":"#N/A"}}]
[null,null,{"$f":"VLOOKUP(B1892,DATA!A:B,2,0)","v":{"$error":"#N/A"}}]
[null,null,{"$f":"VLOOKUP(B1893,DATA!A:B,2,0)","v":{"$error":"#N/A"}}]
[null,null,{"$f":"VLOOKUP(B1894,DATA!A:B,2,0)","v":{"$error":"#N/A"}}]
[null,null,{"$f":"VLOOKUP(B1895,DATA!A:B,2,0)","v":{"$error":"#N/A"}}]
[null,null,{"$f":"VLOOKUP(B1896,DATA!A:B,2,0)","v":{"$error":"#N/A"}}]
[null,null,{"$f":"VLOOKUP(B1897,DATA!A:B,2,0)","v":{"$error":"#N/A"}}]
[null,null,{"$f":"VLOOKUP(B1898,DATA!A:B,2,0)","v":{"$error":"#N/A"}}]
[null,null,{"$f":"VLOOKUP(B1899,DATA!A:B,2,0)","v":{"$error":"#N/A"}}]
[null,null,{"$f":"VLOOKUP(B1900,DATA!A:B,2,0)","v":{"$error":"#N/A"}}]
[null,null,{"$f":"VLOOKUP(B1901,DATA!A:B,2,0)","v":{"$error":"#N/A"}}]
[null,null,{"$f":"VLOOKUP(B1902,DATA!A:B,2,0)","v":{"$error":"#N/A"}}]
[null,null,{"$f":"VLOOKUP(B1903,DATA!A:B,2,0)","v":{"$error":"#N/A"}}]
[null,null,{"$f":"VLOOKUP(B1904,DATA!A:B,2,0)","v":{"$error":"#N/A"}}]
[null,null,{"$f":"VLOOKUP(B1905,DATA!A:B,2,0)","v":{"$error":"#N/A"}}]
[null,null,{"$f":"VLOOKUP(B1906,DATA!A:B,2,0)","v":{"$error":"#N/A"}}]
[null,null,{"$f":"VLOOKUP(B1907,DATA!A:B,2,0)","v":{"$error":"#N/A"}}]
[null,null,{"$f":"VLOOKUP(B1908,DATA!A:B,2,0)","v":{"$error":"#N/A"}}]
[null,null,{"$f":"VLOOKUP(B1909,DATA!A:B,2,0)","v":{"$error":"#N/A"}}]
[null,null,{"$f":"VLOOKUP(B1910,DATA!A:B,2,0)","v":{"$error":"#N/A"}}]
[null,null,{"$f":"VLOOKUP(B1911,DATA!A:B,2,0)","v":{"$error":"#N/A"}}]
[null,null,{"$f":"VLOOKUP(B1912,DATA!A:B,2,0)","v":{"$error":"#N/A"}}]
[null,null,{"$f":"VLOOKUP(B1913,DATA!A:B,2,0)","v":{"$error":"#N/A"}}]
[null,null,{"$f":"VLOOKUP(B1914,DATA!A:B,2,0)","v":{"$error":"#N/A"}}]
[null,null,{"$f":"VLOOKUP(B1915,DATA!A:B,2,0)","v":{"$error":"#N/A"}}]
[null,null,{"$f":"VLOOKUP(B1916,DATA!A:B,2,0)","v":{"$error":"#N/A"}}]
[null,null,{"$f":"VLOOKUP(B1917,DATA!A:B,2,0)","v":{"$error":"#N/A"}}]
[null,null,{"$f":"VLOOKUP(B1918,DATA!A:B,2,0)","v":{"$error":"#N/A"}}]
[null,null,{"$f":"VLOOKUP(B1919,DATA!A:B,2,0)","v":{"$error":"#N/A"}}]
[null,null,{"$f":"VLOOKUP(B1920,DATA!A:B,2,0)","v":{"$error":"#N/A"}}]
[null,null,{"$f":"VLOOKUP(B1921,DATA!A:B,2,0)","v":{"$error":"#N/A"}}]
[null,null,{"$f":"VLOOKUP(B1922,DATA!A:B,2,0)","v":{"$error":"#N/A"}}]
[null,null,{"$f":"VLOOKUP(B1923,DATA!A:B,2,0)","v":{"$error":"#N/A"}}]
[null,null,{"$f":"VLOOKUP(B1924,DATA!A:B,2,0)","v":{"$error":"#N/A"}}]
[null,null,{"$f":"VLOOKUP(B1925,DATA!A:B,2,0)","v":{"$error":"#N/A"}}]
[null,null,{"$f":"VLOOKUP(B1926,DATA!A:B,2,0)","v":{"$error":"#N/A"}}]
[null,null,{"$f":"VLOOKUP(B1927,DATA!A:B,2,0)","v":{"$error":"#N/A"}}]
[null,null,{"$f":"VLOOKUP(B1928,DATA!A:B,2,0)","v":{"$error":"#N/A"}}]
[null,null,{"$f":"VLOOKUP(B1929,DATA!A:B,2,0)","v":{"$error":"#N/A"}}]
[null,null,{"$f":"VLOOKUP(B1930,DATA!A:B,2,0)","v":{"$error":"#N/A"}}]
[null,null,{"$f":"VLOOKUP(B1931,DATA!A:B,2,0)","v":{"$error":"#N/A"}}]
[null,null,{"$f":"VLOOKUP(B1932,DATA!A:B,2,0)","v":{"$error":"#N/A"}}]
[null,null,{"$f":"VLOOKUP(B1933,DATA!A:B,2,0)","v":{"$error":"#N/A"}}]
[null,null,{"$f":"VLOOKUP(B1934,DATA!A:B,2,0)","v":{"$error":"#N/A"}}]
[null,null,{"$f":"VLOOKUP(B1935,DATA!A:B,2,0)","v":{"$error":"#N/A"}}]
[null,null,{"$f":"VLOOKUP(B1936,DATA!A:B,2,0)","v":{"$error":"#N/A"}}]
[null,null,{"$f":"VLOOKUP(B1937,DATA!A:B,2,0)","v":{"$error":"#N/A"}}]
[null,null,{"$f":"VLOOKUP(B1938,DATA!A:B,2,0)","v":{"$error":"#N/A"}}]
[null,null,{"$f":"VLOOKUP(B1939,DATA!A:B,2,0)","v":{"$error":"#N/A"}}]
[null,null,{"$f":"VLOOKUP(B1940,DATA!A:B,2,0)","v":{"$error":"#N/A"}}]
[null,null,{"$f":"VLOOKUP(B1941,DATA!A:B,2,0)","v":{"$error":"#N/A"}}]
[null,null,{"$f":"VLOOKUP(B1942,DATA!A:B,2,0)","v":{"$error":"#N/A"}}]
[null,null,{"$f":"VLOOKUP(B1943,DATA!A:B,2,0)","v":{"$error":"#N/A"}}]
[null,null,{"$f":"VLOOKUP(B1944,DATA!A:B,2,0)","v":{"$error":"#N/A"}}]
[null,null,{"$f":"VLOOKUP(B1945,DATA!A:B,2,0)","v":{"$error":"#N/A"}}]
[null,null,{"$f":"VLOOKUP(B1946,DATA!A:B,2,0)","v":{"$error":"#N/A"}}]
[null,null,{"$f":"VLOOKUP(B1947,DATA!A:B,2,0)","v":{"$error":"#N/A"}}]
[null,null,{"$f":"VLOOKUP(B1948,DATA!A:B,2,0)","v":{"$error":"#N/A"}}]
[null,null,{"$f":"VLOOKUP(B1949,DATA!A:B,2,0)","v":{"$error":"#N/A"}}]
[null,null,{"$f":"VLOOKUP(B1950,DATA!A:B,2,0)","v":{"$error":"#N/A"}}]
[null,null,{"$f":"VLOOKUP(B1951,DATA!A:B,2,0)","v":{"$error":"#N/A"}}]
[null,null,{"$f":"VLOOKUP(B1952,DATA!A:B,2,0)","v":{"$error":"#N/A"}}]
[null,null,{"$f":"VLOOKUP(B1953,DATA!A:B,2,0)","v":{"$error":"#N/A"}}]
[null,null,{"$f":"VLOOKUP(B1954,DATA!A:B,2,0)","v":{"$error":"#N/A"}}]
[null,null,{"$f":"VLOOKUP(B1955,DATA!A:B,2,0)","v":{"$error":"#N/A"}}]
[null,null,{"$f":"VLOOKUP(B1956,DATA!A:B,2,0)","v":{"$error":"#N/A"}}]
[null,null,{"$f":"VLOOKUP(B1957,DATA!A:B,2,0)","v":{"$error":"#N/A"}}]
[null,null,{"$f":"VLOOKUP(B1958,DATA!A:B,2,0)","v":{"$error":"#N/A"}}]
[null,null,{"$f":"VLOOKUP(B1959,DATA!A:B,2,0)","v":{"$error":"#N/A"}}]
[null,null,{"$f":"VLOOKUP(B1960,DATA!A:B,2,0)","v":{"$error":"#N/A"}}]
[null,null,{"$f":"VLOOKUP(B1961,DATA!A:B,2,0)","v":{"$error":"#N/A"}}]
[null,null,{"$f":"VLOOKUP(B1962,DATA!A:B,2,0)","v":{"$error":"#N/A"}}]
[null,null,{"$f":"VLOOKUP(B1963,DATA!A:B,2,0)","v":{"$error":"#N/A"}}]
[null,null,{"$f":"VLOOKUP(B1964,DATA!A:B,2,0)","v":{"$error":"#N/A"}}]
[null,null,{"$f":"VLOOKUP(B1965,DATA!A:B,2,0)","v":{"$error":"#N/A"}}]
[null,null,{"$f":"VLOOKUP(B1966,DATA!A:B,2,0)","v":{"$error":"#N/A"}}]
[null,null,{"$f":"VLOOKUP(B1967,DATA!A:B,2,0)","v":{"$error":"#N/A"}}]
[null,null,{"$f":"VLOOKUP(B1968,DATA!A:B,2,0)","v":{"$error":"#N/A"}}]
[null,null,{"$f":"VLOOKUP(B1969,DATA!A:B,2,0)","v":{"$error":"#N/A"}}]
[null,null,{"$f":"VLOOKUP(B1970,DATA!A:B,2,0)","v":{"$error":"#N/A"}}]
[null,null,{"$f":"VLOOKUP(B1971,DATA!A:B,2,0)","v":{"$error":"#N/A"}}]
[null,null,{"$f":"VLOOKUP(B1972,DATA!A:B,2,0)","v":{"$error":"#N/A"}}]
[null,null,{"$f":"VLOOKUP(B1973,DATA!A:B,2,0)","v":{"$error":"#N/A"}}]
[null,null,{"$f":"VLOOKUP(B1974,DATA!A:B,2,0)","v":{"$error":"#N/A"}}]
[null,null,{"$f":"VLOOKUP(B1975,DATA!A:B,2,0)","v":{"$error":"#N/A"}}]
[null,null,{"$f":"VLOOKUP(B1976,DATA!A:B,2,0)","v":{"$error":"#N/A"}}]
[null,null,{"$f":"VLOOKUP(B1977,DATA!A:B,2,0)","v":{"$error":"#N/A"}}]
[null,null,{"$f":"VLOOKUP(B1978,DATA!A:B,2,0)","v":{"$error":"#N/A"}}]
[null,null,{"$f":"VLOOKUP(B1979,DATA!A:B,2,0)","v":{"$error":"#N/A"}}]
[null,null,{"$f":"VLOOKUP(B1980,DATA!A:B,2,0)","v":{"$error":"#N/A"}}]
[null,null,{"$f":"VLOOKUP(B1981,DATA!A:B,2,0)","v":{"$error":"#N/A"}}]
[null,null,{"$f":"VLOOKUP(B1982,DATA!A:B,2,0)","v":{"$error":"#N/A"}}]
[null,null,{"$f":"VLOOKUP(B1983,DATA!A:B,2,0)","v":{"$error":"#N/A"}}]
[null,null,{"$f":"VLOOKUP(B1984,DATA!A:B,2,0)","v":{"$error":"#N/A"}}]
[null,null,{"$f":"VLOOKUP(B1985,DATA!A:B,2,0)","v":{"$error":"#N/A"}}]
[null,null,{"$f":"VLOOKUP(B1986,DATA!A:B,2,0)","v":{"$error":"#N/A"}}]