{"text_format":"1","workbook":"xlsx","n_sheets":4,"sheets":["salim","salim_macro","ورقة2","ورقة3"],"not_rendered":{"charts":0,"images":0,"macros":1,"external_links":0,"defined_names":0,"comments":0,"pivot_tables":0},"unopened":[],"bounds":{"document_bytes":16777216,"sheet_cells":100000,"rows_first":2000,"rows_last":500,"rows_between":2000,"halvings":0,"cell_chars":16384,"cell_head_chars":4096},"cells_cut":0,"cells_raw":0,"read":"whole","date_system":"1900"}

{"sheet":"salim","index":0,"n_rows":23,"n_cols":14,"rows_kept":23,"cut":false,"hidden":false,"merged":[]}
["J125956",null,"J123456 - علي - 1231",{"$f":"IF($A1=\"\",\"\",IF(COLUMNS($D$1:D1)>SUMPRODUCT(IF(ISNUMBER(SEARCH($A1,$C$1:$C$20)),1,0)),\"\",INDEX($C$1:$C$20,SMALL(IF(ISNUMBER(SEARCH($A1,$C$1:$C$20)),ROW($C$1:$C$20)-ROW($C$1)+1),COLUMNS($D$1:D1)))))","v":"J125956 - احمد - 1234"},{"$f":"IF($A1=\"\",\"\",IF(COLUMNS($D$1:E1)>SUMPRODUCT(IF(ISNUMBER(SEARCH($A1,$C$1:$C$20)),1,0)),\"\",INDEX($C$1:$C$20,SMALL(IF(ISNUMBER(SEARCH($A1,$C$1:$C$20)),ROW($C$1:$C$20)-ROW($C$1)+1),COLUMNS($D$1:E1)))))","v":"J125956 - مصطفى - 1235"},{"$f":"IF($A1=\"\",\"\",IF(COLUMNS($D$1:F1)>SUMPRODUCT(IF(ISNUMBER(SEARCH($A1,$C$1:$C$20)),1,0)),\"\",INDEX($C$1:$C$20,SMALL(IF(ISNUMBER(SEARCH($A1,$C$1:$C$20)),ROW($C$1:$C$20)-ROW($C$1)+1),COLUMNS($D$1:F1)))))","v":""},{"$f":"IF($A1=\"\",\"\",IF(COLUMNS($D$1:G1)>SUMPRODUCT(IF(ISNUMBER(SEARCH($A1,$C$1:$C$20)),1,0)),\"\",INDEX($C$1:$C$20,SMALL(IF(ISNUMBER(SEARCH($A1,$C$1:$C$20)),ROW($C$1:$C$20)-ROW($C$1)+1),COLUMNS($D$1:G1)))))","v":""},{"$f":"IF($A1=\"\",\"\",IF(COLUMNS($D$1:H1)>SUMPRODUCT(IF(ISNUMBER(SEARCH($A1,$C$1:$C$20)),1,0)),\"\",INDEX($C$1:$C$20,SMALL(IF(ISNUMBER(SEARCH($A1,$C$1:$C$20)),ROW($C$1:$C$20)-ROW($C$1)+1),COLUMNS($D$1:H1)))))","v":""},{"$f":"IF($A1=\"\",\"\",IF(COLUMNS($D$1:I1)>SUMPRODUCT(IF(ISNUMBER(SEARCH($A1,$C$1:$C$20)),1,0)),\"\",INDEX($C$1:$C$20,SMALL(IF(ISNUMBER(SEARCH($A1,$C$1:$C$20)),ROW($C$1:$C$20)-ROW($C$1)+1),COLUMNS($D$1:I1)))))","v":""},{"$f":"IF($A1=\"\",\"\",IF(COLUMNS($D$1:J1)>SUMPRODUCT(IF(ISNUMBER(SEARCH($A1,$C$1:$C$20)),1,0)),\"\",INDEX($C$1:$C$20,SMALL(IF(ISNUMBER(SEARCH($A1,$C$1:$C$20)),ROW($C$1:$C$20)-ROW($C$1)+1),COLUMNS($D$1:J1)))))","v":""}]
["J126556 ",null,"J126556 - محمد - 1232",{"$f":"IF($A2=\"\",\"\",IF(COLUMNS($D$1:D2)>SUMPRODUCT(IF(ISNUMBER(SEARCH($A2,$C$1:$C$20)),1,0)),\"\",INDEX($C$1:$C$20,SMALL(IF(ISNUMBER(SEARCH($A2,$C$1:$C$20)),ROW($C$1:$C$20)-ROW($C$1)+1),COLUMNS($D$1:D2)))))","v":"J126556 - محمد - 1232"},{"$f":"IF($A2=\"\",\"\",IF(COLUMNS($D$1:E2)>SUMPRODUCT(IF(ISNUMBER(SEARCH($A2,$C$1:$C$20)),1,0)),\"\",INDEX($C$1:$C$20,SMALL(IF(ISNUMBER(SEARCH($A2,$C$1:$C$20)),ROW($C$1:$C$20)-ROW($C$1)+1),COLUMNS($D$1:E2)))))","v":""},{"$f":"IF($A2=\"\",\"\",IF(COLUMNS($D$1:F2)>SUMPRODUCT(IF(ISNUMBER(SEARCH($A2,$C$1:$C$20)),1,0)),\"\",INDEX($C$1:$C$20,SMALL(IF(ISNUMBER(SEARCH($A2,$C$1:$C$20)),ROW($C$1:$C$20)-ROW($C$1)+1),COLUMNS($D$1:F2)))))","v":""},{"$f":"IF($A2=\"\",\"\",IF(COLUMNS($D$1:G2)>SUMPRODUCT(IF(ISNUMBER(SEARCH($A2,$C$1:$C$20)),1,0)),\"\",INDEX($C$1:$C$20,SMALL(IF(ISNUMBER(SEARCH($A2,$C$1:$C$20)),ROW($C$1:$C$20)-ROW($C$1)+1),COLUMNS($D$1:G2)))))","v":""},{"$f":"IF($A2=\"\",\"\",IF(COLUMNS($D$1:H2)>SUMPRODUCT(IF(ISNUMBER(SEARCH($A2,$C$1:$C$20)),1,0)),\"\",INDEX($C$1:$C$20,SMALL(IF(ISNUMBER(SEARCH($A2,$C$1:$C$20)),ROW($C$1:$C$20)-ROW($C$1)+1),COLUMNS($D$1:H2)))))","v":""},{"$f":"IF($A2=\"\",\"\",IF(COLUMNS($D$1:I2)>SUMPRODUCT(IF(ISNUMBER(SEARCH($A2,$C$1:$C$20)),1,0)),\"\",INDEX($C$1:$C$20,SMALL(IF(ISNUMBER(SEARCH($A2,$C$1:$C$20)),ROW($C$1:$C$20)-ROW($C$1)+1),COLUMNS($D$1:I2)))))","v":""},{"$f":"IF($A2=\"\",\"\",IF(COLUMNS($D$1:J2)>SUMPRODUCT(IF(ISNUMBER(SEARCH($A2,$C$1:$C$20)),1,0)),\"\",INDEX($C$1:$C$20,SMALL(IF(ISNUMBER(SEARCH($A2,$C$1:$C$20)),ROW($C$1:$C$20)-ROW($C$1)+1),COLUMNS($D$1:J2)))))","v":""},"J123456",null,null,"J123456 - علي - 1231"]
["J165556",null,"J165556 - عبدالله - 1233",{"$f":"IF($A3=\"\",\"\",IF(COLUMNS($D$1:D3)>SUMPRODUCT(IF(ISNUMBER(SEARCH($A3,$C$1:$C$20)),1,0)),\"\",INDEX($C$1:$C$20,SMALL(IF(ISNUMBER(SEARCH($A3,$C$1:$C$20)),ROW($C$1:$C$20)-ROW($C$1)+1),COLUMNS($D$1:D3)))))","v":"J165556 - عبدالله - 1233"},{"$f":"IF($A3=\"\",\"\",IF(COLUMNS($D$1:E3)>SUMPRODUCT(IF(ISNUMBER(SEARCH($A3,$C$1:$C$20)),1,0)),\"\",INDEX($C$1:$C$20,SMALL(IF(ISNUMBER(SEARCH($A3,$C$1:$C$20)),ROW($C$1:$C$20)-ROW($C$1)+1),COLUMNS($D$1:E3)))))","v":""},{"$f":"IF($A3=\"\",\"\",IF(COLUMNS($D$1:F3)>SUMPRODUCT(IF(ISNUMBER(SEARCH($A3,$C$1:$C$20)),1,0)),\"\",INDEX($C$1:$C$20,SMALL(IF(ISNUMBER(SEARCH($A3,$C$1:$C$20)),ROW($C$1:$C$20)-ROW($C$1)+1),COLUMNS($D$1:F3)))))","v":""},{"$f":"IF($A3=\"\",\"\",IF(COLUMNS($D$1:G3)>SUMPRODUCT(IF(ISNUMBER(SEARCH($A3,$C$1:$C$20)),1,0)),\"\",INDEX($C$1:$C$20,SMALL(IF(ISNUMBER(SEARCH($A3,$C$1:$C$20)),ROW($C$1:$C$20)-ROW($C$1)+1),COLUMNS($D$1:G3)))))","v":""},{"$f":"IF($A3=\"\",\"\",IF(COLUMNS($D$1:H3)>SUMPRODUCT(IF(ISNUMBER(SEARCH($A3,$C$1:$C$20)),1,0)),\"\",INDEX($C$1:$C$20,SMALL(IF(ISNUMBER(SEARCH($A3,$C$1:$C$20)),ROW($C$1:$C$20)-ROW($C$1)+1),COLUMNS($D$1:H3)))))","v":""},{"$f":"IF($A3=\"\",\"\",IF(COLUMNS($D$1:I3)>SUMPRODUCT(IF(ISNUMBER(SEARCH($A3,$C$1:$C$20)),1,0)),\"\",INDEX($C$1:$C$20,SMALL(IF(ISNUMBER(SEARCH($A3,$C$1:$C$20)),ROW($C$1:$C$20)-ROW($C$1)+1),COLUMNS($D$1:I3)))))","v":""},{"$f":"IF($A3=\"\",\"\",IF(COLUMNS($D$1:J3)>SUMPRODUCT(IF(ISNUMBER(SEARCH($A3,$C$1:$C$20)),1,0)),\"\",INDEX($C$1:$C$20,SMALL(IF(ISNUMBER(SEARCH($A3,$C$1:$C$20)),ROW($C$1:$C$20)-ROW($C$1)+1),COLUMNS($D$1:J3)))))","v":""},"J126556 ",null,null,"J126556 - محمد - 1232"]
["J125956",null,"J125956 - احمد - 1234",{"$f":"IF($A4=\"\",\"\",IF(COLUMNS($D$1:D4)>SUMPRODUCT(IF(ISNUMBER(SEARCH($A4,$C$1:$C$20)),1,0)),\"\",INDEX($C$1:$C$20,SMALL(IF(ISNUMBER(SEARCH($A4,$C$1:$C$20)),ROW($C$1:$C$20)-ROW($C$1)+1),COLUMNS($D$1:D4)))))","v":"J125956 - احمد - 1234"},{"$f":"IF($A4=\"\",\"\",IF(COLUMNS($D$1:E4)>SUMPRODUCT(IF(ISNUMBER(SEARCH($A4,$C$1:$C$20)),1,0)),\"\",INDEX($C$1:$C$20,SMALL(IF(ISNUMBER(SEARCH($A4,$C$1:$C$20)),ROW($C$1:$C$20)-ROW($C$1)+1),COLUMNS($D$1:E4)))))","v":"J125956 - مصطفى - 1235"},{"$f":"IF($A4=\"\",\"\",IF(COLUMNS($D$1:F4)>SUMPRODUCT(IF(ISNUMBER(SEARCH($A4,$C$1:$C$20)),1,0)),\"\",INDEX($C$1:$C$20,SMALL(IF(ISNUMBER(SEARCH($A4,$C$1:$C$20)),ROW($C$1:$C$20)-ROW($C$1)+1),COLUMNS($D$1:F4)))))","v":""},{"$f":"IF($A4=\"\",\"\",IF(COLUMNS($D$1:G4)>SUMPRODUCT(IF(ISNUMBER(SEARCH($A4,$C$1:$C$20)),1,0)),\"\",INDEX($C$1:$C$20,SMALL(IF(ISNUMBER(SEARCH($A4,$C$1:$C$20)),ROW($C$1:$C$20)-ROW($C$1)+1),COLUMNS($D$1:G4)))))","v":""},{"$f":"IF($A4=\"\",\"\",IF(COLUMNS($D$1:H4)>SUMPRODUCT(IF(ISNUMBER(SEARCH($A4,$C$1:$C$20)),1,0)),\"\",INDEX($C$1:$C$20,SMALL(IF(ISNUMBER(SEARCH($A4,$C$1:$C$20)),ROW($C$1:$C$20)-ROW($C$1)+1),COLUMNS($D$1:H4)))))","v":""},{"$f":"IF($A4=\"\",\"\",IF(COLUMNS($D$1:I4)>SUMPRODUCT(IF(ISNUMBER(SEARCH($A4,$C$1:$C$20)),1,0)),\"\",INDEX($C$1:$C$20,SMALL(IF(ISNUMBER(SEARCH($A4,$C$1:$C$20)),ROW($C$1:$C$20)-ROW($C$1)+1),COLUMNS($D$1:I4)))))","v":""},{"$f":"IF($A4=\"\",\"\",IF(COLUMNS($D$1:J4)>SUMPRODUCT(IF(ISNUMBER(SEARCH($A4,$C$1:$C$20)),1,0)),\"\",INDEX($C$1:$C$20,SMALL(IF(ISNUMBER(SEARCH($A4,$C$1:$C$20)),ROW($C$1:$C$20)-ROW($C$1)+1),COLUMNS($D$1:J4)))))","v":""},"J165556",null,null,"J165556 - عبدالله - 1233"]
["J154156",null,"J125956 - مصطفى - 1235",{"$f":"IF($A5=\"\",\"\",IF(COLUMNS($D$1:D5)>SUMPRODUCT(IF(ISNUMBER(SEARCH($A5,$C$1:$C$20)),1,0)),\"\",INDEX($C$1:$C$20,SMALL(IF(ISNUMBER(SEARCH($A5,$C$1:$C$20)),ROW($C$1:$C$20)-ROW($C$1)+1),COLUMNS($D$1:D5)))))","v":""},{"$f":"IF($A5=\"\",\"\",IF(COLUMNS($D$1:E5)>SUMPRODUCT(IF(ISNUMBER(SEARCH($A5,$C$1:$C$20)),1,0)),\"\",INDEX($C$1:$C$20,SMALL(IF(ISNUMBER(SEARCH($A5,$C$1:$C$20)),ROW($C$1:$C$20)-ROW($C$1)+1),COLUMNS($D$1:E5)))))","v":""},{"$f":"IF($A5=\"\",\"\",IF(COLUMNS($D$1:F5)>SUMPRODUCT(IF(ISNUMBER(SEARCH($A5,$C$1:$C$20)),1,0)),\"\",INDEX($C$1:$C$20,SMALL(IF(ISNUMBER(SEARCH($A5,$C$1:$C$20)),ROW($C$1:$C$20)-ROW($C$1)+1),COLUMNS($D$1:F5)))))","v":""},{"$f":"IF($A5=\"\",\"\",IF(COLUMNS($D$1:G5)>SUMPRODUCT(IF(ISNUMBER(SEARCH($A5,$C$1:$C$20)),1,0)),\"\",INDEX($C$1:$C$20,SMALL(IF(ISNUMBER(SEARCH($A5,$C$1:$C$20)),ROW($C$1:$C$20)-ROW($C$1)+1),COLUMNS($D$1:G5)))))","v":""},{"$f":"IF($A5=\"\",\"\",IF(COLUMNS($D$1:H5)>SUMPRODUCT(IF(ISNUMBER(SEARCH($A5,$C$1:$C$20)),1,0)),\"\",INDEX($C$1:$C$20,SMALL(IF(ISNUMBER(SEARCH($A5,$C$1:$C$20)),ROW($C$1:$C$20)-ROW($C$1)+1),COLUMNS($D$1:H5)))))","v":""},{"$f":"IF($A5=\"\",\"\",IF(COLUMNS($D$1:I5)>SUMPRODUCT(IF(ISNUMBER(SEARCH($A5,$C$1:$C$20)),1,0)),\"\",INDEX($C$1:$C$20,SMALL(IF(ISNUMBER(SEARCH($A5,$C$1:$C$20)),ROW($C$1:$C$20)-ROW($C$1)+1),COLUMNS($D$1:I5)))))","v":""},{"$f":"IF($A5=\"\",\"\",IF(COLUMNS($D$1:J5)>SUMPRODUCT(IF(ISNUMBER(SEARCH($A5,$C$1:$C$20)),1,0)),\"\",INDEX($C$1:$C$20,SMALL(IF(ISNUMBER(SEARCH($A5,$C$1:$C$20)),ROW($C$1:$C$20)-ROW($C$1)+1),COLUMNS($D$1:J5)))))","v":""},"J125956",null,null,"J125956 - احمد - 1234"]
["J126520 ",null,"J126520 - ×سليم - 1232",{"$f":"IF($A6=\"\",\"\",IF(COLUMNS($D$1:D6)>SUMPRODUCT(IF(ISNUMBER(SEARCH($A6,$C$1:$C$20)),1,0)),\"\",INDEX($C$1:$C$20,SMALL(IF(ISNUMBER(SEARCH($A6,$C$1:$C$20)),ROW($C$1:$C$20)-ROW($C$1)+1),COLUMNS($D$1:D6)))))","v":"J126520 - ×سليم - 1232"},{"$f":"IF($A6=\"\",\"\",IF(COLUMNS($D$1:E6)>SUMPRODUCT(IF(ISNUMBER(SEARCH($A6,$C$1:$C$20)),1,0)),\"\",INDEX($C$1:$C$20,SMALL(IF(ISNUMBER(SEARCH($A6,$C$1:$C$20)),ROW($C$1:$C$20)-ROW($C$1)+1),COLUMNS($D$1:E6)))))","v":"J126520 - ×خليل - 1233"},{"$f":"IF($A6=\"\",\"\",IF(COLUMNS($D$1:F6)>SUMPRODUCT(IF(ISNUMBER(SEARCH($A6,$C$1:$C$20)),1,0)),\"\",INDEX($C$1:$C$20,SMALL(IF(ISNUMBER(SEARCH($A6,$C$1:$C$20)),ROW($C$1:$C$20)-ROW($C$1)+1),COLUMNS($D$1:F6)))))","v":""},{"$f":"IF($A6=\"\",\"\",IF(COLUMNS($D$1:G6)>SUMPRODUCT(IF(ISNUMBER(SEARCH($A6,$C$1:$C$20)),1,0)),\"\",INDEX($C$1:$C$20,SMALL(IF(ISNUMBER(SEARCH($A6,$C$1:$C$20)),ROW($C$1:$C$20)-ROW($C$1)+1),COLUMNS($D$1:G6)))))","v":""},{"$f":"IF($A6=\"\",\"\",IF(COLUMNS($D$1:H6)>SUMPRODUCT(IF(ISNUMBER(SEARCH($A6,$C$1:$C$20)),1,0)),\"\",INDEX($C$1:$C$20,SMALL(IF(ISNUMBER(SEARCH($A6,$C$1:$C$20)),ROW($C$1:$C$20)-ROW($C$1)+1),COLUMNS($D$1:H6)))))","v":""},{"$f":"IF($A6=\"\",\"\",IF(COLUMNS($D$1:I6)>SUMPRODUCT(IF(ISNUMBER(SEARCH($A6,$C$1:$C$20)),1,0)),\"\",INDEX($C$1:$C$20,SMALL(IF(ISNUMBER(SEARCH($A6,$C$1:$C$20)),ROW($C$1:$C$20)-ROW($C$1)+1),COLUMNS($D$1:I6)))))","v":""},{"$f":"IF($A6=\"\",\"\",IF(COLUMNS($D$1:J6)>SUMPRODUCT(IF(ISNUMBER(SEARCH($A6,$C$1:$C$20)),1,0)),\"\",INDEX($C$1:$C$20,SMALL(IF(ISNUMBER(SEARCH($A6,$C$1:$C$20)),ROW($C$1:$C$20)-ROW($C$1)+1),COLUMNS($D$1:J6)))))","v":""},"J154156","`",null,"J154156 - مصطفى - 1235"]
[null,null,"J126520 - ×خليل - 1233",{"$f":"IF($A7=\"\",\"\",IF(COLUMNS($D$1:D7)>SUMPRODUCT(IF(ISNUMBER(SEARCH($A7,$C$1:$C$20)),1,0)),\"\",INDEX($C$1:$C$20,SMALL(IF(ISNUMBER(SEARCH($A7,$C$1:$C$20)),ROW($C$1:$C$20)-ROW($C$1)+1),COLUMNS($D$1:D7)))))","v":""},{"$f":"IF($A7=\"\",\"\",IF(COLUMNS($D$1:E7)>SUMPRODUCT(IF(ISNUMBER(SEARCH($A7,$C$1:$C$20)),1,0)),\"\",INDEX($C$1:$C$20,SMALL(IF(ISNUMBER(SEARCH($A7,$C$1:$C$20)),ROW($C$1:$C$20)-ROW($C$1)+1),COLUMNS($D$1:E7)))))","v":""},{"$f":"IF($A7=\"\",\"\",IF(COLUMNS($D$1:F7)>SUMPRODUCT(IF(ISNUMBER(SEARCH($A7,$C$1:$C$20)),1,0)),\"\",INDEX($C$1:$C$20,SMALL(IF(ISNUMBER(SEARCH($A7,$C$1:$C$20)),ROW($C$1:$C$20)-ROW($C$1)+1),COLUMNS($D$1:F7)))))","v":""},{"$f":"IF($A7=\"\",\"\",IF(COLUMNS($D$1:G7)>SUMPRODUCT(IF(ISNUMBER(SEARCH($A7,$C$1:$C$20)),1,0)),\"\",INDEX($C$1:$C$20,SMALL(IF(ISNUMBER(SEARCH($A7,$C$1:$C$20)),ROW($C$1:$C$20)-ROW($C$1)+1),COLUMNS($D$1:G7)))))","v":""},{"$f":"IF($A7=\"\",\"\",IF(COLUMNS($D$1:H7)>SUMPRODUCT(IF(ISNUMBER(SEARCH($A7,$C$1:$C$20)),1,0)),\"\",INDEX($C$1:$C$20,SMALL(IF(ISNUMBER(SEARCH($A7,$C$1:$C$20)),ROW($C$1:$C$20)-ROW($C$1)+1),COLUMNS($D$1:H7)))))","v":""},{"$f":"IF($A7=\"\",\"\",IF(COLUMNS($D$1:I7)>SUMPRODUCT(IF(ISNUMBER(SEARCH($A7,$C$1:$C$20)),1,0)),\"\",INDEX($C$1:$C$20,SMALL(IF(ISNUMBER(SEARCH($A7,$C$1:$C$20)),ROW($C$1:$C$20)-ROW($C$1)+1),COLUMNS($D$1:I7)))))","v":""},{"$f":"IF($A7=\"\",\"\",IF(COLUMNS($D$1:J7)>SUMPRODUCT(IF(ISNUMBER(SEARCH($A7,$C$1:$C$20)),1,0)),\"\",INDEX($C$1:$C$20,SMALL(IF(ISNUMBER(SEARCH($A7,$C$1:$C$20)),ROW($C$1:$C$20)-ROW($C$1)+1),COLUMNS($D$1:J7)))))","v":""}]
[null,null,null,{"$f":"IF($A8=\"\",\"\",IF(COLUMNS($D$1:D8)>SUMPRODUCT(IF(ISNUMBER(SEARCH($A8,$C$1:$C$20)),1,0)),\"\",INDEX($C$1:$C$20,SMALL(IF(ISNUMBER(SEARCH($A8,$C$1:$C$20)),ROW($C$1:$C$20)-ROW($C$1)+1),COLUMNS($D$1:D8)))))","v":""},{"$f":"IF($A8=\"\",\"\",IF(COLUMNS($D$1:E8)>SUMPRODUCT(IF(ISNUMBER(SEARCH($A8,$C$1:$C$20)),1,0)),\"\",INDEX($C$1:$C$20,SMALL(IF(ISNUMBER(SEARCH($A8,$C$1:$C$20)),ROW($C$1:$C$20)-ROW($C$1)+1),COLUMNS($D$1:E8)))))","v":""},{"$f":"IF($A8=\"\",\"\",IF(COLUMNS($D$1:F8)>SUMPRODUCT(IF(ISNUMBER(SEARCH($A8,$C$1:$C$20)),1,0)),\"\",INDEX($C$1:$C$20,SMALL(IF(ISNUMBER(SEARCH($A8,$C$1:$C$20)),ROW($C$1:$C$20)-ROW($C$1)+1),COLUMNS($D$1:F8)))))","v":""},{"$f":"IF($A8=\"\",\"\",IF(COLUMNS($D$1:G8)>SUMPRODUCT(IF(ISNUMBER(SEARCH($A8,$C$1:$C$20)),1,0)),\"\",INDEX($C$1:$C$20,SMALL(IF(ISNUMBER(SEARCH($A8,$C$1:$C$20)),ROW($C$1:$C$20)-ROW($C$1)+1),COLUMNS($D$1:G8)))))","v":""},{"$f":"IF($A8=\"\",\"\",IF(COLUMNS($D$1:H8)>SUMPRODUCT(IF(ISNUMBER(SEARCH($A8,$C$1:$C$20)),1,0)),\"\",INDEX($C$1:$C$20,SMALL(IF(ISNUMBER(SEARCH($A8,$C$1:$C$20)),ROW($C$1:$C$20)-ROW($C$1)+1),COLUMNS($D$1:H8)))))","v":""},{"$f":"IF($A8=\"\",\"\",IF(COLUMNS($D$1:I8)>SUMPRODUCT(IF(ISNUMBER(SEARCH($A8,$C$1:$C$20)),1,0)),\"\",INDEX($C$1:$C$20,SMALL(IF(ISNUMBER(SEARCH($A8,$C$1:$C$20)),ROW($C$1:$C$20)-ROW($C$1)+1),COLUMNS($D$1:I8)))))","v":""},{"$f":"IF($A8=\"\",\"\",IF(COLUMNS($D$1:J8)>SUMPRODUCT(IF(ISNUMBER(SEARCH($A8,$C$1:$C$20)),1,0)),\"\",INDEX($C$1:$C$20,SMALL(IF(ISNUMBER(SEARCH($A8,$C$1:$C$20)),ROW($C$1:$C$20)-ROW($C$1)+1),COLUMNS($D$1:J8)))))","v":""}]
[null,null,null,{"$f":"IF($A9=\"\",\"\",IF(COLUMNS($D$1:D9)>SUMPRODUCT(IF(ISNUMBER(SEARCH($A9,$C$1:$C$20)),1,0)),\"\",INDEX($C$1:$C$20,SMALL(IF(ISNUMBER(SEARCH($A9,$C$1:$C$20)),ROW($C$1:$C$20)-ROW($C$1)+1),COLUMNS($D$1:D9)))))","v":""},{"$f":"IF($A9=\"\",\"\",IF(COLUMNS($D$1:E9)>SUMPRODUCT(IF(ISNUMBER(SEARCH($A9,$C$1:$C$20)),1,0)),\"\",INDEX($C$1:$C$20,SMALL(IF(ISNUMBER(SEARCH($A9,$C$1:$C$20)),ROW($C$1:$C$20)-ROW($C$1)+1),COLUMNS($D$1:E9)))))","v":""},{"$f":"IF($A9=\"\",\"\",IF(COLUMNS($D$1:F9)>SUMPRODUCT(IF(ISNUMBER(SEARCH($A9,$C$1:$C$20)),1,0)),\"\",INDEX($C$1:$C$20,SMALL(IF(ISNUMBER(SEARCH($A9,$C$1:$C$20)),ROW($C$1:$C$20)-ROW($C$1)+1),COLUMNS($D$1:F9)))))","v":""},{"$f":"IF($A9=\"\",\"\",IF(COLUMNS($D$1:G9)>SUMPRODUCT(IF(ISNUMBER(SEARCH($A9,$C$1:$C$20)),1,0)),\"\",INDEX($C$1:$C$20,SMALL(IF(ISNUMBER(SEARCH($A9,$C$1:$C$20)),ROW($C$1:$C$20)-ROW($C$1)+1),COLUMNS($D$1:G9)))))","v":""},{"$f":"IF($A9=\"\",\"\",IF(COLUMNS($D$1:H9)>SUMPRODUCT(IF(ISNUMBER(SEARCH($A9,$C$1:$C$20)),1,0)),\"\",INDEX($C$1:$C$20,SMALL(IF(ISNUMBER(SEARCH($A9,$C$1:$C$20)),ROW($C$1:$C$20)-ROW($C$1)+1),COLUMNS($D$1:H9)))))","v":""},{"$f":"IF($A9=\"\",\"\",IF(COLUMNS($D$1:I9)>SUMPRODUCT(IF(ISNUMBER(SEARCH($A9,$C$1:$C$20)),1,0)),\"\",INDEX($C$1:$C$20,SMALL(IF(ISNUMBER(SEARCH($A9,$C$1:$C$20)),ROW($C$1:$C$20)-ROW($C$1)+1),COLUMNS($D$1:I9)))))","v":""},{"$f":"IF($A9=\"\",\"\",IF(COLUMNS($D$1:J9)>SUMPRODUCT(IF(ISNUMBER(SEARCH($A9,$C$1:$C$20)),1,0)),\"\",INDEX($C$1:$C$20,SMALL(IF(ISNUMBER(SEARCH($A9,$C$1:$C$20)),ROW($C$1:$C$20)-ROW($C$1)+1),COLUMNS($D$1:J9)))))","v":""}]
[null,"`",null,{"$f":"IF($A10=\"\",\"\",IF(COLUMNS($D$1:D10)>SUMPRODUCT(IF(ISNUMBER(SEARCH($A10,$C$1:$C$20)),1,0)),\"\",INDEX($C$1:$C$20,SMALL(IF(ISNUMBER(SEARCH($A10,$C$1:$C$20)),ROW($C$1:$C$20)-ROW($C$1)+1),COLUMNS($D$1:D10)))))","v":""},{"$f":"IF($A10=\"\",\"\",IF(COLUMNS($D$1:E10)>SUMPRODUCT(IF(ISNUMBER(SEARCH($A10,$C$1:$C$20)),1,0)),\"\",INDEX($C$1:$C$20,SMALL(IF(ISNUMBER(SEARCH($A10,$C$1:$C$20)),ROW($C$1:$C$20)-ROW($C$1)+1),COLUMNS($D$1:E10)))))","v":""},{"$f":"IF($A10=\"\",\"\",IF(COLUMNS($D$1:F10)>SUMPRODUCT(IF(ISNUMBER(SEARCH($A10,$C$1:$C$20)),1,0)),\"\",INDEX($C$1:$C$20,SMALL(IF(ISNUMBER(SEARCH($A10,$C$1:$C$20)),ROW($C$1:$C$20)-ROW($C$1)+1),COLUMNS($D$1:F10)))))","v":""},{"$f":"IF($A10=\"\",\"\",IF(COLUMNS($D$1:G10)>SUMPRODUCT(IF(ISNUMBER(SEARCH($A10,$C$1:$C$20)),1,0)),\"\",INDEX($C$1:$C$20,SMALL(IF(ISNUMBER(SEARCH($A10,$C$1:$C$20)),ROW($C$1:$C$20)-ROW($C$1)+1),COLUMNS($D$1:G10)))))","v":""},{"$f":"IF($A10=\"\",\"\",IF(COLUMNS($D$1:H10)>SUMPRODUCT(IF(ISNUMBER(SEARCH($A10,$C$1:$C$20)),1,0)),\"\",INDEX($C$1:$C$20,SMALL(IF(ISNUMBER(SEARCH($A10,$C$1:$C$20)),ROW($C$1:$C$20)-ROW($C$1)+1),COLUMNS($D$1:H10)))))","v":""},{"$f":"IF($A10=\"\",\"\",IF(COLUMNS($D$1:I10)>SUMPRODUCT(IF(ISNUMBER(SEARCH($A10,$C$1:$C$20)),1,0)),\"\",INDEX($C$1:$C$20,SMALL(IF(ISNUMBER(SEARCH($A10,$C$1:$C$20)),ROW($C$1:$C$20)-ROW($C$1)+1),COLUMNS($D$1:I10)))))","v":""},{"$f":"IF($A10=\"\",\"\",IF(COLUMNS($D$1:J10)>SUMPRODUCT(IF(ISNUMBER(SEARCH($A10,$C$1:$C$20)),1,0)),\"\",INDEX($C$1:$C$20,SMALL(IF(ISNUMBER(SEARCH($A10,$C$1:$C$20)),ROW($C$1:$C$20)-ROW($C$1)+1),COLUMNS($D$1:J10)))))","v":""}]
[null,null,null,{"$f":"IF($A11=\"\",\"\",IF(COLUMNS($D$1:D11)>SUMPRODUCT(IF(ISNUMBER(SEARCH($A11,$C$1:$C$20)),1,0)),\"\",INDEX($C$1:$C$20,SMALL(IF(ISNUMBER(SEARCH($A11,$C$1:$C$20)),ROW($C$1:$C$20)-ROW($C$1)+1),COLUMNS($D$1:D11)))))","v":""},{"$f":"IF($A11=\"\",\"\",IF(COLUMNS($D$1:E11)>SUMPRODUCT(IF(ISNUMBER(SEARCH($A11,$C$1:$C$20)),1,0)),\"\",INDEX($C$1:$C$20,SMALL(IF(ISNUMBER(SEARCH($A11,$C$1:$C$20)),ROW($C$1:$C$20)-ROW($C$1)+1),COLUMNS($D$1:E11)))))","v":""},{"$f":"IF($A11=\"\",\"\",IF(COLUMNS($D$1:F11)>SUMPRODUCT(IF(ISNUMBER(SEARCH($A11,$C$1:$C$20)),1,0)),\"\",INDEX($C$1:$C$20,SMALL(IF(ISNUMBER(SEARCH($A11,$C$1:$C$20)),ROW($C$1:$C$20)-ROW($C$1)+1),COLUMNS($D$1:F11)))))","v":""},{"$f":"IF($A11=\"\",\"\",IF(COLUMNS($D$1:G11)>SUMPRODUCT(IF(ISNUMBER(SEARCH($A11,$C$1:$C$20)),1,0)),\"\",INDEX($C$1:$C$20,SMALL(IF(ISNUMBER(SEARCH($A11,$C$1:$C$20)),ROW($C$1:$C$20)-ROW($C$1)+1),COLUMNS($D$1:G11)))))","v":""},{"$f":"IF($A11=\"\",\"\",IF(COLUMNS($D$1:H11)>SUMPRODUCT(IF(ISNUMBER(SEARCH($A11,$C$1:$C$20)),1,0)),\"\",INDEX($C$1:$C$20,SMALL(IF(ISNUMBER(SEARCH($A11,$C$1:$C$20)),ROW($C$1:$C$20)-ROW($C$1)+1),COLUMNS($D$1:H11)))))","v":""},{"$f":"IF($A11=\"\",\"\",IF(COLUMNS($D$1:I11)>SUMPRODUCT(IF(ISNUMBER(SEARCH($A11,$C$1:$C$20)),1,0)),\"\",INDEX($C$1:$C$20,SMALL(IF(ISNUMBER(SEARCH($A11,$C$1:$C$20)),ROW($C$1:$C$20)-ROW($C$1)+1),COLUMNS($D$1:I11)))))","v":""},{"$f":"IF($A11=\"\",\"\",IF(COLUMNS($D$1:J11)>SUMPRODUCT(IF(ISNUMBER(SEARCH($A11,$C$1:$C$20)),1,0)),\"\",INDEX($C$1:$C$20,SMALL(IF(ISNUMBER(SEARCH($A11,$C$1:$C$20)),ROW($C$1:$C$20)-ROW($C$1)+1),COLUMNS($D$1:J11)))))","v":""}]
[null,null,null,{"$f":"IF($A12=\"\",\"\",IF(COLUMNS($D$1:D12)>SUMPRODUCT(IF(ISNUMBER(SEARCH($A12,$C$1:$C$20)),1,0)),\"\",INDEX($C$1:$C$20,SMALL(IF(ISNUMBER(SEARCH($A12,$C$1:$C$20)),ROW($C$1:$C$20)-ROW($C$1)+1),COLUMNS($D$1:D12)))))","v":""},{"$f":"IF($A12=\"\",\"\",IF(COLUMNS($D$1:E12)>SUMPRODUCT(IF(ISNUMBER(SEARCH($A12,$C$1:$C$20)),1,0)),\"\",INDEX($C$1:$C$20,SMALL(IF(ISNUMBER(SEARCH($A12,$C$1:$C$20)),ROW($C$1:$C$20)-ROW($C$1)+1),COLUMNS($D$1:E12)))))","v":""},{"$f":"IF($A12=\"\",\"\",IF(COLUMNS($D$1:F12)>SUMPRODUCT(IF(ISNUMBER(SEARCH($A12,$C$1:$C$20)),1,0)),\"\",INDEX($C$1:$C$20,SMALL(IF(ISNUMBER(SEARCH($A12,$C$1:$C$20)),ROW($C$1:$C$20)-ROW($C$1)+1),COLUMNS($D$1:F12)))))","v":""},{"$f":"IF($A12=\"\",\"\",IF(COLUMNS($D$1:G12)>SUMPRODUCT(IF(ISNUMBER(SEARCH($A12,$C$1:$C$20)),1,0)),\"\",INDEX($C$1:$C$20,SMALL(IF(ISNUMBER(SEARCH($A12,$C$1:$C$20)),ROW($C$1:$C$20)-ROW($C$1)+1),COLUMNS($D$1:G12)))))","v":""},{"$f":"IF($A12=\"\",\"\",IF(COLUMNS($D$1:H12)>SUMPRODUCT(IF(ISNUMBER(SEARCH($A12,$C$1:$C$20)),1,0)),\"\",INDEX($C$1:$C$20,SMALL(IF(ISNUMBER(SEARCH($A12,$C$1:$C$20)),ROW($C$1:$C$20)-ROW($C$1)+1),COLUMNS($D$1:H12)))))","v":""},{"$f":"IF($A12=\"\",\"\",IF(COLUMNS($D$1:I12)>SUMPRODUCT(IF(ISNUMBER(SEARCH($A12,$C$1:$C$20)),1,0)),\"\",INDEX($C$1:$C$20,SMALL(IF(ISNUMBER(SEARCH($A12,$C$1:$C$20)),ROW($C$1:$C$20)-ROW($C$1)+1),COLUMNS($D$1:I12)))))","v":""},{"$f":"IF($A12=\"\",\"\",IF(COLUMNS($D$1:J12)>SUMPRODUCT(IF(ISNUMBER(SEARCH($A12,$C$1:$C$20)),1,0)),\"\",INDEX($C$1:$C$20,SMALL(IF(ISNUMBER(SEARCH($A12,$C$1:$C$20)),ROW($C$1:$C$20)-ROW($C$1)+1),COLUMNS($D$1:J12)))))","v":""}]
[null,null,null,{"$f":"IF($A13=\"\",\"\",IF(COLUMNS($D$1:D13)>SUMPRODUCT(IF(ISNUMBER(SEARCH($A13,$C$1:$C$20)),1,0)),\"\",INDEX($C$1:$C$20,SMALL(IF(ISNUMBER(SEARCH($A13,$C$1:$C$20)),ROW($C$1:$C$20)-ROW($C$1)+1),COLUMNS($D$1:D13)))))","v":""},{"$f":"IF($A13=\"\",\"\",IF(COLUMNS($D$1:E13)>SUMPRODUCT(IF(ISNUMBER(SEARCH($A13,$C$1:$C$20)),1,0)),\"\",INDEX($C$1:$C$20,SMALL(IF(ISNUMBER(SEARCH($A13,$C$1:$C$20)),ROW($C$1:$C$20)-ROW($C$1)+1),COLUMNS($D$1:E13)))))","v":""},{"$f":"IF($A13=\"\",\"\",IF(COLUMNS($D$1:F13)>SUMPRODUCT(IF(ISNUMBER(SEARCH($A13,$C$1:$C$20)),1,0)),\"\",INDEX($C$1:$C$20,SMALL(IF(ISNUMBER(SEARCH($A13,$C$1:$C$20)),ROW($C$1:$C$20)-ROW($C$1)+1),COLUMNS($D$1:F13)))))","v":""},{"$f":"IF($A13=\"\",\"\",IF(COLUMNS($D$1:G13)>SUMPRODUCT(IF(ISNUMBER(SEARCH($A13,$C$1:$C$20)),1,0)),\"\",INDEX($C$1:$C$20,SMALL(IF(ISNUMBER(SEARCH($A13,$C$1:$C$20)),ROW($C$1:$C$20)-ROW($C$1)+1),COLUMNS($D$1:G13)))))","v":""},{"$f":"IF($A13=\"\",\"\",IF(COLUMNS($D$1:H13)>SUMPRODUCT(IF(ISNUMBER(SEARCH($A13,$C$1:$C$20)),1,0)),\"\",INDEX($C$1:$C$20,SMALL(IF(ISNUMBER(SEARCH($A13,$C$1:$C$20)),ROW($C$1:$C$20)-ROW($C$1)+1),COLUMNS($D$1:H13)))))","v":""},{"$f":"IF($A13=\"\",\"\",IF(COLUMNS($D$1:I13)>SUMPRODUCT(IF(ISNUMBER(SEARCH($A13,$C$1:$C$20)),1,0)),\"\",INDEX($C$1:$C$20,SMALL(IF(ISNUMBER(SEARCH($A13,$C$1:$C$20)),ROW($C$1:$C$20)-ROW($C$1)+1),COLUMNS($D$1:I13)))))","v":""},{"$f":"IF($A13=\"\",\"\",IF(COLUMNS($D$1:J13)>SUMPRODUCT(IF(ISNUMBER(SEARCH($A13,$C$1:$C$20)),1,0)),\"\",INDEX($C$1:$C$20,SMALL(IF(ISNUMBER(SEARCH($A13,$C$1:$C$20)),ROW($C$1:$C$20)-ROW($C$1)+1),COLUMNS($D$1:J13)))))","v":""}]
[null,null,null,{"$f":"IF($A14=\"\",\"\",IF(COLUMNS($D$1:D14)>SUMPRODUCT(IF(ISNUMBER(SEARCH($A14,$C$1:$C$20)),1,0)),\"\",INDEX($C$1:$C$20,SMALL(IF(ISNUMBER(SEARCH($A14,$C$1:$C$20)),ROW($C$1:$C$20)-ROW($C$1)+1),COLUMNS($D$1:D14)))))","v":""},{"$f":"IF($A14=\"\",\"\",IF(COLUMNS($D$1:E14)>SUMPRODUCT(IF(ISNUMBER(SEARCH($A14,$C$1:$C$20)),1,0)),\"\",INDEX($C$1:$C$20,SMALL(IF(ISNUMBER(SEARCH($A14,$C$1:$C$20)),ROW($C$1:$C$20)-ROW($C$1)+1),COLUMNS($D$1:E14)))))","v":""},{"$f":"IF($A14=\"\",\"\",IF(COLUMNS($D$1:F14)>SUMPRODUCT(IF(ISNUMBER(SEARCH($A14,$C$1:$C$20)),1,0)),\"\",INDEX($C$1:$C$20,SMALL(IF(ISNUMBER(SEARCH($A14,$C$1:$C$20)),ROW($C$1:$C$20)-ROW($C$1)+1),COLUMNS($D$1:F14)))))","v":""},{"$f":"IF($A14=\"\",\"\",IF(COLUMNS($D$1:G14)>SUMPRODUCT(IF(ISNUMBER(SEARCH($A14,$C$1:$C$20)),1,0)),\"\",INDEX($C$1:$C$20,SMALL(IF(ISNUMBER(SEARCH($A14,$C$1:$C$20)),ROW($C$1:$C$20)-ROW($C$1)+1),COLUMNS($D$1:G14)))))","v":""},{"$f":"IF($A14=\"\",\"\",IF(COLUMNS($D$1:H14)>SUMPRODUCT(IF(ISNUMBER(SEARCH($A14,$C$1:$C$20)),1,0)),\"\",INDEX($C$1:$C$20,SMALL(IF(ISNUMBER(SEARCH($A14,$C$1:$C$20)),ROW($C$1:$C$20)-ROW($C$1)+1),COLUMNS($D$1:H14)))))","v":""},{"$f":"IF($A14=\"\",\"\",IF(COLUMNS($D$1:I14)>SUMPRODUCT(IF(ISNUMBER(SEARCH($A14,$C$1:$C$20)),1,0)),\"\",INDEX($C$1:$C$20,SMALL(IF(ISNUMBER(SEARCH($A14,$C$1:$C$20)),ROW($C$1:$C$20)-ROW($C$1)+1),COLUMNS($D$1:I14)))))","v":""},{"$f":"IF($A14=\"\",\"\",IF(COLUMNS($D$1:J14)>SUMPRODUCT(IF(ISNUMBER(SEARCH($A14,$C$1:$C$20)),1,0)),\"\",INDEX($C$1:$C$20,SMALL(IF(ISNUMBER(SEARCH($A14,$C$1:$C$20)),ROW($C$1:$C$20)-ROW($C$1)+1),COLUMNS($D$1:J14)))))","v":""}]
[null,null,null,{"$f":"IF($A15=\"\",\"\",IF(COLUMNS($D$1:D15)>SUMPRODUCT(IF(ISNUMBER(SEARCH($A15,$C$1:$C$20)),1,0)),\"\",INDEX($C$1:$C$20,SMALL(IF(ISNUMBER(SEARCH($A15,$C$1:$C$20)),ROW($C$1:$C$20)-ROW($C$1)+1),COLUMNS($D$1:D15)))))","v":""},{"$f":"IF($A15=\"\",\"\",IF(COLUMNS($D$1:E15)>SUMPRODUCT(IF(ISNUMBER(SEARCH($A15,$C$1:$C$20)),1,0)),\"\",INDEX($C$1:$C$20,SMALL(IF(ISNUMBER(SEARCH($A15,$C$1:$C$20)),ROW($C$1:$C$20)-ROW($C$1)+1),COLUMNS($D$1:E15)))))","v":""},{"$f":"IF($A15=\"\",\"\",IF(COLUMNS($D$1:F15)>SUMPRODUCT(IF(ISNUMBER(SEARCH($A15,$C$1:$C$20)),1,0)),\"\",INDEX($C$1:$C$20,SMALL(IF(ISNUMBER(SEARCH($A15,$C$1:$C$20)),ROW($C$1:$C$20)-ROW($C$1)+1),COLUMNS($D$1:F15)))))","v":""},{"$f":"IF($A15=\"\",\"\",IF(COLUMNS($D$1:G15)>SUMPRODUCT(IF(ISNUMBER(SEARCH($A15,$C$1:$C$20)),1,0)),\"\",INDEX($C$1:$C$20,SMALL(IF(ISNUMBER(SEARCH($A15,$C$1:$C$20)),ROW($C$1:$C$20)-ROW($C$1)+1),COLUMNS($D$1:G15)))))","v":""},{"$f":"IF($A15=\"\",\"\",IF(COLUMNS($D$1:H15)>SUMPRODUCT(IF(ISNUMBER(SEARCH($A15,$C$1:$C$20)),1,0)),\"\",INDEX($C$1:$C$20,SMALL(IF(ISNUMBER(SEARCH($A15,$C$1:$C$20)),ROW($C$1:$C$20)-ROW($C$1)+1),COLUMNS($D$1:H15)))))","v":""},{"$f":"IF($A15=\"\",\"\",IF(COLUMNS($D$1:I15)>SUMPRODUCT(IF(ISNUMBER(SEARCH($A15,$C$1:$C$20)),1,0)),\"\",INDEX($C$1:$C$20,SMALL(IF(ISNUMBER(SEARCH($A15,$C$1:$C$20)),ROW($C$1:$C$20)-ROW($C$1)+1),COLUMNS($D$1:I15)))))","v":""},{"$f":"IF($A15=\"\",\"\",IF(COLUMNS($D$1:J15)>SUMPRODUCT(IF(ISNUMBER(SEARCH($A15,$C$1:$C$20)),1,0)),\"\",INDEX($C$1:$C$20,SMALL(IF(ISNUMBER(SEARCH($A15,$C$1:$C$20)),ROW($C$1:$C$20)-ROW($C$1)+1),COLUMNS($D$1:J15)))))","v":""}]
[null,null,null,{"$f":"IF($A16=\"\",\"\",IF(COLUMNS($D$1:D16)>SUMPRODUCT(IF(ISNUMBER(SEARCH($A16,$C$1:$C$20)),1,0)),\"\",INDEX($C$1:$C$20,SMALL(IF(ISNUMBER(SEARCH($A16,$C$1:$C$20)),ROW($C$1:$C$20)-ROW($C$1)+1),COLUMNS($D$1:D16)))))","v":""},{"$f":"IF($A16=\"\",\"\",IF(COLUMNS($D$1:E16)>SUMPRODUCT(IF(ISNUMBER(SEARCH($A16,$C$1:$C$20)),1,0)),\"\",INDEX($C$1:$C$20,SMALL(IF(ISNUMBER(SEARCH($A16,$C$1:$C$20)),ROW($C$1:$C$20)-ROW($C$1)+1),COLUMNS($D$1:E16)))))","v":""},{"$f":"IF($A16=\"\",\"\",IF(COLUMNS($D$1:F16)>SUMPRODUCT(IF(ISNUMBER(SEARCH($A16,$C$1:$C$20)),1,0)),\"\",INDEX($C$1:$C$20,SMALL(IF(ISNUMBER(SEARCH($A16,$C$1:$C$20)),ROW($C$1:$C$20)-ROW($C$1)+1),COLUMNS($D$1:F16)))))","v":""},{"$f":"IF($A16=\"\",\"\",IF(COLUMNS($D$1:G16)>SUMPRODUCT(IF(ISNUMBER(SEARCH($A16,$C$1:$C$20)),1,0)),\"\",INDEX($C$1:$C$20,SMALL(IF(ISNUMBER(SEARCH($A16,$C$1:$C$20)),ROW($C$1:$C$20)-ROW($C$1)+1),COLUMNS($D$1:G16)))))","v":""},{"$f":"IF($A16=\"\",\"\",IF(COLUMNS($D$1:H16)>SUMPRODUCT(IF(ISNUMBER(SEARCH($A16,$C$1:$C$20)),1,0)),\"\",INDEX($C$1:$C$20,SMALL(IF(ISNUMBER(SEARCH($A16,$C$1:$C$20)),ROW($C$1:$C$20)-ROW($C$1)+1),COLUMNS($D$1:H16)))))","v":""},{"$f":"IF($A16=\"\",\"\",IF(COLUMNS($D$1:I16)>SUMPRODUCT(IF(ISNUMBER(SEARCH($A16,$C$1:$C$20)),1,0)),\"\",INDEX($C$1:$C$20,SMALL(IF(ISNUMBER(SEARCH($A16,$C$1:$C$20)),ROW($C$1:$C$20)-ROW($C$1)+1),COLUMNS($D$1:I16)))))","v":""},{"$f":"IF($A16=\"\",\"\",IF(COLUMNS($D$1:J16)>SUMPRODUCT(IF(ISNUMBER(SEARCH($A16,$C$1:$C$20)),1,0)),\"\",INDEX($C$1:$C$20,SMALL(IF(ISNUMBER(SEARCH($A16,$C$1:$C$20)),ROW($C$1:$C$20)-ROW($C$1)+1),COLUMNS($D$1:J16)))))","v":""}]
[null,null,null,{"$f":"IF($A17=\"\",\"\",IF(COLUMNS($D$1:D17)>SUMPRODUCT(IF(ISNUMBER(SEARCH($A17,$C$1:$C$20)),1,0)),\"\",INDEX($C$1:$C$20,SMALL(IF(ISNUMBER(SEARCH($A17,$C$1:$C$20)),ROW($C$1:$C$20)-ROW($C$1)+1),COLUMNS($D$1:D17)))))","v":""},{"$f":"IF($A17=\"\",\"\",IF(COLUMNS($D$1:E17)>SUMPRODUCT(IF(ISNUMBER(SEARCH($A17,$C$1:$C$20)),1,0)),\"\",INDEX($C$1:$C$20,SMALL(IF(ISNUMBER(SEARCH($A17,$C$1:$C$20)),ROW($C$1:$C$20)-ROW($C$1)+1),COLUMNS($D$1:E17)))))","v":""},{"$f":"IF($A17=\"\",\"\",IF(COLUMNS($D$1:F17)>SUMPRODUCT(IF(ISNUMBER(SEARCH($A17,$C$1:$C$20)),1,0)),\"\",INDEX($C$1:$C$20,SMALL(IF(ISNUMBER(SEARCH($A17,$C$1:$C$20)),ROW($C$1:$C$20)-ROW($C$1)+1),COLUMNS($D$1:F17)))))","v":""},{"$f":"IF($A17=\"\",\"\",IF(COLUMNS($D$1:G17)>SUMPRODUCT(IF(ISNUMBER(SEARCH($A17,$C$1:$C$20)),1,0)),\"\",INDEX($C$1:$C$20,SMALL(IF(ISNUMBER(SEARCH($A17,$C$1:$C$20)),ROW($C$1:$C$20)-ROW($C$1)+1),COLUMNS($D$1:G17)))))","v":""},{"$f":"IF($A17=\"\",\"\",IF(COLUMNS($D$1:H17)>SUMPRODUCT(IF(ISNUMBER(SEARCH($A17,$C$1:$C$20)),1,0)),\"\",INDEX($C$1:$C$20,SMALL(IF(ISNUMBER(SEARCH($A17,$C$1:$C$20)),ROW($C$1:$C$20)-ROW($C$1)+1),COLUMNS($D$1:H17)))))","v":""},{"$f":"IF($A17=\"\",\"\",IF(COLUMNS($D$1:I17)>SUMPRODUCT(IF(ISNUMBER(SEARCH($A17,$C$1:$C$20)),1,0)),\"\",INDEX($C$1:$C$20,SMALL(IF(ISNUMBER(SEARCH($A17,$C$1:$C$20)),ROW($C$1:$C$20)-ROW($C$1)+1),COLUMNS($D$1:I17)))))","v":""},{"$f":"IF($A17=\"\",\"\",IF(COLUMNS($D$1:J17)>SUMPRODUCT(IF(ISNUMBER(SEARCH($A17,$C$1:$C$20)),1,0)),\"\",INDEX($C$1:$C$20,SMALL(IF(ISNUMBER(SEARCH($A17,$C$1:$C$20)),ROW($C$1:$C$20)-ROW($C$1)+1),COLUMNS($D$1:J17)))))","v":""}]
[null,null,null,{"$f":"IF($A18=\"\",\"\",IF(COLUMNS($D$1:D18)>SUMPRODUCT(IF(ISNUMBER(SEARCH($A18,$C$1:$C$20)),1,0)),\"\",INDEX($C$1:$C$20,SMALL(IF(ISNUMBER(SEARCH($A18,$C$1:$C$20)),ROW($C$1:$C$20)-ROW($C$1)+1),COLUMNS($D$1:D18)))))","v":""},{"$f":"IF($A18=\"\",\"\",IF(COLUMNS($D$1:E18)>SUMPRODUCT(IF(ISNUMBER(SEARCH($A18,$C$1:$C$20)),1,0)),\"\",INDEX($C$1:$C$20,SMALL(IF(ISNUMBER(SEARCH($A18,$C$1:$C$20)),ROW($C$1:$C$20)-ROW($C$1)+1),COLUMNS($D$1:E18)))))","v":""},{"$f":"IF($A18=\"\",\"\",IF(COLUMNS($D$1:F18)>SUMPRODUCT(IF(ISNUMBER(SEARCH($A18,$C$1:$C$20)),1,0)),\"\",INDEX($C$1:$C$20,SMALL(IF(ISNUMBER(SEARCH($A18,$C$1:$C$20)),ROW($C$1:$C$20)-ROW($C$1)+1),COLUMNS($D$1:F18)))))","v":""},{"$f":"IF($A18=\"\",\"\",IF(COLUMNS($D$1:G18)>SUMPRODUCT(IF(ISNUMBER(SEARCH($A18,$C$1:$C$20)),1,0)),\"\",INDEX($C$1:$C$20,SMALL(IF(ISNUMBER(SEARCH($A18,$C$1:$C$20)),ROW($C$1:$C$20)-ROW($C$1)+1),COLUMNS($D$1:G18)))))","v":""},{"$f":"IF($A18=\"\",\"\",IF(COLUMNS($D$1:H18)>SUMPRODUCT(IF(ISNUMBER(SEARCH($A18,$C$1:$C$20)),1,0)),\"\",INDEX($C$1:$C$20,SMALL(IF(ISNUMBER(SEARCH($A18,$C$1:$C$20)),ROW($C$1:$C$20)-ROW($C$1)+1),COLUMNS($D$1:H18)))))","v":""},{"$f":"IF($A18=\"\",\"\",IF(COLUMNS($D$1:I18)>SUMPRODUCT(IF(ISNUMBER(SEARCH($A18,$C$1:$C$20)),1,0)),\"\",INDEX($C$1:$C$20,SMALL(IF(ISNUMBER(SEARCH($A18,$C$1:$C$20)),ROW($C$1:$C$20)-ROW($C$1)+1),COLUMNS($D$1:I18)))))","v":""},{"$f":"IF($A18=\"\",\"\",IF(COLUMNS($D$1:J18)>SUMPRODUCT(IF(ISNUMBER(SEARCH($A18,$C$1:$C$20)),1,0)),\"\",INDEX($C$1:$C$20,SMALL(IF(ISNUMBER(SEARCH($A18,$C$1:$C$20)),ROW($C$1:$C$20)-ROW($C$1)+1),COLUMNS($D$1:J18)))))","v":""}]
[null,null,null,{"$f":"IF($A19=\"\",\"\",IF(COLUMNS($D$1:D19)>SUMPRODUCT(IF(ISNUMBER(SEARCH($A19,$C$1:$C$20)),1,0)),\"\",INDEX($C$1:$C$20,SMALL(IF(ISNUMBER(SEARCH($A19,$C$1:$C$20)),ROW($C$1:$C$20)-ROW($C$1)+1),COLUMNS($D$1:D19)))))","v":""},{"$f":"IF($A19=\"\",\"\",IF(COLUMNS($D$1:E19)>SUMPRODUCT(IF(ISNUMBER(SEARCH($A19,$C$1:$C$20)),1,0)),\"\",INDEX($C$1:$C$20,SMALL(IF(ISNUMBER(SEARCH($A19,$C$1:$C$20)),ROW($C$1:$C$20)-ROW($C$1)+1),COLUMNS($D$1:E19)))))","v":""},{"$f":"IF($A19=\"\",\"\",IF(COLUMNS($D$1:F19)>SUMPRODUCT(IF(ISNUMBER(SEARCH($A19,$C$1:$C$20)),1,0)),\"\",INDEX($C$1:$C$20,SMALL(IF(ISNUMBER(SEARCH($A19,$C$1:$C$20)),ROW($C$1:$C$20)-ROW($C$1)+1),COLUMNS($D$1:F19)))))","v":""},{"$f":"IF($A19=\"\",\"\",IF(COLUMNS($D$1:G19)>SUMPRODUCT(IF(ISNUMBER(SEARCH($A19,$C$1:$C$20)),1,0)),\"\",INDEX($C$1:$C$20,SMALL(IF(ISNUMBER(SEARCH($A19,$C$1:$C$20)),ROW($C$1:$C$20)-ROW($C$1)+1),COLUMNS($D$1:G19)))))","v":""},{"$f":"IF($A19=\"\",\"\",IF(COLUMNS($D$1:H19)>SUMPRODUCT(IF(ISNUMBER(SEARCH($A19,$C$1:$C$20)),1,0)),\"\",INDEX($C$1:$C$20,SMALL(IF(ISNUMBER(SEARCH($A19,$C$1:$C$20)),ROW($C$1:$C$20)-ROW($C$1)+1),COLUMNS($D$1:H19)))))","v":""},{"$f":"IF($A19=\"\",\"\",IF(COLUMNS($D$1:I19)>SUMPRODUCT(IF(ISNUMBER(SEARCH($A19,$C$1:$C$20)),1,0)),\"\",INDEX($C$1:$C$20,SMALL(IF(ISNUMBER(SEARCH($A19,$C$1:$C$20)),ROW($C$1:$C$20)-ROW($C$1)+1),COLUMNS($D$1:I19)))))","v":""},{"$f":"IF($A19=\"\",\"\",IF(COLUMNS($D$1:J19)>SUMPRODUCT(IF(ISNUMBER(SEARCH($A19,$C$1:$C$20)),1,0)),\"\",INDEX($C$1:$C$20,SMALL(IF(ISNUMBER(SEARCH($A19,$C$1:$C$20)),ROW($C$1:$C$20)-ROW($C$1)+1),COLUMNS($D$1:J19)))))","v":""}]
[null,null,null,{"$f":"IF($A20=\"\",\"\",IF(COLUMNS($D$1:D20)>SUMPRODUCT(IF(ISNUMBER(SEARCH($A20,$C$1:$C$20)),1,0)),\"\",INDEX($C$1:$C$20,SMALL(IF(ISNUMBER(SEARCH($A20,$C$1:$C$20)),ROW($C$1:$C$20)-ROW($C$1)+1),COLUMNS($D$1:D20)))))","v":""},{"$f":"IF($A20=\"\",\"\",IF(COLUMNS($D$1:E20)>SUMPRODUCT(IF(ISNUMBER(SEARCH($A20,$C$1:$C$20)),1,0)),\"\",INDEX($C$1:$C$20,SMALL(IF(ISNUMBER(SEARCH($A20,$C$1:$C$20)),ROW($C$1:$C$20)-ROW($C$1)+1),COLUMNS($D$1:E20)))))","v":""},{"$f":"IF($A20=\"\",\"\",IF(COLUMNS($D$1:F20)>SUMPRODUCT(IF(ISNUMBER(SEARCH($A20,$C$1:$C$20)),1,0)),\"\",INDEX($C$1:$C$20,SMALL(IF(ISNUMBER(SEARCH($A20,$C$1:$C$20)),ROW($C$1:$C$20)-ROW($C$1)+1),COLUMNS($D$1:F20)))))","v":""},{"$f":"IF($A20=\"\",\"\",IF(COLUMNS($D$1:G20)>SUMPRODUCT(IF(ISNUMBER(SEARCH($A20,$C$1:$C$20)),1,0)),\"\",INDEX($C$1:$C$20,SMALL(IF(ISNUMBER(SEARCH($A20,$C$1:$C$20)),ROW($C$1:$C$20)-ROW($C$1)+1),COLUMNS($D$1:G20)))))","v":""},{"$f":"IF($A20=\"\",\"\",IF(COLUMNS($D$1:H20)>SUMPRODUCT(IF(ISNUMBER(SEARCH($A20,$C$1:$C$20)),1,0)),\"\",INDEX($C$1:$C$20,SMALL(IF(ISNUMBER(SEARCH($A20,$C$1:$C$20)),ROW($C$1:$C$20)-ROW($C$1)+1),COLUMNS($D$1:H20)))))","v":""},{"$f":"IF($A20=\"\",\"\",IF(COLUMNS($D$1:I20)>SUMPRODUCT(IF(ISNUMBER(SEARCH($A20,$C$1:$C$20)),1,0)),\"\",INDEX($C$1:$C$20,SMALL(IF(ISNUMBER(SEARCH($A20,$C$1:$C$20)),ROW($C$1:$C$20)-ROW($C$1)+1),COLUMNS($D$1:I20)))))","v":""},{"$f":"IF($A20=\"\",\"\",IF(COLUMNS($D$1:J20)>SUMPRODUCT(IF(ISNUMBER(SEARCH($A20,$C$1:$C$20)),1,0)),\"\",INDEX($C$1:$C$20,SMALL(IF(ISNUMBER(SEARCH($A20,$C$1:$C$20)),ROW($C$1:$C$20)-ROW($C$1)+1),COLUMNS($D$1:J20)))))","v":""}]
[null,null,null,{"$f":"IF($A21=\"\",\"\",IF(COLUMNS($D$1:D21)>SUMPRODUCT(IF(ISNUMBER(SEARCH($A21,$C$1:$C$20)),1,0)),\"\",INDEX($C$1:$C$20,SMALL(IF(ISNUMBER(SEARCH($A21,$C$1:$C$20)),ROW($C$1:$C$20)-ROW($C$1)+1),COLUMNS($D$1:D21)))))","v":""},{"$f":"IF($A21=\"\",\"\",IF(COLUMNS($D$1:E21)>SUMPRODUCT(IF(ISNUMBER(SEARCH($A21,$C$1:$C$20)),1,0)),\"\",INDEX($C$1:$C$20,SMALL(IF(ISNUMBER(SEARCH($A21,$C$1:$C$20)),ROW($C$1:$C$20)-ROW($C$1)+1),COLUMNS($D$1:E21)))))","v":""},{"$f":"IF($A21=\"\",\"\",IF(COLUMNS($D$1:F21)>SUMPRODUCT(IF(ISNUMBER(SEARCH($A21,$C$1:$C$20)),1,0)),\"\",INDEX($C$1:$C$20,SMALL(IF(ISNUMBER(SEARCH($A21,$C$1:$C$20)),ROW($C$1:$C$20)-ROW($C$1)+1),COLUMNS($D$1:F21)))))","v":""},{"$f":"IF($A21=\"\",\"\",IF(COLUMNS($D$1:G21)>SUMPRODUCT(IF(ISNUMBER(SEARCH($A21,$C$1:$C$20)),1,0)),\"\",INDEX($C$1:$C$20,SMALL(IF(ISNUMBER(SEARCH($A21,$C$1:$C$20)),ROW($C$1:$C$20)-ROW($C$1)+1),COLUMNS($D$1:G21)))))","v":""},{"$f":"IF($A21=\"\",\"\",IF(COLUMNS($D$1:H21)>SUMPRODUCT(IF(ISNUMBER(SEARCH($A21,$C$1:$C$20)),1,0)),\"\",INDEX($C$1:$C$20,SMALL(IF(ISNUMBER(SEARCH($A21,$C$1:$C$20)),ROW($C$1:$C$20)-ROW($C$1)+1),COLUMNS($D$1:H21)))))","v":""},{"$f":"IF($A21=\"\",\"\",IF(COLUMNS($D$1:I21)>SUMPRODUCT(IF(ISNUMBER(SEARCH($A21,$C$1:$C$20)),1,0)),\"\",INDEX($C$1:$C$20,SMALL(IF(ISNUMBER(SEARCH($A21,$C$1:$C$20)),ROW($C$1:$C$20)-ROW($C$1)+1),COLUMNS($D$1:I21)))))","v":""},{"$f":"IF($A21=\"\",\"\",IF(COLUMNS($D$1:J21)>SUMPRODUCT(IF(ISNUMBER(SEARCH($A21,$C$1:$C$20)),1,0)),\"\",INDEX($C$1:$C$20,SMALL(IF(ISNUMBER(SEARCH($A21,$C$1:$C$20)),ROW($C$1:$C$20)-ROW($C$1)+1),COLUMNS($D$1:J21)))))","v":""}]
[null,null,null,{"$f":"IF($A22=\"\",\"\",IF(COLUMNS($D$1:D22)>SUMPRODUCT(IF(ISNUMBER(SEARCH($A22,$C$1:$C$20)),1,0)),\"\",INDEX($C$1:$C$20,SMALL(IF(ISNUMBER(SEARCH($A22,$C$1:$C$20)),ROW($C$1:$C$20)-ROW($C$1)+1),COLUMNS($D$1:D22)))))","v":""},{"$f":"IF($A22=\"\",\"\",IF(COLUMNS($D$1:E22)>SUMPRODUCT(IF(ISNUMBER(SEARCH($A22,$C$1:$C$20)),1,0)),\"\",INDEX($C$1:$C$20,SMALL(IF(ISNUMBER(SEARCH($A22,$C$1:$C$20)),ROW($C$1:$C$20)-ROW($C$1)+1),COLUMNS($D$1:E22)))))","v":""},{"$f":"IF($A22=\"\",\"\",IF(COLUMNS($D$1:F22)>SUMPRODUCT(IF(ISNUMBER(SEARCH($A22,$C$1:$C$20)),1,0)),\"\",INDEX($C$1:$C$20,SMALL(IF(ISNUMBER(SEARCH($A22,$C$1:$C$20)),ROW($C$1:$C$20)-ROW($C$1)+1),COLUMNS($D$1:F22)))))","v":""},{"$f":"IF($A22=\"\",\"\",IF(COLUMNS($D$1:G22)>SUMPRODUCT(IF(ISNUMBER(SEARCH($A22,$C$1:$C$20)),1,0)),\"\",INDEX($C$1:$C$20,SMALL(IF(ISNUMBER(SEARCH($A22,$C$1:$C$20)),ROW($C$1:$C$20)-ROW($C$1)+1),COLUMNS($D$1:G22)))))","v":""},{"$f":"IF($A22=\"\",\"\",IF(COLUMNS($D$1:H22)>SUMPRODUCT(IF(ISNUMBER(SEARCH($A22,$C$1:$C$20)),1,0)),\"\",INDEX($C$1:$C$20,SMALL(IF(ISNUMBER(SEARCH($A22,$C$1:$C$20)),ROW($C$1:$C$20)-ROW($C$1)+1),COLUMNS($D$1:H22)))))","v":""},{"$f":"IF($A22=\"\",\"\",IF(COLUMNS($D$1:I22)>SUMPRODUCT(IF(ISNUMBER(SEARCH($A22,$C$1:$C$20)),1,0)),\"\",INDEX($C$1:$C$20,SMALL(IF(ISNUMBER(SEARCH($A22,$C$1:$C$20)),ROW($C$1:$C$20)-ROW($C$1)+1),COLUMNS($D$1:I22)))))","v":""},{"$f":"IF($A22=\"\",\"\",IF(COLUMNS($D$1:J22)>SUMPRODUCT(IF(ISNUMBER(SEARCH($A22,$C$1:$C$20)),1,0)),\"\",INDEX($C$1:$C$20,SMALL(IF(ISNUMBER(SEARCH($A22,$C$1:$C$20)),ROW($C$1:$C$20)-ROW($C$1)+1),COLUMNS($D$1:J22)))))","v":""}]
[null,null,null,{"$f":"IF($A23=\"\",\"\",IF(COLUMNS($D$1:D23)>SUMPRODUCT(IF(ISNUMBER(SEARCH($A23,$C$1:$C$20)),1,0)),\"\",INDEX($C$1:$C$20,SMALL(IF(ISNUMBER(SEARCH($A23,$C$1:$C$20)),ROW($C$1:$C$20)-ROW($C$1)+1),COLUMNS($D$1:D23)))))","v":""},{"$f":"IF($A23=\"\",\"\",IF(COLUMNS($D$1:E23)>SUMPRODUCT(IF(ISNUMBER(SEARCH($A23,$C$1:$C$20)),1,0)),\"\",INDEX($C$1:$C$20,SMALL(IF(ISNUMBER(SEARCH($A23,$C$1:$C$20)),ROW($C$1:$C$20)-ROW($C$1)+1),COLUMNS($D$1:E23)))))","v":""},{"$f":"IF($A23=\"\",\"\",IF(COLUMNS($D$1:F23)>SUMPRODUCT(IF(ISNUMBER(SEARCH($A23,$C$1:$C$20)),1,0)),\"\",INDEX($C$1:$C$20,SMALL(IF(ISNUMBER(SEARCH($A23,$C$1:$C$20)),ROW($C$1:$C$20)-ROW($C$1)+1),COLUMNS($D$1:F23)))))","v":""},{"$f":"IF($A23=\"\",\"\",IF(COLUMNS($D$1:G23)>SUMPRODUCT(IF(ISNUMBER(SEARCH($A23,$C$1:$C$20)),1,0)),\"\",INDEX($C$1:$C$20,SMALL(IF(ISNUMBER(SEARCH($A23,$C$1:$C$20)),ROW($C$1:$C$20)-ROW($C$1)+1),COLUMNS($D$1:G23)))))","v":""},{"$f":"IF($A23=\"\",\"\",IF(COLUMNS($D$1:H23)>SUMPRODUCT(IF(ISNUMBER(SEARCH($A23,$C$1:$C$20)),1,0)),\"\",INDEX($C$1:$C$20,SMALL(IF(ISNUMBER(SEARCH($A23,$C$1:$C$20)),ROW($C$1:$C$20)-ROW($C$1)+1),COLUMNS($D$1:H23)))))","v":""},{"$f":"IF($A23=\"\",\"\",IF(COLUMNS($D$1:I23)>SUMPRODUCT(IF(ISNUMBER(SEARCH($A23,$C$1:$C$20)),1,0)),\"\",INDEX($C$1:$C$20,SMALL(IF(ISNUMBER(SEARCH($A23,$C$1:$C$20)),ROW($C$1:$C$20)-ROW($C$1)+1),COLUMNS($D$1:I23)))))","v":""},{"$f":"IF($A23=\"\",\"\",IF(COLUMNS($D$1:J23)>SUMPRODUCT(IF(ISNUMBER(SEARCH($A23,$C$1:$C$20)),1,0)),\"\",INDEX($C$1:$C$20,SMALL(IF(ISNUMBER(SEARCH($A23,$C$1:$C$20)),ROW($C$1:$C$20)-ROW($C$1)+1),COLUMNS($D$1:J23)))))","v":""}]

{"sheet":"salim_macro","index":1,"n_rows":13,"n_cols":7,"rows_kept":13,"cut":false,"hidden":false,"merged":[]}
[]
[]
[]
["J125956",null,"J125956 - علي - 1231",null,"J125956 - علي - 1231","J125956 - احمد - 1234","J125956 - مصطفى - 1235"]
["J126556 ",null,"J126556 - محمد - 1232",null,"J126556 - محمد - 1232"]
["J165556",null,"J165556 - عبدالله - 1233",null,"J165556 - عبدالله - 1233"]
["J125956",null,"J125956 - احمد - 1234",null,"J125956 - علي - 1231","J125956 - احمد - 1234","J125956 - مصطفى - 1235"]
["J154156",null,"J125956 - مصطفى - 1235"]
["J126520 ",null,"J126520 - ×سليم - 1232",null,"J126520 - ×سليم - 1232","J126520 - ×خليل - 1233"]
[null,null,"J126520 - ×خليل - 1233"]
[]
[]
[null,"`"]

{"sheet":"ورقة2","index":2,"n_rows":0,"n_cols":0,"rows_kept":0,"cut":false,"hidden":false,"merged":[]}

{"sheet":"ورقة3","index":3,"n_rows":0,"n_cols":0,"rows_kept":0,"cut":false,"hidden":false,"merged":[]}