{"text_format":"1","workbook":"xlsx","n_sheets":2,"sheets":["الجدول","عرض جدول"],"not_rendered":{"charts":0,"images":0,"macros":1,"external_links":0,"defined_names":6,"comments":0,"pivot_tables":0},"unopened":[],"bounds":{"document_bytes":16777216,"sheet_cells":100000,"rows_first":2000,"rows_last":500,"rows_between":2000,"halvings":0,"cell_chars":16384,"cell_head_chars":4096},"cells_cut":0,"cells_raw":0,"read":"whole","date_system":"1900"}

{"sheet":"الجدول","index":0,"n_rows":102,"n_cols":54,"rows_kept":102,"cut":false,"hidden":false,"merged":[[3,49,3,53],[3,7,3,13],[3,15,3,21],[3,39,3,45],[3,31,3,37],[3,23,3,29]]}
[]
[]
[]
[null,null,null,null,null,null,null,"الاحـــــــــــــــــــــــــد",null,null,null,null,null,null,null,"الاثنـــــــــــــــــــــــين",null,null,null,null,null,null,null,"الثـــــــــــــــــــــــــلاثاء",null,null,null,null,null,null,null,"الاربعــــــــــــــــــــــــاء",null,null,null,null,null,null,null,"الخميــــــــــــــــــــــــــــــــــس",null,null,null,null,null,null,null,null,null,"عدد الحصص في اليوم"]
[null,"الرقم","اسم المعلم","السنة التي يدرسها","المادة التي يدرسها","عدد الحصص",null,"ح1","ح2","ح3","ح4","ح5","ح6","ح7",null,"ثن1","ثن2","ثن3","ثن4","ثن5","ثن6","ثن7",null,"ثل1","ثل2","ثل3","ثل4","ثل5","ثل6","ثل7",null,"ر1","ر2","ر3","ر4","ر5","ر6","ر7",null,"خ1","خ2","خ3","خ4","خ5","خ6","خ7",null,"القترة",null,"الأحد","الإثنين","الثلاثاء","الأربعاء","الخميس"]
[null,{"$f":"IF(C6=\"\",\"\",SUBTOTAL(3,$C$6:C6))","v":1},"معلم 1","اولى","تربية اسلامية",{"$f":"SUMPRODUCT(--(H6:AT6<>\"\"))","v":12},null,null,null,"","2/1","1/1","","",null,"","","","",null,"3/1","4/1",null,"","","","","6/1","1/1","4/1",null,"3/1","5/1","6/1",null,"","","",null,"","","","2/1","5/1","","",null,"صباحية",{"$f":"C6","v":"معلم 1"},{"$f":"SUMPRODUCT(--(H6:N6<>\"\"))","v":2},{"$f":"SUMPRODUCT(--(P6:V6<>\"\"))","v":2},{"$f":"SUMPRODUCT(--(X6:AD6<>\"\"))","v":3},{"$f":"SUMPRODUCT(--(AF6:AL6<>\"\"))","v":3},{"$f":"SUMPRODUCT(--(AN6:AT6<>\"\"))","v":2}]
[null,{"$f":"IF(C7=\"\",\"\",SUBTOTAL(3,$C$6:C7))","v":2},"معلم 2","ثانية علمي + ادبي","تربية اسلامية",10,null,"","",null,"2 / د","2/2","","",null,"","","","1/2","3/2","","",null,"4/2","2 / د",null,"","","","",null,"","","","","","1/2","2/2",null,null,null,null,"3/2","4/2","","",null,"صباحية","معلم 2",2,2,2,2,2]
[null,{"$f":"IF(C8=\"\",\"\",SUBTOTAL(3,$C$6:C8))","v":3},"معلم 3","ثالثة علمي + ادبي","تربية اسلامية",14,null,"","","",null," 3 / د","1/3","2/3",null,"","",null,null,"3/3","4/3"," 3 / د",null,"","","","","3/3","5/3","6/3",null,"2/3","4/3","",null,null,null,null,null,"","",null,null,"1/3","6/3","5/3",null,"صباحية","معلم 3",3,3,3,2,3]
[null,{"$f":"IF(C9=\"\",\"\",SUBTOTAL(3,$C$6:C9))","v":4},"معلم 4","اولى","تربية اسلامية",10,null,null,null,null,null,null,"2/1","1/1",null,null,null,"4/1","5/1",null,null,null,null,null,null,null,null,null,"6/1","4/1",null,null,null,null,null,null,"6/1","5/1",null,"1/1","2/1",null,null,null,null,null,null,"مسائية","معلم 4",2,2,2,2,2]
[null,{"$f":"IF(C10=\"\",\"\",SUBTOTAL(3,$C$6:C10))","v":5},"معلم 5","اولى + ثانية علمي","تربية اسلامية",8,null,null,null,null,null,null,null,"3/1",null,null,null,null,null,null,null,"1/2",null,null,"2/2",null,"1/2",null,null,null,null,"3/2","3/1",null,null,null,null,null,null,null,null,null,null,null,"3/2","2/2",null,"مسائية","معلم 5",1,1,2,2,2]
[null,{"$f":"IF(C11=\"\",\"\",SUBTOTAL(3,$C$6:C11))","v":6},"معلم 6","ثانية علمي","لغة عربية",10,null,null,null,null,null,null,"3/2","4/2",null,null,null,null,null,"4/2","3/2",null,null,null,null,null,null,"4/2","3/2",null,null,null,null,null,null,"3/2","4/2",null,null,"3/2","4/2",null,null,null,null,null,null,"صباحية","معلم 6",2,2,2,2,2]
[null,{"$f":"IF(C12=\"\",\"\",SUBTOTAL(3,$C$6:C12))","v":7},"معلم 7","أولى","لغة عربية",10,null,"2/1","1/1",null,null,null,null,null,null,"1/1",null,"2/1",null,null,null,null,null,null,null,null,null,null,"2/1","1/1",null,null,null,null,null,null,"1/1","2/1",null,"2/1","1/1",null,null,null,null,null,null,"صباحية","معلم 7",2,2,2,2,2]
[null,{"$f":"IF(C13=\"\",\"\",SUBTOTAL(3,$C$6:C13))","v":8},"معلم 8","اولى","لغة عربية",10,null,"","3/1","4/1",null,null,"","",null,null,null,null,"4/1","3/1","","",null,"4/1","3/1",null,null,"",null,null,null,"","","","","","4/1","3/1",null,"3/1","4/1",null,"",null,null,"",null,"صباحية","معلم 8",2,2,2,2,2]
[null,{"$f":"IF(C14=\"\",\"\",SUBTOTAL(3,$C$6:C14))","v":9},"معلم 9","ثالثة علمي","لغة عربية",10,null,"",null,null,"","5/3","6/3","",null,"","","5/3","6/3",null,"","",null,"5/3","6/3",null,null,null,null,null,null,"","","","","","5/3","6/3",null,"","",null,null,"6/3","5/3","",null,"صباحية","معلم 9",2,2,2,2,2]
[null,{"$f":"IF(C15=\"\",\"\",SUBTOTAL(3,$C$6:C15))","v":10},"معلم 10","ثانية علمي","لغة عربية",10,null,"","","",null,null,"1/2","2/2",null,"","","","","","2/2","1/2",null,null,"",null,"","2/2","1/2",null,null,"","",null,null,null,"2/2","1/2",null,null,null,"2/2","1/2","","","",null,"صباحية","معلم 10",2,2,2,2,2]
[null,{"$f":"IF(C16=\"\",\"\",SUBTOTAL(3,$C$6:C16))","v":11},"معلم 11","ثالثة ادبي","لغة عربية",9,null,""," 3 / د"," 3 / د","","",null,null,null,null," 3 / د"," 3 / د","","","","",null,null,""," 3 / د","",null,null,"",null," 3 / د"," 3 / د",null,"",null,null,null,null,null," 3 / د"," 3 / د",null,"","","",null,"صباحية","معلم 11",2,2,1,2,2]
[null,{"$f":"IF(C17=\"\",\"\",SUBTOTAL(3,$C$6:C17))","v":12},"معلم 12","اولى","لغة عربية",10,null,"","","","6/1","5/1",null,null,null,null,null,"","","","6/1","5/1",null,null,"","","","","6/1","5/1",null,"","","","5/1","6/1",null,"",null,"5/1","6/1",null,"","","","",null,"صباحية","معلم 12",2,2,2,2,2]
[null,{"$f":"IF(C18=\"\",\"\",SUBTOTAL(3,$C$6:C18))","v":13},"معلم 13","ثالثة علمي","لغة عربية",10,null,"","","1/3","2/3",null,null,"",null,"","",null,null,null,"1/3","2/3",null,"",null,"2/3","1/3","","","",null,"",null,null,"1/3","2/3",null,null,null,"","","","",null,"2/3","1/3",null,"صباحية","معلم 13",2,2,2,2,2]
[null,{"$f":"IF(C19=\"\",\"\",SUBTOTAL(3,$C$6:C19))","v":14},"معلم 14","ثالثة علمي","لغة عربية",10,null,"3/3","4/3",null,null,null,null,"",null,"3/3","4/3","","","",null,null,null,null,null,"","","","4/3","3/3",null,"","","","4/3","3/3","","",null,"","",null,null,"","3/3","4/3",null,"صباحية","معلم 14",2,2,2,2,2]
[null,{"$f":"IF(C20=\"\",\"\",SUBTOTAL(3,$C$6:C20))","v":15},"معلم 15","ثانية ادبي","لغة عربية",9,null,"",null,null,null,null,"2 / د","2 / د",null,"2 / د","2 / د","","","","","",null,"2 / د",null,null,null,"","","",null,"2 / د","2 / د","","","","","",null,"2 / د","2 / د","",null,"","","",null,"صباحية","معلم 15",2,2,1,2,2]
{"$rows_left_out":83}
{"sheet":"عرض جدول","index":1,"n_rows":47,"n_cols":26,"rows_kept":47,"cut":false,"hidden":false,"merged":[[3,6,3,14],[5,14,5,18],[24,16,24,17],[8,3,8,6],[8,7,8,8],[8,12,8,15],[8,16,8,17],[16,3,16,6],[16,7,16,8],[16,12,16,15],[16,16,16,17],[24,3,24,6],[24,12,24,15],[24,7,24,8],[32,16,32,17],[32,7,32,8],[40,7,40,8],[40,16,40,17],[4,6,4,14],[32,3,32,6],[40,3,40,6],[32,12,32,15],[40,12,40,15],[5,2,5,3],[5,4,5,7]]}
[]
[]
[]
[null,null,null,null,null,null,"عرض الجداول"]
[null,null,null,null,null,null,null,null,null,null,null,null,null,null,null,null,null,null,null,null,null,null,null,null,null,"عدد معلمي المادة"]
[null,null,"جداول معلمي مـادة:",null,"اللغة_العربية",null,null,null,null,null,null,null,null,null,null,null,null,null,null,null,null,null,null,null,null,{"$f":"COUNTA(Profs_Mat)","v":14}]
[]
[]
[null,1,"اسم المدرس",{"$f":"IFERROR(IF(B9<=COUNTA(Profs_Mat),INDEX(Profs_Mat,B9),\"\"),\"\")","v":"معلم 6"},null,null,null,"عدد الحصص",null,{"$f":"IF(D9=\"\",\"\",COUNTA(D11:J15)-COUNTBLANK(D11:J15)-COUNT(D11:J15))","v":10},{"$f":"B9+1","v":2},"اسم المدرس",{"$f":"IF(K9<=COUNTA(Profs_Mat),INDEX(Profs_Mat,K9),\"\")","v":"معلم 7"},null,null,null,"عدد الحصص",null,{"$f":"IF(M9=\"\",\"\",COUNTA(M11:S15)-COUNTBLANK(M11:S15)-COUNT(M11:S15))","v":10}]
[null,null,"اليوم",1,2,3,4,5,6,7,null,"اليوم",1,2,3,4,5,6,7]
[null,null,"الأحــد",{"$f":"IFERROR(IF($D$9=\"\",\"\",INDEX(الجدول!$H$6:$H$107,MATCH($D$9,data,0))),\"\")","v":0},{"$f":"IFERROR(IF($D$9=\"\",\"\",INDEX(الجدول!$I$6:$I$107,MATCH($D$9,data,0))),\"\")","v":0},{"$f":"IFERROR(IF($D$9=\"\",\"\",INDEX(الجدول!$J$6:$J$107,MATCH($D$9,data,0))),\"\")","v":0},{"$f":"IFERROR(IF($D$9=\"\",\"\",INDEX(الجدول!$K$6:$K$107,MATCH($D$9,data,0))),\"\")","v":0},{"$f":"IFERROR(IF($D$9=\"\",\"\",INDEX(الجدول!$L$6:$L$107,MATCH($D$9,data,0))),\"\")","v":0},{"$f":"IFERROR(IF($D$9=\"\",\"\",INDEX(الجدول!$M$6:$M$107,MATCH($D$9,data,0))),\"\")","v":"3/2"},{"$f":"IFERROR(IF($D$9=\"\",\"\",INDEX(الجدول!$N$6:$N$107,MATCH($D$9,data,0))),\"\")","v":"4/2"},null,"الأحــد",{"$f":"IFERROR(IF($M$9=\"\",\"\",INDEX(الجدول!$H$6:$H$107,MATCH($M$9,data,0))),\"\")","v":"2/1"},{"$f":"IFERROR(IF($M$9=\"\",\"\",INDEX(الجدول!$I$6:$I$107,MATCH($M$9,data,0))),\"\")","v":"1/1"},{"$f":"IFERROR(IF($M$9=\"\",\"\",INDEX(الجدول!$J$6:$J$107,MATCH($M$9,data,0))),\"\")","v":0},{"$f":"IFERROR(IF($M$9=\"\",\"\",INDEX(الجدول!$K$6:$K$107,MATCH($M$9,data,0))),\"\")","v":0},{"$f":"IFERROR(IF($M$9=\"\",\"\",INDEX(الجدول!$L$6:$L$107,MATCH($M$9,data,0))),\"\")","v":0},{"$f":"IFERROR(IF($M$9=\"\",\"\",INDEX(الجدول!$M$6:$M$107,MATCH($M$9,data,0))),\"\")","v":0},{"$f":"IFERROR(IF($M$9=\"\",\"\",INDEX(الجدول!$N$6:$N$107,MATCH($M$9,data,0))),\"\")","v":0},null,null,null,null,null,"اللغة_العربية","لغة عربية"]
[null,null,"الاثنين",{"$f":"IFERROR(IF($D$9=\"\",\"\",INDEX(الجدول!$P$6:$P$107,MATCH($D$9,data,0))),\"\")","v":0},{"$f":"IFERROR(IF($D$9=\"\",\"\",INDEX(الجدول!$Q$6:$Q$107,MATCH($D$9,data,0))),\"\")","v":0},{"$f":"IFERROR(IF($D$9=\"\",\"\",INDEX(الجدول!$R$6:$R$107,MATCH($D$9,data,0))),\"\")","v":0},{"$f":"IFERROR(IF($D$9=\"\",\"\",INDEX(الجدول!$S$6:$S$107,MATCH($D$9,data,0))),\"\")","v":0},{"$f":"IFERROR(IF($D$9=\"\",\"\",INDEX(الجدول!$T$6:$T$107,MATCH($D$9,data,0))),\"\")","v":"4/2"},{"$f":"IFERROR(IF($D$9=\"\",\"\",INDEX(الجدول!$U$6:$U$107,MATCH($D$9,data,0))),\"\")","v":"3/2"},{"$f":"IFERROR(IF($D$9=\"\",\"\",INDEX(الجدول!$V$6:$V$107,MATCH($D$9,data,0))),\"\")","v":0},null,"الاثنين",{"$f":"IFERROR(IF($M$9=\"\",\"\",INDEX(الجدول!$P$6:$P$107,MATCH($M$9,data,0))),\"\")","v":"1/1"},{"$f":"IFERROR(IF($M$9=\"\",\"\",INDEX(الجدول!$Q$6:$Q$107,MATCH($M$9,data,0))),\"\")","v":0},{"$f":"IFERROR(IF($M$9=\"\",\"\",INDEX(الجدول!$R$6:$R$107,MATCH($M$9,data,0))),\"\")","v":"2/1"},{"$f":"IFERROR(IF($M$9=\"\",\"\",INDEX(الجدول!$S$6:$S$107,MATCH($M$9,data,0))),\"\")","v":0},{"$f":"IFERROR(IF($M$9=\"\",\"\",INDEX(الجدول!$T$6:$T$107,MATCH($M$9,data,0))),\"\")","v":0},{"$f":"IFERROR(IF($M$9=\"\",\"\",INDEX(الجدول!$U$6:$U$107,MATCH($M$9,data,0))),\"\")","v":0},{"$f":"IFERROR(IF($M$9=\"\",\"\",INDEX(الجدول!$V$6:$V$107,MATCH($M$9,data,0))),\"\")","v":0},null,null,null,null,null,"التربية_الإسلامية","تربية اسلامية"]
[null,null,"الثلاثاء",{"$f":"IFERROR(IF($D$9=\"\",\"\",INDEX(الجدول!$X$6:$X$107,MATCH($D$9,data,0))),\"\")","v":0},{"$f":"IFERROR(IF($D$9=\"\",\"\",INDEX(الجدول!$Y$6:$Y$107,MATCH($D$9,data,0))),\"\")","v":0},{"$f":"IFERROR(IF($D$9=\"\",\"\",INDEX(الجدول!$Z$6:$Z$107,MATCH($D$9,data,0))),\"\")","v":0},{"$f":"IFERROR(IF($D$9=\"\",\"\",INDEX(الجدول!$AA$6:$AA$107,MATCH($D$9,data,0))),\"\")","v":0},{"$f":"IFERROR(IF($D$9=\"\",\"\",INDEX(الجدول!$AB$6:$AB$107,MATCH($D$9,data,0))),\"\")","v":"4/2"},{"$f":"IFERROR(IF($D$9=\"\",\"\",INDEX(الجدول!$AC$6:$AC$107,MATCH($D$9,data,0))),\"\")","v":"3/2"},{"$f":"IFERROR(IF($D$9=\"\",\"\",INDEX(الجدول!$AD$6:$AD$107,MATCH($D$9,data,0))),\"\")","v":0},null,"الثلاثاء",{"$f":"IFERROR(IF($M$9=\"\",\"\",INDEX(الجدول!$X$6:$X$107,MATCH($M$9,data,0))),\"\")","v":0},{"$f":"IFERROR(IF($M$9=\"\",\"\",INDEX(الجدول!$Y$6:$Y$107,MATCH($M$9,data,0))),\"\")","v":0},{"$f":"IFERROR(IF($M$9=\"\",\"\",INDEX(الجدول!$Z$6:$Z$107,MATCH($M$9,data,0))),\"\")","v":0},{"$f":"IFERROR(IF($M$9=\"\",\"\",INDEX(الجدول!$AA$6:$AA$107,MATCH($M$9,data,0))),\"\")","v":0},{"$f":"IFERROR(IF($M$9=\"\",\"\",INDEX(الجدول!$AB$6:$AB$107,MATCH($M$9,data,0))),\"\")","v":0},{"$f":"IFERROR(IF($M$9=\"\",\"\",INDEX(الجدول!$AC$6:$AC$107,MATCH($M$9,data,0))),\"\")","v":"2/1"},{"$f":"IFERROR(IF($M$9=\"\",\"\",INDEX(الجدول!$AD$6:$AD$107,MATCH($M$9,data,0))),\"\")","v":"1/1"},null,null,null,null,null,"اللغة_الإنجليزية","لغة انجليزية"]
[null,null,"الأربعاء",{"$f":"IFERROR(IF($D$9=\"\",\"\",INDEX(الجدول!$AF$6:$AF$107,MATCH($D$9,data,0))),\"\")","v":0},{"$f":"IFERROR(IF($D$9=\"\",\"\",INDEX(الجدول!$AG$6:$AG$107,MATCH($D$9,data,0))),\"\")","v":0},{"$f":"IFERROR(IF($D$9=\"\",\"\",INDEX(الجدول!$AH$6:$AH$107,MATCH($D$9,data,0))),\"\")","v":0},{"$f":"IFERROR(IF($D$9=\"\",\"\",INDEX(الجدول!$AI$6:$AI$107,MATCH($D$9,data,0))),\"\")","v":0},{"$f":"IFERROR(IF($D$9=\"\",\"\",INDEX(الجدول!$AJ$6:$AJ$107,MATCH($D$9,data,0))),\"\")","v":"3/2"},{"$f":"IFERROR(IF($D$9=\"\",\"\",INDEX(الجدول!$AK$6:$AK$107,MATCH($D$9,data,0))),\"\")","v":"4/2"},{"$f":"IFERROR(IF($D$9=\"\",\"\",INDEX(الجدول!$AL$6:$AL$107,MATCH($D$9,data,0))),\"\")","v":0},null,"الأربعاء",{"$f":"IFERROR(IF($M$9=\"\",\"\",INDEX(الجدول!$AF$6:$AF$107,MATCH($M$9,data,0))),\"\")","v":0},{"$f":"IFERROR(IF($M$9=\"\",\"\",INDEX(الجدول!$AG$6:$AG$107,MATCH($M$9,data,0))),\"\")","v":0},{"$f":"IFERROR(IF($M$9=\"\",\"\",INDEX(الجدول!$AH$6:$AH$107,MATCH($M$9,data,0))),\"\")","v":0},{"$f":"IFERROR(IF($M$9=\"\",\"\",INDEX(الجدول!$AI$6:$AI$107,MATCH($M$9,data,0))),\"\")","v":0},{"$f":"IFERROR(IF($M$9=\"\",\"\",INDEX(الجدول!$AJ$6:$AJ$107,MATCH($M$9,data,0))),\"\")","v":0},{"$f":"IFERROR(IF($M$9=\"\",\"\",INDEX(الجدول!$AK$6:$AK$107,MATCH($M$9,data,0))),\"\")","v":"1/1"},{"$f":"IFERROR(IF($M$9=\"\",\"\",INDEX(الجدول!$AL$6:$AL$107,MATCH($M$9,data,0))),\"\")","v":"2/1"},null,null,null,null,null,"تقنية_المعلومات","حاسوب"]
[null,null,"الخميس",{"$f":"IFERROR(IF($D$9=\"\",\"\",INDEX(الجدول!$AN$6:$AN$107,MATCH($D$9,data,0))),\"\")","v":"3/2"},{"$f":"IFERROR(IF($D$9=\"\",\"\",INDEX(الجدول!$AO$6:$AO$107,MATCH($D$9,data,0))),\"\")","v":"4/2"},{"$f":"IFERROR(IF($D$9=\"\",\"\",INDEX(الجدول!$AP$6:$AP$107,MATCH($D$9,data,0))),\"\")","v":0},{"$f":"IFERROR(IF($D$9=\"\",\"\",INDEX(الجدول!$AQ$6:$AQ$107,MATCH($D$9,data,0))),\"\")","v":0},{"$f":"IFERROR(IF($D$9=\"\",\"\",INDEX(الجدول!$AR$6:$AR$107,MATCH($D$9,data,0))),\"\")","v":0},{"$f":"IFERROR(IF($D$9=\"\",\"\",INDEX(الجدول!$AS$6:$AS$107,MATCH($D$9,data,0))),\"\")","v":0},{"$f":"IFERROR(IF($D$9=\"\",\"\",INDEX(الجدول!$AT$6:$AT$107,MATCH($D$9,data,0))),\"\")","v":0},null,"الخميس",{"$f":"IFERROR(IF($M$9=\"\",\"\",INDEX(الجدول!$AN$6:$AN$107,MATCH($M$9,data,0))),\"\")","v":"2/1"},{"$f":"IFERROR(IF($M$9=\"\",\"\",INDEX(الجدول!$AO$6:$AO$107,MATCH($M$9,data,0))),\"\")","v":"1/1"},{"$f":"IFERROR(IF($M$9=\"\",\"\",INDEX(الجدول!$AP$6:$AP$107,MATCH($M$9,data,0))),\"\")","v":0},{"$f":"IFERROR(IF($M$9=\"\",\"\",INDEX(الجدول!$AQ$6:$AQ$107,MATCH($M$9,data,0))),\"\")","v":0},{"$f":"IFERROR(IF($M$9=\"\",\"\",INDEX(الجدول!$AR$6:$AR$107,MATCH($M$9,data,0))),\"\")","v":0},{"$f":"IFERROR(IF($M$9=\"\",\"\",INDEX(الجدول!$AS$6:$AS$107,MATCH($M$9,data,0))),\"\")","v":0},{"$f":"IFERROR(IF($M$9=\"\",\"\",INDEX(الجدول!$AT$6:$AT$107,MATCH($M$9,data,0))),\"\")","v":0},null,null,null,null,null,"الرياضيات","رياضيات"]
[null,null,null,null,null,null,null,null,null,null,null,null,null,null,null,null,null,null,null,null,null,null,null,null,"الإحصاء","احصاء"]
[null,{"$f":"K9+1","v":3},"اسم المدرس",{"$f":"IF(B17<=COUNTA(Profs_Mat),INDEX(Profs_Mat,B17),\"\")","v":"معلم 8"},null,null,null,"عدد الحصص",null,{"$f":"IF(D17=\"\",\"\",COUNTA(D19:J23)-COUNTBLANK(D19:J23)-COUNT(D19:J23))","v":10},{"$f":"B17+1","v":4},"اسم المدرس",{"$f":"IF(K17<=COUNTA(Profs_Mat),INDEX(Profs_Mat,K17),\"\")","v":"معلم 9"},null,null,null,"عدد الحصص",null,{"$f":"IF(M17=\"\",\"\",COUNTA(M19:S23)-COUNTBLANK(M19:S23)-COUNT(M19:S23))","v":10},null,null,null,null,null,"الفيزياء","فيزياء"]
[null,null,"اليوم",1,2,3,4,5,6,7,null,"اليوم",1,2,3,4,5,6,7,null,null,null,null,null,"الكيمياء","كيمياء"]
[null,null,"الأحــد",{"$f":"IFERROR(IF($D$17=\"\",\"\",INDEX(الجدول!$H$6:$H$107,MATCH($D$17,data,0))),\"\")","v":""},{"$f":"IFERROR(IF($D$17=\"\",\"\",INDEX(الجدول!$I$6:$I$107,MATCH($D$17,data,0))),\"\")","v":"3/1"},{"$f":"IFERROR(IF($D$17=\"\",\"\",INDEX(الجدول!$J$6:$J$107,MATCH($D$17,data,0))),\"\")","v":"4/1"},{"$f":"IFERROR(IF($D$17=\"\",\"\",INDEX(الجدول!$K$6:$K$107,MATCH($D$17,data,0))),\"\")","v":0},{"$f":"IFERROR(IF($D$17=\"\",\"\",INDEX(الجدول!$L$6:$L$107,MATCH($D$17,data,0))),\"\")","v":0},{"$f":"IFERROR(IF($D$17=\"\",\"\",INDEX(الجدول!$M$6:$M$107,MATCH($D$17,data,0))),\"\")","v":""},{"$f":"IFERROR(IF($D$17=\"\",\"\",INDEX(الجدول!$N$6:$N$107,MATCH($D$17,data,0))),\"\")","v":""},null,"الأحــد",{"$f":"IFERROR(IF($M$17=\"\",\"\",INDEX(الجدول!$H$6:$H$107,MATCH($M$17,data,0))),\"\")","v":""},{"$f":"IFERROR(IF($M$17=\"\",\"\",INDEX(الجدول!$I$6:$I$107,MATCH($M$17,data,0))),\"\")","v":0},{"$f":"IFERROR(IF($M$17=\"\",\"\",INDEX(الجدول!$J$6:$J$107,MATCH($M$17,data,0))),\"\")","v":0},{"$f":"IFERROR(IF($M$17=\"\",\"\",INDEX(الجدول!$K$6:$K$107,MATCH($M$17,data,0))),\"\")","v":""},{"$f":"IFERROR(IF($M$17=\"\",\"\",INDEX(الجدول!$L$6:$L$107,MATCH($M$17,data,0))),\"\")","v":"5/3"},{"$f":"IFERROR(IF($M$17=\"\",\"\",INDEX(الجدول!$M$6:$M$107,MATCH($M$17,data,0))),\"\")","v":"6/3"},{"$f":"IFERROR(IF($M$17=\"\",\"\",INDEX(الجدول!$N$6:$N$107,MATCH($M$17,data,0))),\"\")","v":""},null,null,null,null,null,"الأحياء","احياء"]
[null,null,"الاثنين",{"$f":"IFERROR(IF($D$17=\"\",\"\",INDEX(الجدول!$P$6:$P$107,MATCH($D$17,data,0))),\"\")","v":0},{"$f":"IFERROR(IF($D$17=\"\",\"\",INDEX(الجدول!$Q$6:$Q$107,MATCH($D$17,data,0))),\"\")","v":0},{"$f":"IFERROR(IF($D$17=\"\",\"\",INDEX(الجدول!$R$6:$R$107,MATCH($D$17,data,0))),\"\")","v":0},{"$f":"IFERROR(IF($D$17=\"\",\"\",INDEX(الجدول!$S$6:$S$107,MATCH($D$17,data,0))),\"\")","v":"4/1"},{"$f":"IFERROR(IF($D$17=\"\",\"\",INDEX(الجدول!$T$6:$T$107,MATCH($D$17,data,0))),\"\")","v":"3/1"},{"$f":"IFERROR(IF($D$17=\"\",\"\",INDEX(الجدول!$U$6:$U$107,MATCH($D$17,data,0))),\"\")","v":""},{"$f":"IFERROR(IF($D$17=\"\",\"\",INDEX(الجدول!$V$6:$V$107,MATCH($D$17,data,0))),\"\")","v":""},null,"الاثنين",{"$f":"IFERROR(IF($M$17=\"\",\"\",INDEX(الجدول!$P$6:$P$107,MATCH($M$17,data,0))),\"\")","v":""},{"$f":"IFERROR(IF($M$17=\"\",\"\",INDEX(الجدول!$Q$6:$Q$107,MATCH($M$17,data,0))),\"\")","v":""},{"$f":"IFERROR(IF($M$17=\"\",\"\",INDEX(الجدول!$R$6:$R$107,MATCH($M$17,data,0))),\"\")","v":"5/3"},{"$f":"IFERROR(IF($M$17=\"\",\"\",INDEX(الجدول!$S$6:$S$107,MATCH($M$17,data,0))),\"\")","v":"6/3"},{"$f":"IFERROR(IF($M$17=\"\",\"\",INDEX(الجدول!$T$6:$T$107,MATCH($M$17,data,0))),\"\")","v":0},{"$f":"IFERROR(IF($M$17=\"\",\"\",INDEX(الجدول!$U$6:$U$107,MATCH($M$17,data,0))),\"\")","v":""},{"$f":"IFERROR(IF($M$17=\"\",\"\",INDEX(الجدول!$V$6:$V$107,MATCH($M$17,data,0))),\"\")","v":""},null,null,null,null,null,"التاريخ","تاريخ"]
{"$rows_left_out":27}