{"text_format":"1","workbook":"xlsx","n_sheets":13,"sheets":["1","2","3","4","5","6","7","8","9","10","11","12","فاتورة مبيعات"],"not_rendered":{"charts":0,"images":0,"macros":0,"external_links":0,"defined_names":27,"comments":0,"pivot_tables":0},"unopened":[],"bounds":{"document_bytes":16777216,"sheet_cells":100000,"rows_first":2000,"rows_last":500,"rows_between":2000,"halvings":0,"cell_chars":16384,"cell_head_chars":4096},"cells_cut":0,"cells_raw":0,"read":"whole","date_system":"1900"}

{"sheet":"1","index":0,"n_rows":127,"n_cols":12,"rows_kept":127,"cut":false,"hidden":false,"merged":[[126,2,126,5],[124,2,124,5]]}
[]
[]
[]
[null,null,"مسلسل","رقم الفاتورة","تاريخ","اسم العميل","الكمية","سعر","قيمة","ض.ق.م","اجمالى المبيعات \nمضاف الضريبة","اجمالى \nقيمة الضريبة"]
[null,{"$f":"IF(AND('فاتورة مبيعات'!$F$3=E5,'فاتورة مبيعات'!$D$3=D5),COUNTIFS($E$5:E5,E5,$D$5:D5,D5),\"\")","v":""},1,258,"2019-01-15","س",12,100,{"$f":"H5*G5","v":1200},0.14000000000000001,{"$f":"I5*J5","v":168.00000000000003},{"$f":"I5+K5","v":1368}]
[null,{"$f":"IF(AND('فاتورة مبيعات'!$F$3=E6,'فاتورة مبيعات'!$D$3=D6),COUNTIFS($E$5:E6,E6,$D$5:D6,D6),\"\")","v":""},2,258,"2019-01-15","س",10,105,1050,0.14000000000000001,147,{"$f":"I6+K6","v":1197}]
[null,{"$f":"IF(AND('فاتورة مبيعات'!$F$3=E7,'فاتورة مبيعات'!$D$3=D7),COUNTIFS($E$5:E7,E7,$D$5:D7,D7),\"\")","v":""},3,258,"2019-01-15","س",20,105,2100,0.14000000000000001,294,{"$f":"I7+K7","v":2394}]
[null,{"$f":"IF(AND('فاتورة مبيعات'!$F$3=E8,'فاتورة مبيعات'!$D$3=D8),COUNTIFS($E$5:E8,E8,$D$5:D8,D8),\"\")","v":""},4,258,"2019-01-15","س",50,105,5250,0.14000000000000001,735.00000000000011,{"$f":"I8+K8","v":5985}]
[null,{"$f":"IF(AND('فاتورة مبيعات'!$F$3=E9,'فاتورة مبيعات'!$D$3=D9),COUNTIFS($E$5:E9,E9,$D$5:D9,D9),\"\")","v":""},5,258,"2019-01-15","س",22,105,2310,0.14000000000000001,323.40000000000003,2633.4]
[null,{"$f":"IF(AND('فاتورة مبيعات'!$F$3=E10,'فاتورة مبيعات'!$D$3=D10),COUNTIFS($E$5:E10,E10,$D$5:D10,D10),\"\")","v":""},6,259,"2019-01-15","ص",null,null,0,0.14000000000000001,0,0]
{"$rows_left_out":118}
{"sheet":"2","index":1,"n_rows":44,"n_cols":12,"rows_kept":44,"cut":false,"hidden":false,"merged":[[43,2,43,5],[41,2,41,5]]}
[]
[]
[]
[null,null,"مسلسل","رقم الفاتورة","تاريخ","اسم العميل","الكمية","سعر","قيمة","ض.ق.م","اجمالى المبيعات \nمضاف الضريبة","اجمالى \nقيمة الضريبة"]
[null,{"$f":"IF(AND('فاتورة مبيعات'!$F$3=E5,'فاتورة مبيعات'!$D$3=D5),COUNTIFS($E$5:E5,E5,$D$5:D5,D5),\"\")","v":1},9,273,"2019-02-15","تتتتت",12,100,{"$f":"H5*G5","v":1200},0.14000000000000001,{"$f":"I5*J5","v":168.00000000000003},{"$f":"I5+K5","v":1368}]
[null,{"$f":"IF(AND('فاتورة مبيعات'!$F$3=E6,'فاتورة مبيعات'!$D$3=D6),COUNTIFS($E$5:E6,E6,$D$5:D6,D6),\"\")","v":2},10,273,"2019-02-15","تتتتت",10,105,1050,0.14000000000000001,147,{"$f":"I6+K6","v":1197}]
[null,{"$f":"IF(AND('فاتورة مبيعات'!$F$3=E7,'فاتورة مبيعات'!$D$3=D7),COUNTIFS($E$5:E7,E7,$D$5:D7,D7),\"\")","v":3},11,273,"2019-02-15","تتتتت",4,5,20,0.14000000000000001,2.8000000000000003,{"$f":"I7+K7","v":22.8}]
[null,{"$f":"IF(AND('فاتورة مبيعات'!$F$3=E8,'فاتورة مبيعات'!$D$3=D8),COUNTIFS($E$5:E8,E8,$D$5:D8,D8),\"\")","v":4},1,273,"2019-02-15","تتتتت",5,6,30,0.14000000000000001,4.2,{"$f":"I8+K8","v":34.200000000000003}]
[null,{"$f":"IF(AND('فاتورة مبيعات'!$F$3=E9,'فاتورة مبيعات'!$D$3=D9),COUNTIFS($E$5:E9,E9,$D$5:D9,D9),\"\")","v":5},2,273,"2019-02-15","تتتتت",6,7,42,0.14000000000000001,5.8800000000000008,47.88]
[null,{"$f":"IF(AND('فاتورة مبيعات'!$F$3=E10,'فاتورة مبيعات'!$D$3=D10),COUNTIFS($E$5:E10,E10,$D$5:D10,D10),\"\")","v":6},3,273,"2019-02-15","تتتتت",7,8,56,0.14000000000000001,7.8400000000000007,63.84]
{"$rows_left_out":35}
{"sheet":"3","index":2,"n_rows":37,"n_cols":12,"rows_kept":37,"cut":false,"hidden":false,"merged":[[36,2,36,5],[34,2,34,5]]}
[]
[]
[]
[null,null,"مسلسل","رقم الفاتورة","تاريخ","اسم العميل","الكمية","سعر","قيمة","ض.ق.م","اجمالى المبيعات \nمضاف الضريبة","اجمالى \nقيمة الضريبة"]
[null,{"$f":"IF(AND('فاتورة مبيعات'!$F$3=E5,'فاتورة مبيعات'!$D$3=D5),COUNTIFS($E$5:E5,E5,$D$5:D5,D5),\"\")","v":""},1,285,null,null,12,100,{"$f":"H5*G5","v":1200},0.14000000000000001,{"$f":"I5*J5","v":168.00000000000003},{"$f":"I5+K5","v":1368}]
[null,{"$f":"IF(AND('فاتورة مبيعات'!$F$3=E6,'فاتورة مبيعات'!$D$3=D6),COUNTIFS($E$5:E6,E6,$D$5:D6,D6),\"\")","v":""},2,285,null,null,10,105,1050,0.14000000000000001,147,{"$f":"I6+K6","v":1197}]
[null,{"$f":"IF(AND('فاتورة مبيعات'!$F$3=E7,'فاتورة مبيعات'!$D$3=D7),COUNTIFS($E$5:E7,E7,$D$5:D7,D7),\"\")","v":""},3,285,null,null,null,null,0,0.14000000000000001,0,{"$f":"I7+K7","v":0}]
[null,{"$f":"IF(AND('فاتورة مبيعات'!$F$3=E8,'فاتورة مبيعات'!$D$3=D8),COUNTIFS($E$5:E8,E8,$D$5:D8,D8),\"\")","v":""},4,285,null,null,null,null,0,0.14000000000000001,0,{"$f":"I8+K8","v":0}]
[null,{"$f":"IF(AND('فاتورة مبيعات'!$F$3=E9,'فاتورة مبيعات'!$D$3=D9),COUNTIFS($E$5:E9,E9,$D$5:D9,D9),\"\")","v":""},5,285,null,null,null,null,0,0.14000000000000001,0,0]
[null,{"$f":"IF(AND('فاتورة مبيعات'!$F$3=E10,'فاتورة مبيعات'!$D$3=D10),COUNTIFS($E$5:E10,E10,$D$5:D10,D10),\"\")","v":""},6,286,null,null,null,null,0,0.14000000000000001,0,0]
{"$rows_left_out":28}
{"sheet":"4","index":3,"n_rows":42,"n_cols":12,"rows_kept":42,"cut":false,"hidden":false,"merged":[[39,4,39,5],[36,2,36,5],[34,2,34,5]]}
[]
[]
[]
[null,null,"مسلسل","رقم الفاتورة","تاريخ","اسم العميل","الكمية","سعر","قيمة","ض.ق.م","اجمالى المبيعات \nمضاف الضريبة","اجمالى \nقيمة الضريبة"]
[null,{"$f":"IF(AND('فاتورة مبيعات'!$F$3=E5,'فاتورة مبيعات'!$D$3=D5),COUNTIFS($E$5:E5,E5,$D$5:D5,D5),\"\")","v":""},1,297,null,null,12,100,{"$f":"H5*G5","v":1200},0.14000000000000001,{"$f":"I5*J5","v":168.00000000000003},{"$f":"I5+K5","v":1368}]
[null,{"$f":"IF(AND('فاتورة مبيعات'!$F$3=E6,'فاتورة مبيعات'!$D$3=D6),COUNTIFS($E$5:E6,E6,$D$5:D6,D6),\"\")","v":""},2,297,null,null,10,105,1050,0.14000000000000001,147,{"$f":"I6+K6","v":1197}]
[null,{"$f":"IF(AND('فاتورة مبيعات'!$F$3=E7,'فاتورة مبيعات'!$D$3=D7),COUNTIFS($E$5:E7,E7,$D$5:D7,D7),\"\")","v":""},3,297,null,null,null,null,0,0.14000000000000001,0,{"$f":"I7+K7","v":0}]
[null,{"$f":"IF(AND('فاتورة مبيعات'!$F$3=E8,'فاتورة مبيعات'!$D$3=D8),COUNTIFS($E$5:E8,E8,$D$5:D8,D8),\"\")","v":""},4,297,null,null,null,null,0,0.14000000000000001,0,{"$f":"I8+K8","v":0}]
[null,{"$f":"IF(AND('فاتورة مبيعات'!$F$3=E9,'فاتورة مبيعات'!$D$3=D9),COUNTIFS($E$5:E9,E9,$D$5:D9,D9),\"\")","v":""},5,60,null,null,null,null,0,0.14000000000000001,0,0]
[null,{"$f":"IF(AND('فاتورة مبيعات'!$F$3=E10,'فاتورة مبيعات'!$D$3=D10),COUNTIFS($E$5:E10,E10,$D$5:D10,D10),\"\")","v":""},6,60,null,null,null,null,0,0.14000000000000001,0,0]
{"$rows_left_out":33}
{"sheet":"5","index":4,"n_rows":104,"n_cols":12,"rows_kept":104,"cut":false,"hidden":false,"merged":[[101,4,101,5],[98,2,98,5],[96,2,96,5]]}
[]
[]
[]
[null,null,"مسلسل","رقم الفاتورة","تاريخ","اسم العميل","الكمية","سعر","قيمة","ض.ق.م","اجمالى المبيعات \nمضاف الضريبة","اجمالى \nقيمة الضريبة"]
[null,{"$f":"IF(AND('فاتورة مبيعات'!$F$3=E5,'فاتورة مبيعات'!$D$3=D5),COUNTIFS($E$5:E5,E5,$D$5:D5,D5),\"\")","v":""},null,null,null,null,12,100,{"$f":"H5*G5","v":1200},0.14000000000000001,{"$f":"I5*J5","v":168.00000000000003},{"$f":"I5+K5","v":1368}]
[null,{"$f":"IF(AND('فاتورة مبيعات'!$F$3=E6,'فاتورة مبيعات'!$D$3=D6),COUNTIFS($E$5:E6,E6,$D$5:D6,D6),\"\")","v":""},null,null,null,null,10,105,1050,0.14000000000000001,147,{"$f":"I6+K6","v":1197}]
[null,{"$f":"IF(AND('فاتورة مبيعات'!$F$3=E7,'فاتورة مبيعات'!$D$3=D7),COUNTIFS($E$5:E7,E7,$D$5:D7,D7),\"\")","v":""},null,null,null,null,null,null,0,0.14000000000000001,0,{"$f":"I7+K7","v":0}]
[null,{"$f":"IF(AND('فاتورة مبيعات'!$F$3=E8,'فاتورة مبيعات'!$D$3=D8),COUNTIFS($E$5:E8,E8,$D$5:D8,D8),\"\")","v":""},null,null,null,null,null,null,0,0.14000000000000001,0,{"$f":"I8+K8","v":0}]
[null,{"$f":"IF(AND('فاتورة مبيعات'!$F$3=E9,'فاتورة مبيعات'!$D$3=D9),COUNTIFS($E$5:E9,E9,$D$5:D9,D9),\"\")","v":""},null,null,null,null,null,null,0,0.14000000000000001,0,0]
[null,{"$f":"IF(AND('فاتورة مبيعات'!$F$3=E10,'فاتورة مبيعات'!$D$3=D10),COUNTIFS($E$5:E10,E10,$D$5:D10,D10),\"\")","v":""},null,null,null,null,null,null,0,0.14000000000000001,0,0]
{"$rows_left_out":95}
{"sheet":"6","index":5,"n_rows":105,"n_cols":12,"rows_kept":105,"cut":false,"hidden":false,"merged":[[102,4,102,5],[99,2,99,5],[97,2,97,5]]}
[]
[]
[]
[null,null,"مسلسل","رقم الفاتورة","تاريخ","اسم العميل","الكمية","سعر","قيمة","ض.ق.م","اجمالى المبيعات \nمضاف الضريبة","اجمالى \nقيمة الضريبة"]
[null,{"$f":"IF(AND('فاتورة مبيعات'!$F$3=E5,'فاتورة مبيعات'!$D$3=D5),COUNTIFS($E$5:E5,E5,$D$5:D5,D5),\"\")","v":""},null,null,null,null,12,100,{"$f":"H5*G5","v":1200},0.14000000000000001,{"$f":"I5*J5","v":168.00000000000003},{"$f":"I5+K5","v":1368}]
[null,{"$f":"IF(AND('فاتورة مبيعات'!$F$3=E6,'فاتورة مبيعات'!$D$3=D6),COUNTIFS($E$5:E6,E6,$D$5:D6,D6),\"\")","v":""},null,null,null,null,10,105,1050,0.14000000000000001,147,{"$f":"I6+K6","v":1197}]
[null,{"$f":"IF(AND('فاتورة مبيعات'!$F$3=E7,'فاتورة مبيعات'!$D$3=D7),COUNTIFS($E$5:E7,E7,$D$5:D7,D7),\"\")","v":""},null,null,null,null,null,null,0,0.14000000000000001,0,{"$f":"I7+K7","v":0}]
[null,{"$f":"IF(AND('فاتورة مبيعات'!$F$3=E8,'فاتورة مبيعات'!$D$3=D8),COUNTIFS($E$5:E8,E8,$D$5:D8,D8),\"\")","v":""},null,null,null,null,null,null,0,0.14000000000000001,0,{"$f":"I8+K8","v":0}]
[null,{"$f":"IF(AND('فاتورة مبيعات'!$F$3=E9,'فاتورة مبيعات'!$D$3=D9),COUNTIFS($E$5:E9,E9,$D$5:D9,D9),\"\")","v":""},null,null,null,null,null,null,0,0.14000000000000001,0,0]
[null,{"$f":"IF(AND('فاتورة مبيعات'!$F$3=E10,'فاتورة مبيعات'!$D$3=D10),COUNTIFS($E$5:E10,E10,$D$5:D10,D10),\"\")","v":""},null,null,null,null,null,null,0,0.14000000000000001,0,0]
{"$rows_left_out":96}
{"sheet":"7","index":6,"n_rows":105,"n_cols":12,"rows_kept":105,"cut":false,"hidden":false,"merged":[[102,4,102,5],[99,2,99,5],[97,2,97,5]]}
[]
[]
[]
[null,null,"مسلسل","رقم الفاتورة","تاريخ","اسم العميل","الكمية","سعر","قيمة","ض.ق.م","اجمالى المبيعات \nمضاف الضريبة","اجمالى \nقيمة الضريبة"]
[null,{"$f":"IF(AND('فاتورة مبيعات'!$F$3=E5,'فاتورة مبيعات'!$D$3=D5),COUNTIFS($E$5:E5,E5,$D$5:D5,D5),\"\")","v":""},null,null,null,null,12,100,{"$f":"H5*G5","v":1200},0.14000000000000001,{"$f":"I5*J5","v":168.00000000000003},{"$f":"I5+K5","v":1368}]
[null,{"$f":"IF(AND('فاتورة مبيعات'!$F$3=E6,'فاتورة مبيعات'!$D$3=D6),COUNTIFS($E$5:E6,E6,$D$5:D6,D6),\"\")","v":""},null,null,null,null,10,105,1050,0.14000000000000001,147,{"$f":"I6+K6","v":1197}]
[null,{"$f":"IF(AND('فاتورة مبيعات'!$F$3=E7,'فاتورة مبيعات'!$D$3=D7),COUNTIFS($E$5:E7,E7,$D$5:D7,D7),\"\")","v":""},null,null,null,null,null,null,0,0.14000000000000001,0,{"$f":"I7+K7","v":0}]
[null,{"$f":"IF(AND('فاتورة مبيعات'!$F$3=E8,'فاتورة مبيعات'!$D$3=D8),COUNTIFS($E$5:E8,E8,$D$5:D8,D8),\"\")","v":""},null,null,null,null,null,null,0,0.14000000000000001,0,{"$f":"I8+K8","v":0}]
[null,{"$f":"IF(AND('فاتورة مبيعات'!$F$3=E9,'فاتورة مبيعات'!$D$3=D9),COUNTIFS($E$5:E9,E9,$D$5:D9,D9),\"\")","v":""},null,null,null,null,null,null,0,0.14000000000000001,0,0]
[null,{"$f":"IF(AND('فاتورة مبيعات'!$F$3=E10,'فاتورة مبيعات'!$D$3=D10),COUNTIFS($E$5:E10,E10,$D$5:D10,D10),\"\")","v":""},null,null,null,null,null,null,0,0.14000000000000001,0,0]
{"$rows_left_out":96}
{"sheet":"8","index":7,"n_rows":105,"n_cols":12,"rows_kept":105,"cut":false,"hidden":false,"merged":[[102,4,102,5],[99,2,99,5],[97,2,97,5]]}
[]
[]
[]
[null,null,"مسلسل","رقم الفاتورة","تاريخ","اسم العميل","الكمية","سعر","قيمة","ض.ق.م","اجمالى المبيعات \nمضاف الضريبة","اجمالى \nقيمة الضريبة"]
[null,{"$f":"IF(AND('فاتورة مبيعات'!$F$3=E5,'فاتورة مبيعات'!$D$3=D5),COUNTIFS($E$5:E5,E5,$D$5:D5,D5),\"\")","v":""},null,null,null,null,12,100,{"$f":"H5*G5","v":1200},0.14000000000000001,{"$f":"I5*J5","v":168.00000000000003},{"$f":"I5+K5","v":1368}]
[null,{"$f":"IF(AND('فاتورة مبيعات'!$F$3=E6,'فاتورة مبيعات'!$D$3=D6),COUNTIFS($E$5:E6,E6,$D$5:D6,D6),\"\")","v":""},null,null,null,null,10,105,1050,0.14000000000000001,147,{"$f":"I6+K6","v":1197}]
[null,{"$f":"IF(AND('فاتورة مبيعات'!$F$3=E7,'فاتورة مبيعات'!$D$3=D7),COUNTIFS($E$5:E7,E7,$D$5:D7,D7),\"\")","v":""},null,null,null,null,null,null,0,0.14000000000000001,0,{"$f":"I7+K7","v":0}]
[null,{"$f":"IF(AND('فاتورة مبيعات'!$F$3=E8,'فاتورة مبيعات'!$D$3=D8),COUNTIFS($E$5:E8,E8,$D$5:D8,D8),\"\")","v":""},null,null,null,null,null,null,0,0.14000000000000001,0,{"$f":"I8+K8","v":0}]
[null,{"$f":"IF(AND('فاتورة مبيعات'!$F$3=E9,'فاتورة مبيعات'!$D$3=D9),COUNTIFS($E$5:E9,E9,$D$5:D9,D9),\"\")","v":""},null,null,null,null,null,null,0,0.14000000000000001,0,0]
[null,{"$f":"IF(AND('فاتورة مبيعات'!$F$3=E10,'فاتورة مبيعات'!$D$3=D10),COUNTIFS($E$5:E10,E10,$D$5:D10,D10),\"\")","v":""},null,null,null,null,null,null,0,0.14000000000000001,0,0]
{"$rows_left_out":96}
{"sheet":"9","index":8,"n_rows":105,"n_cols":12,"rows_kept":105,"cut":false,"hidden":false,"merged":[[99,2,99,5],[97,2,97,5]]}
[]
[]
[]
[null,null,"مسلسل","رقم الفاتورة","تاريخ","اسم العميل","الكمية","سعر","قيمة","ض.ق.م","اجمالى المبيعات \nمضاف الضريبة","اجمالى \nقيمة الضريبة"]
[null,{"$f":"IF(AND('فاتورة مبيعات'!$F$3=E5,'فاتورة مبيعات'!$D$3=D5),COUNTIFS($E$5:E5,E5,$D$5:D5,D5),\"\")","v":""},null,null,null,null,12,100,{"$f":"H5*G5","v":1200},0.14000000000000001,{"$f":"I5*J5","v":168.00000000000003},{"$f":"I5+K5","v":1368}]
[null,{"$f":"IF(AND('فاتورة مبيعات'!$F$3=E6,'فاتورة مبيعات'!$D$3=D6),COUNTIFS($E$5:E6,E6,$D$5:D6,D6),\"\")","v":""},null,null,null,null,10,105,1050,0.14000000000000001,147,{"$f":"I6+K6","v":1197}]
[null,{"$f":"IF(AND('فاتورة مبيعات'!$F$3=E7,'فاتورة مبيعات'!$D$3=D7),COUNTIFS($E$5:E7,E7,$D$5:D7,D7),\"\")","v":""},null,null,null,null,null,null,0,0.14000000000000001,0,{"$f":"I7+K7","v":0}]
[null,{"$f":"IF(AND('فاتورة مبيعات'!$F$3=E8,'فاتورة مبيعات'!$D$3=D8),COUNTIFS($E$5:E8,E8,$D$5:D8,D8),\"\")","v":""},null,null,null,null,null,null,0,0.14000000000000001,0,{"$f":"I8+K8","v":0}]
[null,{"$f":"IF(AND('فاتورة مبيعات'!$F$3=E9,'فاتورة مبيعات'!$D$3=D9),COUNTIFS($E$5:E9,E9,$D$5:D9,D9),\"\")","v":""},null,null,null,null,null,null,0,0.14000000000000001,0,0]
[null,{"$f":"IF(AND('فاتورة مبيعات'!$F$3=E10,'فاتورة مبيعات'!$D$3=D10),COUNTIFS($E$5:E10,E10,$D$5:D10,D10),\"\")","v":""},null,null,null,null,null,null,0,0.14000000000000001,0,0]
{"$rows_left_out":96}
{"sheet":"10","index":9,"n_rows":104,"n_cols":12,"rows_kept":104,"cut":false,"hidden":false,"merged":[[99,2,99,5],[97,2,97,5]]}
[]
[]
[]
[null,null,"مسلسل","رقم الفاتورة","تاريخ","اسم العميل","الكمية","سعر","قيمة","ض.ق.م","اجمالى المبيعات \nمضاف الضريبة","اجمالى \nقيمة الضريبة"]
[null,{"$f":"IF(AND('فاتورة مبيعات'!$F$3=E5,'فاتورة مبيعات'!$D$3=D5),COUNTIFS($E$5:E5,E5,$D$5:D5,D5),\"\")","v":""},null,null,null,null,12,100,{"$f":"H5*G5","v":1200},0.14000000000000001,{"$f":"I5*J5","v":168.00000000000003},{"$f":"I5+K5","v":1368}]
[null,{"$f":"IF(AND('فاتورة مبيعات'!$F$3=E6,'فاتورة مبيعات'!$D$3=D6),COUNTIFS($E$5:E6,E6,$D$5:D6,D6),\"\")","v":""},null,null,null,null,10,105,1050,0.14000000000000001,147,{"$f":"I6+K6","v":1197}]
[null,{"$f":"IF(AND('فاتورة مبيعات'!$F$3=E7,'فاتورة مبيعات'!$D$3=D7),COUNTIFS($E$5:E7,E7,$D$5:D7,D7),\"\")","v":""},null,null,null,null,null,null,0,0.14000000000000001,0,{"$f":"I7+K7","v":0}]
[null,{"$f":"IF(AND('فاتورة مبيعات'!$F$3=E8,'فاتورة مبيعات'!$D$3=D8),COUNTIFS($E$5:E8,E8,$D$5:D8,D8),\"\")","v":""},null,null,null,null,null,null,0,0.14000000000000001,0,{"$f":"I8+K8","v":0}]
[null,{"$f":"IF(AND('فاتورة مبيعات'!$F$3=E9,'فاتورة مبيعات'!$D$3=D9),COUNTIFS($E$5:E9,E9,$D$5:D9,D9),\"\")","v":""},null,null,null,null,null,null,0,0.14000000000000001,0,0]
[null,{"$f":"IF(AND('فاتورة مبيعات'!$F$3=E10,'فاتورة مبيعات'!$D$3=D10),COUNTIFS($E$5:E10,E10,$D$5:D10,D10),\"\")","v":""},null,null,null,null,null,null,0,0.14000000000000001,0,0]
{"$rows_left_out":95}
{"sheet":"11","index":10,"n_rows":100,"n_cols":12,"rows_kept":100,"cut":false,"hidden":false,"merged":[[99,2,99,5],[97,2,97,5]]}
[null,null,null,null,"zzzzzz"]
[]
[]
[null,null,"مسلسل","رقم الفاتورة","تاريخ","اسم العميل","الكمية","سعر","قيمة","ض.ق.م","اجمالى المبيعات \nمضاف الضريبة","اجمالى \nقيمة الضريبة"]
[null,{"$f":"IF(AND('فاتورة مبيعات'!$F$3=E5,'فاتورة مبيعات'!$D$3=D5),COUNTIFS($E$5:E5,E5,$D$5:D5,D5),\"\")","v":""},null,null,null,null,12,100,{"$f":"H5*G5","v":1200},0.14000000000000001,{"$f":"I5*J5","v":168.00000000000003},{"$f":"I5+K5","v":1368}]
[null,{"$f":"IF(AND('فاتورة مبيعات'!$F$3=E6,'فاتورة مبيعات'!$D$3=D6),COUNTIFS($E$5:E6,E6,$D$5:D6,D6),\"\")","v":""},null,null,null,null,10,105,1050,0.14000000000000001,147,{"$f":"I6+K6","v":1197}]
[null,{"$f":"IF(AND('فاتورة مبيعات'!$F$3=E7,'فاتورة مبيعات'!$D$3=D7),COUNTIFS($E$5:E7,E7,$D$5:D7,D7),\"\")","v":""},null,null,null,null,null,null,0,0.14000000000000001,0,{"$f":"I7+K7","v":0}]
[null,{"$f":"IF(AND('فاتورة مبيعات'!$F$3=E8,'فاتورة مبيعات'!$D$3=D8),COUNTIFS($E$5:E8,E8,$D$5:D8,D8),\"\")","v":""},null,null,null,null,null,null,0,0.14000000000000001,0,{"$f":"I8+K8","v":0}]
[null,{"$f":"IF(AND('فاتورة مبيعات'!$F$3=E9,'فاتورة مبيعات'!$D$3=D9),COUNTIFS($E$5:E9,E9,$D$5:D9,D9),\"\")","v":""},null,null,null,null,null,null,0,0.14000000000000001,0,0]
[null,{"$f":"IF(AND('فاتورة مبيعات'!$F$3=E10,'فاتورة مبيعات'!$D$3=D10),COUNTIFS($E$5:E10,E10,$D$5:D10,D10),\"\")","v":""},null,null,null,null,null,null,0,0.14000000000000001,0,0]
{"$rows_left_out":91}
{"sheet":"12","index":11,"n_rows":100,"n_cols":12,"rows_kept":100,"cut":false,"hidden":false,"merged":[[99,2,99,5],[97,2,97,5]]}
[]
[]
[]
[null,null,"مسلسل","رقم الفاتورة","تاريخ","اسم العميل","الكمية","سعر","قيمة","ض.ق.م","اجمالى المبيعات \nمضاف الضريبة","اجمالى \nقيمة الضريبة"]
[null,{"$f":"IF(AND('فاتورة مبيعات'!$F$3=E5,'فاتورة مبيعات'!$D$3=D5),COUNTIFS($E$5:E5,E5,$D$5:D5,D5),\"\")","v":""},null,null,null,null,12,100,{"$f":"H5*G5","v":1200},0.14000000000000001,{"$f":"I5*J5","v":168.00000000000003},{"$f":"I5+K5","v":1368}]
[null,{"$f":"IF(AND('فاتورة مبيعات'!$F$3=E6,'فاتورة مبيعات'!$D$3=D6),COUNTIFS($E$5:E6,E6,$D$5:D6,D6),\"\")","v":""},null,null,null,null,10,105,1050,0.14000000000000001,147,{"$f":"I6+K6","v":1197}]
[null,{"$f":"IF(AND('فاتورة مبيعات'!$F$3=E7,'فاتورة مبيعات'!$D$3=D7),COUNTIFS($E$5:E7,E7,$D$5:D7,D7),\"\")","v":""},null,null,null,null,null,null,0,0.14000000000000001,0,{"$f":"I7+K7","v":0}]
[null,{"$f":"IF(AND('فاتورة مبيعات'!$F$3=E8,'فاتورة مبيعات'!$D$3=D8),COUNTIFS($E$5:E8,E8,$D$5:D8,D8),\"\")","v":""},null,null,null,null,null,null,0,0.14000000000000001,0,{"$f":"I8+K8","v":0}]
[null,{"$f":"IF(AND('فاتورة مبيعات'!$F$3=E9,'فاتورة مبيعات'!$D$3=D9),COUNTIFS($E$5:E9,E9,$D$5:D9,D9),\"\")","v":""},null,null,null,null,null,null,0,0.14000000000000001,0,0]
[null,{"$f":"IF(AND('فاتورة مبيعات'!$F$3=E10,'فاتورة مبيعات'!$D$3=D10),COUNTIFS($E$5:E10,E10,$D$5:D10,D10),\"\")","v":""},null,null,null,null,null,null,0,0.14000000000000001,0,0]
{"$rows_left_out":91}
{"sheet":"فاتورة مبيعات","index":12,"n_rows":23,"n_cols":14,"rows_kept":23,"cut":false,"hidden":false,"merged":[[4,8,5,8],[22,1,22,4],[1,1,1,8],[2,7,2,8],[4,1,5,1],[4,2,5,2],[4,3,5,3],[4,4,5,4],[4,5,5,5]]}
[]
[]
[null,{"$f":"IFERROR(INDEX($K$7:$K$18,SUMPRODUCT(($L$7:$L$18<>\"\")*ROW($1:$12))),\"\")","v":2},"رقم الفاتورة",273,null,{"$f":"IF(B3=\"\",\"\",VLOOKUP(B3,K7:M18,3,0))","v":"2019-02-15"},"اسم العميل",{"$f":"IF(B3=\"\",\"\",VLOOKUP(B3,K7:N18,4,0))","v":"تتتتت"}]
[]
[null,"مسلسل","التاريخ","كمية","سعر","قيمة",null,null,"الاجمالى"]
[]
[null,1,{"$f":"IFERROR(VLOOKUP(B7,INDIRECT($B$3&\"!\"&\"b5:L123\"),4,0),\"\")","v":"2019-02-15"},{"$f":"IFERROR(VLOOKUP(B7,INDIRECT($B$3&\"!\"&\"b5:L123\"),6,0),\"\")","v":12},{"$f":"IFERROR(VLOOKUP(B7,INDIRECT($B$3&\"!\"&\"b5:L123\"),7,0),\"\")","v":100},{"$f":"IF(E7=\"\",\"\",D7*E7)","v":1200},{"$f":"IFERROR(VLOOKUP(B7,INDIRECT($B$3&\"!\"&\"b5:L123\"),9,0),\"\")","v":0.14000000000000001},{"$f":"IFERROR(VLOOKUP(B7,INDIRECT($B$3&\"!\"&\"b5:L123\"),10,0),\"\")","v":168.00000000000003},{"$f":"IFERROR(VLOOKUP(B7,INDIRECT($B$3&\"!\"&\"b5:L123\"),11,0),\"\")","v":1368},null,1,{"$f":"IFERROR(MATCH($D$3,INDIRECT($K7&\"!$D:$D\"),0),\"\")","v":""},{"$f":"IFERROR(VLOOKUP($D$3,'1'!D:L,2,0),\"\")","v":""},{"$f":"IFERROR(VLOOKUP($D$3,'1'!D:L,3,0),\"\")","v":""}]
[null,2,{"$f":"IFERROR(VLOOKUP(B8,INDIRECT($B$3&\"!\"&\"b5:L123\"),4,0),\"\")","v":"2019-02-15"},{"$f":"IFERROR(VLOOKUP(B8,INDIRECT($B$3&\"!\"&\"b5:L123\"),6,0),\"\")","v":10},{"$f":"IFERROR(VLOOKUP(B8,INDIRECT($B$3&\"!\"&\"b5:L123\"),7,0),\"\")","v":105},{"$f":"IF(E8=\"\",\"\",D8*E8)","v":1050},{"$f":"IFERROR(VLOOKUP(B8,INDIRECT($B$3&\"!\"&\"b5:L123\"),9,0),\"\")","v":0.14000000000000001},{"$f":"IFERROR(VLOOKUP(B8,INDIRECT($B$3&\"!\"&\"b5:L123\"),10,0),\"\")","v":147},{"$f":"IFERROR(VLOOKUP(B8,INDIRECT($B$3&\"!\"&\"b5:L123\"),11,0),\"\")","v":1197},null,2,{"$f":"IFERROR(MATCH($D$3,INDIRECT($K8&\"!$D:$D\"),0),\"\")","v":5},{"$f":"IFERROR(VLOOKUP($D$3,'2'!D:L,2,0),\"\")","v":43511},{"$f":"IFERROR(VLOOKUP($D$3,'2'!D:L,3,0),\"\")","v":"تتتتت"}]
[null,3,"2019-02-15",4,5,20,0.14000000000000001,2.8000000000000003,22.8,null,3,"",{"$f":"IFERROR(VLOOKUP($D$3,'3'!D:L,2,0),\"\")","v":""},{"$f":"IFERROR(VLOOKUP($D$3,'3'!D:L,3,0),\"\")","v":""}]
[null,4,"2019-02-15",5,6,30,0.14000000000000001,4.2,34.200000000000003,null,4,"",{"$f":"IFERROR(VLOOKUP($D$3,'4'!D:L,2,0),\"\")","v":""},{"$f":"IFERROR(VLOOKUP($D$3,'4'!D:L,3,0),\"\")","v":""}]
{"$rows_left_out":13}