{"text_format":"1","workbook":"xlsx","n_sheets":2,"sheets":["Print","Data"],"not_rendered":{"charts":0,"images":1,"macros":1,"external_links":0,"defined_names":9,"comments":0,"pivot_tables":0},"unopened":[],"bounds":{"document_bytes":16777216,"sheet_cells":100000,"rows_first":2000,"rows_last":500,"rows_between":2000,"halvings":0,"cell_chars":16384,"cell_head_chars":4096},"cells_cut":0,"cells_raw":0,"read":"whole","date_system":"1900"}

{"sheet":"Print","index":0,"n_rows":54,"n_cols":6,"rows_kept":54,"cut":false,"hidden":false,"merged":[]}
[null,null,null,null,null,"الفصل"]
[null,"وزارة التربية والتعليم",null,"الادارة التعليمية لحي جنوب",null,1]
[]
[null,"الأسم:","وائل 1"]
[]
[null,"رقم الجلوس:",{"$f":"IF(C4=\"\",\"\",VLOOKUP(C4,Data!$A$2:$G$1000,2,0))","v":101}]
[]
["مسلسل","المـــــــــــادة","النهاية العظمى","النهاية الصغرى","درجة الطالب"]
[1,"اللغة العربية",100,20,{"$f":"IF(C4=\"\",\"\",VLOOKUP(C4,Data!$A$2:$G$1000,3,0))","v":100}]
[2,"اللغة الانجليزية",120,30,{"$f":"IF(C4=\"\",\"\",VLOOKUP(C4,Data!$A$2:$G$1000,4,0))","v":99}]
[3,"الرياضيات",100,20,{"$f":"IF(C4=\"\",\"\",VLOOKUP(C4,Data!$A$2:$G$1000,5,0))","v":10}]
[4,"الكيمياء",100,20,{"$f":"IF(C4=\"\",\"\",VLOOKUP(C4,Data!$A$2:$G$1000,6,0))","v":23.7}]
[null,"توقيع :"]
[null,null,null,null,null,"الفصل"]
[null,"وزارة التربية والتعليم",null,"الادارة التعليمية لحي جنوب",null,1]
[]
[null,"الأسم:","وائل 2"]
[]
[null,"رقم الجلوس:",{"$f":"IF(C17=\"\",\"\",VLOOKUP(C17,Data!$A$2:$G$1000,2,0))","v":101}]
[]
["مسلسل","المـــــــــــادة","النهاية العظمى","النهاية الصغرى","درجة الطالب"]
[1,"اللغة العربية",100,20,{"$f":"IF(C17=\"\",\"\",VLOOKUP(C17,Data!$A$2:$G$1000,3,0))","v":100}]
[2,"اللغة الانجليزية",120,30,{"$f":"IF(C17=\"\",\"\",VLOOKUP(C17,Data!$A$2:$G$1000,4,0))","v":99}]
[3,"الرياضيات",100,20,{"$f":"IF(C17=\"\",\"\",VLOOKUP(C17,Data!$A$2:$G$1000,5,0))","v":10}]
[4,"الكيمياء",100,20,{"$f":"IF(C17=\"\",\"\",VLOOKUP(C17,Data!$A$2:$G$1000,6,0))","v":23.7}]
[null,"توقيع :"]
[]
[null,null,null,null,null,"الفصل"]
[null,"وزارة التربية والتعليم",null,"الادارة التعليمية لحي جنوب",null,1]
[]
[null,"الأسم:","محمد1"]
[]
[null,"رقم الجلوس:",{"$f":"IF(C31=\"\",\"\",VLOOKUP(C31,Data!$A$2:$G$1000,2,0))","v":102}]
[]
["مسلسل","المـــــــــــادة","النهاية العظمى","النهاية الصغرى","درجة الطالب"]
[1,"اللغة العربية",100,20,{"$f":"IF(C31=\"\",\"\",VLOOKUP(C31,Data!$A$2:$G$1000,3,0))","v":100}]
[2,"اللغة الانجليزية",120,30,{"$f":"IF(C31=\"\",\"\",VLOOKUP(C31,Data!$A$2:$G$1000,4,0))","v":98}]
[3,"الرياضيات",100,20,{"$f":"IF(C31=\"\",\"\",VLOOKUP(C31,Data!$A$2:$G$1000,5,0))","v":20}]
[4,"الكيمياء",100,20,{"$f":"IF(C31=\"\",\"\",VLOOKUP(C31,Data!$A$2:$G$1000,6,0))","v":29.5}]
[null,"توقيع :"]
[]
[null,null,null,null,null,"الفصل"]
[null,"وزارة التربية والتعليم",null,"الادارة التعليمية لحي جنوب",null,1]
[]
[null,"الأسم:","محمد2"]
[]
[null,"رقم الجلوس:",{"$f":"IF(C45=\"\",\"\",VLOOKUP(C45,Data!$A$2:$G$1000,2,0))","v":102}]
[]
["مسلسل","المـــــــــــادة","النهاية العظمى","النهاية الصغرى","درجة الطالب"]
[1,"اللغة العربية",100,20,{"$f":"IF(C45=\"\",\"\",VLOOKUP(C45,Data!$A$2:$G$1000,3,0))","v":95}]
[2,"اللغة الانجليزية",120,30,{"$f":"IF(C45=\"\",\"\",VLOOKUP(C45,Data!$A$2:$G$1000,4,0))","v":98}]
[3,"الرياضيات",100,20,{"$f":"IF(C45=\"\",\"\",VLOOKUP(C45,Data!$A$2:$G$1000,5,0))","v":20}]
[4,"الكيمياء",100,20,{"$f":"IF(C45=\"\",\"\",VLOOKUP(C45,Data!$A$2:$G$1000,6,0))","v":29.5}]
[null,"توقيع :"]

{"sheet":"Data","index":1,"n_rows":16,"n_cols":12,"rows_kept":16,"cut":false,"hidden":false,"merged":[]}
["الأسم","رقم الجلوس","اللغة العربية","اللغة الانجليزية","الرياضيات","الكيمياء","الفصل ",null,null,null,null," \n"]
["وائل 1",101,100,99,10,23.7,1]
["وائل 2",101,100,99,10,23.7,1]
["محمد1",102,100,98,20,29.5,1]
["محمد2",102,95,98,20,29.5,1]
["محمد3",102,95,98,20,29.5,2]
["محمود11",103,90,97,30,35.299999999999997,2]
["محمود12",103,90,97,30,35.299999999999997,3]
["محمود13",103,90,97,30,35.299999999999997,3]
["محمود14",103,90,97,30,35.299999999999997,3]
["حامد1","good","very good","pad","very pad","الحمد لله",4]
["حامد2","good","very good","pad","very pad","الحمد لله",4]
["حامد3","good","very good","pad","very pad","الحمد لله",4]
["عمار1",117,20,83,170,116.5,5]
["عمار2",117,20,83,170,116.5,5]
["عمار3",117,20,83,170,116.5,5]