{"text_format":"1","workbook":"xlsx","n_sheets":3,"sheets":["Feuil1","Feuil2","Feuil3"],"not_rendered":{"charts":0,"images":0,"macros":1,"external_links":2,"defined_names":0,"comments":0,"pivot_tables":0},"unopened":[],"bounds":{"document_bytes":16777216,"sheet_cells":100000,"rows_first":2000,"rows_last":500,"rows_between":2000,"halvings":0,"cell_chars":16384,"cell_head_chars":4096},"cells_cut":0,"cells_raw":0,"read":"whole","date_system":"1900"}

{"sheet":"Feuil1","index":0,"n_rows":2000,"n_cols":4,"rows_kept":2000,"cut":false,"hidden":false,"merged":[]}
[]
[]
[]
[]
[]
[]
[]
[]
[]
[]
[]
[]
[]
[]
[]
[]
[null,null,"الرقم"]
[null,null,{"$f":"IF(EXACT([1]Feuil1!$C18,[2]Feuil1!$C18)=TRUE,[1]Feuil1!$C18,\"X\")","v":"FG183186119"},"إذا ظهرت العلامة X يعني عدم المطابعة"]
[null,null,{"$f":"IF(EXACT([1]Feuil1!$C19,[2]Feuil1!$C19)=TRUE,[1]Feuil1!$C19,\"X\")","v":"FG182048348"},"إذا ظهرت قيمة للخلية فهذا يعني أن اقيمتيان متطابقتان"]
[null,null,{"$f":"IF(EXACT([1]Feuil1!$C20,[2]Feuil1!$C20)=TRUE,[1]Feuil1!$C20,\"X\")","v":"FG176055540"},"أما العلامة صفة فهذا يعني عدوم وجود بيانات في الخلايا التي يتم مقارنتها"]
[null,null,{"$f":"IF(EXACT([1]Feuil1!$C21,[2]Feuil1!$C21)=TRUE,[1]Feuil1!$C21,\"X\")","v":"FG183059383"}]
[null,null,{"$f":"IF(EXACT([1]Feuil1!$C22,[2]Feuil1!$C22)=TRUE,[1]Feuil1!$C22,\"X\")","v":"X"}]
[null,null,{"$f":"IF(EXACT([1]Feuil1!$C23,[2]Feuil1!$C23)=TRUE,[1]Feuil1!$C23,\"X\")","v":"FG185048330"}]
[null,null,{"$f":"IF(EXACT([1]Feuil1!$C24,[2]Feuil1!$C24)=TRUE,[1]Feuil1!$C24,\"X\")","v":"FG184048344"}]
[null,null,{"$f":"IF(EXACT([1]Feuil1!$C25,[2]Feuil1!$C25)=TRUE,[1]Feuil1!$C25,\"X\")","v":0}]
[null,null,{"$f":"IF(EXACT([1]Feuil1!$C26,[2]Feuil1!$C26)=TRUE,[1]Feuil1!$C26,\"X\")","v":0}]
[null,null,{"$f":"IF(EXACT([1]Feuil1!$C27,[2]Feuil1!$C27)=TRUE,[1]Feuil1!$C27,\"X\")","v":0}]
[null,null,{"$f":"IF(EXACT([1]Feuil1!$C28,[2]Feuil1!$C28)=TRUE,[1]Feuil1!$C28,\"X\")","v":0}]
[null,null,{"$f":"IF(EXACT([1]Feuil1!$C29,[2]Feuil1!$C29)=TRUE,[1]Feuil1!$C29,\"X\")","v":0}]
[null,null,{"$f":"IF(EXACT([1]Feuil1!$C30,[2]Feuil1!$C30)=TRUE,[1]Feuil1!$C30,\"X\")","v":0}]
[null,null,{"$f":"IF(EXACT([1]Feuil1!$C31,[2]Feuil1!$C31)=TRUE,[1]Feuil1!$C31,\"X\")","v":0}]
[null,null,{"$f":"IF(EXACT([1]Feuil1!$C32,[2]Feuil1!$C32)=TRUE,[1]Feuil1!$C32,\"X\")","v":0}]
[null,null,{"$f":"IF(EXACT([1]Feuil1!$C33,[2]Feuil1!$C33)=TRUE,[1]Feuil1!$C33,\"X\")","v":0}]
[null,null,{"$f":"IF(EXACT([1]Feuil1!$C34,[2]Feuil1!$C34)=TRUE,[1]Feuil1!$C34,\"X\")","v":0}]
[null,null,{"$f":"IF(EXACT([1]Feuil1!$C35,[2]Feuil1!$C35)=TRUE,[1]Feuil1!$C35,\"X\")","v":0}]
[null,null,{"$f":"IF(EXACT([1]Feuil1!$C36,[2]Feuil1!$C36)=TRUE,[1]Feuil1!$C36,\"X\")","v":0}]
[null,null,{"$f":"IF(EXACT([1]Feuil1!$C37,[2]Feuil1!$C37)=TRUE,[1]Feuil1!$C37,\"X\")","v":0}]
[null,null,{"$f":"IF(EXACT([1]Feuil1!$C38,[2]Feuil1!$C38)=TRUE,[1]Feuil1!$C38,\"X\")","v":0}]
[null,null,{"$f":"IF(EXACT([1]Feuil1!$C39,[2]Feuil1!$C39)=TRUE,[1]Feuil1!$C39,\"X\")","v":0}]
[null,null,{"$f":"IF(EXACT([1]Feuil1!$C40,[2]Feuil1!$C40)=TRUE,[1]Feuil1!$C40,\"X\")","v":0}]
[null,null,{"$f":"IF(EXACT([1]Feuil1!$C41,[2]Feuil1!$C41)=TRUE,[1]Feuil1!$C41,\"X\")","v":0}]
[null,null,{"$f":"IF(EXACT([1]Feuil1!$C42,[2]Feuil1!$C42)=TRUE,[1]Feuil1!$C42,\"X\")","v":0}]
[null,null,{"$f":"IF(EXACT([1]Feuil1!$C43,[2]Feuil1!$C43)=TRUE,[1]Feuil1!$C43,\"X\")","v":0}]
[null,null,{"$f":"IF(EXACT([1]Feuil1!$C44,[2]Feuil1!$C44)=TRUE,[1]Feuil1!$C44,\"X\")","v":0}]
[null,null,{"$f":"IF(EXACT([1]Feuil1!$C45,[2]Feuil1!$C45)=TRUE,[1]Feuil1!$C45,\"X\")","v":0}]
[null,null,{"$f":"IF(EXACT([1]Feuil1!$C46,[2]Feuil1!$C46)=TRUE,[1]Feuil1!$C46,\"X\")","v":0}]
[null,null,{"$f":"IF(EXACT([1]Feuil1!$C47,[2]Feuil1!$C47)=TRUE,[1]Feuil1!$C47,\"X\")","v":0}]
[null,null,{"$f":"IF(EXACT([1]Feuil1!$C48,[2]Feuil1!$C48)=TRUE,[1]Feuil1!$C48,\"X\")","v":0}]
[null,null,{"$f":"IF(EXACT([1]Feuil1!$C49,[2]Feuil1!$C49)=TRUE,[1]Feuil1!$C49,\"X\")","v":0}]
[null,null,{"$f":"IF(EXACT([1]Feuil1!$C50,[2]Feuil1!$C50)=TRUE,[1]Feuil1!$C50,\"X\")","v":0}]
[null,null,{"$f":"IF(EXACT([1]Feuil1!$C51,[2]Feuil1!$C51)=TRUE,[1]Feuil1!$C51,\"X\")","v":0}]
[null,null,{"$f":"IF(EXACT([1]Feuil1!$C52,[2]Feuil1!$C52)=TRUE,[1]Feuil1!$C52,\"X\")","v":0}]
[null,null,{"$f":"IF(EXACT([1]Feuil1!$C53,[2]Feuil1!$C53)=TRUE,[1]Feuil1!$C53,\"X\")","v":0}]
[null,null,{"$f":"IF(EXACT([1]Feuil1!$C54,[2]Feuil1!$C54)=TRUE,[1]Feuil1!$C54,\"X\")","v":0}]
[null,null,{"$f":"IF(EXACT([1]Feuil1!$C55,[2]Feuil1!$C55)=TRUE,[1]Feuil1!$C55,\"X\")","v":0}]
[null,null,{"$f":"IF(EXACT([1]Feuil1!$C56,[2]Feuil1!$C56)=TRUE,[1]Feuil1!$C56,\"X\")","v":0}]
[null,null,{"$f":"IF(EXACT([1]Feuil1!$C57,[2]Feuil1!$C57)=TRUE,[1]Feuil1!$C57,\"X\")","v":0}]
[null,null,{"$f":"IF(EXACT([1]Feuil1!$C58,[2]Feuil1!$C58)=TRUE,[1]Feuil1!$C58,\"X\")","v":0}]
[null,null,{"$f":"IF(EXACT([1]Feuil1!$C59,[2]Feuil1!$C59)=TRUE,[1]Feuil1!$C59,\"X\")","v":0}]
[null,null,{"$f":"IF(EXACT([1]Feuil1!$C60,[2]Feuil1!$C60)=TRUE,[1]Feuil1!$C60,\"X\")","v":0}]
[null,null,{"$f":"IF(EXACT([1]Feuil1!$C61,[2]Feuil1!$C61)=TRUE,[1]Feuil1!$C61,\"X\")","v":0}]
[null,null,{"$f":"IF(EXACT([1]Feuil1!$C62,[2]Feuil1!$C62)=TRUE,[1]Feuil1!$C62,\"X\")","v":0}]
[null,null,{"$f":"IF(EXACT([1]Feuil1!$C63,[2]Feuil1!$C63)=TRUE,[1]Feuil1!$C63,\"X\")","v":0}]
[null,null,{"$f":"IF(EXACT([1]Feuil1!$C64,[2]Feuil1!$C64)=TRUE,[1]Feuil1!$C64,\"X\")","v":0}]
[null,null,{"$f":"IF(EXACT([1]Feuil1!$C65,[2]Feuil1!$C65)=TRUE,[1]Feuil1!$C65,\"X\")","v":0}]
[null,null,{"$f":"IF(EXACT([1]Feuil1!$C66,[2]Feuil1!$C66)=TRUE,[1]Feuil1!$C66,\"X\")","v":0}]
[null,null,{"$f":"IF(EXACT([1]Feuil1!$C67,[2]Feuil1!$C67)=TRUE,[1]Feuil1!$C67,\"X\")","v":0}]
[null,null,{"$f":"IF(EXACT([1]Feuil1!$C68,[2]Feuil1!$C68)=TRUE,[1]Feuil1!$C68,\"X\")","v":0}]
[null,null,{"$f":"IF(EXACT([1]Feuil1!$C69,[2]Feuil1!$C69)=TRUE,[1]Feuil1!$C69,\"X\")","v":0}]
[null,null,{"$f":"IF(EXACT([1]Feuil1!$C70,[2]Feuil1!$C70)=TRUE,[1]Feuil1!$C70,\"X\")","v":0}]
[null,null,{"$f":"IF(EXACT([1]Feuil1!$C71,[2]Feuil1!$C71)=TRUE,[1]Feuil1!$C71,\"X\")","v":0}]
[null,null,{"$f":"IF(EXACT([1]Feuil1!$C72,[2]Feuil1!$C72)=TRUE,[1]Feuil1!$C72,\"X\")","v":0}]
[null,null,{"$f":"IF(EXACT([1]Feuil1!$C73,[2]Feuil1!$C73)=TRUE,[1]Feuil1!$C73,\"X\")","v":0}]
[null,null,{"$f":"IF(EXACT([1]Feuil1!$C74,[2]Feuil1!$C74)=TRUE,[1]Feuil1!$C74,\"X\")","v":0}]
[null,null,{"$f":"IF(EXACT([1]Feuil1!$C75,[2]Feuil1!$C75)=TRUE,[1]Feuil1!$C75,\"X\")","v":0}]
[null,null,{"$f":"IF(EXACT([1]Feuil1!$C76,[2]Feuil1!$C76)=TRUE,[1]Feuil1!$C76,\"X\")","v":0}]
[null,null,{"$f":"IF(EXACT([1]Feuil1!$C77,[2]Feuil1!$C77)=TRUE,[1]Feuil1!$C77,\"X\")","v":0}]
[null,null,{"$f":"IF(EXACT([1]Feuil1!$C78,[2]Feuil1!$C78)=TRUE,[1]Feuil1!$C78,\"X\")","v":0}]
[null,null,{"$f":"IF(EXACT([1]Feuil1!$C79,[2]Feuil1!$C79)=TRUE,[1]Feuil1!$C79,\"X\")","v":0}]
[null,null,{"$f":"IF(EXACT([1]Feuil1!$C80,[2]Feuil1!$C80)=TRUE,[1]Feuil1!$C80,\"X\")","v":0}]
[null,null,{"$f":"IF(EXACT([1]Feuil1!$C81,[2]Feuil1!$C81)=TRUE,[1]Feuil1!$C81,\"X\")","v":0}]
[null,null,{"$f":"IF(EXACT([1]Feuil1!$C82,[2]Feuil1!$C82)=TRUE,[1]Feuil1!$C82,\"X\")","v":0}]
[null,null,{"$f":"IF(EXACT([1]Feuil1!$C83,[2]Feuil1!$C83)=TRUE,[1]Feuil1!$C83,\"X\")","v":0}]
[null,null,{"$f":"IF(EXACT([1]Feuil1!$C84,[2]Feuil1!$C84)=TRUE,[1]Feuil1!$C84,\"X\")","v":0}]
[null,null,{"$f":"IF(EXACT([1]Feuil1!$C85,[2]Feuil1!$C85)=TRUE,[1]Feuil1!$C85,\"X\")","v":0}]
[null,null,{"$f":"IF(EXACT([1]Feuil1!$C86,[2]Feuil1!$C86)=TRUE,[1]Feuil1!$C86,\"X\")","v":0}]
[null,null,{"$f":"IF(EXACT([1]Feuil1!$C87,[2]Feuil1!$C87)=TRUE,[1]Feuil1!$C87,\"X\")","v":0}]
[null,null,{"$f":"IF(EXACT([1]Feuil1!$C88,[2]Feuil1!$C88)=TRUE,[1]Feuil1!$C88,\"X\")","v":0}]
[null,null,{"$f":"IF(EXACT([1]Feuil1!$C89,[2]Feuil1!$C89)=TRUE,[1]Feuil1!$C89,\"X\")","v":0}]
[null,null,{"$f":"IF(EXACT([1]Feuil1!$C90,[2]Feuil1!$C90)=TRUE,[1]Feuil1!$C90,\"X\")","v":0}]
[null,null,{"$f":"IF(EXACT([1]Feuil1!$C91,[2]Feuil1!$C91)=TRUE,[1]Feuil1!$C91,\"X\")","v":0}]
[null,null,{"$f":"IF(EXACT([1]Feuil1!$C92,[2]Feuil1!$C92)=TRUE,[1]Feuil1!$C92,\"X\")","v":0}]
[null,null,{"$f":"IF(EXACT([1]Feuil1!$C93,[2]Feuil1!$C93)=TRUE,[1]Feuil1!$C93,\"X\")","v":0}]
[null,null,{"$f":"IF(EXACT([1]Feuil1!$C94,[2]Feuil1!$C94)=TRUE,[1]Feuil1!$C94,\"X\")","v":0}]
[null,null,{"$f":"IF(EXACT([1]Feuil1!$C95,[2]Feuil1!$C95)=TRUE,[1]Feuil1!$C95,\"X\")","v":0}]
[null,null,{"$f":"IF(EXACT([1]Feuil1!$C96,[2]Feuil1!$C96)=TRUE,[1]Feuil1!$C96,\"X\")","v":0}]
[null,null,{"$f":"IF(EXACT([1]Feuil1!$C97,[2]Feuil1!$C97)=TRUE,[1]Feuil1!$C97,\"X\")","v":0}]
[null,null,{"$f":"IF(EXACT([1]Feuil1!$C98,[2]Feuil1!$C98)=TRUE,[1]Feuil1!$C98,\"X\")","v":0}]
[null,null,{"$f":"IF(EXACT([1]Feuil1!$C99,[2]Feuil1!$C99)=TRUE,[1]Feuil1!$C99,\"X\")","v":0}]
[null,null,{"$f":"IF(EXACT([1]Feuil1!$C100,[2]Feuil1!$C100)=TRUE,[1]Feuil1!$C100,\"X\")","v":0}]
[null,null,{"$f":"IF(EXACT([1]Feuil1!$C101,[2]Feuil1!$C101)=TRUE,[1]Feuil1!$C101,\"X\")","v":0}]
[null,null,{"$f":"IF(EXACT([1]Feuil1!$C102,[2]Feuil1!$C102)=TRUE,[1]Feuil1!$C102,\"X\")","v":0}]
[null,null,{"$f":"IF(EXACT([1]Feuil1!$C103,[2]Feuil1!$C103)=TRUE,[1]Feuil1!$C103,\"X\")","v":0}]
[null,null,{"$f":"IF(EXACT([1]Feuil1!$C104,[2]Feuil1!$C104)=TRUE,[1]Feuil1!$C104,\"X\")","v":0}]
[null,null,{"$f":"IF(EXACT([1]Feuil1!$C105,[2]Feuil1!$C105)=TRUE,[1]Feuil1!$C105,\"X\")","v":0}]
[null,null,{"$f":"IF(EXACT([1]Feuil1!$C106,[2]Feuil1!$C106)=TRUE,[1]Feuil1!$C106,\"X\")","v":0}]
[null,null,{"$f":"IF(EXACT([1]Feuil1!$C107,[2]Feuil1!$C107)=TRUE,[1]Feuil1!$C107,\"X\")","v":0}]
[null,null,{"$f":"IF(EXACT([1]Feuil1!$C108,[2]Feuil1!$C108)=TRUE,[1]Feuil1!$C108,\"X\")","v":0}]
[null,null,{"$f":"IF(EXACT([1]Feuil1!$C109,[2]Feuil1!$C109)=TRUE,[1]Feuil1!$C109,\"X\")","v":0}]
[null,null,{"$f":"IF(EXACT([1]Feuil1!$C110,[2]Feuil1!$C110)=TRUE,[1]Feuil1!$C110,\"X\")","v":0}]
[null,null,{"$f":"IF(EXACT([1]Feuil1!$C111,[2]Feuil1!$C111)=TRUE,[1]Feuil1!$C111,\"X\")","v":0}]
[null,null,{"$f":"IF(EXACT([1]Feuil1!$C112,[2]Feuil1!$C112)=TRUE,[1]Feuil1!$C112,\"X\")","v":0}]
[null,null,{"$f":"IF(EXACT([1]Feuil1!$C113,[2]Feuil1!$C113)=TRUE,[1]Feuil1!$C113,\"X\")","v":0}]
[null,null,{"$f":"IF(EXACT([1]Feuil1!$C114,[2]Feuil1!$C114)=TRUE,[1]Feuil1!$C114,\"X\")","v":0}]
[null,null,{"$f":"IF(EXACT([1]Feuil1!$C115,[2]Feuil1!$C115)=TRUE,[1]Feuil1!$C115,\"X\")","v":0}]
[null,null,{"$f":"IF(EXACT([1]Feuil1!$C116,[2]Feuil1!$C116)=TRUE,[1]Feuil1!$C116,\"X\")","v":0}]
[null,null,{"$f":"IF(EXACT([1]Feuil1!$C117,[2]Feuil1!$C117)=TRUE,[1]Feuil1!$C117,\"X\")","v":0}]
[null,null,{"$f":"IF(EXACT([1]Feuil1!$C118,[2]Feuil1!$C118)=TRUE,[1]Feuil1!$C118,\"X\")","v":0}]
[null,null,{"$f":"IF(EXACT([1]Feuil1!$C119,[2]Feuil1!$C119)=TRUE,[1]Feuil1!$C119,\"X\")","v":0}]
[null,null,{"$f":"IF(EXACT([1]Feuil1!$C120,[2]Feuil1!$C120)=TRUE,[1]Feuil1!$C120,\"X\")","v":0}]
[null,null,{"$f":"IF(EXACT([1]Feuil1!$C121,[2]Feuil1!$C121)=TRUE,[1]Feuil1!$C121,\"X\")","v":0}]
[null,null,{"$f":"IF(EXACT([1]Feuil1!$C122,[2]Feuil1!$C122)=TRUE,[1]Feuil1!$C122,\"X\")","v":0}]
[null,null,{"$f":"IF(EXACT([1]Feuil1!$C123,[2]Feuil1!$C123)=TRUE,[1]Feuil1!$C123,\"X\")","v":0}]
[null,null,{"$f":"IF(EXACT([1]Feuil1!$C124,[2]Feuil1!$C124)=TRUE,[1]Feuil1!$C124,\"X\")","v":0}]
[null,null,{"$f":"IF(EXACT([1]Feuil1!$C125,[2]Feuil1!$C125)=TRUE,[1]Feuil1!$C125,\"X\")","v":0}]
[null,null,{"$f":"IF(EXACT([1]Feuil1!$C126,[2]Feuil1!$C126)=TRUE,[1]Feuil1!$C126,\"X\")","v":0}]
[null,null,{"$f":"IF(EXACT([1]Feuil1!$C127,[2]Feuil1!$C127)=TRUE,[1]Feuil1!$C127,\"X\")","v":0}]
[null,null,{"$f":"IF(EXACT([1]Feuil1!$C128,[2]Feuil1!$C128)=TRUE,[1]Feuil1!$C128,\"X\")","v":0}]
[null,null,{"$f":"IF(EXACT([1]Feuil1!$C129,[2]Feuil1!$C129)=TRUE,[1]Feuil1!$C129,\"X\")","v":0}]
[null,null,{"$f":"IF(EXACT([1]Feuil1!$C130,[2]Feuil1!$C130)=TRUE,[1]Feuil1!$C130,\"X\")","v":0}]
[null,null,{"$f":"IF(EXACT([1]Feuil1!$C131,[2]Feuil1!$C131)=TRUE,[1]Feuil1!$C131,\"X\")","v":0}]
[null,null,{"$f":"IF(EXACT([1]Feuil1!$C132,[2]Feuil1!$C132)=TRUE,[1]Feuil1!$C132,\"X\")","v":0}]
[null,null,{"$f":"IF(EXACT([1]Feuil1!$C133,[2]Feuil1!$C133)=TRUE,[1]Feuil1!$C133,\"X\")","v":0}]
[null,null,{"$f":"IF(EXACT([1]Feuil1!$C134,[2]Feuil1!$C134)=TRUE,[1]Feuil1!$C134,\"X\")","v":0}]
[null,null,{"$f":"IF(EXACT([1]Feuil1!$C135,[2]Feuil1!$C135)=TRUE,[1]Feuil1!$C135,\"X\")","v":0}]
[null,null,{"$f":"IF(EXACT([1]Feuil1!$C136,[2]Feuil1!$C136)=TRUE,[1]Feuil1!$C136,\"X\")","v":0}]
[null,null,{"$f":"IF(EXACT([1]Feuil1!$C137,[2]Feuil1!$C137)=TRUE,[1]Feuil1!$C137,\"X\")","v":0}]
[null,null,{"$f":"IF(EXACT([1]Feuil1!$C138,[2]Feuil1!$C138)=TRUE,[1]Feuil1!$C138,\"X\")","v":0}]
[null,null,{"$f":"IF(EXACT([1]Feuil1!$C139,[2]Feuil1!$C139)=TRUE,[1]Feuil1!$C139,\"X\")","v":0}]
[null,null,{"$f":"IF(EXACT([1]Feuil1!$C140,[2]Feuil1!$C140)=TRUE,[1]Feuil1!$C140,\"X\")","v":0}]
[null,null,{"$f":"IF(EXACT([1]Feuil1!$C141,[2]Feuil1!$C141)=TRUE,[1]Feuil1!$C141,\"X\")","v":0}]
[null,null,{"$f":"IF(EXACT([1]Feuil1!$C142,[2]Feuil1!$C142)=TRUE,[1]Feuil1!$C142,\"X\")","v":0}]
[null,null,{"$f":"IF(EXACT([1]Feuil1!$C143,[2]Feuil1!$C143)=TRUE,[1]Feuil1!$C143,\"X\")","v":0}]
[null,null,{"$f":"IF(EXACT([1]Feuil1!$C144,[2]Feuil1!$C144)=TRUE,[1]Feuil1!$C144,\"X\")","v":0}]
[null,null,{"$f":"IF(EXACT([1]Feuil1!$C145,[2]Feuil1!$C145)=TRUE,[1]Feuil1!$C145,\"X\")","v":0}]
[null,null,{"$f":"IF(EXACT([1]Feuil1!$C146,[2]Feuil1!$C146)=TRUE,[1]Feuil1!$C146,\"X\")","v":0}]
[null,null,{"$f":"IF(EXACT([1]Feuil1!$C147,[2]Feuil1!$C147)=TRUE,[1]Feuil1!$C147,\"X\")","v":0}]
[null,null,{"$f":"IF(EXACT([1]Feuil1!$C148,[2]Feuil1!$C148)=TRUE,[1]Feuil1!$C148,\"X\")","v":0}]
[null,null,{"$f":"IF(EXACT([1]Feuil1!$C149,[2]Feuil1!$C149)=TRUE,[1]Feuil1!$C149,\"X\")","v":0}]
[null,null,{"$f":"IF(EXACT([1]Feuil1!$C150,[2]Feuil1!$C150)=TRUE,[1]Feuil1!$C150,\"X\")","v":0}]
[null,null,{"$f":"IF(EXACT([1]Feuil1!$C151,[2]Feuil1!$C151)=TRUE,[1]Feuil1!$C151,\"X\")","v":0}]
[null,null,{"$f":"IF(EXACT([1]Feuil1!$C152,[2]Feuil1!$C152)=TRUE,[1]Feuil1!$C152,\"X\")","v":0}]
[null,null,{"$f":"IF(EXACT([1]Feuil1!$C153,[2]Feuil1!$C153)=TRUE,[1]Feuil1!$C153,\"X\")","v":0}]
[null,null,{"$f":"IF(EXACT([1]Feuil1!$C154,[2]Feuil1!$C154)=TRUE,[1]Feuil1!$C154,\"X\")","v":0}]
[null,null,{"$f":"IF(EXACT([1]Feuil1!$C155,[2]Feuil1!$C155)=TRUE,[1]Feuil1!$C155,\"X\")","v":0}]
[null,null,{"$f":"IF(EXACT([1]Feuil1!$C156,[2]Feuil1!$C156)=TRUE,[1]Feuil1!$C156,\"X\")","v":0}]
[null,null,{"$f":"IF(EXACT([1]Feuil1!$C157,[2]Feuil1!$C157)=TRUE,[1]Feuil1!$C157,\"X\")","v":0}]
[null,null,{"$f":"IF(EXACT([1]Feuil1!$C158,[2]Feuil1!$C158)=TRUE,[1]Feuil1!$C158,\"X\")","v":0}]
[null,null,{"$f":"IF(EXACT([1]Feuil1!$C159,[2]Feuil1!$C159)=TRUE,[1]Feuil1!$C159,\"X\")","v":0}]
[null,null,{"$f":"IF(EXACT([1]Feuil1!$C160,[2]Feuil1!$C160)=TRUE,[1]Feuil1!$C160,\"X\")","v":0}]
[null,null,{"$f":"IF(EXACT([1]Feuil1!$C161,[2]Feuil1!$C161)=TRUE,[1]Feuil1!$C161,\"X\")","v":0}]
[null,null,{"$f":"IF(EXACT([1]Feuil1!$C162,[2]Feuil1!$C162)=TRUE,[1]Feuil1!$C162,\"X\")","v":0}]
[null,null,{"$f":"IF(EXACT([1]Feuil1!$C163,[2]Feuil1!$C163)=TRUE,[1]Feuil1!$C163,\"X\")","v":0}]
[null,null,{"$f":"IF(EXACT([1]Feuil1!$C164,[2]Feuil1!$C164)=TRUE,[1]Feuil1!$C164,\"X\")","v":0}]
[null,null,{"$f":"IF(EXACT([1]Feuil1!$C165,[2]Feuil1!$C165)=TRUE,[1]Feuil1!$C165,\"X\")","v":0}]
[null,null,{"$f":"IF(EXACT([1]Feuil1!$C166,[2]Feuil1!$C166)=TRUE,[1]Feuil1!$C166,\"X\")","v":0}]
[null,null,{"$f":"IF(EXACT([1]Feuil1!$C167,[2]Feuil1!$C167)=TRUE,[1]Feuil1!$C167,\"X\")","v":0}]
[null,null,{"$f":"IF(EXACT([1]Feuil1!$C168,[2]Feuil1!$C168)=TRUE,[1]Feuil1!$C168,\"X\")","v":0}]
[null,null,{"$f":"IF(EXACT([1]Feuil1!$C169,[2]Feuil1!$C169)=TRUE,[1]Feuil1!$C169,\"X\")","v":0}]
[null,null,{"$f":"IF(EXACT([1]Feuil1!$C170,[2]Feuil1!$C170)=TRUE,[1]Feuil1!$C170,\"X\")","v":0}]
[null,null,{"$f":"IF(EXACT([1]Feuil1!$C171,[2]Feuil1!$C171)=TRUE,[1]Feuil1!$C171,\"X\")","v":0}]
[null,null,{"$f":"IF(EXACT([1]Feuil1!$C172,[2]Feuil1!$C172)=TRUE,[1]Feuil1!$C172,\"X\")","v":0}]
[null,null,{"$f":"IF(EXACT([1]Feuil1!$C173,[2]Feuil1!$C173)=TRUE,[1]Feuil1!$C173,\"X\")","v":0}]
[null,null,{"$f":"IF(EXACT([1]Feuil1!$C174,[2]Feuil1!$C174)=TRUE,[1]Feuil1!$C174,\"X\")","v":0}]
[null,null,{"$f":"IF(EXACT([1]Feuil1!$C175,[2]Feuil1!$C175)=TRUE,[1]Feuil1!$C175,\"X\")","v":0}]
[null,null,{"$f":"IF(EXACT([1]Feuil1!$C176,[2]Feuil1!$C176)=TRUE,[1]Feuil1!$C176,\"X\")","v":0}]
[null,null,{"$f":"IF(EXACT([1]Feuil1!$C177,[2]Feuil1!$C177)=TRUE,[1]Feuil1!$C177,\"X\")","v":0}]
[null,null,{"$f":"IF(EXACT([1]Feuil1!$C178,[2]Feuil1!$C178)=TRUE,[1]Feuil1!$C178,\"X\")","v":0}]
[null,null,{"$f":"IF(EXACT([1]Feuil1!$C179,[2]Feuil1!$C179)=TRUE,[1]Feuil1!$C179,\"X\")","v":0}]
[null,null,{"$f":"IF(EXACT([1]Feuil1!$C180,[2]Feuil1!$C180)=TRUE,[1]Feuil1!$C180,\"X\")","v":0}]
[null,null,{"$f":"IF(EXACT([1]Feuil1!$C181,[2]Feuil1!$C181)=TRUE,[1]Feuil1!$C181,\"X\")","v":0}]
[null,null,{"$f":"IF(EXACT([1]Feuil1!$C182,[2]Feuil1!$C182)=TRUE,[1]Feuil1!$C182,\"X\")","v":0}]
[null,null,{"$f":"IF(EXACT([1]Feuil1!$C183,[2]Feuil1!$C183)=TRUE,[1]Feuil1!$C183,\"X\")","v":0}]
[null,null,{"$f":"IF(EXACT([1]Feuil1!$C184,[2]Feuil1!$C184)=TRUE,[1]Feuil1!$C184,\"X\")","v":0}]
[null,null,{"$f":"IF(EXACT([1]Feuil1!$C185,[2]Feuil1!$C185)=TRUE,[1]Feuil1!$C185,\"X\")","v":0}]
[null,null,{"$f":"IF(EXACT([1]Feuil1!$C186,[2]Feuil1!$C186)=TRUE,[1]Feuil1!$C186,\"X\")","v":0}]
[null,null,{"$f":"IF(EXACT([1]Feuil1!$C187,[2]Feuil1!$C187)=TRUE,[1]Feuil1!$C187,\"X\")","v":0}]
[null,null,{"$f":"IF(EXACT([1]Feuil1!$C188,[2]Feuil1!$C188)=TRUE,[1]Feuil1!$C188,\"X\")","v":0}]
[null,null,{"$f":"IF(EXACT([1]Feuil1!$C189,[2]Feuil1!$C189)=TRUE,[1]Feuil1!$C189,\"X\")","v":0}]
[null,null,{"$f":"IF(EXACT([1]Feuil1!$C190,[2]Feuil1!$C190)=TRUE,[1]Feuil1!$C190,\"X\")","v":0}]
[null,null,{"$f":"IF(EXACT([1]Feuil1!$C191,[2]Feuil1!$C191)=TRUE,[1]Feuil1!$C191,\"X\")","v":0}]
[null,null,{"$f":"IF(EXACT([1]Feuil1!$C192,[2]Feuil1!$C192)=TRUE,[1]Feuil1!$C192,\"X\")","v":0}]
[null,null,{"$f":"IF(EXACT([1]Feuil1!$C193,[2]Feuil1!$C193)=TRUE,[1]Feuil1!$C193,\"X\")","v":0}]
[null,null,{"$f":"IF(EXACT([1]Feuil1!$C194,[2]Feuil1!$C194)=TRUE,[1]Feuil1!$C194,\"X\")","v":0}]
[null,null,{"$f":"IF(EXACT([1]Feuil1!$C195,[2]Feuil1!$C195)=TRUE,[1]Feuil1!$C195,\"X\")","v":0}]
[null,null,{"$f":"IF(EXACT([1]Feuil1!$C196,[2]Feuil1!$C196)=TRUE,[1]Feuil1!$C196,\"X\")","v":0}]
[null,null,{"$f":"IF(EXACT([1]Feuil1!$C197,[2]Feuil1!$C197)=TRUE,[1]Feuil1!$C197,\"X\")","v":0}]
[null,null,{"$f":"IF(EXACT([1]Feuil1!$C198,[2]Feuil1!$C198)=TRUE,[1]Feuil1!$C198,\"X\")","v":0}]
[null,null,{"$f":"IF(EXACT([1]Feuil1!$C199,[2]Feuil1!$C199)=TRUE,[1]Feuil1!$C199,\"X\")","v":0}]
[null,null,{"$f":"IF(EXACT([1]Feuil1!$C200,[2]Feuil1!$C200)=TRUE,[1]Feuil1!$C200,\"X\")","v":0}]
[null,null,{"$f":"IF(EXACT([1]Feuil1!$C201,[2]Feuil1!$C201)=TRUE,[1]Feuil1!$C201,\"X\")","v":0}]
[null,null,{"$f":"IF(EXACT([1]Feuil1!$C202,[2]Feuil1!$C202)=TRUE,[1]Feuil1!$C202,\"X\")","v":0}]
[null,null,{"$f":"IF(EXACT([1]Feuil1!$C203,[2]Feuil1!$C203)=TRUE,[1]Feuil1!$C203,\"X\")","v":0}]
[null,null,{"$f":"IF(EXACT([1]Feuil1!$C204,[2]Feuil1!$C204)=TRUE,[1]Feuil1!$C204,\"X\")","v":0}]
[null,null,{"$f":"IF(EXACT([1]Feuil1!$C205,[2]Feuil1!$C205)=TRUE,[1]Feuil1!$C205,\"X\")","v":0}]
[null,null,{"$f":"IF(EXACT([1]Feuil1!$C206,[2]Feuil1!$C206)=TRUE,[1]Feuil1!$C206,\"X\")","v":0}]
[null,null,{"$f":"IF(EXACT([1]Feuil1!$C207,[2]Feuil1!$C207)=TRUE,[1]Feuil1!$C207,\"X\")","v":0}]
[null,null,{"$f":"IF(EXACT([1]Feuil1!$C208,[2]Feuil1!$C208)=TRUE,[1]Feuil1!$C208,\"X\")","v":0}]
[null,null,{"$f":"IF(EXACT([1]Feuil1!$C209,[2]Feuil1!$C209)=TRUE,[1]Feuil1!$C209,\"X\")","v":0}]
[null,null,{"$f":"IF(EXACT([1]Feuil1!$C210,[2]Feuil1!$C210)=TRUE,[1]Feuil1!$C210,\"X\")","v":0}]
[null,null,{"$f":"IF(EXACT([1]Feuil1!$C211,[2]Feuil1!$C211)=TRUE,[1]Feuil1!$C211,\"X\")","v":0}]
[null,null,{"$f":"IF(EXACT([1]Feuil1!$C212,[2]Feuil1!$C212)=TRUE,[1]Feuil1!$C212,\"X\")","v":0}]
[null,null,{"$f":"IF(EXACT([1]Feuil1!$C213,[2]Feuil1!$C213)=TRUE,[1]Feuil1!$C213,\"X\")","v":0}]
[null,null,{"$f":"IF(EXACT([1]Feuil1!$C214,[2]Feuil1!$C214)=TRUE,[1]Feuil1!$C214,\"X\")","v":0}]
[null,null,{"$f":"IF(EXACT([1]Feuil1!$C215,[2]Feuil1!$C215)=TRUE,[1]Feuil1!$C215,\"X\")","v":0}]
[null,null,{"$f":"IF(EXACT([1]Feuil1!$C216,[2]Feuil1!$C216)=TRUE,[1]Feuil1!$C216,\"X\")","v":0}]
[null,null,{"$f":"IF(EXACT([1]Feuil1!$C217,[2]Feuil1!$C217)=TRUE,[1]Feuil1!$C217,\"X\")","v":0}]
[null,null,{"$f":"IF(EXACT([1]Feuil1!$C218,[2]Feuil1!$C218)=TRUE,[1]Feuil1!$C218,\"X\")","v":0}]
[null,null,{"$f":"IF(EXACT([1]Feuil1!$C219,[2]Feuil1!$C219)=TRUE,[1]Feuil1!$C219,\"X\")","v":0}]
[null,null,{"$f":"IF(EXACT([1]Feuil1!$C220,[2]Feuil1!$C220)=TRUE,[1]Feuil1!$C220,\"X\")","v":0}]
[null,null,{"$f":"IF(EXACT([1]Feuil1!$C221,[2]Feuil1!$C221)=TRUE,[1]Feuil1!$C221,\"X\")","v":0}]
[null,null,{"$f":"IF(EXACT([1]Feuil1!$C222,[2]Feuil1!$C222)=TRUE,[1]Feuil1!$C222,\"X\")","v":0}]
[null,null,{"$f":"IF(EXACT([1]Feuil1!$C223,[2]Feuil1!$C223)=TRUE,[1]Feuil1!$C223,\"X\")","v":0}]
[null,null,{"$f":"IF(EXACT([1]Feuil1!$C224,[2]Feuil1!$C224)=TRUE,[1]Feuil1!$C224,\"X\")","v":0}]
[null,null,{"$f":"IF(EXACT([1]Feuil1!$C225,[2]Feuil1!$C225)=TRUE,[1]Feuil1!$C225,\"X\")","v":0}]
[null,null,{"$f":"IF(EXACT([1]Feuil1!$C226,[2]Feuil1!$C226)=TRUE,[1]Feuil1!$C226,\"X\")","v":0}]
[null,null,{"$f":"IF(EXACT([1]Feuil1!$C227,[2]Feuil1!$C227)=TRUE,[1]Feuil1!$C227,\"X\")","v":0}]
[null,null,{"$f":"IF(EXACT([1]Feuil1!$C228,[2]Feuil1!$C228)=TRUE,[1]Feuil1!$C228,\"X\")","v":0}]
[null,null,{"$f":"IF(EXACT([1]Feuil1!$C229,[2]Feuil1!$C229)=TRUE,[1]Feuil1!$C229,\"X\")","v":0}]
[null,null,{"$f":"IF(EXACT([1]Feuil1!$C230,[2]Feuil1!$C230)=TRUE,[1]Feuil1!$C230,\"X\")","v":0}]
[null,null,{"$f":"IF(EXACT([1]Feuil1!$C231,[2]Feuil1!$C231)=TRUE,[1]Feuil1!$C231,\"X\")","v":0}]
[null,null,{"$f":"IF(EXACT([1]Feuil1!$C232,[2]Feuil1!$C232)=TRUE,[1]Feuil1!$C232,\"X\")","v":0}]
[null,null,{"$f":"IF(EXACT([1]Feuil1!$C233,[2]Feuil1!$C233)=TRUE,[1]Feuil1!$C233,\"X\")","v":0}]
[null,null,{"$f":"IF(EXACT([1]Feuil1!$C234,[2]Feuil1!$C234)=TRUE,[1]Feuil1!$C234,\"X\")","v":0}]
[null,null,{"$f":"IF(EXACT([1]Feuil1!$C235,[2]Feuil1!$C235)=TRUE,[1]Feuil1!$C235,\"X\")","v":0}]
[null,null,{"$f":"IF(EXACT([1]Feuil1!$C236,[2]Feuil1!$C236)=TRUE,[1]Feuil1!$C236,\"X\")","v":0}]
[null,null,{"$f":"IF(EXACT([1]Feuil1!$C237,[2]Feuil1!$C237)=TRUE,[1]Feuil1!$C237,\"X\")","v":0}]
[null,null,{"$f":"IF(EXACT([1]Feuil1!$C238,[2]Feuil1!$C238)=TRUE,[1]Feuil1!$C238,\"X\")","v":0}]
[null,null,{"$f":"IF(EXACT([1]Feuil1!$C239,[2]Feuil1!$C239)=TRUE,[1]Feuil1!$C239,\"X\")","v":0}]
[null,null,{"$f":"IF(EXACT([1]Feuil1!$C240,[2]Feuil1!$C240)=TRUE,[1]Feuil1!$C240,\"X\")","v":0}]
[null,null,{"$f":"IF(EXACT([1]Feuil1!$C241,[2]Feuil1!$C241)=TRUE,[1]Feuil1!$C241,\"X\")","v":0}]
[null,null,{"$f":"IF(EXACT([1]Feuil1!$C242,[2]Feuil1!$C242)=TRUE,[1]Feuil1!$C242,\"X\")","v":0}]
[null,null,{"$f":"IF(EXACT([1]Feuil1!$C243,[2]Feuil1!$C243)=TRUE,[1]Feuil1!$C243,\"X\")","v":0}]
[null,null,{"$f":"IF(EXACT([1]Feuil1!$C244,[2]Feuil1!$C244)=TRUE,[1]Feuil1!$C244,\"X\")","v":0}]
[null,null,{"$f":"IF(EXACT([1]Feuil1!$C245,[2]Feuil1!$C245)=TRUE,[1]Feuil1!$C245,\"X\")","v":0}]
[null,null,{"$f":"IF(EXACT([1]Feuil1!$C246,[2]Feuil1!$C246)=TRUE,[1]Feuil1!$C246,\"X\")","v":0}]
[null,null,{"$f":"IF(EXACT([1]Feuil1!$C247,[2]Feuil1!$C247)=TRUE,[1]Feuil1!$C247,\"X\")","v":0}]
[null,null,{"$f":"IF(EXACT([1]Feuil1!$C248,[2]Feuil1!$C248)=TRUE,[1]Feuil1!$C248,\"X\")","v":0}]
[null,null,{"$f":"IF(EXACT([1]Feuil1!$C249,[2]Feuil1!$C249)=TRUE,[1]Feuil1!$C249,\"X\")","v":0}]
[null,null,{"$f":"IF(EXACT([1]Feuil1!$C250,[2]Feuil1!$C250)=TRUE,[1]Feuil1!$C250,\"X\")","v":0}]
[null,null,{"$f":"IF(EXACT([1]Feuil1!$C251,[2]Feuil1!$C251)=TRUE,[1]Feuil1!$C251,\"X\")","v":0}]
[null,null,{"$f":"IF(EXACT([1]Feuil1!$C252,[2]Feuil1!$C252)=TRUE,[1]Feuil1!$C252,\"X\")","v":0}]
[null,null,{"$f":"IF(EXACT([1]Feuil1!$C253,[2]Feuil1!$C253)=TRUE,[1]Feuil1!$C253,\"X\")","v":0}]
[null,null,{"$f":"IF(EXACT([1]Feuil1!$C254,[2]Feuil1!$C254)=TRUE,[1]Feuil1!$C254,\"X\")","v":0}]
[null,null,{"$f":"IF(EXACT([1]Feuil1!$C255,[2]Feuil1!$C255)=TRUE,[1]Feuil1!$C255,\"X\")","v":0}]
[null,null,{"$f":"IF(EXACT([1]Feuil1!$C256,[2]Feuil1!$C256)=TRUE,[1]Feuil1!$C256,\"X\")","v":0}]
[null,null,{"$f":"IF(EXACT([1]Feuil1!$C257,[2]Feuil1!$C257)=TRUE,[1]Feuil1!$C257,\"X\")","v":0}]
[null,null,{"$f":"IF(EXACT([1]Feuil1!$C258,[2]Feuil1!$C258)=TRUE,[1]Feuil1!$C258,\"X\")","v":0}]
[null,null,{"$f":"IF(EXACT([1]Feuil1!$C259,[2]Feuil1!$C259)=TRUE,[1]Feuil1!$C259,\"X\")","v":0}]
[null,null,{"$f":"IF(EXACT([1]Feuil1!$C260,[2]Feuil1!$C260)=TRUE,[1]Feuil1!$C260,\"X\")","v":0}]
[null,null,{"$f":"IF(EXACT([1]Feuil1!$C261,[2]Feuil1!$C261)=TRUE,[1]Feuil1!$C261,\"X\")","v":0}]
[null,null,{"$f":"IF(EXACT([1]Feuil1!$C262,[2]Feuil1!$C262)=TRUE,[1]Feuil1!$C262,\"X\")","v":0}]
[null,null,{"$f":"IF(EXACT([1]Feuil1!$C263,[2]Feuil1!$C263)=TRUE,[1]Feuil1!$C263,\"X\")","v":0}]
[null,null,{"$f":"IF(EXACT([1]Feuil1!$C264,[2]Feuil1!$C264)=TRUE,[1]Feuil1!$C264,\"X\")","v":0}]
[null,null,{"$f":"IF(EXACT([1]Feuil1!$C265,[2]Feuil1!$C265)=TRUE,[1]Feuil1!$C265,\"X\")","v":0}]
[null,null,{"$f":"IF(EXACT([1]Feuil1!$C266,[2]Feuil1!$C266)=TRUE,[1]Feuil1!$C266,\"X\")","v":0}]
[null,null,{"$f":"IF(EXACT([1]Feuil1!$C267,[2]Feuil1!$C267)=TRUE,[1]Feuil1!$C267,\"X\")","v":0}]
[null,null,{"$f":"IF(EXACT([1]Feuil1!$C268,[2]Feuil1!$C268)=TRUE,[1]Feuil1!$C268,\"X\")","v":0}]
[null,null,{"$f":"IF(EXACT([1]Feuil1!$C269,[2]Feuil1!$C269)=TRUE,[1]Feuil1!$C269,\"X\")","v":0}]
[null,null,{"$f":"IF(EXACT([1]Feuil1!$C270,[2]Feuil1!$C270)=TRUE,[1]Feuil1!$C270,\"X\")","v":0}]
[null,null,{"$f":"IF(EXACT([1]Feuil1!$C271,[2]Feuil1!$C271)=TRUE,[1]Feuil1!$C271,\"X\")","v":0}]
[null,null,{"$f":"IF(EXACT([1]Feuil1!$C272,[2]Feuil1!$C272)=TRUE,[1]Feuil1!$C272,\"X\")","v":0}]
[null,null,{"$f":"IF(EXACT([1]Feuil1!$C273,[2]Feuil1!$C273)=TRUE,[1]Feuil1!$C273,\"X\")","v":0}]
[null,null,{"$f":"IF(EXACT([1]Feuil1!$C274,[2]Feuil1!$C274)=TRUE,[1]Feuil1!$C274,\"X\")","v":0}]
[null,null,{"$f":"IF(EXACT([1]Feuil1!$C275,[2]Feuil1!$C275)=TRUE,[1]Feuil1!$C275,\"X\")","v":0}]
[null,null,{"$f":"IF(EXACT([1]Feuil1!$C276,[2]Feuil1!$C276)=TRUE,[1]Feuil1!$C276,\"X\")","v":0}]
[null,null,{"$f":"IF(EXACT([1]Feuil1!$C277,[2]Feuil1!$C277)=TRUE,[1]Feuil1!$C277,\"X\")","v":0}]
[null,null,{"$f":"IF(EXACT([1]Feuil1!$C278,[2]Feuil1!$C278)=TRUE,[1]Feuil1!$C278,\"X\")","v":0}]
[null,null,{"$f":"IF(EXACT([1]Feuil1!$C279,[2]Feuil1!$C279)=TRUE,[1]Feuil1!$C279,\"X\")","v":0}]
[null,null,{"$f":"IF(EXACT([1]Feuil1!$C280,[2]Feuil1!$C280)=TRUE,[1]Feuil1!$C280,\"X\")","v":0}]
[null,null,{"$f":"IF(EXACT([1]Feuil1!$C281,[2]Feuil1!$C281)=TRUE,[1]Feuil1!$C281,\"X\")","v":0}]
[null,null,{"$f":"IF(EXACT([1]Feuil1!$C282,[2]Feuil1!$C282)=TRUE,[1]Feuil1!$C282,\"X\")","v":0}]
[null,null,{"$f":"IF(EXACT([1]Feuil1!$C283,[2]Feuil1!$C283)=TRUE,[1]Feuil1!$C283,\"X\")","v":0}]
[null,null,{"$f":"IF(EXACT([1]Feuil1!$C284,[2]Feuil1!$C284)=TRUE,[1]Feuil1!$C284,\"X\")","v":0}]
[null,null,{"$f":"IF(EXACT([1]Feuil1!$C285,[2]Feuil1!$C285)=TRUE,[1]Feuil1!$C285,\"X\")","v":0}]
[null,null,{"$f":"IF(EXACT([1]Feuil1!$C286,[2]Feuil1!$C286)=TRUE,[1]Feuil1!$C286,\"X\")","v":0}]
[null,null,{"$f":"IF(EXACT([1]Feuil1!$C287,[2]Feuil1!$C287)=TRUE,[1]Feuil1!$C287,\"X\")","v":0}]
[null,null,{"$f":"IF(EXACT([1]Feuil1!$C288,[2]Feuil1!$C288)=TRUE,[1]Feuil1!$C288,\"X\")","v":0}]
[null,null,{"$f":"IF(EXACT([1]Feuil1!$C289,[2]Feuil1!$C289)=TRUE,[1]Feuil1!$C289,\"X\")","v":0}]
[null,null,{"$f":"IF(EXACT([1]Feuil1!$C290,[2]Feuil1!$C290)=TRUE,[1]Feuil1!$C290,\"X\")","v":0}]
[null,null,{"$f":"IF(EXACT([1]Feuil1!$C291,[2]Feuil1!$C291)=TRUE,[1]Feuil1!$C291,\"X\")","v":0}]
[null,null,{"$f":"IF(EXACT([1]Feuil1!$C292,[2]Feuil1!$C292)=TRUE,[1]Feuil1!$C292,\"X\")","v":0}]
[null,null,{"$f":"IF(EXACT([1]Feuil1!$C293,[2]Feuil1!$C293)=TRUE,[1]Feuil1!$C293,\"X\")","v":0}]
[null,null,{"$f":"IF(EXACT([1]Feuil1!$C294,[2]Feuil1!$C294)=TRUE,[1]Feuil1!$C294,\"X\")","v":0}]
[null,null,{"$f":"IF(EXACT([1]Feuil1!$C295,[2]Feuil1!$C295)=TRUE,[1]Feuil1!$C295,\"X\")","v":0}]
[null,null,{"$f":"IF(EXACT([1]Feuil1!$C296,[2]Feuil1!$C296)=TRUE,[1]Feuil1!$C296,\"X\")","v":0}]
[null,null,{"$f":"IF(EXACT([1]Feuil1!$C297,[2]Feuil1!$C297)=TRUE,[1]Feuil1!$C297,\"X\")","v":0}]
[null,null,{"$f":"IF(EXACT([1]Feuil1!$C298,[2]Feuil1!$C298)=TRUE,[1]Feuil1!$C298,\"X\")","v":0}]
[null,null,{"$f":"IF(EXACT([1]Feuil1!$C299,[2]Feuil1!$C299)=TRUE,[1]Feuil1!$C299,\"X\")","v":0}]
[null,null,{"$f":"IF(EXACT([1]Feuil1!$C300,[2]Feuil1!$C300)=TRUE,[1]Feuil1!$C300,\"X\")","v":0}]
[null,null,{"$f":"IF(EXACT([1]Feuil1!$C301,[2]Feuil1!$C301)=TRUE,[1]Feuil1!$C301,\"X\")","v":0}]
[null,null,{"$f":"IF(EXACT([1]Feuil1!$C302,[2]Feuil1!$C302)=TRUE,[1]Feuil1!$C302,\"X\")","v":0}]
[null,null,{"$f":"IF(EXACT([1]Feuil1!$C303,[2]Feuil1!$C303)=TRUE,[1]Feuil1!$C303,\"X\")","v":0}]
[null,null,{"$f":"IF(EXACT([1]Feuil1!$C304,[2]Feuil1!$C304)=TRUE,[1]Feuil1!$C304,\"X\")","v":0}]
[null,null,{"$f":"IF(EXACT([1]Feuil1!$C305,[2]Feuil1!$C305)=TRUE,[1]Feuil1!$C305,\"X\")","v":0}]
[null,null,{"$f":"IF(EXACT([1]Feuil1!$C306,[2]Feuil1!$C306)=TRUE,[1]Feuil1!$C306,\"X\")","v":0}]
[null,null,{"$f":"IF(EXACT([1]Feuil1!$C307,[2]Feuil1!$C307)=TRUE,[1]Feuil1!$C307,\"X\")","v":0}]
[null,null,{"$f":"IF(EXACT([1]Feuil1!$C308,[2]Feuil1!$C308)=TRUE,[1]Feuil1!$C308,\"X\")","v":0}]
[null,null,{"$f":"IF(EXACT([1]Feuil1!$C309,[2]Feuil1!$C309)=TRUE,[1]Feuil1!$C309,\"X\")","v":0}]
[null,null,{"$f":"IF(EXACT([1]Feuil1!$C310,[2]Feuil1!$C310)=TRUE,[1]Feuil1!$C310,\"X\")","v":0}]
[null,null,{"$f":"IF(EXACT([1]Feuil1!$C311,[2]Feuil1!$C311)=TRUE,[1]Feuil1!$C311,\"X\")","v":0}]
[null,null,{"$f":"IF(EXACT([1]Feuil1!$C312,[2]Feuil1!$C312)=TRUE,[1]Feuil1!$C312,\"X\")","v":0}]
[null,null,{"$f":"IF(EXACT([1]Feuil1!$C313,[2]Feuil1!$C313)=TRUE,[1]Feuil1!$C313,\"X\")","v":0}]
[null,null,{"$f":"IF(EXACT([1]Feuil1!$C314,[2]Feuil1!$C314)=TRUE,[1]Feuil1!$C314,\"X\")","v":0}]
[null,null,{"$f":"IF(EXACT([1]Feuil1!$C315,[2]Feuil1!$C315)=TRUE,[1]Feuil1!$C315,\"X\")","v":0}]
[null,null,{"$f":"IF(EXACT([1]Feuil1!$C316,[2]Feuil1!$C316)=TRUE,[1]Feuil1!$C316,\"X\")","v":0}]
[null,null,{"$f":"IF(EXACT([1]Feuil1!$C317,[2]Feuil1!$C317)=TRUE,[1]Feuil1!$C317,\"X\")","v":0}]
[null,null,{"$f":"IF(EXACT([1]Feuil1!$C318,[2]Feuil1!$C318)=TRUE,[1]Feuil1!$C318,\"X\")","v":0}]
[null,null,{"$f":"IF(EXACT([1]Feuil1!$C319,[2]Feuil1!$C319)=TRUE,[1]Feuil1!$C319,\"X\")","v":0}]
[null,null,{"$f":"IF(EXACT([1]Feuil1!$C320,[2]Feuil1!$C320)=TRUE,[1]Feuil1!$C320,\"X\")","v":0}]
[null,null,{"$f":"IF(EXACT([1]Feuil1!$C321,[2]Feuil1!$C321)=TRUE,[1]Feuil1!$C321,\"X\")","v":0}]
[null,null,{"$f":"IF(EXACT([1]Feuil1!$C322,[2]Feuil1!$C322)=TRUE,[1]Feuil1!$C322,\"X\")","v":0}]
[null,null,{"$f":"IF(EXACT([1]Feuil1!$C323,[2]Feuil1!$C323)=TRUE,[1]Feuil1!$C323,\"X\")","v":0}]
[null,null,{"$f":"IF(EXACT([1]Feuil1!$C324,[2]Feuil1!$C324)=TRUE,[1]Feuil1!$C324,\"X\")","v":0}]
[null,null,{"$f":"IF(EXACT([1]Feuil1!$C325,[2]Feuil1!$C325)=TRUE,[1]Feuil1!$C325,\"X\")","v":0}]
[null,null,{"$f":"IF(EXACT([1]Feuil1!$C326,[2]Feuil1!$C326)=TRUE,[1]Feuil1!$C326,\"X\")","v":0}]
[null,null,{"$f":"IF(EXACT([1]Feuil1!$C327,[2]Feuil1!$C327)=TRUE,[1]Feuil1!$C327,\"X\")","v":0}]
[null,null,{"$f":"IF(EXACT([1]Feuil1!$C328,[2]Feuil1!$C328)=TRUE,[1]Feuil1!$C328,\"X\")","v":0}]
[null,null,{"$f":"IF(EXACT([1]Feuil1!$C329,[2]Feuil1!$C329)=TRUE,[1]Feuil1!$C329,\"X\")","v":0}]
[null,null,{"$f":"IF(EXACT([1]Feuil1!$C330,[2]Feuil1!$C330)=TRUE,[1]Feuil1!$C330,\"X\")","v":0}]
[null,null,{"$f":"IF(EXACT([1]Feuil1!$C331,[2]Feuil1!$C331)=TRUE,[1]Feuil1!$C331,\"X\")","v":0}]
[null,null,{"$f":"IF(EXACT([1]Feuil1!$C332,[2]Feuil1!$C332)=TRUE,[1]Feuil1!$C332,\"X\")","v":0}]
[null,null,{"$f":"IF(EXACT([1]Feuil1!$C333,[2]Feuil1!$C333)=TRUE,[1]Feuil1!$C333,\"X\")","v":0}]
[null,null,{"$f":"IF(EXACT([1]Feuil1!$C334,[2]Feuil1!$C334)=TRUE,[1]Feuil1!$C334,\"X\")","v":0}]
[null,null,{"$f":"IF(EXACT([1]Feuil1!$C335,[2]Feuil1!$C335)=TRUE,[1]Feuil1!$C335,\"X\")","v":0}]
[null,null,{"$f":"IF(EXACT([1]Feuil1!$C336,[2]Feuil1!$C336)=TRUE,[1]Feuil1!$C336,\"X\")","v":0}]
[null,null,{"$f":"IF(EXACT([1]Feuil1!$C337,[2]Feuil1!$C337)=TRUE,[1]Feuil1!$C337,\"X\")","v":0}]
[null,null,{"$f":"IF(EXACT([1]Feuil1!$C338,[2]Feuil1!$C338)=TRUE,[1]Feuil1!$C338,\"X\")","v":0}]
[null,null,{"$f":"IF(EXACT([1]Feuil1!$C339,[2]Feuil1!$C339)=TRUE,[1]Feuil1!$C339,\"X\")","v":0}]
[null,null,{"$f":"IF(EXACT([1]Feuil1!$C340,[2]Feuil1!$C340)=TRUE,[1]Feuil1!$C340,\"X\")","v":0}]
[null,null,{"$f":"IF(EXACT([1]Feuil1!$C341,[2]Feuil1!$C341)=TRUE,[1]Feuil1!$C341,\"X\")","v":0}]
[null,null,{"$f":"IF(EXACT([1]Feuil1!$C342,[2]Feuil1!$C342)=TRUE,[1]Feuil1!$C342,\"X\")","v":0}]
[null,null,{"$f":"IF(EXACT([1]Feuil1!$C343,[2]Feuil1!$C343)=TRUE,[1]Feuil1!$C343,\"X\")","v":0}]
[null,null,{"$f":"IF(EXACT([1]Feuil1!$C344,[2]Feuil1!$C344)=TRUE,[1]Feuil1!$C344,\"X\")","v":0}]
[null,null,{"$f":"IF(EXACT([1]Feuil1!$C345,[2]Feuil1!$C345)=TRUE,[1]Feuil1!$C345,\"X\")","v":0}]
[null,null,{"$f":"IF(EXACT([1]Feuil1!$C346,[2]Feuil1!$C346)=TRUE,[1]Feuil1!$C346,\"X\")","v":0}]
[null,null,{"$f":"IF(EXACT([1]Feuil1!$C347,[2]Feuil1!$C347)=TRUE,[1]Feuil1!$C347,\"X\")","v":0}]
[null,null,{"$f":"IF(EXACT([1]Feuil1!$C348,[2]Feuil1!$C348)=TRUE,[1]Feuil1!$C348,\"X\")","v":0}]
[null,null,{"$f":"IF(EXACT([1]Feuil1!$C349,[2]Feuil1!$C349)=TRUE,[1]Feuil1!$C349,\"X\")","v":0}]
[null,null,{"$f":"IF(EXACT([1]Feuil1!$C350,[2]Feuil1!$C350)=TRUE,[1]Feuil1!$C350,\"X\")","v":0}]
[null,null,{"$f":"IF(EXACT([1]Feuil1!$C351,[2]Feuil1!$C351)=TRUE,[1]Feuil1!$C351,\"X\")","v":0}]
[null,null,{"$f":"IF(EXACT([1]Feuil1!$C352,[2]Feuil1!$C352)=TRUE,[1]Feuil1!$C352,\"X\")","v":0}]
[null,null,{"$f":"IF(EXACT([1]Feuil1!$C353,[2]Feuil1!$C353)=TRUE,[1]Feuil1!$C353,\"X\")","v":0}]
[null,null,{"$f":"IF(EXACT([1]Feuil1!$C354,[2]Feuil1!$C354)=TRUE,[1]Feuil1!$C354,\"X\")","v":0}]
[null,null,{"$f":"IF(EXACT([1]Feuil1!$C355,[2]Feuil1!$C355)=TRUE,[1]Feuil1!$C355,\"X\")","v":0}]
[null,null,{"$f":"IF(EXACT([1]Feuil1!$C356,[2]Feuil1!$C356)=TRUE,[1]Feuil1!$C356,\"X\")","v":0}]
[null,null,{"$f":"IF(EXACT([1]Feuil1!$C357,[2]Feuil1!$C357)=TRUE,[1]Feuil1!$C357,\"X\")","v":0}]
[null,null,{"$f":"IF(EXACT([1]Feuil1!$C358,[2]Feuil1!$C358)=TRUE,[1]Feuil1!$C358,\"X\")","v":0}]
[null,null,{"$f":"IF(EXACT([1]Feuil1!$C359,[2]Feuil1!$C359)=TRUE,[1]Feuil1!$C359,\"X\")","v":0}]
[null,null,{"$f":"IF(EXACT([1]Feuil1!$C360,[2]Feuil1!$C360)=TRUE,[1]Feuil1!$C360,\"X\")","v":0}]
[null,null,{"$f":"IF(EXACT([1]Feuil1!$C361,[2]Feuil1!$C361)=TRUE,[1]Feuil1!$C361,\"X\")","v":0}]
[null,null,{"$f":"IF(EXACT([1]Feuil1!$C362,[2]Feuil1!$C362)=TRUE,[1]Feuil1!$C362,\"X\")","v":0}]
[null,null,{"$f":"IF(EXACT([1]Feuil1!$C363,[2]Feuil1!$C363)=TRUE,[1]Feuil1!$C363,\"X\")","v":0}]
[null,null,{"$f":"IF(EXACT([1]Feuil1!$C364,[2]Feuil1!$C364)=TRUE,[1]Feuil1!$C364,\"X\")","v":0}]
[null,null,{"$f":"IF(EXACT([1]Feuil1!$C365,[2]Feuil1!$C365)=TRUE,[1]Feuil1!$C365,\"X\")","v":0}]
[null,null,{"$f":"IF(EXACT([1]Feuil1!$C366,[2]Feuil1!$C366)=TRUE,[1]Feuil1!$C366,\"X\")","v":0}]
[null,null,{"$f":"IF(EXACT([1]Feuil1!$C367,[2]Feuil1!$C367)=TRUE,[1]Feuil1!$C367,\"X\")","v":0}]
[null,null,{"$f":"IF(EXACT([1]Feuil1!$C368,[2]Feuil1!$C368)=TRUE,[1]Feuil1!$C368,\"X\")","v":0}]
[null,null,{"$f":"IF(EXACT([1]Feuil1!$C369,[2]Feuil1!$C369)=TRUE,[1]Feuil1!$C369,\"X\")","v":0}]
[null,null,{"$f":"IF(EXACT([1]Feuil1!$C370,[2]Feuil1!$C370)=TRUE,[1]Feuil1!$C370,\"X\")","v":0}]
[null,null,{"$f":"IF(EXACT([1]Feuil1!$C371,[2]Feuil1!$C371)=TRUE,[1]Feuil1!$C371,\"X\")","v":0}]
[null,null,{"$f":"IF(EXACT([1]Feuil1!$C372,[2]Feuil1!$C372)=TRUE,[1]Feuil1!$C372,\"X\")","v":0}]
[null,null,{"$f":"IF(EXACT([1]Feuil1!$C373,[2]Feuil1!$C373)=TRUE,[1]Feuil1!$C373,\"X\")","v":0}]
[null,null,{"$f":"IF(EXACT([1]Feuil1!$C374,[2]Feuil1!$C374)=TRUE,[1]Feuil1!$C374,\"X\")","v":0}]
[null,null,{"$f":"IF(EXACT([1]Feuil1!$C375,[2]Feuil1!$C375)=TRUE,[1]Feuil1!$C375,\"X\")","v":0}]
[null,null,{"$f":"IF(EXACT([1]Feuil1!$C376,[2]Feuil1!$C376)=TRUE,[1]Feuil1!$C376,\"X\")","v":0}]
[null,null,{"$f":"IF(EXACT([1]Feuil1!$C377,[2]Feuil1!$C377)=TRUE,[1]Feuil1!$C377,\"X\")","v":0}]
[null,null,{"$f":"IF(EXACT([1]Feuil1!$C378,[2]Feuil1!$C378)=TRUE,[1]Feuil1!$C378,\"X\")","v":0}]
[null,null,{"$f":"IF(EXACT([1]Feuil1!$C379,[2]Feuil1!$C379)=TRUE,[1]Feuil1!$C379,\"X\")","v":0}]
[null,null,{"$f":"IF(EXACT([1]Feuil1!$C380,[2]Feuil1!$C380)=TRUE,[1]Feuil1!$C380,\"X\")","v":0}]
[null,null,{"$f":"IF(EXACT([1]Feuil1!$C381,[2]Feuil1!$C381)=TRUE,[1]Feuil1!$C381,\"X\")","v":0}]
[null,null,{"$f":"IF(EXACT([1]Feuil1!$C382,[2]Feuil1!$C382)=TRUE,[1]Feuil1!$C382,\"X\")","v":0}]
[null,null,{"$f":"IF(EXACT([1]Feuil1!$C383,[2]Feuil1!$C383)=TRUE,[1]Feuil1!$C383,\"X\")","v":0}]
[null,null,{"$f":"IF(EXACT([1]Feuil1!$C384,[2]Feuil1!$C384)=TRUE,[1]Feuil1!$C384,\"X\")","v":0}]
[null,null,{"$f":"IF(EXACT([1]Feuil1!$C385,[2]Feuil1!$C385)=TRUE,[1]Feuil1!$C385,\"X\")","v":0}]
[null,null,{"$f":"IF(EXACT([1]Feuil1!$C386,[2]Feuil1!$C386)=TRUE,[1]Feuil1!$C386,\"X\")","v":0}]
[null,null,{"$f":"IF(EXACT([1]Feuil1!$C387,[2]Feuil1!$C387)=TRUE,[1]Feuil1!$C387,\"X\")","v":0}]
[null,null,{"$f":"IF(EXACT([1]Feuil1!$C388,[2]Feuil1!$C388)=TRUE,[1]Feuil1!$C388,\"X\")","v":0}]
[null,null,{"$f":"IF(EXACT([1]Feuil1!$C389,[2]Feuil1!$C389)=TRUE,[1]Feuil1!$C389,\"X\")","v":0}]
[null,null,{"$f":"IF(EXACT([1]Feuil1!$C390,[2]Feuil1!$C390)=TRUE,[1]Feuil1!$C390,\"X\")","v":0}]
[null,null,{"$f":"IF(EXACT([1]Feuil1!$C391,[2]Feuil1!$C391)=TRUE,[1]Feuil1!$C391,\"X\")","v":0}]
[null,null,{"$f":"IF(EXACT([1]Feuil1!$C392,[2]Feuil1!$C392)=TRUE,[1]Feuil1!$C392,\"X\")","v":0}]
[null,null,{"$f":"IF(EXACT([1]Feuil1!$C393,[2]Feuil1!$C393)=TRUE,[1]Feuil1!$C393,\"X\")","v":0}]
[null,null,{"$f":"IF(EXACT([1]Feuil1!$C394,[2]Feuil1!$C394)=TRUE,[1]Feuil1!$C394,\"X\")","v":0}]
[null,null,{"$f":"IF(EXACT([1]Feuil1!$C395,[2]Feuil1!$C395)=TRUE,[1]Feuil1!$C395,\"X\")","v":0}]
[null,null,{"$f":"IF(EXACT([1]Feuil1!$C396,[2]Feuil1!$C396)=TRUE,[1]Feuil1!$C396,\"X\")","v":0}]
[null,null,{"$f":"IF(EXACT([1]Feuil1!$C397,[2]Feuil1!$C397)=TRUE,[1]Feuil1!$C397,\"X\")","v":0}]
[null,null,{"$f":"IF(EXACT([1]Feuil1!$C398,[2]Feuil1!$C398)=TRUE,[1]Feuil1!$C398,\"X\")","v":0}]
[null,null,{"$f":"IF(EXACT([1]Feuil1!$C399,[2]Feuil1!$C399)=TRUE,[1]Feuil1!$C399,\"X\")","v":0}]
[null,null,{"$f":"IF(EXACT([1]Feuil1!$C400,[2]Feuil1!$C400)=TRUE,[1]Feuil1!$C400,\"X\")","v":0}]
[null,null,{"$f":"IF(EXACT([1]Feuil1!$C401,[2]Feuil1!$C401)=TRUE,[1]Feuil1!$C401,\"X\")","v":0}]
[null,null,{"$f":"IF(EXACT([1]Feuil1!$C402,[2]Feuil1!$C402)=TRUE,[1]Feuil1!$C402,\"X\")","v":0}]
[null,null,{"$f":"IF(EXACT([1]Feuil1!$C403,[2]Feuil1!$C403)=TRUE,[1]Feuil1!$C403,\"X\")","v":0}]
[null,null,{"$f":"IF(EXACT([1]Feuil1!$C404,[2]Feuil1!$C404)=TRUE,[1]Feuil1!$C404,\"X\")","v":0}]
[null,null,{"$f":"IF(EXACT([1]Feuil1!$C405,[2]Feuil1!$C405)=TRUE,[1]Feuil1!$C405,\"X\")","v":0}]
[null,null,{"$f":"IF(EXACT([1]Feuil1!$C406,[2]Feuil1!$C406)=TRUE,[1]Feuil1!$C406,\"X\")","v":0}]
[null,null,{"$f":"IF(EXACT([1]Feuil1!$C407,[2]Feuil1!$C407)=TRUE,[1]Feuil1!$C407,\"X\")","v":0}]
[null,null,{"$f":"IF(EXACT([1]Feuil1!$C408,[2]Feuil1!$C408)=TRUE,[1]Feuil1!$C408,\"X\")","v":0}]
[null,null,{"$f":"IF(EXACT([1]Feuil1!$C409,[2]Feuil1!$C409)=TRUE,[1]Feuil1!$C409,\"X\")","v":0}]
[null,null,{"$f":"IF(EXACT([1]Feuil1!$C410,[2]Feuil1!$C410)=TRUE,[1]Feuil1!$C410,\"X\")","v":0}]
[null,null,{"$f":"IF(EXACT([1]Feuil1!$C411,[2]Feuil1!$C411)=TRUE,[1]Feuil1!$C411,\"X\")","v":0}]
[null,null,{"$f":"IF(EXACT([1]Feuil1!$C412,[2]Feuil1!$C412)=TRUE,[1]Feuil1!$C412,\"X\")","v":0}]
[null,null,{"$f":"IF(EXACT([1]Feuil1!$C413,[2]Feuil1!$C413)=TRUE,[1]Feuil1!$C413,\"X\")","v":0}]
[null,null,{"$f":"IF(EXACT([1]Feuil1!$C414,[2]Feuil1!$C414)=TRUE,[1]Feuil1!$C414,\"X\")","v":0}]
[null,null,{"$f":"IF(EXACT([1]Feuil1!$C415,[2]Feuil1!$C415)=TRUE,[1]Feuil1!$C415,\"X\")","v":0}]
[null,null,{"$f":"IF(EXACT([1]Feuil1!$C416,[2]Feuil1!$C416)=TRUE,[1]Feuil1!$C416,\"X\")","v":0}]
[null,null,{"$f":"IF(EXACT([1]Feuil1!$C417,[2]Feuil1!$C417)=TRUE,[1]Feuil1!$C417,\"X\")","v":0}]
[null,null,{"$f":"IF(EXACT([1]Feuil1!$C418,[2]Feuil1!$C418)=TRUE,[1]Feuil1!$C418,\"X\")","v":0}]
[null,null,{"$f":"IF(EXACT([1]Feuil1!$C419,[2]Feuil1!$C419)=TRUE,[1]Feuil1!$C419,\"X\")","v":0}]
[null,null,{"$f":"IF(EXACT([1]Feuil1!$C420,[2]Feuil1!$C420)=TRUE,[1]Feuil1!$C420,\"X\")","v":0}]
[null,null,{"$f":"IF(EXACT([1]Feuil1!$C421,[2]Feuil1!$C421)=TRUE,[1]Feuil1!$C421,\"X\")","v":0}]
[null,null,{"$f":"IF(EXACT([1]Feuil1!$C422,[2]Feuil1!$C422)=TRUE,[1]Feuil1!$C422,\"X\")","v":0}]
[null,null,{"$f":"IF(EXACT([1]Feuil1!$C423,[2]Feuil1!$C423)=TRUE,[1]Feuil1!$C423,\"X\")","v":0}]
[null,null,{"$f":"IF(EXACT([1]Feuil1!$C424,[2]Feuil1!$C424)=TRUE,[1]Feuil1!$C424,\"X\")","v":0}]
[null,null,{"$f":"IF(EXACT([1]Feuil1!$C425,[2]Feuil1!$C425)=TRUE,[1]Feuil1!$C425,\"X\")","v":0}]
[null,null,{"$f":"IF(EXACT([1]Feuil1!$C426,[2]Feuil1!$C426)=TRUE,[1]Feuil1!$C426,\"X\")","v":0}]
[null,null,{"$f":"IF(EXACT([1]Feuil1!$C427,[2]Feuil1!$C427)=TRUE,[1]Feuil1!$C427,\"X\")","v":0}]
[null,null,{"$f":"IF(EXACT([1]Feuil1!$C428,[2]Feuil1!$C428)=TRUE,[1]Feuil1!$C428,\"X\")","v":0}]
[null,null,{"$f":"IF(EXACT([1]Feuil1!$C429,[2]Feuil1!$C429)=TRUE,[1]Feuil1!$C429,\"X\")","v":0}]
[null,null,{"$f":"IF(EXACT([1]Feuil1!$C430,[2]Feuil1!$C430)=TRUE,[1]Feuil1!$C430,\"X\")","v":0}]
[null,null,{"$f":"IF(EXACT([1]Feuil1!$C431,[2]Feuil1!$C431)=TRUE,[1]Feuil1!$C431,\"X\")","v":0}]
[null,null,{"$f":"IF(EXACT([1]Feuil1!$C432,[2]Feuil1!$C432)=TRUE,[1]Feuil1!$C432,\"X\")","v":0}]
[null,null,{"$f":"IF(EXACT([1]Feuil1!$C433,[2]Feuil1!$C433)=TRUE,[1]Feuil1!$C433,\"X\")","v":0}]
[null,null,{"$f":"IF(EXACT([1]Feuil1!$C434,[2]Feuil1!$C434)=TRUE,[1]Feuil1!$C434,\"X\")","v":0}]
[null,null,{"$f":"IF(EXACT([1]Feuil1!$C435,[2]Feuil1!$C435)=TRUE,[1]Feuil1!$C435,\"X\")","v":0}]
[null,null,{"$f":"IF(EXACT([1]Feuil1!$C436,[2]Feuil1!$C436)=TRUE,[1]Feuil1!$C436,\"X\")","v":0}]
[null,null,{"$f":"IF(EXACT([1]Feuil1!$C437,[2]Feuil1!$C437)=TRUE,[1]Feuil1!$C437,\"X\")","v":0}]
[null,null,{"$f":"IF(EXACT([1]Feuil1!$C438,[2]Feuil1!$C438)=TRUE,[1]Feuil1!$C438,\"X\")","v":0}]
[null,null,{"$f":"IF(EXACT([1]Feuil1!$C439,[2]Feuil1!$C439)=TRUE,[1]Feuil1!$C439,\"X\")","v":0}]
[null,null,{"$f":"IF(EXACT([1]Feuil1!$C440,[2]Feuil1!$C440)=TRUE,[1]Feuil1!$C440,\"X\")","v":0}]
[null,null,{"$f":"IF(EXACT([1]Feuil1!$C441,[2]Feuil1!$C441)=TRUE,[1]Feuil1!$C441,\"X\")","v":0}]
[null,null,{"$f":"IF(EXACT([1]Feuil1!$C442,[2]Feuil1!$C442)=TRUE,[1]Feuil1!$C442,\"X\")","v":0}]
[null,null,{"$f":"IF(EXACT([1]Feuil1!$C443,[2]Feuil1!$C443)=TRUE,[1]Feuil1!$C443,\"X\")","v":0}]
[null,null,{"$f":"IF(EXACT([1]Feuil1!$C444,[2]Feuil1!$C444)=TRUE,[1]Feuil1!$C444,\"X\")","v":0}]
[null,null,{"$f":"IF(EXACT([1]Feuil1!$C445,[2]Feuil1!$C445)=TRUE,[1]Feuil1!$C445,\"X\")","v":0}]
[null,null,{"$f":"IF(EXACT([1]Feuil1!$C446,[2]Feuil1!$C446)=TRUE,[1]Feuil1!$C446,\"X\")","v":0}]
[null,null,{"$f":"IF(EXACT([1]Feuil1!$C447,[2]Feuil1!$C447)=TRUE,[1]Feuil1!$C447,\"X\")","v":0}]
[null,null,{"$f":"IF(EXACT([1]Feuil1!$C448,[2]Feuil1!$C448)=TRUE,[1]Feuil1!$C448,\"X\")","v":0}]
[null,null,{"$f":"IF(EXACT([1]Feuil1!$C449,[2]Feuil1!$C449)=TRUE,[1]Feuil1!$C449,\"X\")","v":0}]
[null,null,{"$f":"IF(EXACT([1]Feuil1!$C450,[2]Feuil1!$C450)=TRUE,[1]Feuil1!$C450,\"X\")","v":0}]
[null,null,{"$f":"IF(EXACT([1]Feuil1!$C451,[2]Feuil1!$C451)=TRUE,[1]Feuil1!$C451,\"X\")","v":0}]
[null,null,{"$f":"IF(EXACT([1]Feuil1!$C452,[2]Feuil1!$C452)=TRUE,[1]Feuil1!$C452,\"X\")","v":0}]
[null,null,{"$f":"IF(EXACT([1]Feuil1!$C453,[2]Feuil1!$C453)=TRUE,[1]Feuil1!$C453,\"X\")","v":0}]
[null,null,{"$f":"IF(EXACT([1]Feuil1!$C454,[2]Feuil1!$C454)=TRUE,[1]Feuil1!$C454,\"X\")","v":0}]
[null,null,{"$f":"IF(EXACT([1]Feuil1!$C455,[2]Feuil1!$C455)=TRUE,[1]Feuil1!$C455,\"X\")","v":0}]
[null,null,{"$f":"IF(EXACT([1]Feuil1!$C456,[2]Feuil1!$C456)=TRUE,[1]Feuil1!$C456,\"X\")","v":0}]
[null,null,{"$f":"IF(EXACT([1]Feuil1!$C457,[2]Feuil1!$C457)=TRUE,[1]Feuil1!$C457,\"X\")","v":0}]
[null,null,{"$f":"IF(EXACT([1]Feuil1!$C458,[2]Feuil1!$C458)=TRUE,[1]Feuil1!$C458,\"X\")","v":0}]
[null,null,{"$f":"IF(EXACT([1]Feuil1!$C459,[2]Feuil1!$C459)=TRUE,[1]Feuil1!$C459,\"X\")","v":0}]
[null,null,{"$f":"IF(EXACT([1]Feuil1!$C460,[2]Feuil1!$C460)=TRUE,[1]Feuil1!$C460,\"X\")","v":0}]
[null,null,{"$f":"IF(EXACT([1]Feuil1!$C461,[2]Feuil1!$C461)=TRUE,[1]Feuil1!$C461,\"X\")","v":0}]
[null,null,{"$f":"IF(EXACT([1]Feuil1!$C462,[2]Feuil1!$C462)=TRUE,[1]Feuil1!$C462,\"X\")","v":0}]
[null,null,{"$f":"IF(EXACT([1]Feuil1!$C463,[2]Feuil1!$C463)=TRUE,[1]Feuil1!$C463,\"X\")","v":0}]
[null,null,{"$f":"IF(EXACT([1]Feuil1!$C464,[2]Feuil1!$C464)=TRUE,[1]Feuil1!$C464,\"X\")","v":0}]
[null,null,{"$f":"IF(EXACT([1]Feuil1!$C465,[2]Feuil1!$C465)=TRUE,[1]Feuil1!$C465,\"X\")","v":0}]
[null,null,{"$f":"IF(EXACT([1]Feuil1!$C466,[2]Feuil1!$C466)=TRUE,[1]Feuil1!$C466,\"X\")","v":0}]
[null,null,{"$f":"IF(EXACT([1]Feuil1!$C467,[2]Feuil1!$C467)=TRUE,[1]Feuil1!$C467,\"X\")","v":0}]
[null,null,{"$f":"IF(EXACT([1]Feuil1!$C468,[2]Feuil1!$C468)=TRUE,[1]Feuil1!$C468,\"X\")","v":0}]
[null,null,{"$f":"IF(EXACT([1]Feuil1!$C469,[2]Feuil1!$C469)=TRUE,[1]Feuil1!$C469,\"X\")","v":0}]
[null,null,{"$f":"IF(EXACT([1]Feuil1!$C470,[2]Feuil1!$C470)=TRUE,[1]Feuil1!$C470,\"X\")","v":0}]
[null,null,{"$f":"IF(EXACT([1]Feuil1!$C471,[2]Feuil1!$C471)=TRUE,[1]Feuil1!$C471,\"X\")","v":0}]
[null,null,{"$f":"IF(EXACT([1]Feuil1!$C472,[2]Feuil1!$C472)=TRUE,[1]Feuil1!$C472,\"X\")","v":0}]
[null,null,{"$f":"IF(EXACT([1]Feuil1!$C473,[2]Feuil1!$C473)=TRUE,[1]Feuil1!$C473,\"X\")","v":0}]
[null,null,{"$f":"IF(EXACT([1]Feuil1!$C474,[2]Feuil1!$C474)=TRUE,[1]Feuil1!$C474,\"X\")","v":0}]
[null,null,{"$f":"IF(EXACT([1]Feuil1!$C475,[2]Feuil1!$C475)=TRUE,[1]Feuil1!$C475,\"X\")","v":0}]
[null,null,{"$f":"IF(EXACT([1]Feuil1!$C476,[2]Feuil1!$C476)=TRUE,[1]Feuil1!$C476,\"X\")","v":0}]
[null,null,{"$f":"IF(EXACT([1]Feuil1!$C477,[2]Feuil1!$C477)=TRUE,[1]Feuil1!$C477,\"X\")","v":0}]
[null,null,{"$f":"IF(EXACT([1]Feuil1!$C478,[2]Feuil1!$C478)=TRUE,[1]Feuil1!$C478,\"X\")","v":0}]
[null,null,{"$f":"IF(EXACT([1]Feuil1!$C479,[2]Feuil1!$C479)=TRUE,[1]Feuil1!$C479,\"X\")","v":0}]
[null,null,{"$f":"IF(EXACT([1]Feuil1!$C480,[2]Feuil1!$C480)=TRUE,[1]Feuil1!$C480,\"X\")","v":0}]
[null,null,{"$f":"IF(EXACT([1]Feuil1!$C481,[2]Feuil1!$C481)=TRUE,[1]Feuil1!$C481,\"X\")","v":0}]
[null,null,{"$f":"IF(EXACT([1]Feuil1!$C482,[2]Feuil1!$C482)=TRUE,[1]Feuil1!$C482,\"X\")","v":0}]
[null,null,{"$f":"IF(EXACT([1]Feuil1!$C483,[2]Feuil1!$C483)=TRUE,[1]Feuil1!$C483,\"X\")","v":0}]
[null,null,{"$f":"IF(EXACT([1]Feuil1!$C484,[2]Feuil1!$C484)=TRUE,[1]Feuil1!$C484,\"X\")","v":0}]
[null,null,{"$f":"IF(EXACT([1]Feuil1!$C485,[2]Feuil1!$C485)=TRUE,[1]Feuil1!$C485,\"X\")","v":0}]
[null,null,{"$f":"IF(EXACT([1]Feuil1!$C486,[2]Feuil1!$C486)=TRUE,[1]Feuil1!$C486,\"X\")","v":0}]
[null,null,{"$f":"IF(EXACT([1]Feuil1!$C487,[2]Feuil1!$C487)=TRUE,[1]Feuil1!$C487,\"X\")","v":0}]
[null,null,{"$f":"IF(EXACT([1]Feuil1!$C488,[2]Feuil1!$C488)=TRUE,[1]Feuil1!$C488,\"X\")","v":0}]
[null,null,{"$f":"IF(EXACT([1]Feuil1!$C489,[2]Feuil1!$C489)=TRUE,[1]Feuil1!$C489,\"X\")","v":0}]
[null,null,{"$f":"IF(EXACT([1]Feuil1!$C490,[2]Feuil1!$C490)=TRUE,[1]Feuil1!$C490,\"X\")","v":0}]
[null,null,{"$f":"IF(EXACT([1]Feuil1!$C491,[2]Feuil1!$C491)=TRUE,[1]Feuil1!$C491,\"X\")","v":0}]
[null,null,{"$f":"IF(EXACT([1]Feuil1!$C492,[2]Feuil1!$C492)=TRUE,[1]Feuil1!$C492,\"X\")","v":0}]
[null,null,{"$f":"IF(EXACT([1]Feuil1!$C493,[2]Feuil1!$C493)=TRUE,[1]Feuil1!$C493,\"X\")","v":0}]
[null,null,{"$f":"IF(EXACT([1]Feuil1!$C494,[2]Feuil1!$C494)=TRUE,[1]Feuil1!$C494,\"X\")","v":0}]
[null,null,{"$f":"IF(EXACT([1]Feuil1!$C495,[2]Feuil1!$C495)=TRUE,[1]Feuil1!$C495,\"X\")","v":0}]
[null,null,{"$f":"IF(EXACT([1]Feuil1!$C496,[2]Feuil1!$C496)=TRUE,[1]Feuil1!$C496,\"X\")","v":0}]
[null,null,{"$f":"IF(EXACT([1]Feuil1!$C497,[2]Feuil1!$C497)=TRUE,[1]Feuil1!$C497,\"X\")","v":0}]
[null,null,{"$f":"IF(EXACT([1]Feuil1!$C498,[2]Feuil1!$C498)=TRUE,[1]Feuil1!$C498,\"X\")","v":0}]
[null,null,{"$f":"IF(EXACT([1]Feuil1!$C499,[2]Feuil1!$C499)=TRUE,[1]Feuil1!$C499,\"X\")","v":0}]
[null,null,{"$f":"IF(EXACT([1]Feuil1!$C500,[2]Feuil1!$C500)=TRUE,[1]Feuil1!$C500,\"X\")","v":0}]
[null,null,{"$f":"IF(EXACT([1]Feuil1!$C501,[2]Feuil1!$C501)=TRUE,[1]Feuil1!$C501,\"X\")","v":0}]
[null,null,{"$f":"IF(EXACT([1]Feuil1!$C502,[2]Feuil1!$C502)=TRUE,[1]Feuil1!$C502,\"X\")","v":0}]
[null,null,{"$f":"IF(EXACT([1]Feuil1!$C503,[2]Feuil1!$C503)=TRUE,[1]Feuil1!$C503,\"X\")","v":0}]
[null,null,{"$f":"IF(EXACT([1]Feuil1!$C504,[2]Feuil1!$C504)=TRUE,[1]Feuil1!$C504,\"X\")","v":0}]
[null,null,{"$f":"IF(EXACT([1]Feuil1!$C505,[2]Feuil1!$C505)=TRUE,[1]Feuil1!$C505,\"X\")","v":0}]
[null,null,{"$f":"IF(EXACT([1]Feuil1!$C506,[2]Feuil1!$C506)=TRUE,[1]Feuil1!$C506,\"X\")","v":0}]
[null,null,{"$f":"IF(EXACT([1]Feuil1!$C507,[2]Feuil1!$C507)=TRUE,[1]Feuil1!$C507,\"X\")","v":0}]
[null,null,{"$f":"IF(EXACT([1]Feuil1!$C508,[2]Feuil1!$C508)=TRUE,[1]Feuil1!$C508,\"X\")","v":0}]
[null,null,{"$f":"IF(EXACT([1]Feuil1!$C509,[2]Feuil1!$C509)=TRUE,[1]Feuil1!$C509,\"X\")","v":0}]
[null,null,{"$f":"IF(EXACT([1]Feuil1!$C510,[2]Feuil1!$C510)=TRUE,[1]Feuil1!$C510,\"X\")","v":0}]
[null,null,{"$f":"IF(EXACT([1]Feuil1!$C511,[2]Feuil1!$C511)=TRUE,[1]Feuil1!$C511,\"X\")","v":0}]
[null,null,{"$f":"IF(EXACT([1]Feuil1!$C512,[2]Feuil1!$C512)=TRUE,[1]Feuil1!$C512,\"X\")","v":0}]
[null,null,{"$f":"IF(EXACT([1]Feuil1!$C513,[2]Feuil1!$C513)=TRUE,[1]Feuil1!$C513,\"X\")","v":0}]
[null,null,{"$f":"IF(EXACT([1]Feuil1!$C514,[2]Feuil1!$C514)=TRUE,[1]Feuil1!$C514,\"X\")","v":0}]
[null,null,{"$f":"IF(EXACT([1]Feuil1!$C515,[2]Feuil1!$C515)=TRUE,[1]Feuil1!$C515,\"X\")","v":0}]
[null,null,{"$f":"IF(EXACT([1]Feuil1!$C516,[2]Feuil1!$C516)=TRUE,[1]Feuil1!$C516,\"X\")","v":0}]
[null,null,{"$f":"IF(EXACT([1]Feuil1!$C517,[2]Feuil1!$C517)=TRUE,[1]Feuil1!$C517,\"X\")","v":0}]
[null,null,{"$f":"IF(EXACT([1]Feuil1!$C518,[2]Feuil1!$C518)=TRUE,[1]Feuil1!$C518,\"X\")","v":0}]
[null,null,{"$f":"IF(EXACT([1]Feuil1!$C519,[2]Feuil1!$C519)=TRUE,[1]Feuil1!$C519,\"X\")","v":0}]
[null,null,{"$f":"IF(EXACT([1]Feuil1!$C520,[2]Feuil1!$C520)=TRUE,[1]Feuil1!$C520,\"X\")","v":0}]
[null,null,{"$f":"IF(EXACT([1]Feuil1!$C521,[2]Feuil1!$C521)=TRUE,[1]Feuil1!$C521,\"X\")","v":0}]
[null,null,{"$f":"IF(EXACT([1]Feuil1!$C522,[2]Feuil1!$C522)=TRUE,[1]Feuil1!$C522,\"X\")","v":0}]
[null,null,{"$f":"IF(EXACT([1]Feuil1!$C523,[2]Feuil1!$C523)=TRUE,[1]Feuil1!$C523,\"X\")","v":0}]
[null,null,{"$f":"IF(EXACT([1]Feuil1!$C524,[2]Feuil1!$C524)=TRUE,[1]Feuil1!$C524,\"X\")","v":0}]
[null,null,{"$f":"IF(EXACT([1]Feuil1!$C525,[2]Feuil1!$C525)=TRUE,[1]Feuil1!$C525,\"X\")","v":0}]
[null,null,{"$f":"IF(EXACT([1]Feuil1!$C526,[2]Feuil1!$C526)=TRUE,[1]Feuil1!$C526,\"X\")","v":0}]
[null,null,{"$f":"IF(EXACT([1]Feuil1!$C527,[2]Feuil1!$C527)=TRUE,[1]Feuil1!$C527,\"X\")","v":0}]
[null,null,{"$f":"IF(EXACT([1]Feuil1!$C528,[2]Feuil1!$C528)=TRUE,[1]Feuil1!$C528,\"X\")","v":0}]
[null,null,{"$f":"IF(EXACT([1]Feuil1!$C529,[2]Feuil1!$C529)=TRUE,[1]Feuil1!$C529,\"X\")","v":0}]
[null,null,{"$f":"IF(EXACT([1]Feuil1!$C530,[2]Feuil1!$C530)=TRUE,[1]Feuil1!$C530,\"X\")","v":0}]
[null,null,{"$f":"IF(EXACT([1]Feuil1!$C531,[2]Feuil1!$C531)=TRUE,[1]Feuil1!$C531,\"X\")","v":0}]
[null,null,{"$f":"IF(EXACT([1]Feuil1!$C532,[2]Feuil1!$C532)=TRUE,[1]Feuil1!$C532,\"X\")","v":0}]
[null,null,{"$f":"IF(EXACT([1]Feuil1!$C533,[2]Feuil1!$C533)=TRUE,[1]Feuil1!$C533,\"X\")","v":0}]
[null,null,{"$f":"IF(EXACT([1]Feuil1!$C534,[2]Feuil1!$C534)=TRUE,[1]Feuil1!$C534,\"X\")","v":0}]
[null,null,{"$f":"IF(EXACT([1]Feuil1!$C535,[2]Feuil1!$C535)=TRUE,[1]Feuil1!$C535,\"X\")","v":0}]
[null,null,{"$f":"IF(EXACT([1]Feuil1!$C536,[2]Feuil1!$C536)=TRUE,[1]Feuil1!$C536,\"X\")","v":0}]
[null,null,{"$f":"IF(EXACT([1]Feuil1!$C537,[2]Feuil1!$C537)=TRUE,[1]Feuil1!$C537,\"X\")","v":0}]
[null,null,{"$f":"IF(EXACT([1]Feuil1!$C538,[2]Feuil1!$C538)=TRUE,[1]Feuil1!$C538,\"X\")","v":0}]
[null,null,{"$f":"IF(EXACT([1]Feuil1!$C539,[2]Feuil1!$C539)=TRUE,[1]Feuil1!$C539,\"X\")","v":0}]
[null,null,{"$f":"IF(EXACT([1]Feuil1!$C540,[2]Feuil1!$C540)=TRUE,[1]Feuil1!$C540,\"X\")","v":0}]
[null,null,{"$f":"IF(EXACT([1]Feuil1!$C541,[2]Feuil1!$C541)=TRUE,[1]Feuil1!$C541,\"X\")","v":0}]
[null,null,{"$f":"IF(EXACT([1]Feuil1!$C542,[2]Feuil1!$C542)=TRUE,[1]Feuil1!$C542,\"X\")","v":0}]
[null,null,{"$f":"IF(EXACT([1]Feuil1!$C543,[2]Feuil1!$C543)=TRUE,[1]Feuil1!$C543,\"X\")","v":0}]
[null,null,{"$f":"IF(EXACT([1]Feuil1!$C544,[2]Feuil1!$C544)=TRUE,[1]Feuil1!$C544,\"X\")","v":0}]
[null,null,{"$f":"IF(EXACT([1]Feuil1!$C545,[2]Feuil1!$C545)=TRUE,[1]Feuil1!$C545,\"X\")","v":0}]
[null,null,{"$f":"IF(EXACT([1]Feuil1!$C546,[2]Feuil1!$C546)=TRUE,[1]Feuil1!$C546,\"X\")","v":0}]
[null,null,{"$f":"IF(EXACT([1]Feuil1!$C547,[2]Feuil1!$C547)=TRUE,[1]Feuil1!$C547,\"X\")","v":0}]
[null,null,{"$f":"IF(EXACT([1]Feuil1!$C548,[2]Feuil1!$C548)=TRUE,[1]Feuil1!$C548,\"X\")","v":0}]
[null,null,{"$f":"IF(EXACT([1]Feuil1!$C549,[2]Feuil1!$C549)=TRUE,[1]Feuil1!$C549,\"X\")","v":0}]
[null,null,{"$f":"IF(EXACT([1]Feuil1!$C550,[2]Feuil1!$C550)=TRUE,[1]Feuil1!$C550,\"X\")","v":0}]
[null,null,{"$f":"IF(EXACT([1]Feuil1!$C551,[2]Feuil1!$C551)=TRUE,[1]Feuil1!$C551,\"X\")","v":0}]
[null,null,{"$f":"IF(EXACT([1]Feuil1!$C552,[2]Feuil1!$C552)=TRUE,[1]Feuil1!$C552,\"X\")","v":0}]
[null,null,{"$f":"IF(EXACT([1]Feuil1!$C553,[2]Feuil1!$C553)=TRUE,[1]Feuil1!$C553,\"X\")","v":0}]
[null,null,{"$f":"IF(EXACT([1]Feuil1!$C554,[2]Feuil1!$C554)=TRUE,[1]Feuil1!$C554,\"X\")","v":0}]
[null,null,{"$f":"IF(EXACT([1]Feuil1!$C555,[2]Feuil1!$C555)=TRUE,[1]Feuil1!$C555,\"X\")","v":0}]
[null,null,{"$f":"IF(EXACT([1]Feuil1!$C556,[2]Feuil1!$C556)=TRUE,[1]Feuil1!$C556,\"X\")","v":0}]
[null,null,{"$f":"IF(EXACT([1]Feuil1!$C557,[2]Feuil1!$C557)=TRUE,[1]Feuil1!$C557,\"X\")","v":0}]
[null,null,{"$f":"IF(EXACT([1]Feuil1!$C558,[2]Feuil1!$C558)=TRUE,[1]Feuil1!$C558,\"X\")","v":0}]
[null,null,{"$f":"IF(EXACT([1]Feuil1!$C559,[2]Feuil1!$C559)=TRUE,[1]Feuil1!$C559,\"X\")","v":0}]
[null,null,{"$f":"IF(EXACT([1]Feuil1!$C560,[2]Feuil1!$C560)=TRUE,[1]Feuil1!$C560,\"X\")","v":0}]
[null,null,{"$f":"IF(EXACT([1]Feuil1!$C561,[2]Feuil1!$C561)=TRUE,[1]Feuil1!$C561,\"X\")","v":0}]
[null,null,{"$f":"IF(EXACT([1]Feuil1!$C562,[2]Feuil1!$C562)=TRUE,[1]Feuil1!$C562,\"X\")","v":0}]
[null,null,{"$f":"IF(EXACT([1]Feuil1!$C563,[2]Feuil1!$C563)=TRUE,[1]Feuil1!$C563,\"X\")","v":0}]
[null,null,{"$f":"IF(EXACT([1]Feuil1!$C564,[2]Feuil1!$C564)=TRUE,[1]Feuil1!$C564,\"X\")","v":0}]
[null,null,{"$f":"IF(EXACT([1]Feuil1!$C565,[2]Feuil1!$C565)=TRUE,[1]Feuil1!$C565,\"X\")","v":0}]
[null,null,{"$f":"IF(EXACT([1]Feuil1!$C566,[2]Feuil1!$C566)=TRUE,[1]Feuil1!$C566,\"X\")","v":0}]
[null,null,{"$f":"IF(EXACT([1]Feuil1!$C567,[2]Feuil1!$C567)=TRUE,[1]Feuil1!$C567,\"X\")","v":0}]
[null,null,{"$f":"IF(EXACT([1]Feuil1!$C568,[2]Feuil1!$C568)=TRUE,[1]Feuil1!$C568,\"X\")","v":0}]
[null,null,{"$f":"IF(EXACT([1]Feuil1!$C569,[2]Feuil1!$C569)=TRUE,[1]Feuil1!$C569,\"X\")","v":0}]
[null,null,{"$f":"IF(EXACT([1]Feuil1!$C570,[2]Feuil1!$C570)=TRUE,[1]Feuil1!$C570,\"X\")","v":0}]
[null,null,{"$f":"IF(EXACT([1]Feuil1!$C571,[2]Feuil1!$C571)=TRUE,[1]Feuil1!$C571,\"X\")","v":0}]
[null,null,{"$f":"IF(EXACT([1]Feuil1!$C572,[2]Feuil1!$C572)=TRUE,[1]Feuil1!$C572,\"X\")","v":0}]
[null,null,{"$f":"IF(EXACT([1]Feuil1!$C573,[2]Feuil1!$C573)=TRUE,[1]Feuil1!$C573,\"X\")","v":0}]
[null,null,{"$f":"IF(EXACT([1]Feuil1!$C574,[2]Feuil1!$C574)=TRUE,[1]Feuil1!$C574,\"X\")","v":0}]
[null,null,{"$f":"IF(EXACT([1]Feuil1!$C575,[2]Feuil1!$C575)=TRUE,[1]Feuil1!$C575,\"X\")","v":0}]
[null,null,{"$f":"IF(EXACT([1]Feuil1!$C576,[2]Feuil1!$C576)=TRUE,[1]Feuil1!$C576,\"X\")","v":0}]
[null,null,{"$f":"IF(EXACT([1]Feuil1!$C577,[2]Feuil1!$C577)=TRUE,[1]Feuil1!$C577,\"X\")","v":0}]
[null,null,{"$f":"IF(EXACT([1]Feuil1!$C578,[2]Feuil1!$C578)=TRUE,[1]Feuil1!$C578,\"X\")","v":0}]
[null,null,{"$f":"IF(EXACT([1]Feuil1!$C579,[2]Feuil1!$C579)=TRUE,[1]Feuil1!$C579,\"X\")","v":0}]
[null,null,{"$f":"IF(EXACT([1]Feuil1!$C580,[2]Feuil1!$C580)=TRUE,[1]Feuil1!$C580,\"X\")","v":0}]
[null,null,{"$f":"IF(EXACT([1]Feuil1!$C581,[2]Feuil1!$C581)=TRUE,[1]Feuil1!$C581,\"X\")","v":0}]
[null,null,{"$f":"IF(EXACT([1]Feuil1!$C582,[2]Feuil1!$C582)=TRUE,[1]Feuil1!$C582,\"X\")","v":0}]
[null,null,{"$f":"IF(EXACT([1]Feuil1!$C583,[2]Feuil1!$C583)=TRUE,[1]Feuil1!$C583,\"X\")","v":0}]
[null,null,{"$f":"IF(EXACT([1]Feuil1!$C584,[2]Feuil1!$C584)=TRUE,[1]Feuil1!$C584,\"X\")","v":0}]
[null,null,{"$f":"IF(EXACT([1]Feuil1!$C585,[2]Feuil1!$C585)=TRUE,[1]Feuil1!$C585,\"X\")","v":0}]
[null,null,{"$f":"IF(EXACT([1]Feuil1!$C586,[2]Feuil1!$C586)=TRUE,[1]Feuil1!$C586,\"X\")","v":0}]
[null,null,{"$f":"IF(EXACT([1]Feuil1!$C587,[2]Feuil1!$C587)=TRUE,[1]Feuil1!$C587,\"X\")","v":0}]
[null,null,{"$f":"IF(EXACT([1]Feuil1!$C588,[2]Feuil1!$C588)=TRUE,[1]Feuil1!$C588,\"X\")","v":0}]
[null,null,{"$f":"IF(EXACT([1]Feuil1!$C589,[2]Feuil1!$C589)=TRUE,[1]Feuil1!$C589,\"X\")","v":0}]
[null,null,{"$f":"IF(EXACT([1]Feuil1!$C590,[2]Feuil1!$C590)=TRUE,[1]Feuil1!$C590,\"X\")","v":0}]
[null,null,{"$f":"IF(EXACT([1]Feuil1!$C591,[2]Feuil1!$C591)=TRUE,[1]Feuil1!$C591,\"X\")","v":0}]
[null,null,{"$f":"IF(EXACT([1]Feuil1!$C592,[2]Feuil1!$C592)=TRUE,[1]Feuil1!$C592,\"X\")","v":0}]
[null,null,{"$f":"IF(EXACT([1]Feuil1!$C593,[2]Feuil1!$C593)=TRUE,[1]Feuil1!$C593,\"X\")","v":0}]
[null,null,{"$f":"IF(EXACT([1]Feuil1!$C594,[2]Feuil1!$C594)=TRUE,[1]Feuil1!$C594,\"X\")","v":0}]
[null,null,{"$f":"IF(EXACT([1]Feuil1!$C595,[2]Feuil1!$C595)=TRUE,[1]Feuil1!$C595,\"X\")","v":0}]
[null,null,{"$f":"IF(EXACT([1]Feuil1!$C596,[2]Feuil1!$C596)=TRUE,[1]Feuil1!$C596,\"X\")","v":0}]
[null,null,{"$f":"IF(EXACT([1]Feuil1!$C597,[2]Feuil1!$C597)=TRUE,[1]Feuil1!$C597,\"X\")","v":0}]
[null,null,{"$f":"IF(EXACT([1]Feuil1!$C598,[2]Feuil1!$C598)=TRUE,[1]Feuil1!$C598,\"X\")","v":0}]
[null,null,{"$f":"IF(EXACT([1]Feuil1!$C599,[2]Feuil1!$C599)=TRUE,[1]Feuil1!$C599,\"X\")","v":0}]
[null,null,{"$f":"IF(EXACT([1]Feuil1!$C600,[2]Feuil1!$C600)=TRUE,[1]Feuil1!$C600,\"X\")","v":0}]
[null,null,{"$f":"IF(EXACT([1]Feuil1!$C601,[2]Feuil1!$C601)=TRUE,[1]Feuil1!$C601,\"X\")","v":0}]
[null,null,{"$f":"IF(EXACT([1]Feuil1!$C602,[2]Feuil1!$C602)=TRUE,[1]Feuil1!$C602,\"X\")","v":0}]
[null,null,{"$f":"IF(EXACT([1]Feuil1!$C603,[2]Feuil1!$C603)=TRUE,[1]Feuil1!$C603,\"X\")","v":0}]
[null,null,{"$f":"IF(EXACT([1]Feuil1!$C604,[2]Feuil1!$C604)=TRUE,[1]Feuil1!$C604,\"X\")","v":0}]
[null,null,{"$f":"IF(EXACT([1]Feuil1!$C605,[2]Feuil1!$C605)=TRUE,[1]Feuil1!$C605,\"X\")","v":0}]
[null,null,{"$f":"IF(EXACT([1]Feuil1!$C606,[2]Feuil1!$C606)=TRUE,[1]Feuil1!$C606,\"X\")","v":0}]
[null,null,{"$f":"IF(EXACT([1]Feuil1!$C607,[2]Feuil1!$C607)=TRUE,[1]Feuil1!$C607,\"X\")","v":0}]
[null,null,{"$f":"IF(EXACT([1]Feuil1!$C608,[2]Feuil1!$C608)=TRUE,[1]Feuil1!$C608,\"X\")","v":0}]
[null,null,{"$f":"IF(EXACT([1]Feuil1!$C609,[2]Feuil1!$C609)=TRUE,[1]Feuil1!$C609,\"X\")","v":0}]
[null,null,{"$f":"IF(EXACT([1]Feuil1!$C610,[2]Feuil1!$C610)=TRUE,[1]Feuil1!$C610,\"X\")","v":0}]
[null,null,{"$f":"IF(EXACT([1]Feuil1!$C611,[2]Feuil1!$C611)=TRUE,[1]Feuil1!$C611,\"X\")","v":0}]
[null,null,{"$f":"IF(EXACT([1]Feuil1!$C612,[2]Feuil1!$C612)=TRUE,[1]Feuil1!$C612,\"X\")","v":0}]
[null,null,{"$f":"IF(EXACT([1]Feuil1!$C613,[2]Feuil1!$C613)=TRUE,[1]Feuil1!$C613,\"X\")","v":0}]
[null,null,{"$f":"IF(EXACT([1]Feuil1!$C614,[2]Feuil1!$C614)=TRUE,[1]Feuil1!$C614,\"X\")","v":0}]
[null,null,{"$f":"IF(EXACT([1]Feuil1!$C615,[2]Feuil1!$C615)=TRUE,[1]Feuil1!$C615,\"X\")","v":0}]
[null,null,{"$f":"IF(EXACT([1]Feuil1!$C616,[2]Feuil1!$C616)=TRUE,[1]Feuil1!$C616,\"X\")","v":0}]
[null,null,{"$f":"IF(EXACT([1]Feuil1!$C617,[2]Feuil1!$C617)=TRUE,[1]Feuil1!$C617,\"X\")","v":0}]
[null,null,{"$f":"IF(EXACT([1]Feuil1!$C618,[2]Feuil1!$C618)=TRUE,[1]Feuil1!$C618,\"X\")","v":0}]
[null,null,{"$f":"IF(EXACT([1]Feuil1!$C619,[2]Feuil1!$C619)=TRUE,[1]Feuil1!$C619,\"X\")","v":0}]
[null,null,{"$f":"IF(EXACT([1]Feuil1!$C620,[2]Feuil1!$C620)=TRUE,[1]Feuil1!$C620,\"X\")","v":0}]
[null,null,{"$f":"IF(EXACT([1]Feuil1!$C621,[2]Feuil1!$C621)=TRUE,[1]Feuil1!$C621,\"X\")","v":0}]
[null,null,{"$f":"IF(EXACT([1]Feuil1!$C622,[2]Feuil1!$C622)=TRUE,[1]Feuil1!$C622,\"X\")","v":0}]
[null,null,{"$f":"IF(EXACT([1]Feuil1!$C623,[2]Feuil1!$C623)=TRUE,[1]Feuil1!$C623,\"X\")","v":0}]
[null,null,{"$f":"IF(EXACT([1]Feuil1!$C624,[2]Feuil1!$C624)=TRUE,[1]Feuil1!$C624,\"X\")","v":0}]
[null,null,{"$f":"IF(EXACT([1]Feuil1!$C625,[2]Feuil1!$C625)=TRUE,[1]Feuil1!$C625,\"X\")","v":0}]
[null,null,{"$f":"IF(EXACT([1]Feuil1!$C626,[2]Feuil1!$C626)=TRUE,[1]Feuil1!$C626,\"X\")","v":0}]
[null,null,{"$f":"IF(EXACT([1]Feuil1!$C627,[2]Feuil1!$C627)=TRUE,[1]Feuil1!$C627,\"X\")","v":0}]
[null,null,{"$f":"IF(EXACT([1]Feuil1!$C628,[2]Feuil1!$C628)=TRUE,[1]Feuil1!$C628,\"X\")","v":0}]
[null,null,{"$f":"IF(EXACT([1]Feuil1!$C629,[2]Feuil1!$C629)=TRUE,[1]Feuil1!$C629,\"X\")","v":0}]
[null,null,{"$f":"IF(EXACT([1]Feuil1!$C630,[2]Feuil1!$C630)=TRUE,[1]Feuil1!$C630,\"X\")","v":0}]
[null,null,{"$f":"IF(EXACT([1]Feuil1!$C631,[2]Feuil1!$C631)=TRUE,[1]Feuil1!$C631,\"X\")","v":0}]
[null,null,{"$f":"IF(EXACT([1]Feuil1!$C632,[2]Feuil1!$C632)=TRUE,[1]Feuil1!$C632,\"X\")","v":0}]
[null,null,{"$f":"IF(EXACT([1]Feuil1!$C633,[2]Feuil1!$C633)=TRUE,[1]Feuil1!$C633,\"X\")","v":0}]
[null,null,{"$f":"IF(EXACT([1]Feuil1!$C634,[2]Feuil1!$C634)=TRUE,[1]Feuil1!$C634,\"X\")","v":0}]
[null,null,{"$f":"IF(EXACT([1]Feuil1!$C635,[2]Feuil1!$C635)=TRUE,[1]Feuil1!$C635,\"X\")","v":0}]
[null,null,{"$f":"IF(EXACT([1]Feuil1!$C636,[2]Feuil1!$C636)=TRUE,[1]Feuil1!$C636,\"X\")","v":0}]
[null,null,{"$f":"IF(EXACT([1]Feuil1!$C637,[2]Feuil1!$C637)=TRUE,[1]Feuil1!$C637,\"X\")","v":0}]
[null,null,{"$f":"IF(EXACT([1]Feuil1!$C638,[2]Feuil1!$C638)=TRUE,[1]Feuil1!$C638,\"X\")","v":0}]
[null,null,{"$f":"IF(EXACT([1]Feuil1!$C639,[2]Feuil1!$C639)=TRUE,[1]Feuil1!$C639,\"X\")","v":0}]
[null,null,{"$f":"IF(EXACT([1]Feuil1!$C640,[2]Feuil1!$C640)=TRUE,[1]Feuil1!$C640,\"X\")","v":0}]
[null,null,{"$f":"IF(EXACT([1]Feuil1!$C641,[2]Feuil1!$C641)=TRUE,[1]Feuil1!$C641,\"X\")","v":0}]
[null,null,{"$f":"IF(EXACT([1]Feuil1!$C642,[2]Feuil1!$C642)=TRUE,[1]Feuil1!$C642,\"X\")","v":0}]
[null,null,{"$f":"IF(EXACT([1]Feuil1!$C643,[2]Feuil1!$C643)=TRUE,[1]Feuil1!$C643,\"X\")","v":0}]
[null,null,{"$f":"IF(EXACT([1]Feuil1!$C644,[2]Feuil1!$C644)=TRUE,[1]Feuil1!$C644,\"X\")","v":0}]
[null,null,{"$f":"IF(EXACT([1]Feuil1!$C645,[2]Feuil1!$C645)=TRUE,[1]Feuil1!$C645,\"X\")","v":0}]
[null,null,{"$f":"IF(EXACT([1]Feuil1!$C646,[2]Feuil1!$C646)=TRUE,[1]Feuil1!$C646,\"X\")","v":0}]
[null,null,{"$f":"IF(EXACT([1]Feuil1!$C647,[2]Feuil1!$C647)=TRUE,[1]Feuil1!$C647,\"X\")","v":0}]
[null,null,{"$f":"IF(EXACT([1]Feuil1!$C648,[2]Feuil1!$C648)=TRUE,[1]Feuil1!$C648,\"X\")","v":0}]
[null,null,{"$f":"IF(EXACT([1]Feuil1!$C649,[2]Feuil1!$C649)=TRUE,[1]Feuil1!$C649,\"X\")","v":0}]
[null,null,{"$f":"IF(EXACT([1]Feuil1!$C650,[2]Feuil1!$C650)=TRUE,[1]Feuil1!$C650,\"X\")","v":0}]
[null,null,{"$f":"IF(EXACT([1]Feuil1!$C651,[2]Feuil1!$C651)=TRUE,[1]Feuil1!$C651,\"X\")","v":0}]
[null,null,{"$f":"IF(EXACT([1]Feuil1!$C652,[2]Feuil1!$C652)=TRUE,[1]Feuil1!$C652,\"X\")","v":0}]
[null,null,{"$f":"IF(EXACT([1]Feuil1!$C653,[2]Feuil1!$C653)=TRUE,[1]Feuil1!$C653,\"X\")","v":0}]
[null,null,{"$f":"IF(EXACT([1]Feuil1!$C654,[2]Feuil1!$C654)=TRUE,[1]Feuil1!$C654,\"X\")","v":0}]
[null,null,{"$f":"IF(EXACT([1]Feuil1!$C655,[2]Feuil1!$C655)=TRUE,[1]Feuil1!$C655,\"X\")","v":0}]
[null,null,{"$f":"IF(EXACT([1]Feuil1!$C656,[2]Feuil1!$C656)=TRUE,[1]Feuil1!$C656,\"X\")","v":0}]
[null,null,{"$f":"IF(EXACT([1]Feuil1!$C657,[2]Feuil1!$C657)=TRUE,[1]Feuil1!$C657,\"X\")","v":0}]
[null,null,{"$f":"IF(EXACT([1]Feuil1!$C658,[2]Feuil1!$C658)=TRUE,[1]Feuil1!$C658,\"X\")","v":0}]
[null,null,{"$f":"IF(EXACT([1]Feuil1!$C659,[2]Feuil1!$C659)=TRUE,[1]Feuil1!$C659,\"X\")","v":0}]
[null,null,{"$f":"IF(EXACT([1]Feuil1!$C660,[2]Feuil1!$C660)=TRUE,[1]Feuil1!$C660,\"X\")","v":0}]
[null,null,{"$f":"IF(EXACT([1]Feuil1!$C661,[2]Feuil1!$C661)=TRUE,[1]Feuil1!$C661,\"X\")","v":0}]
[null,null,{"$f":"IF(EXACT([1]Feuil1!$C662,[2]Feuil1!$C662)=TRUE,[1]Feuil1!$C662,\"X\")","v":0}]
[null,null,{"$f":"IF(EXACT([1]Feuil1!$C663,[2]Feuil1!$C663)=TRUE,[1]Feuil1!$C663,\"X\")","v":0}]
[null,null,{"$f":"IF(EXACT([1]Feuil1!$C664,[2]Feuil1!$C664)=TRUE,[1]Feuil1!$C664,\"X\")","v":0}]
[null,null,{"$f":"IF(EXACT([1]Feuil1!$C665,[2]Feuil1!$C665)=TRUE,[1]Feuil1!$C665,\"X\")","v":0}]
[null,null,{"$f":"IF(EXACT([1]Feuil1!$C666,[2]Feuil1!$C666)=TRUE,[1]Feuil1!$C666,\"X\")","v":0}]
[null,null,{"$f":"IF(EXACT([1]Feuil1!$C667,[2]Feuil1!$C667)=TRUE,[1]Feuil1!$C667,\"X\")","v":0}]
[null,null,{"$f":"IF(EXACT([1]Feuil1!$C668,[2]Feuil1!$C668)=TRUE,[1]Feuil1!$C668,\"X\")","v":0}]
[null,null,{"$f":"IF(EXACT([1]Feuil1!$C669,[2]Feuil1!$C669)=TRUE,[1]Feuil1!$C669,\"X\")","v":0}]
[null,null,{"$f":"IF(EXACT([1]Feuil1!$C670,[2]Feuil1!$C670)=TRUE,[1]Feuil1!$C670,\"X\")","v":0}]
[null,null,{"$f":"IF(EXACT([1]Feuil1!$C671,[2]Feuil1!$C671)=TRUE,[1]Feuil1!$C671,\"X\")","v":0}]
[null,null,{"$f":"IF(EXACT([1]Feuil1!$C672,[2]Feuil1!$C672)=TRUE,[1]Feuil1!$C672,\"X\")","v":0}]
[null,null,{"$f":"IF(EXACT([1]Feuil1!$C673,[2]Feuil1!$C673)=TRUE,[1]Feuil1!$C673,\"X\")","v":0}]
[null,null,{"$f":"IF(EXACT([1]Feuil1!$C674,[2]Feuil1!$C674)=TRUE,[1]Feuil1!$C674,\"X\")","v":0}]
[null,null,{"$f":"IF(EXACT([1]Feuil1!$C675,[2]Feuil1!$C675)=TRUE,[1]Feuil1!$C675,\"X\")","v":0}]
[null,null,{"$f":"IF(EXACT([1]Feuil1!$C676,[2]Feuil1!$C676)=TRUE,[1]Feuil1!$C676,\"X\")","v":0}]
[null,null,{"$f":"IF(EXACT([1]Feuil1!$C677,[2]Feuil1!$C677)=TRUE,[1]Feuil1!$C677,\"X\")","v":0}]
[null,null,{"$f":"IF(EXACT([1]Feuil1!$C678,[2]Feuil1!$C678)=TRUE,[1]Feuil1!$C678,\"X\")","v":0}]
[null,null,{"$f":"IF(EXACT([1]Feuil1!$C679,[2]Feuil1!$C679)=TRUE,[1]Feuil1!$C679,\"X\")","v":0}]
[null,null,{"$f":"IF(EXACT([1]Feuil1!$C680,[2]Feuil1!$C680)=TRUE,[1]Feuil1!$C680,\"X\")","v":0}]
[null,null,{"$f":"IF(EXACT([1]Feuil1!$C681,[2]Feuil1!$C681)=TRUE,[1]Feuil1!$C681,\"X\")","v":0}]
[null,null,{"$f":"IF(EXACT([1]Feuil1!$C682,[2]Feuil1!$C682)=TRUE,[1]Feuil1!$C682,\"X\")","v":0}]
[null,null,{"$f":"IF(EXACT([1]Feuil1!$C683,[2]Feuil1!$C683)=TRUE,[1]Feuil1!$C683,\"X\")","v":0}]
[null,null,{"$f":"IF(EXACT([1]Feuil1!$C684,[2]Feuil1!$C684)=TRUE,[1]Feuil1!$C684,\"X\")","v":0}]
[null,null,{"$f":"IF(EXACT([1]Feuil1!$C685,[2]Feuil1!$C685)=TRUE,[1]Feuil1!$C685,\"X\")","v":0}]
[null,null,{"$f":"IF(EXACT([1]Feuil1!$C686,[2]Feuil1!$C686)=TRUE,[1]Feuil1!$C686,\"X\")","v":0}]
[null,null,{"$f":"IF(EXACT([1]Feuil1!$C687,[2]Feuil1!$C687)=TRUE,[1]Feuil1!$C687,\"X\")","v":0}]
[null,null,{"$f":"IF(EXACT([1]Feuil1!$C688,[2]Feuil1!$C688)=TRUE,[1]Feuil1!$C688,\"X\")","v":0}]
[null,null,{"$f":"IF(EXACT([1]Feuil1!$C689,[2]Feuil1!$C689)=TRUE,[1]Feuil1!$C689,\"X\")","v":0}]
[null,null,{"$f":"IF(EXACT([1]Feuil1!$C690,[2]Feuil1!$C690)=TRUE,[1]Feuil1!$C690,\"X\")","v":0}]
[null,null,{"$f":"IF(EXACT([1]Feuil1!$C691,[2]Feuil1!$C691)=TRUE,[1]Feuil1!$C691,\"X\")","v":0}]
[null,null,{"$f":"IF(EXACT([1]Feuil1!$C692,[2]Feuil1!$C692)=TRUE,[1]Feuil1!$C692,\"X\")","v":0}]
[null,null,{"$f":"IF(EXACT([1]Feuil1!$C693,[2]Feuil1!$C693)=TRUE,[1]Feuil1!$C693,\"X\")","v":0}]
[null,null,{"$f":"IF(EXACT([1]Feuil1!$C694,[2]Feuil1!$C694)=TRUE,[1]Feuil1!$C694,\"X\")","v":0}]
[null,null,{"$f":"IF(EXACT([1]Feuil1!$C695,[2]Feuil1!$C695)=TRUE,[1]Feuil1!$C695,\"X\")","v":0}]
[null,null,{"$f":"IF(EXACT([1]Feuil1!$C696,[2]Feuil1!$C696)=TRUE,[1]Feuil1!$C696,\"X\")","v":0}]
[null,null,{"$f":"IF(EXACT([1]Feuil1!$C697,[2]Feuil1!$C697)=TRUE,[1]Feuil1!$C697,\"X\")","v":0}]
[null,null,{"$f":"IF(EXACT([1]Feuil1!$C698,[2]Feuil1!$C698)=TRUE,[1]Feuil1!$C698,\"X\")","v":0}]
[null,null,{"$f":"IF(EXACT([1]Feuil1!$C699,[2]Feuil1!$C699)=TRUE,[1]Feuil1!$C699,\"X\")","v":0}]
[null,null,{"$f":"IF(EXACT([1]Feuil1!$C700,[2]Feuil1!$C700)=TRUE,[1]Feuil1!$C700,\"X\")","v":0}]
[null,null,{"$f":"IF(EXACT([1]Feuil1!$C701,[2]Feuil1!$C701)=TRUE,[1]Feuil1!$C701,\"X\")","v":0}]
[null,null,{"$f":"IF(EXACT([1]Feuil1!$C702,[2]Feuil1!$C702)=TRUE,[1]Feuil1!$C702,\"X\")","v":0}]
[null,null,{"$f":"IF(EXACT([1]Feuil1!$C703,[2]Feuil1!$C703)=TRUE,[1]Feuil1!$C703,\"X\")","v":0}]
[null,null,{"$f":"IF(EXACT([1]Feuil1!$C704,[2]Feuil1!$C704)=TRUE,[1]Feuil1!$C704,\"X\")","v":0}]
[null,null,{"$f":"IF(EXACT([1]Feuil1!$C705,[2]Feuil1!$C705)=TRUE,[1]Feuil1!$C705,\"X\")","v":0}]
[null,null,{"$f":"IF(EXACT([1]Feuil1!$C706,[2]Feuil1!$C706)=TRUE,[1]Feuil1!$C706,\"X\")","v":0}]
[null,null,{"$f":"IF(EXACT([1]Feuil1!$C707,[2]Feuil1!$C707)=TRUE,[1]Feuil1!$C707,\"X\")","v":0}]
[null,null,{"$f":"IF(EXACT([1]Feuil1!$C708,[2]Feuil1!$C708)=TRUE,[1]Feuil1!$C708,\"X\")","v":0}]
[null,null,{"$f":"IF(EXACT([1]Feuil1!$C709,[2]Feuil1!$C709)=TRUE,[1]Feuil1!$C709,\"X\")","v":0}]
[null,null,{"$f":"IF(EXACT([1]Feuil1!$C710,[2]Feuil1!$C710)=TRUE,[1]Feuil1!$C710,\"X\")","v":0}]
[null,null,{"$f":"IF(EXACT([1]Feuil1!$C711,[2]Feuil1!$C711)=TRUE,[1]Feuil1!$C711,\"X\")","v":0}]
[null,null,{"$f":"IF(EXACT([1]Feuil1!$C712,[2]Feuil1!$C712)=TRUE,[1]Feuil1!$C712,\"X\")","v":0}]
[null,null,{"$f":"IF(EXACT([1]Feuil1!$C713,[2]Feuil1!$C713)=TRUE,[1]Feuil1!$C713,\"X\")","v":0}]
[null,null,{"$f":"IF(EXACT([1]Feuil1!$C714,[2]Feuil1!$C714)=TRUE,[1]Feuil1!$C714,\"X\")","v":0}]
[null,null,{"$f":"IF(EXACT([1]Feuil1!$C715,[2]Feuil1!$C715)=TRUE,[1]Feuil1!$C715,\"X\")","v":0}]
[null,null,{"$f":"IF(EXACT([1]Feuil1!$C716,[2]Feuil1!$C716)=TRUE,[1]Feuil1!$C716,\"X\")","v":0}]
[null,null,{"$f":"IF(EXACT([1]Feuil1!$C717,[2]Feuil1!$C717)=TRUE,[1]Feuil1!$C717,\"X\")","v":0}]
[null,null,{"$f":"IF(EXACT([1]Feuil1!$C718,[2]Feuil1!$C718)=TRUE,[1]Feuil1!$C718,\"X\")","v":0}]
[null,null,{"$f":"IF(EXACT([1]Feuil1!$C719,[2]Feuil1!$C719)=TRUE,[1]Feuil1!$C719,\"X\")","v":0}]
[null,null,{"$f":"IF(EXACT([1]Feuil1!$C720,[2]Feuil1!$C720)=TRUE,[1]Feuil1!$C720,\"X\")","v":0}]
[null,null,{"$f":"IF(EXACT([1]Feuil1!$C721,[2]Feuil1!$C721)=TRUE,[1]Feuil1!$C721,\"X\")","v":0}]
[null,null,{"$f":"IF(EXACT([1]Feuil1!$C722,[2]Feuil1!$C722)=TRUE,[1]Feuil1!$C722,\"X\")","v":0}]
[null,null,{"$f":"IF(EXACT([1]Feuil1!$C723,[2]Feuil1!$C723)=TRUE,[1]Feuil1!$C723,\"X\")","v":0}]
[null,null,{"$f":"IF(EXACT([1]Feuil1!$C724,[2]Feuil1!$C724)=TRUE,[1]Feuil1!$C724,\"X\")","v":0}]
[null,null,{"$f":"IF(EXACT([1]Feuil1!$C725,[2]Feuil1!$C725)=TRUE,[1]Feuil1!$C725,\"X\")","v":0}]
[null,null,{"$f":"IF(EXACT([1]Feuil1!$C726,[2]Feuil1!$C726)=TRUE,[1]Feuil1!$C726,\"X\")","v":0}]
[null,null,{"$f":"IF(EXACT([1]Feuil1!$C727,[2]Feuil1!$C727)=TRUE,[1]Feuil1!$C727,\"X\")","v":0}]
[null,null,{"$f":"IF(EXACT([1]Feuil1!$C728,[2]Feuil1!$C728)=TRUE,[1]Feuil1!$C728,\"X\")","v":0}]
[null,null,{"$f":"IF(EXACT([1]Feuil1!$C729,[2]Feuil1!$C729)=TRUE,[1]Feuil1!$C729,\"X\")","v":0}]
[null,null,{"$f":"IF(EXACT([1]Feuil1!$C730,[2]Feuil1!$C730)=TRUE,[1]Feuil1!$C730,\"X\")","v":0}]
[null,null,{"$f":"IF(EXACT([1]Feuil1!$C731,[2]Feuil1!$C731)=TRUE,[1]Feuil1!$C731,\"X\")","v":0}]
[null,null,{"$f":"IF(EXACT([1]Feuil1!$C732,[2]Feuil1!$C732)=TRUE,[1]Feuil1!$C732,\"X\")","v":0}]
[null,null,{"$f":"IF(EXACT([1]Feuil1!$C733,[2]Feuil1!$C733)=TRUE,[1]Feuil1!$C733,\"X\")","v":0}]
[null,null,{"$f":"IF(EXACT([1]Feuil1!$C734,[2]Feuil1!$C734)=TRUE,[1]Feuil1!$C734,\"X\")","v":0}]
[null,null,{"$f":"IF(EXACT([1]Feuil1!$C735,[2]Feuil1!$C735)=TRUE,[1]Feuil1!$C735,\"X\")","v":0}]
[null,null,{"$f":"IF(EXACT([1]Feuil1!$C736,[2]Feuil1!$C736)=TRUE,[1]Feuil1!$C736,\"X\")","v":0}]
[null,null,{"$f":"IF(EXACT([1]Feuil1!$C737,[2]Feuil1!$C737)=TRUE,[1]Feuil1!$C737,\"X\")","v":0}]
[null,null,{"$f":"IF(EXACT([1]Feuil1!$C738,[2]Feuil1!$C738)=TRUE,[1]Feuil1!$C738,\"X\")","v":0}]
[null,null,{"$f":"IF(EXACT([1]Feuil1!$C739,[2]Feuil1!$C739)=TRUE,[1]Feuil1!$C739,\"X\")","v":0}]
[null,null,{"$f":"IF(EXACT([1]Feuil1!$C740,[2]Feuil1!$C740)=TRUE,[1]Feuil1!$C740,\"X\")","v":0}]
[null,null,{"$f":"IF(EXACT([1]Feuil1!$C741,[2]Feuil1!$C741)=TRUE,[1]Feuil1!$C741,\"X\")","v":0}]
[null,null,{"$f":"IF(EXACT([1]Feuil1!$C742,[2]Feuil1!$C742)=TRUE,[1]Feuil1!$C742,\"X\")","v":0}]
[null,null,{"$f":"IF(EXACT([1]Feuil1!$C743,[2]Feuil1!$C743)=TRUE,[1]Feuil1!$C743,\"X\")","v":0}]
[null,null,{"$f":"IF(EXACT([1]Feuil1!$C744,[2]Feuil1!$C744)=TRUE,[1]Feuil1!$C744,\"X\")","v":0}]
[null,null,{"$f":"IF(EXACT([1]Feuil1!$C745,[2]Feuil1!$C745)=TRUE,[1]Feuil1!$C745,\"X\")","v":0}]
[null,null,{"$f":"IF(EXACT([1]Feuil1!$C746,[2]Feuil1!$C746)=TRUE,[1]Feuil1!$C746,\"X\")","v":0}]
[null,null,{"$f":"IF(EXACT([1]Feuil1!$C747,[2]Feuil1!$C747)=TRUE,[1]Feuil1!$C747,\"X\")","v":0}]
[null,null,{"$f":"IF(EXACT([1]Feuil1!$C748,[2]Feuil1!$C748)=TRUE,[1]Feuil1!$C748,\"X\")","v":0}]
[null,null,{"$f":"IF(EXACT([1]Feuil1!$C749,[2]Feuil1!$C749)=TRUE,[1]Feuil1!$C749,\"X\")","v":0}]
[null,null,{"$f":"IF(EXACT([1]Feuil1!$C750,[2]Feuil1!$C750)=TRUE,[1]Feuil1!$C750,\"X\")","v":0}]
[null,null,{"$f":"IF(EXACT([1]Feuil1!$C751,[2]Feuil1!$C751)=TRUE,[1]Feuil1!$C751,\"X\")","v":0}]
[null,null,{"$f":"IF(EXACT([1]Feuil1!$C752,[2]Feuil1!$C752)=TRUE,[1]Feuil1!$C752,\"X\")","v":0}]
[null,null,{"$f":"IF(EXACT([1]Feuil1!$C753,[2]Feuil1!$C753)=TRUE,[1]Feuil1!$C753,\"X\")","v":0}]
[null,null,{"$f":"IF(EXACT([1]Feuil1!$C754,[2]Feuil1!$C754)=TRUE,[1]Feuil1!$C754,\"X\")","v":0}]
[null,null,{"$f":"IF(EXACT([1]Feuil1!$C755,[2]Feuil1!$C755)=TRUE,[1]Feuil1!$C755,\"X\")","v":0}]
[null,null,{"$f":"IF(EXACT([1]Feuil1!$C756,[2]Feuil1!$C756)=TRUE,[1]Feuil1!$C756,\"X\")","v":0}]
[null,null,{"$f":"IF(EXACT([1]Feuil1!$C757,[2]Feuil1!$C757)=TRUE,[1]Feuil1!$C757,\"X\")","v":0}]
[null,null,{"$f":"IF(EXACT([1]Feuil1!$C758,[2]Feuil1!$C758)=TRUE,[1]Feuil1!$C758,\"X\")","v":0}]
[null,null,{"$f":"IF(EXACT([1]Feuil1!$C759,[2]Feuil1!$C759)=TRUE,[1]Feuil1!$C759,\"X\")","v":0}]
[null,null,{"$f":"IF(EXACT([1]Feuil1!$C760,[2]Feuil1!$C760)=TRUE,[1]Feuil1!$C760,\"X\")","v":0}]
[null,null,{"$f":"IF(EXACT([1]Feuil1!$C761,[2]Feuil1!$C761)=TRUE,[1]Feuil1!$C761,\"X\")","v":0}]
[null,null,{"$f":"IF(EXACT([1]Feuil1!$C762,[2]Feuil1!$C762)=TRUE,[1]Feuil1!$C762,\"X\")","v":0}]
[null,null,{"$f":"IF(EXACT([1]Feuil1!$C763,[2]Feuil1!$C763)=TRUE,[1]Feuil1!$C763,\"X\")","v":0}]
[null,null,{"$f":"IF(EXACT([1]Feuil1!$C764,[2]Feuil1!$C764)=TRUE,[1]Feuil1!$C764,\"X\")","v":0}]
[null,null,{"$f":"IF(EXACT([1]Feuil1!$C765,[2]Feuil1!$C765)=TRUE,[1]Feuil1!$C765,\"X\")","v":0}]
[null,null,{"$f":"IF(EXACT([1]Feuil1!$C766,[2]Feuil1!$C766)=TRUE,[1]Feuil1!$C766,\"X\")","v":0}]
[null,null,{"$f":"IF(EXACT([1]Feuil1!$C767,[2]Feuil1!$C767)=TRUE,[1]Feuil1!$C767,\"X\")","v":0}]
[null,null,{"$f":"IF(EXACT([1]Feuil1!$C768,[2]Feuil1!$C768)=TRUE,[1]Feuil1!$C768,\"X\")","v":0}]
[null,null,{"$f":"IF(EXACT([1]Feuil1!$C769,[2]Feuil1!$C769)=TRUE,[1]Feuil1!$C769,\"X\")","v":0}]
[null,null,{"$f":"IF(EXACT([1]Feuil1!$C770,[2]Feuil1!$C770)=TRUE,[1]Feuil1!$C770,\"X\")","v":0}]
[null,null,{"$f":"IF(EXACT([1]Feuil1!$C771,[2]Feuil1!$C771)=TRUE,[1]Feuil1!$C771,\"X\")","v":0}]
[null,null,{"$f":"IF(EXACT([1]Feuil1!$C772,[2]Feuil1!$C772)=TRUE,[1]Feuil1!$C772,\"X\")","v":0}]
[null,null,{"$f":"IF(EXACT([1]Feuil1!$C773,[2]Feuil1!$C773)=TRUE,[1]Feuil1!$C773,\"X\")","v":0}]
[null,null,{"$f":"IF(EXACT([1]Feuil1!$C774,[2]Feuil1!$C774)=TRUE,[1]Feuil1!$C774,\"X\")","v":0}]
[null,null,{"$f":"IF(EXACT([1]Feuil1!$C775,[2]Feuil1!$C775)=TRUE,[1]Feuil1!$C775,\"X\")","v":0}]
[null,null,{"$f":"IF(EXACT([1]Feuil1!$C776,[2]Feuil1!$C776)=TRUE,[1]Feuil1!$C776,\"X\")","v":0}]
[null,null,{"$f":"IF(EXACT([1]Feuil1!$C777,[2]Feuil1!$C777)=TRUE,[1]Feuil1!$C777,\"X\")","v":0}]
[null,null,{"$f":"IF(EXACT([1]Feuil1!$C778,[2]Feuil1!$C778)=TRUE,[1]Feuil1!$C778,\"X\")","v":0}]
[null,null,{"$f":"IF(EXACT([1]Feuil1!$C779,[2]Feuil1!$C779)=TRUE,[1]Feuil1!$C779,\"X\")","v":0}]
[null,null,{"$f":"IF(EXACT([1]Feuil1!$C780,[2]Feuil1!$C780)=TRUE,[1]Feuil1!$C780,\"X\")","v":0}]
[null,null,{"$f":"IF(EXACT([1]Feuil1!$C781,[2]Feuil1!$C781)=TRUE,[1]Feuil1!$C781,\"X\")","v":0}]
[null,null,{"$f":"IF(EXACT([1]Feuil1!$C782,[2]Feuil1!$C782)=TRUE,[1]Feuil1!$C782,\"X\")","v":0}]
[null,null,{"$f":"IF(EXACT([1]Feuil1!$C783,[2]Feuil1!$C783)=TRUE,[1]Feuil1!$C783,\"X\")","v":0}]
[null,null,{"$f":"IF(EXACT([1]Feuil1!$C784,[2]Feuil1!$C784)=TRUE,[1]Feuil1!$C784,\"X\")","v":0}]
[null,null,{"$f":"IF(EXACT([1]Feuil1!$C785,[2]Feuil1!$C785)=TRUE,[1]Feuil1!$C785,\"X\")","v":0}]
[null,null,{"$f":"IF(EXACT([1]Feuil1!$C786,[2]Feuil1!$C786)=TRUE,[1]Feuil1!$C786,\"X\")","v":0}]
[null,null,{"$f":"IF(EXACT([1]Feuil1!$C787,[2]Feuil1!$C787)=TRUE,[1]Feuil1!$C787,\"X\")","v":0}]
[null,null,{"$f":"IF(EXACT([1]Feuil1!$C788,[2]Feuil1!$C788)=TRUE,[1]Feuil1!$C788,\"X\")","v":0}]
[null,null,{"$f":"IF(EXACT([1]Feuil1!$C789,[2]Feuil1!$C789)=TRUE,[1]Feuil1!$C789,\"X\")","v":0}]
[null,null,{"$f":"IF(EXACT([1]Feuil1!$C790,[2]Feuil1!$C790)=TRUE,[1]Feuil1!$C790,\"X\")","v":0}]
[null,null,{"$f":"IF(EXACT([1]Feuil1!$C791,[2]Feuil1!$C791)=TRUE,[1]Feuil1!$C791,\"X\")","v":0}]
[null,null,{"$f":"IF(EXACT([1]Feuil1!$C792,[2]Feuil1!$C792)=TRUE,[1]Feuil1!$C792,\"X\")","v":0}]
[null,null,{"$f":"IF(EXACT([1]Feuil1!$C793,[2]Feuil1!$C793)=TRUE,[1]Feuil1!$C793,\"X\")","v":0}]
[null,null,{"$f":"IF(EXACT([1]Feuil1!$C794,[2]Feuil1!$C794)=TRUE,[1]Feuil1!$C794,\"X\")","v":0}]
[null,null,{"$f":"IF(EXACT([1]Feuil1!$C795,[2]Feuil1!$C795)=TRUE,[1]Feuil1!$C795,\"X\")","v":0}]
[null,null,{"$f":"IF(EXACT([1]Feuil1!$C796,[2]Feuil1!$C796)=TRUE,[1]Feuil1!$C796,\"X\")","v":0}]
[null,null,{"$f":"IF(EXACT([1]Feuil1!$C797,[2]Feuil1!$C797)=TRUE,[1]Feuil1!$C797,\"X\")","v":0}]
[null,null,{"$f":"IF(EXACT([1]Feuil1!$C798,[2]Feuil1!$C798)=TRUE,[1]Feuil1!$C798,\"X\")","v":0}]
[null,null,{"$f":"IF(EXACT([1]Feuil1!$C799,[2]Feuil1!$C799)=TRUE,[1]Feuil1!$C799,\"X\")","v":0}]
[null,null,{"$f":"IF(EXACT([1]Feuil1!$C800,[2]Feuil1!$C800)=TRUE,[1]Feuil1!$C800,\"X\")","v":0}]
[null,null,{"$f":"IF(EXACT([1]Feuil1!$C801,[2]Feuil1!$C801)=TRUE,[1]Feuil1!$C801,\"X\")","v":0}]
[null,null,{"$f":"IF(EXACT([1]Feuil1!$C802,[2]Feuil1!$C802)=TRUE,[1]Feuil1!$C802,\"X\")","v":0}]
[null,null,{"$f":"IF(EXACT([1]Feuil1!$C803,[2]Feuil1!$C803)=TRUE,[1]Feuil1!$C803,\"X\")","v":0}]
[null,null,{"$f":"IF(EXACT([1]Feuil1!$C804,[2]Feuil1!$C804)=TRUE,[1]Feuil1!$C804,\"X\")","v":0}]
[null,null,{"$f":"IF(EXACT([1]Feuil1!$C805,[2]Feuil1!$C805)=TRUE,[1]Feuil1!$C805,\"X\")","v":0}]
[null,null,{"$f":"IF(EXACT([1]Feuil1!$C806,[2]Feuil1!$C806)=TRUE,[1]Feuil1!$C806,\"X\")","v":0}]
[null,null,{"$f":"IF(EXACT([1]Feuil1!$C807,[2]Feuil1!$C807)=TRUE,[1]Feuil1!$C807,\"X\")","v":0}]
[null,null,{"$f":"IF(EXACT([1]Feuil1!$C808,[2]Feuil1!$C808)=TRUE,[1]Feuil1!$C808,\"X\")","v":0}]
[null,null,{"$f":"IF(EXACT([1]Feuil1!$C809,[2]Feuil1!$C809)=TRUE,[1]Feuil1!$C809,\"X\")","v":0}]
[null,null,{"$f":"IF(EXACT([1]Feuil1!$C810,[2]Feuil1!$C810)=TRUE,[1]Feuil1!$C810,\"X\")","v":0}]
[null,null,{"$f":"IF(EXACT([1]Feuil1!$C811,[2]Feuil1!$C811)=TRUE,[1]Feuil1!$C811,\"X\")","v":0}]
[null,null,{"$f":"IF(EXACT([1]Feuil1!$C812,[2]Feuil1!$C812)=TRUE,[1]Feuil1!$C812,\"X\")","v":0}]
[null,null,{"$f":"IF(EXACT([1]Feuil1!$C813,[2]Feuil1!$C813)=TRUE,[1]Feuil1!$C813,\"X\")","v":0}]
[null,null,{"$f":"IF(EXACT([1]Feuil1!$C814,[2]Feuil1!$C814)=TRUE,[1]Feuil1!$C814,\"X\")","v":0}]
[null,null,{"$f":"IF(EXACT([1]Feuil1!$C815,[2]Feuil1!$C815)=TRUE,[1]Feuil1!$C815,\"X\")","v":0}]
[null,null,{"$f":"IF(EXACT([1]Feuil1!$C816,[2]Feuil1!$C816)=TRUE,[1]Feuil1!$C816,\"X\")","v":0}]
[null,null,{"$f":"IF(EXACT([1]Feuil1!$C817,[2]Feuil1!$C817)=TRUE,[1]Feuil1!$C817,\"X\")","v":0}]
[null,null,{"$f":"IF(EXACT([1]Feuil1!$C818,[2]Feuil1!$C818)=TRUE,[1]Feuil1!$C818,\"X\")","v":0}]
[null,null,{"$f":"IF(EXACT([1]Feuil1!$C819,[2]Feuil1!$C819)=TRUE,[1]Feuil1!$C819,\"X\")","v":0}]
[null,null,{"$f":"IF(EXACT([1]Feuil1!$C820,[2]Feuil1!$C820)=TRUE,[1]Feuil1!$C820,\"X\")","v":0}]
[null,null,{"$f":"IF(EXACT([1]Feuil1!$C821,[2]Feuil1!$C821)=TRUE,[1]Feuil1!$C821,\"X\")","v":0}]
[null,null,{"$f":"IF(EXACT([1]Feuil1!$C822,[2]Feuil1!$C822)=TRUE,[1]Feuil1!$C822,\"X\")","v":0}]
[null,null,{"$f":"IF(EXACT([1]Feuil1!$C823,[2]Feuil1!$C823)=TRUE,[1]Feuil1!$C823,\"X\")","v":0}]
[null,null,{"$f":"IF(EXACT([1]Feuil1!$C824,[2]Feuil1!$C824)=TRUE,[1]Feuil1!$C824,\"X\")","v":0}]
[null,null,{"$f":"IF(EXACT([1]Feuil1!$C825,[2]Feuil1!$C825)=TRUE,[1]Feuil1!$C825,\"X\")","v":0}]
[null,null,{"$f":"IF(EXACT([1]Feuil1!$C826,[2]Feuil1!$C826)=TRUE,[1]Feuil1!$C826,\"X\")","v":0}]
[null,null,{"$f":"IF(EXACT([1]Feuil1!$C827,[2]Feuil1!$C827)=TRUE,[1]Feuil1!$C827,\"X\")","v":0}]
[null,null,{"$f":"IF(EXACT([1]Feuil1!$C828,[2]Feuil1!$C828)=TRUE,[1]Feuil1!$C828,\"X\")","v":0}]
[null,null,{"$f":"IF(EXACT([1]Feuil1!$C829,[2]Feuil1!$C829)=TRUE,[1]Feuil1!$C829,\"X\")","v":0}]
[null,null,{"$f":"IF(EXACT([1]Feuil1!$C830,[2]Feuil1!$C830)=TRUE,[1]Feuil1!$C830,\"X\")","v":0}]
[null,null,{"$f":"IF(EXACT([1]Feuil1!$C831,[2]Feuil1!$C831)=TRUE,[1]Feuil1!$C831,\"X\")","v":0}]
[null,null,{"$f":"IF(EXACT([1]Feuil1!$C832,[2]Feuil1!$C832)=TRUE,[1]Feuil1!$C832,\"X\")","v":0}]
[null,null,{"$f":"IF(EXACT([1]Feuil1!$C833,[2]Feuil1!$C833)=TRUE,[1]Feuil1!$C833,\"X\")","v":0}]
[null,null,{"$f":"IF(EXACT([1]Feuil1!$C834,[2]Feuil1!$C834)=TRUE,[1]Feuil1!$C834,\"X\")","v":0}]
[null,null,{"$f":"IF(EXACT([1]Feuil1!$C835,[2]Feuil1!$C835)=TRUE,[1]Feuil1!$C835,\"X\")","v":0}]
[null,null,{"$f":"IF(EXACT([1]Feuil1!$C836,[2]Feuil1!$C836)=TRUE,[1]Feuil1!$C836,\"X\")","v":0}]
[null,null,{"$f":"IF(EXACT([1]Feuil1!$C837,[2]Feuil1!$C837)=TRUE,[1]Feuil1!$C837,\"X\")","v":0}]
[null,null,{"$f":"IF(EXACT([1]Feuil1!$C838,[2]Feuil1!$C838)=TRUE,[1]Feuil1!$C838,\"X\")","v":0}]
[null,null,{"$f":"IF(EXACT([1]Feuil1!$C839,[2]Feuil1!$C839)=TRUE,[1]Feuil1!$C839,\"X\")","v":0}]
[null,null,{"$f":"IF(EXACT([1]Feuil1!$C840,[2]Feuil1!$C840)=TRUE,[1]Feuil1!$C840,\"X\")","v":0}]
[null,null,{"$f":"IF(EXACT([1]Feuil1!$C841,[2]Feuil1!$C841)=TRUE,[1]Feuil1!$C841,\"X\")","v":0}]
[null,null,{"$f":"IF(EXACT([1]Feuil1!$C842,[2]Feuil1!$C842)=TRUE,[1]Feuil1!$C842,\"X\")","v":0}]
[null,null,{"$f":"IF(EXACT([1]Feuil1!$C843,[2]Feuil1!$C843)=TRUE,[1]Feuil1!$C843,\"X\")","v":0}]
[null,null,{"$f":"IF(EXACT([1]Feuil1!$C844,[2]Feuil1!$C844)=TRUE,[1]Feuil1!$C844,\"X\")","v":0}]
[null,null,{"$f":"IF(EXACT([1]Feuil1!$C845,[2]Feuil1!$C845)=TRUE,[1]Feuil1!$C845,\"X\")","v":0}]
[null,null,{"$f":"IF(EXACT([1]Feuil1!$C846,[2]Feuil1!$C846)=TRUE,[1]Feuil1!$C846,\"X\")","v":0}]
[null,null,{"$f":"IF(EXACT([1]Feuil1!$C847,[2]Feuil1!$C847)=TRUE,[1]Feuil1!$C847,\"X\")","v":0}]
[null,null,{"$f":"IF(EXACT([1]Feuil1!$C848,[2]Feuil1!$C848)=TRUE,[1]Feuil1!$C848,\"X\")","v":0}]
[null,null,{"$f":"IF(EXACT([1]Feuil1!$C849,[2]Feuil1!$C849)=TRUE,[1]Feuil1!$C849,\"X\")","v":0}]
[null,null,{"$f":"IF(EXACT([1]Feuil1!$C850,[2]Feuil1!$C850)=TRUE,[1]Feuil1!$C850,\"X\")","v":0}]
[null,null,{"$f":"IF(EXACT([1]Feuil1!$C851,[2]Feuil1!$C851)=TRUE,[1]Feuil1!$C851,\"X\")","v":0}]
[null,null,{"$f":"IF(EXACT([1]Feuil1!$C852,[2]Feuil1!$C852)=TRUE,[1]Feuil1!$C852,\"X\")","v":0}]
[null,null,{"$f":"IF(EXACT([1]Feuil1!$C853,[2]Feuil1!$C853)=TRUE,[1]Feuil1!$C853,\"X\")","v":0}]
[null,null,{"$f":"IF(EXACT([1]Feuil1!$C854,[2]Feuil1!$C854)=TRUE,[1]Feuil1!$C854,\"X\")","v":0}]
[null,null,{"$f":"IF(EXACT([1]Feuil1!$C855,[2]Feuil1!$C855)=TRUE,[1]Feuil1!$C855,\"X\")","v":0}]
[null,null,{"$f":"IF(EXACT([1]Feuil1!$C856,[2]Feuil1!$C856)=TRUE,[1]Feuil1!$C856,\"X\")","v":0}]
[null,null,{"$f":"IF(EXACT([1]Feuil1!$C857,[2]Feuil1!$C857)=TRUE,[1]Feuil1!$C857,\"X\")","v":0}]
[null,null,{"$f":"IF(EXACT([1]Feuil1!$C858,[2]Feuil1!$C858)=TRUE,[1]Feuil1!$C858,\"X\")","v":0}]
[null,null,{"$f":"IF(EXACT([1]Feuil1!$C859,[2]Feuil1!$C859)=TRUE,[1]Feuil1!$C859,\"X\")","v":0}]
[null,null,{"$f":"IF(EXACT([1]Feuil1!$C860,[2]Feuil1!$C860)=TRUE,[1]Feuil1!$C860,\"X\")","v":0}]
[null,null,{"$f":"IF(EXACT([1]Feuil1!$C861,[2]Feuil1!$C861)=TRUE,[1]Feuil1!$C861,\"X\")","v":0}]
[null,null,{"$f":"IF(EXACT([1]Feuil1!$C862,[2]Feuil1!$C862)=TRUE,[1]Feuil1!$C862,\"X\")","v":0}]
[null,null,{"$f":"IF(EXACT([1]Feuil1!$C863,[2]Feuil1!$C863)=TRUE,[1]Feuil1!$C863,\"X\")","v":0}]
[null,null,{"$f":"IF(EXACT([1]Feuil1!$C864,[2]Feuil1!$C864)=TRUE,[1]Feuil1!$C864,\"X\")","v":0}]
[null,null,{"$f":"IF(EXACT([1]Feuil1!$C865,[2]Feuil1!$C865)=TRUE,[1]Feuil1!$C865,\"X\")","v":0}]
[null,null,{"$f":"IF(EXACT([1]Feuil1!$C866,[2]Feuil1!$C866)=TRUE,[1]Feuil1!$C866,\"X\")","v":0}]
[null,null,{"$f":"IF(EXACT([1]Feuil1!$C867,[2]Feuil1!$C867)=TRUE,[1]Feuil1!$C867,\"X\")","v":0}]
[null,null,{"$f":"IF(EXACT([1]Feuil1!$C868,[2]Feuil1!$C868)=TRUE,[1]Feuil1!$C868,\"X\")","v":0}]
[null,null,{"$f":"IF(EXACT([1]Feuil1!$C869,[2]Feuil1!$C869)=TRUE,[1]Feuil1!$C869,\"X\")","v":0}]
[null,null,{"$f":"IF(EXACT([1]Feuil1!$C870,[2]Feuil1!$C870)=TRUE,[1]Feuil1!$C870,\"X\")","v":0}]
[null,null,{"$f":"IF(EXACT([1]Feuil1!$C871,[2]Feuil1!$C871)=TRUE,[1]Feuil1!$C871,\"X\")","v":0}]
[null,null,{"$f":"IF(EXACT([1]Feuil1!$C872,[2]Feuil1!$C872)=TRUE,[1]Feuil1!$C872,\"X\")","v":0}]
[null,null,{"$f":"IF(EXACT([1]Feuil1!$C873,[2]Feuil1!$C873)=TRUE,[1]Feuil1!$C873,\"X\")","v":0}]
[null,null,{"$f":"IF(EXACT([1]Feuil1!$C874,[2]Feuil1!$C874)=TRUE,[1]Feuil1!$C874,\"X\")","v":0}]
[null,null,{"$f":"IF(EXACT([1]Feuil1!$C875,[2]Feuil1!$C875)=TRUE,[1]Feuil1!$C875,\"X\")","v":0}]
[null,null,{"$f":"IF(EXACT([1]Feuil1!$C876,[2]Feuil1!$C876)=TRUE,[1]Feuil1!$C876,\"X\")","v":0}]
[null,null,{"$f":"IF(EXACT([1]Feuil1!$C877,[2]Feuil1!$C877)=TRUE,[1]Feuil1!$C877,\"X\")","v":0}]
[null,null,{"$f":"IF(EXACT([1]Feuil1!$C878,[2]Feuil1!$C878)=TRUE,[1]Feuil1!$C878,\"X\")","v":0}]
[null,null,{"$f":"IF(EXACT([1]Feuil1!$C879,[2]Feuil1!$C879)=TRUE,[1]Feuil1!$C879,\"X\")","v":0}]
[null,null,{"$f":"IF(EXACT([1]Feuil1!$C880,[2]Feuil1!$C880)=TRUE,[1]Feuil1!$C880,\"X\")","v":0}]
[null,null,{"$f":"IF(EXACT([1]Feuil1!$C881,[2]Feuil1!$C881)=TRUE,[1]Feuil1!$C881,\"X\")","v":0}]
[null,null,{"$f":"IF(EXACT([1]Feuil1!$C882,[2]Feuil1!$C882)=TRUE,[1]Feuil1!$C882,\"X\")","v":0}]
[null,null,{"$f":"IF(EXACT([1]Feuil1!$C883,[2]Feuil1!$C883)=TRUE,[1]Feuil1!$C883,\"X\")","v":0}]
[null,null,{"$f":"IF(EXACT([1]Feuil1!$C884,[2]Feuil1!$C884)=TRUE,[1]Feuil1!$C884,\"X\")","v":0}]
[null,null,{"$f":"IF(EXACT([1]Feuil1!$C885,[2]Feuil1!$C885)=TRUE,[1]Feuil1!$C885,\"X\")","v":0}]
[null,null,{"$f":"IF(EXACT([1]Feuil1!$C886,[2]Feuil1!$C886)=TRUE,[1]Feuil1!$C886,\"X\")","v":0}]
[null,null,{"$f":"IF(EXACT([1]Feuil1!$C887,[2]Feuil1!$C887)=TRUE,[1]Feuil1!$C887,\"X\")","v":0}]
[null,null,{"$f":"IF(EXACT([1]Feuil1!$C888,[2]Feuil1!$C888)=TRUE,[1]Feuil1!$C888,\"X\")","v":0}]
[null,null,{"$f":"IF(EXACT([1]Feuil1!$C889,[2]Feuil1!$C889)=TRUE,[1]Feuil1!$C889,\"X\")","v":0}]
[null,null,{"$f":"IF(EXACT([1]Feuil1!$C890,[2]Feuil1!$C890)=TRUE,[1]Feuil1!$C890,\"X\")","v":0}]
[null,null,{"$f":"IF(EXACT([1]Feuil1!$C891,[2]Feuil1!$C891)=TRUE,[1]Feuil1!$C891,\"X\")","v":0}]
[null,null,{"$f":"IF(EXACT([1]Feuil1!$C892,[2]Feuil1!$C892)=TRUE,[1]Feuil1!$C892,\"X\")","v":0}]
[null,null,{"$f":"IF(EXACT([1]Feuil1!$C893,[2]Feuil1!$C893)=TRUE,[1]Feuil1!$C893,\"X\")","v":0}]
[null,null,{"$f":"IF(EXACT([1]Feuil1!$C894,[2]Feuil1!$C894)=TRUE,[1]Feuil1!$C894,\"X\")","v":0}]
[null,null,{"$f":"IF(EXACT([1]Feuil1!$C895,[2]Feuil1!$C895)=TRUE,[1]Feuil1!$C895,\"X\")","v":0}]
[null,null,{"$f":"IF(EXACT([1]Feuil1!$C896,[2]Feuil1!$C896)=TRUE,[1]Feuil1!$C896,\"X\")","v":0}]
[null,null,{"$f":"IF(EXACT([1]Feuil1!$C897,[2]Feuil1!$C897)=TRUE,[1]Feuil1!$C897,\"X\")","v":0}]
[null,null,{"$f":"IF(EXACT([1]Feuil1!$C898,[2]Feuil1!$C898)=TRUE,[1]Feuil1!$C898,\"X\")","v":0}]
[null,null,{"$f":"IF(EXACT([1]Feuil1!$C899,[2]Feuil1!$C899)=TRUE,[1]Feuil1!$C899,\"X\")","v":0}]
[null,null,{"$f":"IF(EXACT([1]Feuil1!$C900,[2]Feuil1!$C900)=TRUE,[1]Feuil1!$C900,\"X\")","v":0}]
[null,null,{"$f":"IF(EXACT([1]Feuil1!$C901,[2]Feuil1!$C901)=TRUE,[1]Feuil1!$C901,\"X\")","v":0}]
[null,null,{"$f":"IF(EXACT([1]Feuil1!$C902,[2]Feuil1!$C902)=TRUE,[1]Feuil1!$C902,\"X\")","v":0}]
[null,null,{"$f":"IF(EXACT([1]Feuil1!$C903,[2]Feuil1!$C903)=TRUE,[1]Feuil1!$C903,\"X\")","v":0}]
[null,null,{"$f":"IF(EXACT([1]Feuil1!$C904,[2]Feuil1!$C904)=TRUE,[1]Feuil1!$C904,\"X\")","v":0}]
[null,null,{"$f":"IF(EXACT([1]Feuil1!$C905,[2]Feuil1!$C905)=TRUE,[1]Feuil1!$C905,\"X\")","v":0}]
[null,null,{"$f":"IF(EXACT([1]Feuil1!$C906,[2]Feuil1!$C906)=TRUE,[1]Feuil1!$C906,\"X\")","v":0}]
[null,null,{"$f":"IF(EXACT([1]Feuil1!$C907,[2]Feuil1!$C907)=TRUE,[1]Feuil1!$C907,\"X\")","v":0}]
[null,null,{"$f":"IF(EXACT([1]Feuil1!$C908,[2]Feuil1!$C908)=TRUE,[1]Feuil1!$C908,\"X\")","v":0}]
[null,null,{"$f":"IF(EXACT([1]Feuil1!$C909,[2]Feuil1!$C909)=TRUE,[1]Feuil1!$C909,\"X\")","v":0}]
[null,null,{"$f":"IF(EXACT([1]Feuil1!$C910,[2]Feuil1!$C910)=TRUE,[1]Feuil1!$C910,\"X\")","v":0}]
[null,null,{"$f":"IF(EXACT([1]Feuil1!$C911,[2]Feuil1!$C911)=TRUE,[1]Feuil1!$C911,\"X\")","v":0}]
[null,null,{"$f":"IF(EXACT([1]Feuil1!$C912,[2]Feuil1!$C912)=TRUE,[1]Feuil1!$C912,\"X\")","v":0}]
[null,null,{"$f":"IF(EXACT([1]Feuil1!$C913,[2]Feuil1!$C913)=TRUE,[1]Feuil1!$C913,\"X\")","v":0}]
[null,null,{"$f":"IF(EXACT([1]Feuil1!$C914,[2]Feuil1!$C914)=TRUE,[1]Feuil1!$C914,\"X\")","v":0}]
[null,null,{"$f":"IF(EXACT([1]Feuil1!$C915,[2]Feuil1!$C915)=TRUE,[1]Feuil1!$C915,\"X\")","v":0}]
[null,null,{"$f":"IF(EXACT([1]Feuil1!$C916,[2]Feuil1!$C916)=TRUE,[1]Feuil1!$C916,\"X\")","v":0}]
[null,null,{"$f":"IF(EXACT([1]Feuil1!$C917,[2]Feuil1!$C917)=TRUE,[1]Feuil1!$C917,\"X\")","v":0}]
[null,null,{"$f":"IF(EXACT([1]Feuil1!$C918,[2]Feuil1!$C918)=TRUE,[1]Feuil1!$C918,\"X\")","v":0}]
[null,null,{"$f":"IF(EXACT([1]Feuil1!$C919,[2]Feuil1!$C919)=TRUE,[1]Feuil1!$C919,\"X\")","v":0}]
[null,null,{"$f":"IF(EXACT([1]Feuil1!$C920,[2]Feuil1!$C920)=TRUE,[1]Feuil1!$C920,\"X\")","v":0}]
[null,null,{"$f":"IF(EXACT([1]Feuil1!$C921,[2]Feuil1!$C921)=TRUE,[1]Feuil1!$C921,\"X\")","v":0}]
[null,null,{"$f":"IF(EXACT([1]Feuil1!$C922,[2]Feuil1!$C922)=TRUE,[1]Feuil1!$C922,\"X\")","v":0}]
[null,null,{"$f":"IF(EXACT([1]Feuil1!$C923,[2]Feuil1!$C923)=TRUE,[1]Feuil1!$C923,\"X\")","v":0}]
[null,null,{"$f":"IF(EXACT([1]Feuil1!$C924,[2]Feuil1!$C924)=TRUE,[1]Feuil1!$C924,\"X\")","v":0}]
[null,null,{"$f":"IF(EXACT([1]Feuil1!$C925,[2]Feuil1!$C925)=TRUE,[1]Feuil1!$C925,\"X\")","v":0}]
[null,null,{"$f":"IF(EXACT([1]Feuil1!$C926,[2]Feuil1!$C926)=TRUE,[1]Feuil1!$C926,\"X\")","v":0}]
[null,null,{"$f":"IF(EXACT([1]Feuil1!$C927,[2]Feuil1!$C927)=TRUE,[1]Feuil1!$C927,\"X\")","v":0}]
[null,null,{"$f":"IF(EXACT([1]Feuil1!$C928,[2]Feuil1!$C928)=TRUE,[1]Feuil1!$C928,\"X\")","v":0}]
[null,null,{"$f":"IF(EXACT([1]Feuil1!$C929,[2]Feuil1!$C929)=TRUE,[1]Feuil1!$C929,\"X\")","v":0}]
[null,null,{"$f":"IF(EXACT([1]Feuil1!$C930,[2]Feuil1!$C930)=TRUE,[1]Feuil1!$C930,\"X\")","v":0}]
[null,null,{"$f":"IF(EXACT([1]Feuil1!$C931,[2]Feuil1!$C931)=TRUE,[1]Feuil1!$C931,\"X\")","v":0}]
[null,null,{"$f":"IF(EXACT([1]Feuil1!$C932,[2]Feuil1!$C932)=TRUE,[1]Feuil1!$C932,\"X\")","v":0}]
[null,null,{"$f":"IF(EXACT([1]Feuil1!$C933,[2]Feuil1!$C933)=TRUE,[1]Feuil1!$C933,\"X\")","v":0}]
[null,null,{"$f":"IF(EXACT([1]Feuil1!$C934,[2]Feuil1!$C934)=TRUE,[1]Feuil1!$C934,\"X\")","v":0}]
[null,null,{"$f":"IF(EXACT([1]Feuil1!$C935,[2]Feuil1!$C935)=TRUE,[1]Feuil1!$C935,\"X\")","v":0}]
[null,null,{"$f":"IF(EXACT([1]Feuil1!$C936,[2]Feuil1!$C936)=TRUE,[1]Feuil1!$C936,\"X\")","v":0}]
[null,null,{"$f":"IF(EXACT([1]Feuil1!$C937,[2]Feuil1!$C937)=TRUE,[1]Feuil1!$C937,\"X\")","v":0}]
[null,null,{"$f":"IF(EXACT([1]Feuil1!$C938,[2]Feuil1!$C938)=TRUE,[1]Feuil1!$C938,\"X\")","v":0}]
[null,null,{"$f":"IF(EXACT([1]Feuil1!$C939,[2]Feuil1!$C939)=TRUE,[1]Feuil1!$C939,\"X\")","v":0}]
[null,null,{"$f":"IF(EXACT([1]Feuil1!$C940,[2]Feuil1!$C940)=TRUE,[1]Feuil1!$C940,\"X\")","v":0}]
[null,null,{"$f":"IF(EXACT([1]Feuil1!$C941,[2]Feuil1!$C941)=TRUE,[1]Feuil1!$C941,\"X\")","v":0}]
[null,null,{"$f":"IF(EXACT([1]Feuil1!$C942,[2]Feuil1!$C942)=TRUE,[1]Feuil1!$C942,\"X\")","v":0}]
[null,null,{"$f":"IF(EXACT([1]Feuil1!$C943,[2]Feuil1!$C943)=TRUE,[1]Feuil1!$C943,\"X\")","v":0}]
[null,null,{"$f":"IF(EXACT([1]Feuil1!$C944,[2]Feuil1!$C944)=TRUE,[1]Feuil1!$C944,\"X\")","v":0}]
[null,null,{"$f":"IF(EXACT([1]Feuil1!$C945,[2]Feuil1!$C945)=TRUE,[1]Feuil1!$C945,\"X\")","v":0}]
[null,null,{"$f":"IF(EXACT([1]Feuil1!$C946,[2]Feuil1!$C946)=TRUE,[1]Feuil1!$C946,\"X\")","v":0}]
[null,null,{"$f":"IF(EXACT([1]Feuil1!$C947,[2]Feuil1!$C947)=TRUE,[1]Feuil1!$C947,\"X\")","v":0}]
[null,null,{"$f":"IF(EXACT([1]Feuil1!$C948,[2]Feuil1!$C948)=TRUE,[1]Feuil1!$C948,\"X\")","v":0}]
[null,null,{"$f":"IF(EXACT([1]Feuil1!$C949,[2]Feuil1!$C949)=TRUE,[1]Feuil1!$C949,\"X\")","v":0}]
[null,null,{"$f":"IF(EXACT([1]Feuil1!$C950,[2]Feuil1!$C950)=TRUE,[1]Feuil1!$C950,\"X\")","v":0}]
[null,null,{"$f":"IF(EXACT([1]Feuil1!$C951,[2]Feuil1!$C951)=TRUE,[1]Feuil1!$C951,\"X\")","v":0}]
[null,null,{"$f":"IF(EXACT([1]Feuil1!$C952,[2]Feuil1!$C952)=TRUE,[1]Feuil1!$C952,\"X\")","v":0}]
[null,null,{"$f":"IF(EXACT([1]Feuil1!$C953,[2]Feuil1!$C953)=TRUE,[1]Feuil1!$C953,\"X\")","v":0}]
[null,null,{"$f":"IF(EXACT([1]Feuil1!$C954,[2]Feuil1!$C954)=TRUE,[1]Feuil1!$C954,\"X\")","v":0}]
[null,null,{"$f":"IF(EXACT([1]Feuil1!$C955,[2]Feuil1!$C955)=TRUE,[1]Feuil1!$C955,\"X\")","v":0}]
[null,null,{"$f":"IF(EXACT([1]Feuil1!$C956,[2]Feuil1!$C956)=TRUE,[1]Feuil1!$C956,\"X\")","v":0}]
[null,null,{"$f":"IF(EXACT([1]Feuil1!$C957,[2]Feuil1!$C957)=TRUE,[1]Feuil1!$C957,\"X\")","v":0}]
[null,null,{"$f":"IF(EXACT([1]Feuil1!$C958,[2]Feuil1!$C958)=TRUE,[1]Feuil1!$C958,\"X\")","v":0}]
[null,null,{"$f":"IF(EXACT([1]Feuil1!$C959,[2]Feuil1!$C959)=TRUE,[1]Feuil1!$C959,\"X\")","v":0}]
[null,null,{"$f":"IF(EXACT([1]Feuil1!$C960,[2]Feuil1!$C960)=TRUE,[1]Feuil1!$C960,\"X\")","v":0}]
[null,null,{"$f":"IF(EXACT([1]Feuil1!$C961,[2]Feuil1!$C961)=TRUE,[1]Feuil1!$C961,\"X\")","v":0}]
[null,null,{"$f":"IF(EXACT([1]Feuil1!$C962,[2]Feuil1!$C962)=TRUE,[1]Feuil1!$C962,\"X\")","v":0}]
[null,null,{"$f":"IF(EXACT([1]Feuil1!$C963,[2]Feuil1!$C963)=TRUE,[1]Feuil1!$C963,\"X\")","v":0}]
[null,null,{"$f":"IF(EXACT([1]Feuil1!$C964,[2]Feuil1!$C964)=TRUE,[1]Feuil1!$C964,\"X\")","v":0}]
[null,null,{"$f":"IF(EXACT([1]Feuil1!$C965,[2]Feuil1!$C965)=TRUE,[1]Feuil1!$C965,\"X\")","v":0}]
[null,null,{"$f":"IF(EXACT([1]Feuil1!$C966,[2]Feuil1!$C966)=TRUE,[1]Feuil1!$C966,\"X\")","v":0}]
[null,null,{"$f":"IF(EXACT([1]Feuil1!$C967,[2]Feuil1!$C967)=TRUE,[1]Feuil1!$C967,\"X\")","v":0}]
[null,null,{"$f":"IF(EXACT([1]Feuil1!$C968,[2]Feuil1!$C968)=TRUE,[1]Feuil1!$C968,\"X\")","v":0}]
[null,null,{"$f":"IF(EXACT([1]Feuil1!$C969,[2]Feuil1!$C969)=TRUE,[1]Feuil1!$C969,\"X\")","v":0}]
[null,null,{"$f":"IF(EXACT([1]Feuil1!$C970,[2]Feuil1!$C970)=TRUE,[1]Feuil1!$C970,\"X\")","v":0}]
[null,null,{"$f":"IF(EXACT([1]Feuil1!$C971,[2]Feuil1!$C971)=TRUE,[1]Feuil1!$C971,\"X\")","v":0}]
[null,null,{"$f":"IF(EXACT([1]Feuil1!$C972,[2]Feuil1!$C972)=TRUE,[1]Feuil1!$C972,\"X\")","v":0}]
[null,null,{"$f":"IF(EXACT([1]Feuil1!$C973,[2]Feuil1!$C973)=TRUE,[1]Feuil1!$C973,\"X\")","v":0}]
[null,null,{"$f":"IF(EXACT([1]Feuil1!$C974,[2]Feuil1!$C974)=TRUE,[1]Feuil1!$C974,\"X\")","v":0}]
[null,null,{"$f":"IF(EXACT([1]Feuil1!$C975,[2]Feuil1!$C975)=TRUE,[1]Feuil1!$C975,\"X\")","v":0}]
[null,null,{"$f":"IF(EXACT([1]Feuil1!$C976,[2]Feuil1!$C976)=TRUE,[1]Feuil1!$C976,\"X\")","v":0}]
[null,null,{"$f":"IF(EXACT([1]Feuil1!$C977,[2]Feuil1!$C977)=TRUE,[1]Feuil1!$C977,\"X\")","v":0}]
[null,null,{"$f":"IF(EXACT([1]Feuil1!$C978,[2]Feuil1!$C978)=TRUE,[1]Feuil1!$C978,\"X\")","v":0}]
[null,null,{"$f":"IF(EXACT([1]Feuil1!$C979,[2]Feuil1!$C979)=TRUE,[1]Feuil1!$C979,\"X\")","v":0}]
[null,null,{"$f":"IF(EXACT([1]Feuil1!$C980,[2]Feuil1!$C980)=TRUE,[1]Feuil1!$C980,\"X\")","v":0}]
[null,null,{"$f":"IF(EXACT([1]Feuil1!$C981,[2]Feuil1!$C981)=TRUE,[1]Feuil1!$C981,\"X\")","v":0}]
[null,null,{"$f":"IF(EXACT([1]Feuil1!$C982,[2]Feuil1!$C982)=TRUE,[1]Feuil1!$C982,\"X\")","v":0}]
[null,null,{"$f":"IF(EXACT([1]Feuil1!$C983,[2]Feuil1!$C983)=TRUE,[1]Feuil1!$C983,\"X\")","v":0}]
[null,null,{"$f":"IF(EXACT([1]Feuil1!$C984,[2]Feuil1!$C984)=TRUE,[1]Feuil1!$C984,\"X\")","v":0}]
[null,null,{"$f":"IF(EXACT([1]Feuil1!$C985,[2]Feuil1!$C985)=TRUE,[1]Feuil1!$C985,\"X\")","v":0}]
[null,null,{"$f":"IF(EXACT([1]Feuil1!$C986,[2]Feuil1!$C986)=TRUE,[1]Feuil1!$C986,\"X\")","v":0}]
[null,null,{"$f":"IF(EXACT([1]Feuil1!$C987,[2]Feuil1!$C987)=TRUE,[1]Feuil1!$C987,\"X\")","v":0}]
[null,null,{"$f":"IF(EXACT([1]Feuil1!$C988,[2]Feuil1!$C988)=TRUE,[1]Feuil1!$C988,\"X\")","v":0}]
[null,null,{"$f":"IF(EXACT([1]Feuil1!$C989,[2]Feuil1!$C989)=TRUE,[1]Feuil1!$C989,\"X\")","v":0}]
[null,null,{"$f":"IF(EXACT([1]Feuil1!$C990,[2]Feuil1!$C990)=TRUE,[1]Feuil1!$C990,\"X\")","v":0}]
[null,null,{"$f":"IF(EXACT([1]Feuil1!$C991,[2]Feuil1!$C991)=TRUE,[1]Feuil1!$C991,\"X\")","v":0}]
[null,null,{"$f":"IF(EXACT([1]Feuil1!$C992,[2]Feuil1!$C992)=TRUE,[1]Feuil1!$C992,\"X\")","v":0}]
[null,null,{"$f":"IF(EXACT([1]Feuil1!$C993,[2]Feuil1!$C993)=TRUE,[1]Feuil1!$C993,\"X\")","v":0}]
[null,null,{"$f":"IF(EXACT([1]Feuil1!$C994,[2]Feuil1!$C994)=TRUE,[1]Feuil1!$C994,\"X\")","v":0}]
[null,null,{"$f":"IF(EXACT([1]Feuil1!$C995,[2]Feuil1!$C995)=TRUE,[1]Feuil1!$C995,\"X\")","v":0}]
[null,null,{"$f":"IF(EXACT([1]Feuil1!$C996,[2]Feuil1!$C996)=TRUE,[1]Feuil1!$C996,\"X\")","v":0}]
[null,null,{"$f":"IF(EXACT([1]Feuil1!$C997,[2]Feuil1!$C997)=TRUE,[1]Feuil1!$C997,\"X\")","v":0}]
[null,null,{"$f":"IF(EXACT([1]Feuil1!$C998,[2]Feuil1!$C998)=TRUE,[1]Feuil1!$C998,\"X\")","v":0}]
[null,null,{"$f":"IF(EXACT([1]Feuil1!$C999,[2]Feuil1!$C999)=TRUE,[1]Feuil1!$C999,\"X\")","v":0}]
[null,null,{"$f":"IF(EXACT([1]Feuil1!$C1000,[2]Feuil1!$C1000)=TRUE,[1]Feuil1!$C1000,\"X\")","v":0}]
[null,null,{"$f":"IF(EXACT([1]Feuil1!$C1001,[2]Feuil1!$C1001)=TRUE,[1]Feuil1!$C1001,\"X\")","v":0}]
[null,null,{"$f":"IF(EXACT([1]Feuil1!$C1002,[2]Feuil1!$C1002)=TRUE,[1]Feuil1!$C1002,\"X\")","v":0}]
[null,null,{"$f":"IF(EXACT([1]Feuil1!$C1003,[2]Feuil1!$C1003)=TRUE,[1]Feuil1!$C1003,\"X\")","v":0}]
[null,null,{"$f":"IF(EXACT([1]Feuil1!$C1004,[2]Feuil1!$C1004)=TRUE,[1]Feuil1!$C1004,\"X\")","v":0}]
[null,null,{"$f":"IF(EXACT([1]Feuil1!$C1005,[2]Feuil1!$C1005)=TRUE,[1]Feuil1!$C1005,\"X\")","v":0}]
[null,null,{"$f":"IF(EXACT([1]Feuil1!$C1006,[2]Feuil1!$C1006)=TRUE,[1]Feuil1!$C1006,\"X\")","v":0}]
[null,null,{"$f":"IF(EXACT([1]Feuil1!$C1007,[2]Feuil1!$C1007)=TRUE,[1]Feuil1!$C1007,\"X\")","v":0}]
[null,null,{"$f":"IF(EXACT([1]Feuil1!$C1008,[2]Feuil1!$C1008)=TRUE,[1]Feuil1!$C1008,\"X\")","v":0}]
[null,null,{"$f":"IF(EXACT([1]Feuil1!$C1009,[2]Feuil1!$C1009)=TRUE,[1]Feuil1!$C1009,\"X\")","v":0}]
[null,null,{"$f":"IF(EXACT([1]Feuil1!$C1010,[2]Feuil1!$C1010)=TRUE,[1]Feuil1!$C1010,\"X\")","v":0}]
[null,null,{"$f":"IF(EXACT([1]Feuil1!$C1011,[2]Feuil1!$C1011)=TRUE,[1]Feuil1!$C1011,\"X\")","v":0}]
[null,null,{"$f":"IF(EXACT([1]Feuil1!$C1012,[2]Feuil1!$C1012)=TRUE,[1]Feuil1!$C1012,\"X\")","v":0}]
[null,null,{"$f":"IF(EXACT([1]Feuil1!$C1013,[2]Feuil1!$C1013)=TRUE,[1]Feuil1!$C1013,\"X\")","v":0}]
[null,null,{"$f":"IF(EXACT([1]Feuil1!$C1014,[2]Feuil1!$C1014)=TRUE,[1]Feuil1!$C1014,\"X\")","v":0}]
[null,null,{"$f":"IF(EXACT([1]Feuil1!$C1015,[2]Feuil1!$C1015)=TRUE,[1]Feuil1!$C1015,\"X\")","v":0}]
[null,null,{"$f":"IF(EXACT([1]Feuil1!$C1016,[2]Feuil1!$C1016)=TRUE,[1]Feuil1!$C1016,\"X\")","v":0}]
[null,null,{"$f":"IF(EXACT([1]Feuil1!$C1017,[2]Feuil1!$C1017)=TRUE,[1]Feuil1!$C1017,\"X\")","v":0}]
[null,null,{"$f":"IF(EXACT([1]Feuil1!$C1018,[2]Feuil1!$C1018)=TRUE,[1]Feuil1!$C1018,\"X\")","v":0}]
[null,null,{"$f":"IF(EXACT([1]Feuil1!$C1019,[2]Feuil1!$C1019)=TRUE,[1]Feuil1!$C1019,\"X\")","v":0}]
[null,null,{"$f":"IF(EXACT([1]Feuil1!$C1020,[2]Feuil1!$C1020)=TRUE,[1]Feuil1!$C1020,\"X\")","v":0}]
[null,null,{"$f":"IF(EXACT([1]Feuil1!$C1021,[2]Feuil1!$C1021)=TRUE,[1]Feuil1!$C1021,\"X\")","v":0}]
[null,null,{"$f":"IF(EXACT([1]Feuil1!$C1022,[2]Feuil1!$C1022)=TRUE,[1]Feuil1!$C1022,\"X\")","v":0}]
[null,null,{"$f":"IF(EXACT([1]Feuil1!$C1023,[2]Feuil1!$C1023)=TRUE,[1]Feuil1!$C1023,\"X\")","v":0}]
[null,null,{"$f":"IF(EXACT([1]Feuil1!$C1024,[2]Feuil1!$C1024)=TRUE,[1]Feuil1!$C1024,\"X\")","v":0}]
[null,null,{"$f":"IF(EXACT([1]Feuil1!$C1025,[2]Feuil1!$C1025)=TRUE,[1]Feuil1!$C1025,\"X\")","v":0}]
[null,null,{"$f":"IF(EXACT([1]Feuil1!$C1026,[2]Feuil1!$C1026)=TRUE,[1]Feuil1!$C1026,\"X\")","v":0}]
[null,null,{"$f":"IF(EXACT([1]Feuil1!$C1027,[2]Feuil1!$C1027)=TRUE,[1]Feuil1!$C1027,\"X\")","v":0}]
[null,null,{"$f":"IF(EXACT([1]Feuil1!$C1028,[2]Feuil1!$C1028)=TRUE,[1]Feuil1!$C1028,\"X\")","v":0}]
[null,null,{"$f":"IF(EXACT([1]Feuil1!$C1029,[2]Feuil1!$C1029)=TRUE,[1]Feuil1!$C1029,\"X\")","v":0}]
[null,null,{"$f":"IF(EXACT([1]Feuil1!$C1030,[2]Feuil1!$C1030)=TRUE,[1]Feuil1!$C1030,\"X\")","v":0}]
[null,null,{"$f":"IF(EXACT([1]Feuil1!$C1031,[2]Feuil1!$C1031)=TRUE,[1]Feuil1!$C1031,\"X\")","v":0}]
[null,null,{"$f":"IF(EXACT([1]Feuil1!$C1032,[2]Feuil1!$C1032)=TRUE,[1]Feuil1!$C1032,\"X\")","v":0}]
[null,null,{"$f":"IF(EXACT([1]Feuil1!$C1033,[2]Feuil1!$C1033)=TRUE,[1]Feuil1!$C1033,\"X\")","v":0}]
[null,null,{"$f":"IF(EXACT([1]Feuil1!$C1034,[2]Feuil1!$C1034)=TRUE,[1]Feuil1!$C1034,\"X\")","v":0}]
[null,null,{"$f":"IF(EXACT([1]Feuil1!$C1035,[2]Feuil1!$C1035)=TRUE,[1]Feuil1!$C1035,\"X\")","v":0}]
[null,null,{"$f":"IF(EXACT([1]Feuil1!$C1036,[2]Feuil1!$C1036)=TRUE,[1]Feuil1!$C1036,\"X\")","v":0}]
[null,null,{"$f":"IF(EXACT([1]Feuil1!$C1037,[2]Feuil1!$C1037)=TRUE,[1]Feuil1!$C1037,\"X\")","v":0}]
[null,null,{"$f":"IF(EXACT([1]Feuil1!$C1038,[2]Feuil1!$C1038)=TRUE,[1]Feuil1!$C1038,\"X\")","v":0}]
[null,null,{"$f":"IF(EXACT([1]Feuil1!$C1039,[2]Feuil1!$C1039)=TRUE,[1]Feuil1!$C1039,\"X\")","v":0}]
[null,null,{"$f":"IF(EXACT([1]Feuil1!$C1040,[2]Feuil1!$C1040)=TRUE,[1]Feuil1!$C1040,\"X\")","v":0}]
[null,null,{"$f":"IF(EXACT([1]Feuil1!$C1041,[2]Feuil1!$C1041)=TRUE,[1]Feuil1!$C1041,\"X\")","v":0}]
[null,null,{"$f":"IF(EXACT([1]Feuil1!$C1042,[2]Feuil1!$C1042)=TRUE,[1]Feuil1!$C1042,\"X\")","v":0}]
[null,null,{"$f":"IF(EXACT([1]Feuil1!$C1043,[2]Feuil1!$C1043)=TRUE,[1]Feuil1!$C1043,\"X\")","v":0}]
[null,null,{"$f":"IF(EXACT([1]Feuil1!$C1044,[2]Feuil1!$C1044)=TRUE,[1]Feuil1!$C1044,\"X\")","v":0}]
[null,null,{"$f":"IF(EXACT([1]Feuil1!$C1045,[2]Feuil1!$C1045)=TRUE,[1]Feuil1!$C1045,\"X\")","v":0}]
[null,null,{"$f":"IF(EXACT([1]Feuil1!$C1046,[2]Feuil1!$C1046)=TRUE,[1]Feuil1!$C1046,\"X\")","v":0}]
[null,null,{"$f":"IF(EXACT([1]Feuil1!$C1047,[2]Feuil1!$C1047)=TRUE,[1]Feuil1!$C1047,\"X\")","v":0}]
[null,null,{"$f":"IF(EXACT([1]Feuil1!$C1048,[2]Feuil1!$C1048)=TRUE,[1]Feuil1!$C1048,\"X\")","v":0}]
[null,null,{"$f":"IF(EXACT([1]Feuil1!$C1049,[2]Feuil1!$C1049)=TRUE,[1]Feuil1!$C1049,\"X\")","v":0}]
[null,null,{"$f":"IF(EXACT([1]Feuil1!$C1050,[2]Feuil1!$C1050)=TRUE,[1]Feuil1!$C1050,\"X\")","v":0}]
[null,null,{"$f":"IF(EXACT([1]Feuil1!$C1051,[2]Feuil1!$C1051)=TRUE,[1]Feuil1!$C1051,\"X\")","v":0}]
[null,null,{"$f":"IF(EXACT([1]Feuil1!$C1052,[2]Feuil1!$C1052)=TRUE,[1]Feuil1!$C1052,\"X\")","v":0}]
[null,null,{"$f":"IF(EXACT([1]Feuil1!$C1053,[2]Feuil1!$C1053)=TRUE,[1]Feuil1!$C1053,\"X\")","v":0}]
[null,null,{"$f":"IF(EXACT([1]Feuil1!$C1054,[2]Feuil1!$C1054)=TRUE,[1]Feuil1!$C1054,\"X\")","v":0}]
[null,null,{"$f":"IF(EXACT([1]Feuil1!$C1055,[2]Feuil1!$C1055)=TRUE,[1]Feuil1!$C1055,\"X\")","v":0}]
[null,null,{"$f":"IF(EXACT([1]Feuil1!$C1056,[2]Feuil1!$C1056)=TRUE,[1]Feuil1!$C1056,\"X\")","v":0}]
[null,null,{"$f":"IF(EXACT([1]Feuil1!$C1057,[2]Feuil1!$C1057)=TRUE,[1]Feuil1!$C1057,\"X\")","v":0}]
[null,null,{"$f":"IF(EXACT([1]Feuil1!$C1058,[2]Feuil1!$C1058)=TRUE,[1]Feuil1!$C1058,\"X\")","v":0}]
[null,null,{"$f":"IF(EXACT([1]Feuil1!$C1059,[2]Feuil1!$C1059)=TRUE,[1]Feuil1!$C1059,\"X\")","v":0}]
[null,null,{"$f":"IF(EXACT([1]Feuil1!$C1060,[2]Feuil1!$C1060)=TRUE,[1]Feuil1!$C1060,\"X\")","v":0}]
[null,null,{"$f":"IF(EXACT([1]Feuil1!$C1061,[2]Feuil1!$C1061)=TRUE,[1]Feuil1!$C1061,\"X\")","v":0}]
[null,null,{"$f":"IF(EXACT([1]Feuil1!$C1062,[2]Feuil1!$C1062)=TRUE,[1]Feuil1!$C1062,\"X\")","v":0}]
[null,null,{"$f":"IF(EXACT([1]Feuil1!$C1063,[2]Feuil1!$C1063)=TRUE,[1]Feuil1!$C1063,\"X\")","v":0}]
[null,null,{"$f":"IF(EXACT([1]Feuil1!$C1064,[2]Feuil1!$C1064)=TRUE,[1]Feuil1!$C1064,\"X\")","v":0}]
[null,null,{"$f":"IF(EXACT([1]Feuil1!$C1065,[2]Feuil1!$C1065)=TRUE,[1]Feuil1!$C1065,\"X\")","v":0}]
[null,null,{"$f":"IF(EXACT([1]Feuil1!$C1066,[2]Feuil1!$C1066)=TRUE,[1]Feuil1!$C1066,\"X\")","v":0}]
[null,null,{"$f":"IF(EXACT([1]Feuil1!$C1067,[2]Feuil1!$C1067)=TRUE,[1]Feuil1!$C1067,\"X\")","v":0}]
[null,null,{"$f":"IF(EXACT([1]Feuil1!$C1068,[2]Feuil1!$C1068)=TRUE,[1]Feuil1!$C1068,\"X\")","v":0}]
[null,null,{"$f":"IF(EXACT([1]Feuil1!$C1069,[2]Feuil1!$C1069)=TRUE,[1]Feuil1!$C1069,\"X\")","v":0}]
[null,null,{"$f":"IF(EXACT([1]Feuil1!$C1070,[2]Feuil1!$C1070)=TRUE,[1]Feuil1!$C1070,\"X\")","v":0}]
[null,null,{"$f":"IF(EXACT([1]Feuil1!$C1071,[2]Feuil1!$C1071)=TRUE,[1]Feuil1!$C1071,\"X\")","v":0}]
[null,null,{"$f":"IF(EXACT([1]Feuil1!$C1072,[2]Feuil1!$C1072)=TRUE,[1]Feuil1!$C1072,\"X\")","v":0}]
[null,null,{"$f":"IF(EXACT([1]Feuil1!$C1073,[2]Feuil1!$C1073)=TRUE,[1]Feuil1!$C1073,\"X\")","v":0}]
[null,null,{"$f":"IF(EXACT([1]Feuil1!$C1074,[2]Feuil1!$C1074)=TRUE,[1]Feuil1!$C1074,\"X\")","v":0}]
[null,null,{"$f":"IF(EXACT([1]Feuil1!$C1075,[2]Feuil1!$C1075)=TRUE,[1]Feuil1!$C1075,\"X\")","v":0}]
[null,null,{"$f":"IF(EXACT([1]Feuil1!$C1076,[2]Feuil1!$C1076)=TRUE,[1]Feuil1!$C1076,\"X\")","v":0}]
[null,null,{"$f":"IF(EXACT([1]Feuil1!$C1077,[2]Feuil1!$C1077)=TRUE,[1]Feuil1!$C1077,\"X\")","v":0}]
[null,null,{"$f":"IF(EXACT([1]Feuil1!$C1078,[2]Feuil1!$C1078)=TRUE,[1]Feuil1!$C1078,\"X\")","v":0}]
[null,null,{"$f":"IF(EXACT([1]Feuil1!$C1079,[2]Feuil1!$C1079)=TRUE,[1]Feuil1!$C1079,\"X\")","v":0}]
[null,null,{"$f":"IF(EXACT([1]Feuil1!$C1080,[2]Feuil1!$C1080)=TRUE,[1]Feuil1!$C1080,\"X\")","v":0}]
[null,null,{"$f":"IF(EXACT([1]Feuil1!$C1081,[2]Feuil1!$C1081)=TRUE,[1]Feuil1!$C1081,\"X\")","v":0}]
[null,null,{"$f":"IF(EXACT([1]Feuil1!$C1082,[2]Feuil1!$C1082)=TRUE,[1]Feuil1!$C1082,\"X\")","v":0}]
[null,null,{"$f":"IF(EXACT([1]Feuil1!$C1083,[2]Feuil1!$C1083)=TRUE,[1]Feuil1!$C1083,\"X\")","v":0}]
[null,null,{"$f":"IF(EXACT([1]Feuil1!$C1084,[2]Feuil1!$C1084)=TRUE,[1]Feuil1!$C1084,\"X\")","v":0}]
[null,null,{"$f":"IF(EXACT([1]Feuil1!$C1085,[2]Feuil1!$C1085)=TRUE,[1]Feuil1!$C1085,\"X\")","v":0}]
[null,null,{"$f":"IF(EXACT([1]Feuil1!$C1086,[2]Feuil1!$C1086)=TRUE,[1]Feuil1!$C1086,\"X\")","v":0}]
[null,null,{"$f":"IF(EXACT([1]Feuil1!$C1087,[2]Feuil1!$C1087)=TRUE,[1]Feuil1!$C1087,\"X\")","v":0}]
[null,null,{"$f":"IF(EXACT([1]Feuil1!$C1088,[2]Feuil1!$C1088)=TRUE,[1]Feuil1!$C1088,\"X\")","v":0}]
[null,null,{"$f":"IF(EXACT([1]Feuil1!$C1089,[2]Feuil1!$C1089)=TRUE,[1]Feuil1!$C1089,\"X\")","v":0}]
[null,null,{"$f":"IF(EXACT([1]Feuil1!$C1090,[2]Feuil1!$C1090)=TRUE,[1]Feuil1!$C1090,\"X\")","v":0}]
[null,null,{"$f":"IF(EXACT([1]Feuil1!$C1091,[2]Feuil1!$C1091)=TRUE,[1]Feuil1!$C1091,\"X\")","v":0}]
[null,null,{"$f":"IF(EXACT([1]Feuil1!$C1092,[2]Feuil1!$C1092)=TRUE,[1]Feuil1!$C1092,\"X\")","v":0}]
[null,null,{"$f":"IF(EXACT([1]Feuil1!$C1093,[2]Feuil1!$C1093)=TRUE,[1]Feuil1!$C1093,\"X\")","v":0}]
[null,null,{"$f":"IF(EXACT([1]Feuil1!$C1094,[2]Feuil1!$C1094)=TRUE,[1]Feuil1!$C1094,\"X\")","v":0}]
[null,null,{"$f":"IF(EXACT([1]Feuil1!$C1095,[2]Feuil1!$C1095)=TRUE,[1]Feuil1!$C1095,\"X\")","v":0}]
[null,null,{"$f":"IF(EXACT([1]Feuil1!$C1096,[2]Feuil1!$C1096)=TRUE,[1]Feuil1!$C1096,\"X\")","v":0}]
[null,null,{"$f":"IF(EXACT([1]Feuil1!$C1097,[2]Feuil1!$C1097)=TRUE,[1]Feuil1!$C1097,\"X\")","v":0}]
[null,null,{"$f":"IF(EXACT([1]Feuil1!$C1098,[2]Feuil1!$C1098)=TRUE,[1]Feuil1!$C1098,\"X\")","v":0}]
[null,null,{"$f":"IF(EXACT([1]Feuil1!$C1099,[2]Feuil1!$C1099)=TRUE,[1]Feuil1!$C1099,\"X\")","v":0}]
[null,null,{"$f":"IF(EXACT([1]Feuil1!$C1100,[2]Feuil1!$C1100)=TRUE,[1]Feuil1!$C1100,\"X\")","v":0}]
[null,null,{"$f":"IF(EXACT([1]Feuil1!$C1101,[2]Feuil1!$C1101)=TRUE,[1]Feuil1!$C1101,\"X\")","v":0}]
[null,null,{"$f":"IF(EXACT([1]Feuil1!$C1102,[2]Feuil1!$C1102)=TRUE,[1]Feuil1!$C1102,\"X\")","v":0}]
[null,null,{"$f":"IF(EXACT([1]Feuil1!$C1103,[2]Feuil1!$C1103)=TRUE,[1]Feuil1!$C1103,\"X\")","v":0}]
[null,null,{"$f":"IF(EXACT([1]Feuil1!$C1104,[2]Feuil1!$C1104)=TRUE,[1]Feuil1!$C1104,\"X\")","v":0}]
[null,null,{"$f":"IF(EXACT([1]Feuil1!$C1105,[2]Feuil1!$C1105)=TRUE,[1]Feuil1!$C1105,\"X\")","v":0}]
[null,null,{"$f":"IF(EXACT([1]Feuil1!$C1106,[2]Feuil1!$C1106)=TRUE,[1]Feuil1!$C1106,\"X\")","v":0}]
[null,null,{"$f":"IF(EXACT([1]Feuil1!$C1107,[2]Feuil1!$C1107)=TRUE,[1]Feuil1!$C1107,\"X\")","v":0}]
[null,null,{"$f":"IF(EXACT([1]Feuil1!$C1108,[2]Feuil1!$C1108)=TRUE,[1]Feuil1!$C1108,\"X\")","v":0}]
[null,null,{"$f":"IF(EXACT([1]Feuil1!$C1109,[2]Feuil1!$C1109)=TRUE,[1]Feuil1!$C1109,\"X\")","v":0}]
[null,null,{"$f":"IF(EXACT([1]Feuil1!$C1110,[2]Feuil1!$C1110)=TRUE,[1]Feuil1!$C1110,\"X\")","v":0}]
[null,null,{"$f":"IF(EXACT([1]Feuil1!$C1111,[2]Feuil1!$C1111)=TRUE,[1]Feuil1!$C1111,\"X\")","v":0}]
[null,null,{"$f":"IF(EXACT([1]Feuil1!$C1112,[2]Feuil1!$C1112)=TRUE,[1]Feuil1!$C1112,\"X\")","v":0}]
[null,null,{"$f":"IF(EXACT([1]Feuil1!$C1113,[2]Feuil1!$C1113)=TRUE,[1]Feuil1!$C1113,\"X\")","v":0}]
[null,null,{"$f":"IF(EXACT([1]Feuil1!$C1114,[2]Feuil1!$C1114)=TRUE,[1]Feuil1!$C1114,\"X\")","v":0}]
[null,null,{"$f":"IF(EXACT([1]Feuil1!$C1115,[2]Feuil1!$C1115)=TRUE,[1]Feuil1!$C1115,\"X\")","v":0}]
[null,null,{"$f":"IF(EXACT([1]Feuil1!$C1116,[2]Feuil1!$C1116)=TRUE,[1]Feuil1!$C1116,\"X\")","v":0}]
[null,null,{"$f":"IF(EXACT([1]Feuil1!$C1117,[2]Feuil1!$C1117)=TRUE,[1]Feuil1!$C1117,\"X\")","v":0}]
[null,null,{"$f":"IF(EXACT([1]Feuil1!$C1118,[2]Feuil1!$C1118)=TRUE,[1]Feuil1!$C1118,\"X\")","v":0}]
[null,null,{"$f":"IF(EXACT([1]Feuil1!$C1119,[2]Feuil1!$C1119)=TRUE,[1]Feuil1!$C1119,\"X\")","v":0}]
[null,null,{"$f":"IF(EXACT([1]Feuil1!$C1120,[2]Feuil1!$C1120)=TRUE,[1]Feuil1!$C1120,\"X\")","v":0}]
[null,null,{"$f":"IF(EXACT([1]Feuil1!$C1121,[2]Feuil1!$C1121)=TRUE,[1]Feuil1!$C1121,\"X\")","v":0}]
[null,null,{"$f":"IF(EXACT([1]Feuil1!$C1122,[2]Feuil1!$C1122)=TRUE,[1]Feuil1!$C1122,\"X\")","v":0}]
[null,null,{"$f":"IF(EXACT([1]Feuil1!$C1123,[2]Feuil1!$C1123)=TRUE,[1]Feuil1!$C1123,\"X\")","v":0}]
[null,null,{"$f":"IF(EXACT([1]Feuil1!$C1124,[2]Feuil1!$C1124)=TRUE,[1]Feuil1!$C1124,\"X\")","v":0}]
[null,null,{"$f":"IF(EXACT([1]Feuil1!$C1125,[2]Feuil1!$C1125)=TRUE,[1]Feuil1!$C1125,\"X\")","v":0}]
[null,null,{"$f":"IF(EXACT([1]Feuil1!$C1126,[2]Feuil1!$C1126)=TRUE,[1]Feuil1!$C1126,\"X\")","v":0}]
[null,null,{"$f":"IF(EXACT([1]Feuil1!$C1127,[2]Feuil1!$C1127)=TRUE,[1]Feuil1!$C1127,\"X\")","v":0}]
[null,null,{"$f":"IF(EXACT([1]Feuil1!$C1128,[2]Feuil1!$C1128)=TRUE,[1]Feuil1!$C1128,\"X\")","v":0}]
[null,null,{"$f":"IF(EXACT([1]Feuil1!$C1129,[2]Feuil1!$C1129)=TRUE,[1]Feuil1!$C1129,\"X\")","v":0}]
[null,null,{"$f":"IF(EXACT([1]Feuil1!$C1130,[2]Feuil1!$C1130)=TRUE,[1]Feuil1!$C1130,\"X\")","v":0}]
[null,null,{"$f":"IF(EXACT([1]Feuil1!$C1131,[2]Feuil1!$C1131)=TRUE,[1]Feuil1!$C1131,\"X\")","v":0}]
[null,null,{"$f":"IF(EXACT([1]Feuil1!$C1132,[2]Feuil1!$C1132)=TRUE,[1]Feuil1!$C1132,\"X\")","v":0}]
[null,null,{"$f":"IF(EXACT([1]Feuil1!$C1133,[2]Feuil1!$C1133)=TRUE,[1]Feuil1!$C1133,\"X\")","v":0}]
[null,null,{"$f":"IF(EXACT([1]Feuil1!$C1134,[2]Feuil1!$C1134)=TRUE,[1]Feuil1!$C1134,\"X\")","v":0}]
[null,null,{"$f":"IF(EXACT([1]Feuil1!$C1135,[2]Feuil1!$C1135)=TRUE,[1]Feuil1!$C1135,\"X\")","v":0}]
[null,null,{"$f":"IF(EXACT([1]Feuil1!$C1136,[2]Feuil1!$C1136)=TRUE,[1]Feuil1!$C1136,\"X\")","v":0}]
[null,null,{"$f":"IF(EXACT([1]Feuil1!$C1137,[2]Feuil1!$C1137)=TRUE,[1]Feuil1!$C1137,\"X\")","v":0}]
[null,null,{"$f":"IF(EXACT([1]Feuil1!$C1138,[2]Feuil1!$C1138)=TRUE,[1]Feuil1!$C1138,\"X\")","v":0}]
[null,null,{"$f":"IF(EXACT([1]Feuil1!$C1139,[2]Feuil1!$C1139)=TRUE,[1]Feuil1!$C1139,\"X\")","v":0}]
[null,null,{"$f":"IF(EXACT([1]Feuil1!$C1140,[2]Feuil1!$C1140)=TRUE,[1]Feuil1!$C1140,\"X\")","v":0}]
[null,null,{"$f":"IF(EXACT([1]Feuil1!$C1141,[2]Feuil1!$C1141)=TRUE,[1]Feuil1!$C1141,\"X\")","v":0}]
[null,null,{"$f":"IF(EXACT([1]Feuil1!$C1142,[2]Feuil1!$C1142)=TRUE,[1]Feuil1!$C1142,\"X\")","v":0}]
[null,null,{"$f":"IF(EXACT([1]Feuil1!$C1143,[2]Feuil1!$C1143)=TRUE,[1]Feuil1!$C1143,\"X\")","v":0}]
[null,null,{"$f":"IF(EXACT([1]Feuil1!$C1144,[2]Feuil1!$C1144)=TRUE,[1]Feuil1!$C1144,\"X\")","v":0}]
[null,null,{"$f":"IF(EXACT([1]Feuil1!$C1145,[2]Feuil1!$C1145)=TRUE,[1]Feuil1!$C1145,\"X\")","v":0}]
[null,null,{"$f":"IF(EXACT([1]Feuil1!$C1146,[2]Feuil1!$C1146)=TRUE,[1]Feuil1!$C1146,\"X\")","v":0}]
[null,null,{"$f":"IF(EXACT([1]Feuil1!$C1147,[2]Feuil1!$C1147)=TRUE,[1]Feuil1!$C1147,\"X\")","v":0}]
[null,null,{"$f":"IF(EXACT([1]Feuil1!$C1148,[2]Feuil1!$C1148)=TRUE,[1]Feuil1!$C1148,\"X\")","v":0}]
[null,null,{"$f":"IF(EXACT([1]Feuil1!$C1149,[2]Feuil1!$C1149)=TRUE,[1]Feuil1!$C1149,\"X\")","v":0}]
[null,null,{"$f":"IF(EXACT([1]Feuil1!$C1150,[2]Feuil1!$C1150)=TRUE,[1]Feuil1!$C1150,\"X\")","v":0}]
[null,null,{"$f":"IF(EXACT([1]Feuil1!$C1151,[2]Feuil1!$C1151)=TRUE,[1]Feuil1!$C1151,\"X\")","v":0}]
[null,null,{"$f":"IF(EXACT([1]Feuil1!$C1152,[2]Feuil1!$C1152)=TRUE,[1]Feuil1!$C1152,\"X\")","v":0}]
[null,null,{"$f":"IF(EXACT([1]Feuil1!$C1153,[2]Feuil1!$C1153)=TRUE,[1]Feuil1!$C1153,\"X\")","v":0}]
[null,null,{"$f":"IF(EXACT([1]Feuil1!$C1154,[2]Feuil1!$C1154)=TRUE,[1]Feuil1!$C1154,\"X\")","v":0}]
[null,null,{"$f":"IF(EXACT([1]Feuil1!$C1155,[2]Feuil1!$C1155)=TRUE,[1]Feuil1!$C1155,\"X\")","v":0}]
[null,null,{"$f":"IF(EXACT([1]Feuil1!$C1156,[2]Feuil1!$C1156)=TRUE,[1]Feuil1!$C1156,\"X\")","v":0}]
[null,null,{"$f":"IF(EXACT([1]Feuil1!$C1157,[2]Feuil1!$C1157)=TRUE,[1]Feuil1!$C1157,\"X\")","v":0}]
[null,null,{"$f":"IF(EXACT([1]Feuil1!$C1158,[2]Feuil1!$C1158)=TRUE,[1]Feuil1!$C1158,\"X\")","v":0}]
[null,null,{"$f":"IF(EXACT([1]Feuil1!$C1159,[2]Feuil1!$C1159)=TRUE,[1]Feuil1!$C1159,\"X\")","v":0}]
[null,null,{"$f":"IF(EXACT([1]Feuil1!$C1160,[2]Feuil1!$C1160)=TRUE,[1]Feuil1!$C1160,\"X\")","v":0}]
[null,null,{"$f":"IF(EXACT([1]Feuil1!$C1161,[2]Feuil1!$C1161)=TRUE,[1]Feuil1!$C1161,\"X\")","v":0}]
[null,null,{"$f":"IF(EXACT([1]Feuil1!$C1162,[2]Feuil1!$C1162)=TRUE,[1]Feuil1!$C1162,\"X\")","v":0}]
[null,null,{"$f":"IF(EXACT([1]Feuil1!$C1163,[2]Feuil1!$C1163)=TRUE,[1]Feuil1!$C1163,\"X\")","v":0}]
[null,null,{"$f":"IF(EXACT([1]Feuil1!$C1164,[2]Feuil1!$C1164)=TRUE,[1]Feuil1!$C1164,\"X\")","v":0}]
[null,null,{"$f":"IF(EXACT([1]Feuil1!$C1165,[2]Feuil1!$C1165)=TRUE,[1]Feuil1!$C1165,\"X\")","v":0}]
[null,null,{"$f":"IF(EXACT([1]Feuil1!$C1166,[2]Feuil1!$C1166)=TRUE,[1]Feuil1!$C1166,\"X\")","v":0}]
[null,null,{"$f":"IF(EXACT([1]Feuil1!$C1167,[2]Feuil1!$C1167)=TRUE,[1]Feuil1!$C1167,\"X\")","v":0}]
[null,null,{"$f":"IF(EXACT([1]Feuil1!$C1168,[2]Feuil1!$C1168)=TRUE,[1]Feuil1!$C1168,\"X\")","v":0}]
[null,null,{"$f":"IF(EXACT([1]Feuil1!$C1169,[2]Feuil1!$C1169)=TRUE,[1]Feuil1!$C1169,\"X\")","v":0}]
[null,null,{"$f":"IF(EXACT([1]Feuil1!$C1170,[2]Feuil1!$C1170)=TRUE,[1]Feuil1!$C1170,\"X\")","v":0}]
[null,null,{"$f":"IF(EXACT([1]Feuil1!$C1171,[2]Feuil1!$C1171)=TRUE,[1]Feuil1!$C1171,\"X\")","v":0}]
[null,null,{"$f":"IF(EXACT([1]Feuil1!$C1172,[2]Feuil1!$C1172)=TRUE,[1]Feuil1!$C1172,\"X\")","v":0}]
[null,null,{"$f":"IF(EXACT([1]Feuil1!$C1173,[2]Feuil1!$C1173)=TRUE,[1]Feuil1!$C1173,\"X\")","v":0}]
[null,null,{"$f":"IF(EXACT([1]Feuil1!$C1174,[2]Feuil1!$C1174)=TRUE,[1]Feuil1!$C1174,\"X\")","v":0}]
[null,null,{"$f":"IF(EXACT([1]Feuil1!$C1175,[2]Feuil1!$C1175)=TRUE,[1]Feuil1!$C1175,\"X\")","v":0}]
[null,null,{"$f":"IF(EXACT([1]Feuil1!$C1176,[2]Feuil1!$C1176)=TRUE,[1]Feuil1!$C1176,\"X\")","v":0}]
[null,null,{"$f":"IF(EXACT([1]Feuil1!$C1177,[2]Feuil1!$C1177)=TRUE,[1]Feuil1!$C1177,\"X\")","v":0}]
[null,null,{"$f":"IF(EXACT([1]Feuil1!$C1178,[2]Feuil1!$C1178)=TRUE,[1]Feuil1!$C1178,\"X\")","v":0}]
[null,null,{"$f":"IF(EXACT([1]Feuil1!$C1179,[2]Feuil1!$C1179)=TRUE,[1]Feuil1!$C1179,\"X\")","v":0}]
[null,null,{"$f":"IF(EXACT([1]Feuil1!$C1180,[2]Feuil1!$C1180)=TRUE,[1]Feuil1!$C1180,\"X\")","v":0}]
[null,null,{"$f":"IF(EXACT([1]Feuil1!$C1181,[2]Feuil1!$C1181)=TRUE,[1]Feuil1!$C1181,\"X\")","v":0}]
[null,null,{"$f":"IF(EXACT([1]Feuil1!$C1182,[2]Feuil1!$C1182)=TRUE,[1]Feuil1!$C1182,\"X\")","v":0}]
[null,null,{"$f":"IF(EXACT([1]Feuil1!$C1183,[2]Feuil1!$C1183)=TRUE,[1]Feuil1!$C1183,\"X\")","v":0}]
[null,null,{"$f":"IF(EXACT([1]Feuil1!$C1184,[2]Feuil1!$C1184)=TRUE,[1]Feuil1!$C1184,\"X\")","v":0}]
[null,null,{"$f":"IF(EXACT([1]Feuil1!$C1185,[2]Feuil1!$C1185)=TRUE,[1]Feuil1!$C1185,\"X\")","v":0}]
[null,null,{"$f":"IF(EXACT([1]Feuil1!$C1186,[2]Feuil1!$C1186)=TRUE,[1]Feuil1!$C1186,\"X\")","v":0}]
[null,null,{"$f":"IF(EXACT([1]Feuil1!$C1187,[2]Feuil1!$C1187)=TRUE,[1]Feuil1!$C1187,\"X\")","v":0}]
[null,null,{"$f":"IF(EXACT([1]Feuil1!$C1188,[2]Feuil1!$C1188)=TRUE,[1]Feuil1!$C1188,\"X\")","v":0}]
[null,null,{"$f":"IF(EXACT([1]Feuil1!$C1189,[2]Feuil1!$C1189)=TRUE,[1]Feuil1!$C1189,\"X\")","v":0}]
[null,null,{"$f":"IF(EXACT([1]Feuil1!$C1190,[2]Feuil1!$C1190)=TRUE,[1]Feuil1!$C1190,\"X\")","v":0}]
[null,null,{"$f":"IF(EXACT([1]Feuil1!$C1191,[2]Feuil1!$C1191)=TRUE,[1]Feuil1!$C1191,\"X\")","v":0}]
[null,null,{"$f":"IF(EXACT([1]Feuil1!$C1192,[2]Feuil1!$C1192)=TRUE,[1]Feuil1!$C1192,\"X\")","v":0}]
[null,null,{"$f":"IF(EXACT([1]Feuil1!$C1193,[2]Feuil1!$C1193)=TRUE,[1]Feuil1!$C1193,\"X\")","v":0}]
[null,null,{"$f":"IF(EXACT([1]Feuil1!$C1194,[2]Feuil1!$C1194)=TRUE,[1]Feuil1!$C1194,\"X\")","v":0}]
[null,null,{"$f":"IF(EXACT([1]Feuil1!$C1195,[2]Feuil1!$C1195)=TRUE,[1]Feuil1!$C1195,\"X\")","v":0}]
[null,null,{"$f":"IF(EXACT([1]Feuil1!$C1196,[2]Feuil1!$C1196)=TRUE,[1]Feuil1!$C1196,\"X\")","v":0}]
[null,null,{"$f":"IF(EXACT([1]Feuil1!$C1197,[2]Feuil1!$C1197)=TRUE,[1]Feuil1!$C1197,\"X\")","v":0}]
[null,null,{"$f":"IF(EXACT([1]Feuil1!$C1198,[2]Feuil1!$C1198)=TRUE,[1]Feuil1!$C1198,\"X\")","v":0}]
[null,null,{"$f":"IF(EXACT([1]Feuil1!$C1199,[2]Feuil1!$C1199)=TRUE,[1]Feuil1!$C1199,\"X\")","v":0}]
[null,null,{"$f":"IF(EXACT([1]Feuil1!$C1200,[2]Feuil1!$C1200)=TRUE,[1]Feuil1!$C1200,\"X\")","v":0}]
[null,null,{"$f":"IF(EXACT([1]Feuil1!$C1201,[2]Feuil1!$C1201)=TRUE,[1]Feuil1!$C1201,\"X\")","v":0}]
[null,null,{"$f":"IF(EXACT([1]Feuil1!$C1202,[2]Feuil1!$C1202)=TRUE,[1]Feuil1!$C1202,\"X\")","v":0}]
[null,null,{"$f":"IF(EXACT([1]Feuil1!$C1203,[2]Feuil1!$C1203)=TRUE,[1]Feuil1!$C1203,\"X\")","v":0}]
[null,null,{"$f":"IF(EXACT([1]Feuil1!$C1204,[2]Feuil1!$C1204)=TRUE,[1]Feuil1!$C1204,\"X\")","v":0}]
[null,null,{"$f":"IF(EXACT([1]Feuil1!$C1205,[2]Feuil1!$C1205)=TRUE,[1]Feuil1!$C1205,\"X\")","v":0}]
[null,null,{"$f":"IF(EXACT([1]Feuil1!$C1206,[2]Feuil1!$C1206)=TRUE,[1]Feuil1!$C1206,\"X\")","v":0}]
[null,null,{"$f":"IF(EXACT([1]Feuil1!$C1207,[2]Feuil1!$C1207)=TRUE,[1]Feuil1!$C1207,\"X\")","v":0}]
[null,null,{"$f":"IF(EXACT([1]Feuil1!$C1208,[2]Feuil1!$C1208)=TRUE,[1]Feuil1!$C1208,\"X\")","v":0}]
[null,null,{"$f":"IF(EXACT([1]Feuil1!$C1209,[2]Feuil1!$C1209)=TRUE,[1]Feuil1!$C1209,\"X\")","v":0}]
[null,null,{"$f":"IF(EXACT([1]Feuil1!$C1210,[2]Feuil1!$C1210)=TRUE,[1]Feuil1!$C1210,\"X\")","v":0}]
[null,null,{"$f":"IF(EXACT([1]Feuil1!$C1211,[2]Feuil1!$C1211)=TRUE,[1]Feuil1!$C1211,\"X\")","v":0}]
[null,null,{"$f":"IF(EXACT([1]Feuil1!$C1212,[2]Feuil1!$C1212)=TRUE,[1]Feuil1!$C1212,\"X\")","v":0}]
[null,null,{"$f":"IF(EXACT([1]Feuil1!$C1213,[2]Feuil1!$C1213)=TRUE,[1]Feuil1!$C1213,\"X\")","v":0}]
[null,null,{"$f":"IF(EXACT([1]Feuil1!$C1214,[2]Feuil1!$C1214)=TRUE,[1]Feuil1!$C1214,\"X\")","v":0}]
[null,null,{"$f":"IF(EXACT([1]Feuil1!$C1215,[2]Feuil1!$C1215)=TRUE,[1]Feuil1!$C1215,\"X\")","v":0}]
[null,null,{"$f":"IF(EXACT([1]Feuil1!$C1216,[2]Feuil1!$C1216)=TRUE,[1]Feuil1!$C1216,\"X\")","v":0}]
[null,null,{"$f":"IF(EXACT([1]Feuil1!$C1217,[2]Feuil1!$C1217)=TRUE,[1]Feuil1!$C1217,\"X\")","v":0}]
[null,null,{"$f":"IF(EXACT([1]Feuil1!$C1218,[2]Feuil1!$C1218)=TRUE,[1]Feuil1!$C1218,\"X\")","v":0}]
[null,null,{"$f":"IF(EXACT([1]Feuil1!$C1219,[2]Feuil1!$C1219)=TRUE,[1]Feuil1!$C1219,\"X\")","v":0}]
[null,null,{"$f":"IF(EXACT([1]Feuil1!$C1220,[2]Feuil1!$C1220)=TRUE,[1]Feuil1!$C1220,\"X\")","v":0}]
[null,null,{"$f":"IF(EXACT([1]Feuil1!$C1221,[2]Feuil1!$C1221)=TRUE,[1]Feuil1!$C1221,\"X\")","v":0}]
[null,null,{"$f":"IF(EXACT([1]Feuil1!$C1222,[2]Feuil1!$C1222)=TRUE,[1]Feuil1!$C1222,\"X\")","v":0}]
[null,null,{"$f":"IF(EXACT([1]Feuil1!$C1223,[2]Feuil1!$C1223)=TRUE,[1]Feuil1!$C1223,\"X\")","v":0}]
[null,null,{"$f":"IF(EXACT([1]Feuil1!$C1224,[2]Feuil1!$C1224)=TRUE,[1]Feuil1!$C1224,\"X\")","v":0}]
[null,null,{"$f":"IF(EXACT([1]Feuil1!$C1225,[2]Feuil1!$C1225)=TRUE,[1]Feuil1!$C1225,\"X\")","v":0}]
[null,null,{"$f":"IF(EXACT([1]Feuil1!$C1226,[2]Feuil1!$C1226)=TRUE,[1]Feuil1!$C1226,\"X\")","v":0}]
[null,null,{"$f":"IF(EXACT([1]Feuil1!$C1227,[2]Feuil1!$C1227)=TRUE,[1]Feuil1!$C1227,\"X\")","v":0}]
[null,null,{"$f":"IF(EXACT([1]Feuil1!$C1228,[2]Feuil1!$C1228)=TRUE,[1]Feuil1!$C1228,\"X\")","v":0}]
[null,null,{"$f":"IF(EXACT([1]Feuil1!$C1229,[2]Feuil1!$C1229)=TRUE,[1]Feuil1!$C1229,\"X\")","v":0}]
[null,null,{"$f":"IF(EXACT([1]Feuil1!$C1230,[2]Feuil1!$C1230)=TRUE,[1]Feuil1!$C1230,\"X\")","v":0}]
[null,null,{"$f":"IF(EXACT([1]Feuil1!$C1231,[2]Feuil1!$C1231)=TRUE,[1]Feuil1!$C1231,\"X\")","v":0}]
[null,null,{"$f":"IF(EXACT([1]Feuil1!$C1232,[2]Feuil1!$C1232)=TRUE,[1]Feuil1!$C1232,\"X\")","v":0}]
[null,null,{"$f":"IF(EXACT([1]Feuil1!$C1233,[2]Feuil1!$C1233)=TRUE,[1]Feuil1!$C1233,\"X\")","v":0}]
[null,null,{"$f":"IF(EXACT([1]Feuil1!$C1234,[2]Feuil1!$C1234)=TRUE,[1]Feuil1!$C1234,\"X\")","v":0}]
[null,null,{"$f":"IF(EXACT([1]Feuil1!$C1235,[2]Feuil1!$C1235)=TRUE,[1]Feuil1!$C1235,\"X\")","v":0}]
[null,null,{"$f":"IF(EXACT([1]Feuil1!$C1236,[2]Feuil1!$C1236)=TRUE,[1]Feuil1!$C1236,\"X\")","v":0}]
[null,null,{"$f":"IF(EXACT([1]Feuil1!$C1237,[2]Feuil1!$C1237)=TRUE,[1]Feuil1!$C1237,\"X\")","v":0}]
[null,null,{"$f":"IF(EXACT([1]Feuil1!$C1238,[2]Feuil1!$C1238)=TRUE,[1]Feuil1!$C1238,\"X\")","v":0}]
[null,null,{"$f":"IF(EXACT([1]Feuil1!$C1239,[2]Feuil1!$C1239)=TRUE,[1]Feuil1!$C1239,\"X\")","v":0}]
[null,null,{"$f":"IF(EXACT([1]Feuil1!$C1240,[2]Feuil1!$C1240)=TRUE,[1]Feuil1!$C1240,\"X\")","v":0}]
[null,null,{"$f":"IF(EXACT([1]Feuil1!$C1241,[2]Feuil1!$C1241)=TRUE,[1]Feuil1!$C1241,\"X\")","v":0}]
[null,null,{"$f":"IF(EXACT([1]Feuil1!$C1242,[2]Feuil1!$C1242)=TRUE,[1]Feuil1!$C1242,\"X\")","v":0}]
[null,null,{"$f":"IF(EXACT([1]Feuil1!$C1243,[2]Feuil1!$C1243)=TRUE,[1]Feuil1!$C1243,\"X\")","v":0}]
[null,null,{"$f":"IF(EXACT([1]Feuil1!$C1244,[2]Feuil1!$C1244)=TRUE,[1]Feuil1!$C1244,\"X\")","v":0}]
[null,null,{"$f":"IF(EXACT([1]Feuil1!$C1245,[2]Feuil1!$C1245)=TRUE,[1]Feuil1!$C1245,\"X\")","v":0}]
[null,null,{"$f":"IF(EXACT([1]Feuil1!$C1246,[2]Feuil1!$C1246)=TRUE,[1]Feuil1!$C1246,\"X\")","v":0}]
[null,null,{"$f":"IF(EXACT([1]Feuil1!$C1247,[2]Feuil1!$C1247)=TRUE,[1]Feuil1!$C1247,\"X\")","v":0}]
[null,null,{"$f":"IF(EXACT([1]Feuil1!$C1248,[2]Feuil1!$C1248)=TRUE,[1]Feuil1!$C1248,\"X\")","v":0}]
[null,null,{"$f":"IF(EXACT([1]Feuil1!$C1249,[2]Feuil1!$C1249)=TRUE,[1]Feuil1!$C1249,\"X\")","v":0}]
[null,null,{"$f":"IF(EXACT([1]Feuil1!$C1250,[2]Feuil1!$C1250)=TRUE,[1]Feuil1!$C1250,\"X\")","v":0}]
[null,null,{"$f":"IF(EXACT([1]Feuil1!$C1251,[2]Feuil1!$C1251)=TRUE,[1]Feuil1!$C1251,\"X\")","v":0}]
[null,null,{"$f":"IF(EXACT([1]Feuil1!$C1252,[2]Feuil1!$C1252)=TRUE,[1]Feuil1!$C1252,\"X\")","v":0}]
[null,null,{"$f":"IF(EXACT([1]Feuil1!$C1253,[2]Feuil1!$C1253)=TRUE,[1]Feuil1!$C1253,\"X\")","v":0}]
[null,null,{"$f":"IF(EXACT([1]Feuil1!$C1254,[2]Feuil1!$C1254)=TRUE,[1]Feuil1!$C1254,\"X\")","v":0}]
[null,null,{"$f":"IF(EXACT([1]Feuil1!$C1255,[2]Feuil1!$C1255)=TRUE,[1]Feuil1!$C1255,\"X\")","v":0}]
[null,null,{"$f":"IF(EXACT([1]Feuil1!$C1256,[2]Feuil1!$C1256)=TRUE,[1]Feuil1!$C1256,\"X\")","v":0}]
[null,null,{"$f":"IF(EXACT([1]Feuil1!$C1257,[2]Feuil1!$C1257)=TRUE,[1]Feuil1!$C1257,\"X\")","v":0}]
[null,null,{"$f":"IF(EXACT([1]Feuil1!$C1258,[2]Feuil1!$C1258)=TRUE,[1]Feuil1!$C1258,\"X\")","v":0}]
[null,null,{"$f":"IF(EXACT([1]Feuil1!$C1259,[2]Feuil1!$C1259)=TRUE,[1]Feuil1!$C1259,\"X\")","v":0}]
[null,null,{"$f":"IF(EXACT([1]Feuil1!$C1260,[2]Feuil1!$C1260)=TRUE,[1]Feuil1!$C1260,\"X\")","v":0}]
[null,null,{"$f":"IF(EXACT([1]Feuil1!$C1261,[2]Feuil1!$C1261)=TRUE,[1]Feuil1!$C1261,\"X\")","v":0}]
[null,null,{"$f":"IF(EXACT([1]Feuil1!$C1262,[2]Feuil1!$C1262)=TRUE,[1]Feuil1!$C1262,\"X\")","v":0}]
[null,null,{"$f":"IF(EXACT([1]Feuil1!$C1263,[2]Feuil1!$C1263)=TRUE,[1]Feuil1!$C1263,\"X\")","v":0}]
[null,null,{"$f":"IF(EXACT([1]Feuil1!$C1264,[2]Feuil1!$C1264)=TRUE,[1]Feuil1!$C1264,\"X\")","v":0}]
[null,null,{"$f":"IF(EXACT([1]Feuil1!$C1265,[2]Feuil1!$C1265)=TRUE,[1]Feuil1!$C1265,\"X\")","v":0}]
[null,null,{"$f":"IF(EXACT([1]Feuil1!$C1266,[2]Feuil1!$C1266)=TRUE,[1]Feuil1!$C1266,\"X\")","v":0}]
[null,null,{"$f":"IF(EXACT([1]Feuil1!$C1267,[2]Feuil1!$C1267)=TRUE,[1]Feuil1!$C1267,\"X\")","v":0}]
[null,null,{"$f":"IF(EXACT([1]Feuil1!$C1268,[2]Feuil1!$C1268)=TRUE,[1]Feuil1!$C1268,\"X\")","v":0}]
[null,null,{"$f":"IF(EXACT([1]Feuil1!$C1269,[2]Feuil1!$C1269)=TRUE,[1]Feuil1!$C1269,\"X\")","v":0}]
[null,null,{"$f":"IF(EXACT([1]Feuil1!$C1270,[2]Feuil1!$C1270)=TRUE,[1]Feuil1!$C1270,\"X\")","v":0}]
[null,null,{"$f":"IF(EXACT([1]Feuil1!$C1271,[2]Feuil1!$C1271)=TRUE,[1]Feuil1!$C1271,\"X\")","v":0}]
[null,null,{"$f":"IF(EXACT([1]Feuil1!$C1272,[2]Feuil1!$C1272)=TRUE,[1]Feuil1!$C1272,\"X\")","v":0}]
[null,null,{"$f":"IF(EXACT([1]Feuil1!$C1273,[2]Feuil1!$C1273)=TRUE,[1]Feuil1!$C1273,\"X\")","v":0}]
[null,null,{"$f":"IF(EXACT([1]Feuil1!$C1274,[2]Feuil1!$C1274)=TRUE,[1]Feuil1!$C1274,\"X\")","v":0}]
[null,null,{"$f":"IF(EXACT([1]Feuil1!$C1275,[2]Feuil1!$C1275)=TRUE,[1]Feuil1!$C1275,\"X\")","v":0}]
[null,null,{"$f":"IF(EXACT([1]Feuil1!$C1276,[2]Feuil1!$C1276)=TRUE,[1]Feuil1!$C1276,\"X\")","v":0}]
[null,null,{"$f":"IF(EXACT([1]Feuil1!$C1277,[2]Feuil1!$C1277)=TRUE,[1]Feuil1!$C1277,\"X\")","v":0}]
[null,null,{"$f":"IF(EXACT([1]Feuil1!$C1278,[2]Feuil1!$C1278)=TRUE,[1]Feuil1!$C1278,\"X\")","v":0}]
[null,null,{"$f":"IF(EXACT([1]Feuil1!$C1279,[2]Feuil1!$C1279)=TRUE,[1]Feuil1!$C1279,\"X\")","v":0}]
[null,null,{"$f":"IF(EXACT([1]Feuil1!$C1280,[2]Feuil1!$C1280)=TRUE,[1]Feuil1!$C1280,\"X\")","v":0}]
[null,null,{"$f":"IF(EXACT([1]Feuil1!$C1281,[2]Feuil1!$C1281)=TRUE,[1]Feuil1!$C1281,\"X\")","v":0}]
[null,null,{"$f":"IF(EXACT([1]Feuil1!$C1282,[2]Feuil1!$C1282)=TRUE,[1]Feuil1!$C1282,\"X\")","v":0}]
[null,null,{"$f":"IF(EXACT([1]Feuil1!$C1283,[2]Feuil1!$C1283)=TRUE,[1]Feuil1!$C1283,\"X\")","v":0}]
[null,null,{"$f":"IF(EXACT([1]Feuil1!$C1284,[2]Feuil1!$C1284)=TRUE,[1]Feuil1!$C1284,\"X\")","v":0}]
[null,null,{"$f":"IF(EXACT([1]Feuil1!$C1285,[2]Feuil1!$C1285)=TRUE,[1]Feuil1!$C1285,\"X\")","v":0}]
[null,null,{"$f":"IF(EXACT([1]Feuil1!$C1286,[2]Feuil1!$C1286)=TRUE,[1]Feuil1!$C1286,\"X\")","v":0}]
[null,null,{"$f":"IF(EXACT([1]Feuil1!$C1287,[2]Feuil1!$C1287)=TRUE,[1]Feuil1!$C1287,\"X\")","v":0}]
[null,null,{"$f":"IF(EXACT([1]Feuil1!$C1288,[2]Feuil1!$C1288)=TRUE,[1]Feuil1!$C1288,\"X\")","v":0}]
[null,null,{"$f":"IF(EXACT([1]Feuil1!$C1289,[2]Feuil1!$C1289)=TRUE,[1]Feuil1!$C1289,\"X\")","v":0}]
[null,null,{"$f":"IF(EXACT([1]Feuil1!$C1290,[2]Feuil1!$C1290)=TRUE,[1]Feuil1!$C1290,\"X\")","v":0}]
[null,null,{"$f":"IF(EXACT([1]Feuil1!$C1291,[2]Feuil1!$C1291)=TRUE,[1]Feuil1!$C1291,\"X\")","v":0}]
[null,null,{"$f":"IF(EXACT([1]Feuil1!$C1292,[2]Feuil1!$C1292)=TRUE,[1]Feuil1!$C1292,\"X\")","v":0}]
[null,null,{"$f":"IF(EXACT([1]Feuil1!$C1293,[2]Feuil1!$C1293)=TRUE,[1]Feuil1!$C1293,\"X\")","v":0}]
[null,null,{"$f":"IF(EXACT([1]Feuil1!$C1294,[2]Feuil1!$C1294)=TRUE,[1]Feuil1!$C1294,\"X\")","v":0}]
[null,null,{"$f":"IF(EXACT([1]Feuil1!$C1295,[2]Feuil1!$C1295)=TRUE,[1]Feuil1!$C1295,\"X\")","v":0}]
[null,null,{"$f":"IF(EXACT([1]Feuil1!$C1296,[2]Feuil1!$C1296)=TRUE,[1]Feuil1!$C1296,\"X\")","v":0}]
[null,null,{"$f":"IF(EXACT([1]Feuil1!$C1297,[2]Feuil1!$C1297)=TRUE,[1]Feuil1!$C1297,\"X\")","v":0}]
[null,null,{"$f":"IF(EXACT([1]Feuil1!$C1298,[2]Feuil1!$C1298)=TRUE,[1]Feuil1!$C1298,\"X\")","v":0}]
[null,null,{"$f":"IF(EXACT([1]Feuil1!$C1299,[2]Feuil1!$C1299)=TRUE,[1]Feuil1!$C1299,\"X\")","v":0}]
[null,null,{"$f":"IF(EXACT([1]Feuil1!$C1300,[2]Feuil1!$C1300)=TRUE,[1]Feuil1!$C1300,\"X\")","v":0}]
[null,null,{"$f":"IF(EXACT([1]Feuil1!$C1301,[2]Feuil1!$C1301)=TRUE,[1]Feuil1!$C1301,\"X\")","v":0}]
[null,null,{"$f":"IF(EXACT([1]Feuil1!$C1302,[2]Feuil1!$C1302)=TRUE,[1]Feuil1!$C1302,\"X\")","v":0}]
[null,null,{"$f":"IF(EXACT([1]Feuil1!$C1303,[2]Feuil1!$C1303)=TRUE,[1]Feuil1!$C1303,\"X\")","v":0}]
[null,null,{"$f":"IF(EXACT([1]Feuil1!$C1304,[2]Feuil1!$C1304)=TRUE,[1]Feuil1!$C1304,\"X\")","v":0}]
[null,null,{"$f":"IF(EXACT([1]Feuil1!$C1305,[2]Feuil1!$C1305)=TRUE,[1]Feuil1!$C1305,\"X\")","v":0}]
[null,null,{"$f":"IF(EXACT([1]Feuil1!$C1306,[2]Feuil1!$C1306)=TRUE,[1]Feuil1!$C1306,\"X\")","v":0}]
[null,null,{"$f":"IF(EXACT([1]Feuil1!$C1307,[2]Feuil1!$C1307)=TRUE,[1]Feuil1!$C1307,\"X\")","v":0}]
[null,null,{"$f":"IF(EXACT([1]Feuil1!$C1308,[2]Feuil1!$C1308)=TRUE,[1]Feuil1!$C1308,\"X\")","v":0}]
[null,null,{"$f":"IF(EXACT([1]Feuil1!$C1309,[2]Feuil1!$C1309)=TRUE,[1]Feuil1!$C1309,\"X\")","v":0}]
[null,null,{"$f":"IF(EXACT([1]Feuil1!$C1310,[2]Feuil1!$C1310)=TRUE,[1]Feuil1!$C1310,\"X\")","v":0}]
[null,null,{"$f":"IF(EXACT([1]Feuil1!$C1311,[2]Feuil1!$C1311)=TRUE,[1]Feuil1!$C1311,\"X\")","v":0}]
[null,null,{"$f":"IF(EXACT([1]Feuil1!$C1312,[2]Feuil1!$C1312)=TRUE,[1]Feuil1!$C1312,\"X\")","v":0}]
[null,null,{"$f":"IF(EXACT([1]Feuil1!$C1313,[2]Feuil1!$C1313)=TRUE,[1]Feuil1!$C1313,\"X\")","v":0}]
[null,null,{"$f":"IF(EXACT([1]Feuil1!$C1314,[2]Feuil1!$C1314)=TRUE,[1]Feuil1!$C1314,\"X\")","v":0}]
[null,null,{"$f":"IF(EXACT([1]Feuil1!$C1315,[2]Feuil1!$C1315)=TRUE,[1]Feuil1!$C1315,\"X\")","v":0}]
[null,null,{"$f":"IF(EXACT([1]Feuil1!$C1316,[2]Feuil1!$C1316)=TRUE,[1]Feuil1!$C1316,\"X\")","v":0}]
[null,null,{"$f":"IF(EXACT([1]Feuil1!$C1317,[2]Feuil1!$C1317)=TRUE,[1]Feuil1!$C1317,\"X\")","v":0}]
[null,null,{"$f":"IF(EXACT([1]Feuil1!$C1318,[2]Feuil1!$C1318)=TRUE,[1]Feuil1!$C1318,\"X\")","v":0}]
[null,null,{"$f":"IF(EXACT([1]Feuil1!$C1319,[2]Feuil1!$C1319)=TRUE,[1]Feuil1!$C1319,\"X\")","v":0}]
[null,null,{"$f":"IF(EXACT([1]Feuil1!$C1320,[2]Feuil1!$C1320)=TRUE,[1]Feuil1!$C1320,\"X\")","v":0}]
[null,null,{"$f":"IF(EXACT([1]Feuil1!$C1321,[2]Feuil1!$C1321)=TRUE,[1]Feuil1!$C1321,\"X\")","v":0}]
[null,null,{"$f":"IF(EXACT([1]Feuil1!$C1322,[2]Feuil1!$C1322)=TRUE,[1]Feuil1!$C1322,\"X\")","v":0}]
[null,null,{"$f":"IF(EXACT([1]Feuil1!$C1323,[2]Feuil1!$C1323)=TRUE,[1]Feuil1!$C1323,\"X\")","v":0}]
[null,null,{"$f":"IF(EXACT([1]Feuil1!$C1324,[2]Feuil1!$C1324)=TRUE,[1]Feuil1!$C1324,\"X\")","v":0}]
[null,null,{"$f":"IF(EXACT([1]Feuil1!$C1325,[2]Feuil1!$C1325)=TRUE,[1]Feuil1!$C1325,\"X\")","v":0}]
[null,null,{"$f":"IF(EXACT([1]Feuil1!$C1326,[2]Feuil1!$C1326)=TRUE,[1]Feuil1!$C1326,\"X\")","v":0}]
[null,null,{"$f":"IF(EXACT([1]Feuil1!$C1327,[2]Feuil1!$C1327)=TRUE,[1]Feuil1!$C1327,\"X\")","v":0}]
[null,null,{"$f":"IF(EXACT([1]Feuil1!$C1328,[2]Feuil1!$C1328)=TRUE,[1]Feuil1!$C1328,\"X\")","v":0}]
[null,null,{"$f":"IF(EXACT([1]Feuil1!$C1329,[2]Feuil1!$C1329)=TRUE,[1]Feuil1!$C1329,\"X\")","v":0}]
[null,null,{"$f":"IF(EXACT([1]Feuil1!$C1330,[2]Feuil1!$C1330)=TRUE,[1]Feuil1!$C1330,\"X\")","v":0}]
[null,null,{"$f":"IF(EXACT([1]Feuil1!$C1331,[2]Feuil1!$C1331)=TRUE,[1]Feuil1!$C1331,\"X\")","v":0}]
[null,null,{"$f":"IF(EXACT([1]Feuil1!$C1332,[2]Feuil1!$C1332)=TRUE,[1]Feuil1!$C1332,\"X\")","v":0}]
[null,null,{"$f":"IF(EXACT([1]Feuil1!$C1333,[2]Feuil1!$C1333)=TRUE,[1]Feuil1!$C1333,\"X\")","v":0}]
[null,null,{"$f":"IF(EXACT([1]Feuil1!$C1334,[2]Feuil1!$C1334)=TRUE,[1]Feuil1!$C1334,\"X\")","v":0}]
[null,null,{"$f":"IF(EXACT([1]Feuil1!$C1335,[2]Feuil1!$C1335)=TRUE,[1]Feuil1!$C1335,\"X\")","v":0}]
[null,null,{"$f":"IF(EXACT([1]Feuil1!$C1336,[2]Feuil1!$C1336)=TRUE,[1]Feuil1!$C1336,\"X\")","v":0}]
[null,null,{"$f":"IF(EXACT([1]Feuil1!$C1337,[2]Feuil1!$C1337)=TRUE,[1]Feuil1!$C1337,\"X\")","v":0}]
[null,null,{"$f":"IF(EXACT([1]Feuil1!$C1338,[2]Feuil1!$C1338)=TRUE,[1]Feuil1!$C1338,\"X\")","v":0}]
[null,null,{"$f":"IF(EXACT([1]Feuil1!$C1339,[2]Feuil1!$C1339)=TRUE,[1]Feuil1!$C1339,\"X\")","v":0}]
[null,null,{"$f":"IF(EXACT([1]Feuil1!$C1340,[2]Feuil1!$C1340)=TRUE,[1]Feuil1!$C1340,\"X\")","v":0}]
[null,null,{"$f":"IF(EXACT([1]Feuil1!$C1341,[2]Feuil1!$C1341)=TRUE,[1]Feuil1!$C1341,\"X\")","v":0}]
[null,null,{"$f":"IF(EXACT([1]Feuil1!$C1342,[2]Feuil1!$C1342)=TRUE,[1]Feuil1!$C1342,\"X\")","v":0}]
[null,null,{"$f":"IF(EXACT([1]Feuil1!$C1343,[2]Feuil1!$C1343)=TRUE,[1]Feuil1!$C1343,\"X\")","v":0}]
[null,null,{"$f":"IF(EXACT([1]Feuil1!$C1344,[2]Feuil1!$C1344)=TRUE,[1]Feuil1!$C1344,\"X\")","v":0}]
[null,null,{"$f":"IF(EXACT([1]Feuil1!$C1345,[2]Feuil1!$C1345)=TRUE,[1]Feuil1!$C1345,\"X\")","v":0}]
[null,null,{"$f":"IF(EXACT([1]Feuil1!$C1346,[2]Feuil1!$C1346)=TRUE,[1]Feuil1!$C1346,\"X\")","v":0}]
[null,null,{"$f":"IF(EXACT([1]Feuil1!$C1347,[2]Feuil1!$C1347)=TRUE,[1]Feuil1!$C1347,\"X\")","v":0}]
[null,null,{"$f":"IF(EXACT([1]Feuil1!$C1348,[2]Feuil1!$C1348)=TRUE,[1]Feuil1!$C1348,\"X\")","v":0}]
[null,null,{"$f":"IF(EXACT([1]Feuil1!$C1349,[2]Feuil1!$C1349)=TRUE,[1]Feuil1!$C1349,\"X\")","v":0}]
[null,null,{"$f":"IF(EXACT([1]Feuil1!$C1350,[2]Feuil1!$C1350)=TRUE,[1]Feuil1!$C1350,\"X\")","v":0}]
[null,null,{"$f":"IF(EXACT([1]Feuil1!$C1351,[2]Feuil1!$C1351)=TRUE,[1]Feuil1!$C1351,\"X\")","v":0}]
[null,null,{"$f":"IF(EXACT([1]Feuil1!$C1352,[2]Feuil1!$C1352)=TRUE,[1]Feuil1!$C1352,\"X\")","v":0}]
[null,null,{"$f":"IF(EXACT([1]Feuil1!$C1353,[2]Feuil1!$C1353)=TRUE,[1]Feuil1!$C1353,\"X\")","v":0}]
[null,null,{"$f":"IF(EXACT([1]Feuil1!$C1354,[2]Feuil1!$C1354)=TRUE,[1]Feuil1!$C1354,\"X\")","v":0}]
[null,null,{"$f":"IF(EXACT([1]Feuil1!$C1355,[2]Feuil1!$C1355)=TRUE,[1]Feuil1!$C1355,\"X\")","v":0}]
[null,null,{"$f":"IF(EXACT([1]Feuil1!$C1356,[2]Feuil1!$C1356)=TRUE,[1]Feuil1!$C1356,\"X\")","v":0}]
[null,null,{"$f":"IF(EXACT([1]Feuil1!$C1357,[2]Feuil1!$C1357)=TRUE,[1]Feuil1!$C1357,\"X\")","v":0}]
[null,null,{"$f":"IF(EXACT([1]Feuil1!$C1358,[2]Feuil1!$C1358)=TRUE,[1]Feuil1!$C1358,\"X\")","v":0}]
[null,null,{"$f":"IF(EXACT([1]Feuil1!$C1359,[2]Feuil1!$C1359)=TRUE,[1]Feuil1!$C1359,\"X\")","v":0}]
[null,null,{"$f":"IF(EXACT([1]Feuil1!$C1360,[2]Feuil1!$C1360)=TRUE,[1]Feuil1!$C1360,\"X\")","v":0}]
[null,null,{"$f":"IF(EXACT([1]Feuil1!$C1361,[2]Feuil1!$C1361)=TRUE,[1]Feuil1!$C1361,\"X\")","v":0}]
[null,null,{"$f":"IF(EXACT([1]Feuil1!$C1362,[2]Feuil1!$C1362)=TRUE,[1]Feuil1!$C1362,\"X\")","v":0}]
[null,null,{"$f":"IF(EXACT([1]Feuil1!$C1363,[2]Feuil1!$C1363)=TRUE,[1]Feuil1!$C1363,\"X\")","v":0}]
[null,null,{"$f":"IF(EXACT([1]Feuil1!$C1364,[2]Feuil1!$C1364)=TRUE,[1]Feuil1!$C1364,\"X\")","v":0}]
[null,null,{"$f":"IF(EXACT([1]Feuil1!$C1365,[2]Feuil1!$C1365)=TRUE,[1]Feuil1!$C1365,\"X\")","v":0}]
[null,null,{"$f":"IF(EXACT([1]Feuil1!$C1366,[2]Feuil1!$C1366)=TRUE,[1]Feuil1!$C1366,\"X\")","v":0}]
[null,null,{"$f":"IF(EXACT([1]Feuil1!$C1367,[2]Feuil1!$C1367)=TRUE,[1]Feuil1!$C1367,\"X\")","v":0}]
[null,null,{"$f":"IF(EXACT([1]Feuil1!$C1368,[2]Feuil1!$C1368)=TRUE,[1]Feuil1!$C1368,\"X\")","v":0}]
[null,null,{"$f":"IF(EXACT([1]Feuil1!$C1369,[2]Feuil1!$C1369)=TRUE,[1]Feuil1!$C1369,\"X\")","v":0}]
[null,null,{"$f":"IF(EXACT([1]Feuil1!$C1370,[2]Feuil1!$C1370)=TRUE,[1]Feuil1!$C1370,\"X\")","v":0}]
[null,null,{"$f":"IF(EXACT([1]Feuil1!$C1371,[2]Feuil1!$C1371)=TRUE,[1]Feuil1!$C1371,\"X\")","v":0}]
[null,null,{"$f":"IF(EXACT([1]Feuil1!$C1372,[2]Feuil1!$C1372)=TRUE,[1]Feuil1!$C1372,\"X\")","v":0}]
[null,null,{"$f":"IF(EXACT([1]Feuil1!$C1373,[2]Feuil1!$C1373)=TRUE,[1]Feuil1!$C1373,\"X\")","v":0}]
[null,null,{"$f":"IF(EXACT([1]Feuil1!$C1374,[2]Feuil1!$C1374)=TRUE,[1]Feuil1!$C1374,\"X\")","v":0}]
[null,null,{"$f":"IF(EXACT([1]Feuil1!$C1375,[2]Feuil1!$C1375)=TRUE,[1]Feuil1!$C1375,\"X\")","v":0}]
[null,null,{"$f":"IF(EXACT([1]Feuil1!$C1376,[2]Feuil1!$C1376)=TRUE,[1]Feuil1!$C1376,\"X\")","v":0}]
[null,null,{"$f":"IF(EXACT([1]Feuil1!$C1377,[2]Feuil1!$C1377)=TRUE,[1]Feuil1!$C1377,\"X\")","v":0}]
[null,null,{"$f":"IF(EXACT([1]Feuil1!$C1378,[2]Feuil1!$C1378)=TRUE,[1]Feuil1!$C1378,\"X\")","v":0}]
[null,null,{"$f":"IF(EXACT([1]Feuil1!$C1379,[2]Feuil1!$C1379)=TRUE,[1]Feuil1!$C1379,\"X\")","v":0}]
[null,null,{"$f":"IF(EXACT([1]Feuil1!$C1380,[2]Feuil1!$C1380)=TRUE,[1]Feuil1!$C1380,\"X\")","v":0}]
[null,null,{"$f":"IF(EXACT([1]Feuil1!$C1381,[2]Feuil1!$C1381)=TRUE,[1]Feuil1!$C1381,\"X\")","v":0}]
[null,null,{"$f":"IF(EXACT([1]Feuil1!$C1382,[2]Feuil1!$C1382)=TRUE,[1]Feuil1!$C1382,\"X\")","v":0}]
[null,null,{"$f":"IF(EXACT([1]Feuil1!$C1383,[2]Feuil1!$C1383)=TRUE,[1]Feuil1!$C1383,\"X\")","v":0}]
[null,null,{"$f":"IF(EXACT([1]Feuil1!$C1384,[2]Feuil1!$C1384)=TRUE,[1]Feuil1!$C1384,\"X\")","v":0}]
[null,null,{"$f":"IF(EXACT([1]Feuil1!$C1385,[2]Feuil1!$C1385)=TRUE,[1]Feuil1!$C1385,\"X\")","v":0}]
[null,null,{"$f":"IF(EXACT([1]Feuil1!$C1386,[2]Feuil1!$C1386)=TRUE,[1]Feuil1!$C1386,\"X\")","v":0}]
[null,null,{"$f":"IF(EXACT([1]Feuil1!$C1387,[2]Feuil1!$C1387)=TRUE,[1]Feuil1!$C1387,\"X\")","v":0}]
[null,null,{"$f":"IF(EXACT([1]Feuil1!$C1388,[2]Feuil1!$C1388)=TRUE,[1]Feuil1!$C1388,\"X\")","v":0}]
[null,null,{"$f":"IF(EXACT([1]Feuil1!$C1389,[2]Feuil1!$C1389)=TRUE,[1]Feuil1!$C1389,\"X\")","v":0}]
[null,null,{"$f":"IF(EXACT([1]Feuil1!$C1390,[2]Feuil1!$C1390)=TRUE,[1]Feuil1!$C1390,\"X\")","v":0}]
[null,null,{"$f":"IF(EXACT([1]Feuil1!$C1391,[2]Feuil1!$C1391)=TRUE,[1]Feuil1!$C1391,\"X\")","v":0}]
[null,null,{"$f":"IF(EXACT([1]Feuil1!$C1392,[2]Feuil1!$C1392)=TRUE,[1]Feuil1!$C1392,\"X\")","v":0}]
[null,null,{"$f":"IF(EXACT([1]Feuil1!$C1393,[2]Feuil1!$C1393)=TRUE,[1]Feuil1!$C1393,\"X\")","v":0}]
[null,null,{"$f":"IF(EXACT([1]Feuil1!$C1394,[2]Feuil1!$C1394)=TRUE,[1]Feuil1!$C1394,\"X\")","v":0}]
[null,null,{"$f":"IF(EXACT([1]Feuil1!$C1395,[2]Feuil1!$C1395)=TRUE,[1]Feuil1!$C1395,\"X\")","v":0}]
[null,null,{"$f":"IF(EXACT([1]Feuil1!$C1396,[2]Feuil1!$C1396)=TRUE,[1]Feuil1!$C1396,\"X\")","v":0}]
[null,null,{"$f":"IF(EXACT([1]Feuil1!$C1397,[2]Feuil1!$C1397)=TRUE,[1]Feuil1!$C1397,\"X\")","v":0}]
[null,null,{"$f":"IF(EXACT([1]Feuil1!$C1398,[2]Feuil1!$C1398)=TRUE,[1]Feuil1!$C1398,\"X\")","v":0}]
[null,null,{"$f":"IF(EXACT([1]Feuil1!$C1399,[2]Feuil1!$C1399)=TRUE,[1]Feuil1!$C1399,\"X\")","v":0}]
[null,null,{"$f":"IF(EXACT([1]Feuil1!$C1400,[2]Feuil1!$C1400)=TRUE,[1]Feuil1!$C1400,\"X\")","v":0}]
[null,null,{"$f":"IF(EXACT([1]Feuil1!$C1401,[2]Feuil1!$C1401)=TRUE,[1]Feuil1!$C1401,\"X\")","v":0}]
[null,null,{"$f":"IF(EXACT([1]Feuil1!$C1402,[2]Feuil1!$C1402)=TRUE,[1]Feuil1!$C1402,\"X\")","v":0}]
[null,null,{"$f":"IF(EXACT([1]Feuil1!$C1403,[2]Feuil1!$C1403)=TRUE,[1]Feuil1!$C1403,\"X\")","v":0}]
[null,null,{"$f":"IF(EXACT([1]Feuil1!$C1404,[2]Feuil1!$C1404)=TRUE,[1]Feuil1!$C1404,\"X\")","v":0}]
[null,null,{"$f":"IF(EXACT([1]Feuil1!$C1405,[2]Feuil1!$C1405)=TRUE,[1]Feuil1!$C1405,\"X\")","v":0}]
[null,null,{"$f":"IF(EXACT([1]Feuil1!$C1406,[2]Feuil1!$C1406)=TRUE,[1]Feuil1!$C1406,\"X\")","v":0}]
[null,null,{"$f":"IF(EXACT([1]Feuil1!$C1407,[2]Feuil1!$C1407)=TRUE,[1]Feuil1!$C1407,\"X\")","v":0}]
[null,null,{"$f":"IF(EXACT([1]Feuil1!$C1408,[2]Feuil1!$C1408)=TRUE,[1]Feuil1!$C1408,\"X\")","v":0}]
[null,null,{"$f":"IF(EXACT([1]Feuil1!$C1409,[2]Feuil1!$C1409)=TRUE,[1]Feuil1!$C1409,\"X\")","v":0}]
[null,null,{"$f":"IF(EXACT([1]Feuil1!$C1410,[2]Feuil1!$C1410)=TRUE,[1]Feuil1!$C1410,\"X\")","v":0}]
[null,null,{"$f":"IF(EXACT([1]Feuil1!$C1411,[2]Feuil1!$C1411)=TRUE,[1]Feuil1!$C1411,\"X\")","v":0}]
[null,null,{"$f":"IF(EXACT([1]Feuil1!$C1412,[2]Feuil1!$C1412)=TRUE,[1]Feuil1!$C1412,\"X\")","v":0}]
[null,null,{"$f":"IF(EXACT([1]Feuil1!$C1413,[2]Feuil1!$C1413)=TRUE,[1]Feuil1!$C1413,\"X\")","v":0}]
[null,null,{"$f":"IF(EXACT([1]Feuil1!$C1414,[2]Feuil1!$C1414)=TRUE,[1]Feuil1!$C1414,\"X\")","v":0}]
[null,null,{"$f":"IF(EXACT([1]Feuil1!$C1415,[2]Feuil1!$C1415)=TRUE,[1]Feuil1!$C1415,\"X\")","v":0}]
[null,null,{"$f":"IF(EXACT([1]Feuil1!$C1416,[2]Feuil1!$C1416)=TRUE,[1]Feuil1!$C1416,\"X\")","v":0}]
[null,null,{"$f":"IF(EXACT([1]Feuil1!$C1417,[2]Feuil1!$C1417)=TRUE,[1]Feuil1!$C1417,\"X\")","v":0}]
[null,null,{"$f":"IF(EXACT([1]Feuil1!$C1418,[2]Feuil1!$C1418)=TRUE,[1]Feuil1!$C1418,\"X\")","v":0}]
[null,null,{"$f":"IF(EXACT([1]Feuil1!$C1419,[2]Feuil1!$C1419)=TRUE,[1]Feuil1!$C1419,\"X\")","v":0}]
[null,null,{"$f":"IF(EXACT([1]Feuil1!$C1420,[2]Feuil1!$C1420)=TRUE,[1]Feuil1!$C1420,\"X\")","v":0}]
[null,null,{"$f":"IF(EXACT([1]Feuil1!$C1421,[2]Feuil1!$C1421)=TRUE,[1]Feuil1!$C1421,\"X\")","v":0}]
[null,null,{"$f":"IF(EXACT([1]Feuil1!$C1422,[2]Feuil1!$C1422)=TRUE,[1]Feuil1!$C1422,\"X\")","v":0}]
[null,null,{"$f":"IF(EXACT([1]Feuil1!$C1423,[2]Feuil1!$C1423)=TRUE,[1]Feuil1!$C1423,\"X\")","v":0}]
[null,null,{"$f":"IF(EXACT([1]Feuil1!$C1424,[2]Feuil1!$C1424)=TRUE,[1]Feuil1!$C1424,\"X\")","v":0}]
[null,null,{"$f":"IF(EXACT([1]Feuil1!$C1425,[2]Feuil1!$C1425)=TRUE,[1]Feuil1!$C1425,\"X\")","v":0}]
[null,null,{"$f":"IF(EXACT([1]Feuil1!$C1426,[2]Feuil1!$C1426)=TRUE,[1]Feuil1!$C1426,\"X\")","v":0}]
[null,null,{"$f":"IF(EXACT([1]Feuil1!$C1427,[2]Feuil1!$C1427)=TRUE,[1]Feuil1!$C1427,\"X\")","v":0}]
[null,null,{"$f":"IF(EXACT([1]Feuil1!$C1428,[2]Feuil1!$C1428)=TRUE,[1]Feuil1!$C1428,\"X\")","v":0}]
[null,null,{"$f":"IF(EXACT([1]Feuil1!$C1429,[2]Feuil1!$C1429)=TRUE,[1]Feuil1!$C1429,\"X\")","v":0}]
[null,null,{"$f":"IF(EXACT([1]Feuil1!$C1430,[2]Feuil1!$C1430)=TRUE,[1]Feuil1!$C1430,\"X\")","v":0}]
[null,null,{"$f":"IF(EXACT([1]Feuil1!$C1431,[2]Feuil1!$C1431)=TRUE,[1]Feuil1!$C1431,\"X\")","v":0}]
[null,null,{"$f":"IF(EXACT([1]Feuil1!$C1432,[2]Feuil1!$C1432)=TRUE,[1]Feuil1!$C1432,\"X\")","v":0}]
[null,null,{"$f":"IF(EXACT([1]Feuil1!$C1433,[2]Feuil1!$C1433)=TRUE,[1]Feuil1!$C1433,\"X\")","v":0}]
[null,null,{"$f":"IF(EXACT([1]Feuil1!$C1434,[2]Feuil1!$C1434)=TRUE,[1]Feuil1!$C1434,\"X\")","v":0}]
[null,null,{"$f":"IF(EXACT([1]Feuil1!$C1435,[2]Feuil1!$C1435)=TRUE,[1]Feuil1!$C1435,\"X\")","v":0}]
[null,null,{"$f":"IF(EXACT([1]Feuil1!$C1436,[2]Feuil1!$C1436)=TRUE,[1]Feuil1!$C1436,\"X\")","v":0}]
[null,null,{"$f":"IF(EXACT([1]Feuil1!$C1437,[2]Feuil1!$C1437)=TRUE,[1]Feuil1!$C1437,\"X\")","v":0}]
[null,null,{"$f":"IF(EXACT([1]Feuil1!$C1438,[2]Feuil1!$C1438)=TRUE,[1]Feuil1!$C1438,\"X\")","v":0}]
[null,null,{"$f":"IF(EXACT([1]Feuil1!$C1439,[2]Feuil1!$C1439)=TRUE,[1]Feuil1!$C1439,\"X\")","v":0}]
[null,null,{"$f":"IF(EXACT([1]Feuil1!$C1440,[2]Feuil1!$C1440)=TRUE,[1]Feuil1!$C1440,\"X\")","v":0}]
[null,null,{"$f":"IF(EXACT([1]Feuil1!$C1441,[2]Feuil1!$C1441)=TRUE,[1]Feuil1!$C1441,\"X\")","v":0}]
[null,null,{"$f":"IF(EXACT([1]Feuil1!$C1442,[2]Feuil1!$C1442)=TRUE,[1]Feuil1!$C1442,\"X\")","v":0}]
[null,null,{"$f":"IF(EXACT([1]Feuil1!$C1443,[2]Feuil1!$C1443)=TRUE,[1]Feuil1!$C1443,\"X\")","v":0}]
[null,null,{"$f":"IF(EXACT([1]Feuil1!$C1444,[2]Feuil1!$C1444)=TRUE,[1]Feuil1!$C1444,\"X\")","v":0}]
[null,null,{"$f":"IF(EXACT([1]Feuil1!$C1445,[2]Feuil1!$C1445)=TRUE,[1]Feuil1!$C1445,\"X\")","v":0}]
[null,null,{"$f":"IF(EXACT([1]Feuil1!$C1446,[2]Feuil1!$C1446)=TRUE,[1]Feuil1!$C1446,\"X\")","v":0}]
[null,null,{"$f":"IF(EXACT([1]Feuil1!$C1447,[2]Feuil1!$C1447)=TRUE,[1]Feuil1!$C1447,\"X\")","v":0}]
[null,null,{"$f":"IF(EXACT([1]Feuil1!$C1448,[2]Feuil1!$C1448)=TRUE,[1]Feuil1!$C1448,\"X\")","v":0}]
[null,null,{"$f":"IF(EXACT([1]Feuil1!$C1449,[2]Feuil1!$C1449)=TRUE,[1]Feuil1!$C1449,\"X\")","v":0}]
[null,null,{"$f":"IF(EXACT([1]Feuil1!$C1450,[2]Feuil1!$C1450)=TRUE,[1]Feuil1!$C1450,\"X\")","v":0}]
[null,null,{"$f":"IF(EXACT([1]Feuil1!$C1451,[2]Feuil1!$C1451)=TRUE,[1]Feuil1!$C1451,\"X\")","v":0}]
[null,null,{"$f":"IF(EXACT([1]Feuil1!$C1452,[2]Feuil1!$C1452)=TRUE,[1]Feuil1!$C1452,\"X\")","v":0}]
[null,null,{"$f":"IF(EXACT([1]Feuil1!$C1453,[2]Feuil1!$C1453)=TRUE,[1]Feuil1!$C1453,\"X\")","v":0}]
[null,null,{"$f":"IF(EXACT([1]Feuil1!$C1454,[2]Feuil1!$C1454)=TRUE,[1]Feuil1!$C1454,\"X\")","v":0}]
[null,null,{"$f":"IF(EXACT([1]Feuil1!$C1455,[2]Feuil1!$C1455)=TRUE,[1]Feuil1!$C1455,\"X\")","v":0}]
[null,null,{"$f":"IF(EXACT([1]Feuil1!$C1456,[2]Feuil1!$C1456)=TRUE,[1]Feuil1!$C1456,\"X\")","v":0}]
[null,null,{"$f":"IF(EXACT([1]Feuil1!$C1457,[2]Feuil1!$C1457)=TRUE,[1]Feuil1!$C1457,\"X\")","v":0}]
[null,null,{"$f":"IF(EXACT([1]Feuil1!$C1458,[2]Feuil1!$C1458)=TRUE,[1]Feuil1!$C1458,\"X\")","v":0}]
[null,null,{"$f":"IF(EXACT([1]Feuil1!$C1459,[2]Feuil1!$C1459)=TRUE,[1]Feuil1!$C1459,\"X\")","v":0}]
[null,null,{"$f":"IF(EXACT([1]Feuil1!$C1460,[2]Feuil1!$C1460)=TRUE,[1]Feuil1!$C1460,\"X\")","v":0}]
[null,null,{"$f":"IF(EXACT([1]Feuil1!$C1461,[2]Feuil1!$C1461)=TRUE,[1]Feuil1!$C1461,\"X\")","v":0}]
[null,null,{"$f":"IF(EXACT([1]Feuil1!$C1462,[2]Feuil1!$C1462)=TRUE,[1]Feuil1!$C1462,\"X\")","v":0}]
[null,null,{"$f":"IF(EXACT([1]Feuil1!$C1463,[2]Feuil1!$C1463)=TRUE,[1]Feuil1!$C1463,\"X\")","v":0}]
[null,null,{"$f":"IF(EXACT([1]Feuil1!$C1464,[2]Feuil1!$C1464)=TRUE,[1]Feuil1!$C1464,\"X\")","v":0}]
[null,null,{"$f":"IF(EXACT([1]Feuil1!$C1465,[2]Feuil1!$C1465)=TRUE,[1]Feuil1!$C1465,\"X\")","v":0}]
[null,null,{"$f":"IF(EXACT([1]Feuil1!$C1466,[2]Feuil1!$C1466)=TRUE,[1]Feuil1!$C1466,\"X\")","v":0}]
[null,null,{"$f":"IF(EXACT([1]Feuil1!$C1467,[2]Feuil1!$C1467)=TRUE,[1]Feuil1!$C1467,\"X\")","v":0}]
[null,null,{"$f":"IF(EXACT([1]Feuil1!$C1468,[2]Feuil1!$C1468)=TRUE,[1]Feuil1!$C1468,\"X\")","v":0}]
[null,null,{"$f":"IF(EXACT([1]Feuil1!$C1469,[2]Feuil1!$C1469)=TRUE,[1]Feuil1!$C1469,\"X\")","v":0}]
[null,null,{"$f":"IF(EXACT([1]Feuil1!$C1470,[2]Feuil1!$C1470)=TRUE,[1]Feuil1!$C1470,\"X\")","v":0}]
[null,null,{"$f":"IF(EXACT([1]Feuil1!$C1471,[2]Feuil1!$C1471)=TRUE,[1]Feuil1!$C1471,\"X\")","v":0}]
[null,null,{"$f":"IF(EXACT([1]Feuil1!$C1472,[2]Feuil1!$C1472)=TRUE,[1]Feuil1!$C1472,\"X\")","v":0}]
[null,null,{"$f":"IF(EXACT([1]Feuil1!$C1473,[2]Feuil1!$C1473)=TRUE,[1]Feuil1!$C1473,\"X\")","v":0}]
[null,null,{"$f":"IF(EXACT([1]Feuil1!$C1474,[2]Feuil1!$C1474)=TRUE,[1]Feuil1!$C1474,\"X\")","v":0}]
[null,null,{"$f":"IF(EXACT([1]Feuil1!$C1475,[2]Feuil1!$C1475)=TRUE,[1]Feuil1!$C1475,\"X\")","v":0}]
[null,null,{"$f":"IF(EXACT([1]Feuil1!$C1476,[2]Feuil1!$C1476)=TRUE,[1]Feuil1!$C1476,\"X\")","v":0}]
[null,null,{"$f":"IF(EXACT([1]Feuil1!$C1477,[2]Feuil1!$C1477)=TRUE,[1]Feuil1!$C1477,\"X\")","v":0}]
[null,null,{"$f":"IF(EXACT([1]Feuil1!$C1478,[2]Feuil1!$C1478)=TRUE,[1]Feuil1!$C1478,\"X\")","v":0}]
[null,null,{"$f":"IF(EXACT([1]Feuil1!$C1479,[2]Feuil1!$C1479)=TRUE,[1]Feuil1!$C1479,\"X\")","v":0}]
[null,null,{"$f":"IF(EXACT([1]Feuil1!$C1480,[2]Feuil1!$C1480)=TRUE,[1]Feuil1!$C1480,\"X\")","v":0}]
[null,null,{"$f":"IF(EXACT([1]Feuil1!$C1481,[2]Feuil1!$C1481)=TRUE,[1]Feuil1!$C1481,\"X\")","v":0}]
[null,null,{"$f":"IF(EXACT([1]Feuil1!$C1482,[2]Feuil1!$C1482)=TRUE,[1]Feuil1!$C1482,\"X\")","v":0}]
[null,null,{"$f":"IF(EXACT([1]Feuil1!$C1483,[2]Feuil1!$C1483)=TRUE,[1]Feuil1!$C1483,\"X\")","v":0}]
[null,null,{"$f":"IF(EXACT([1]Feuil1!$C1484,[2]Feuil1!$C1484)=TRUE,[1]Feuil1!$C1484,\"X\")","v":0}]
[null,null,{"$f":"IF(EXACT([1]Feuil1!$C1485,[2]Feuil1!$C1485)=TRUE,[1]Feuil1!$C1485,\"X\")","v":0}]
[null,null,{"$f":"IF(EXACT([1]Feuil1!$C1486,[2]Feuil1!$C1486)=TRUE,[1]Feuil1!$C1486,\"X\")","v":0}]
[null,null,{"$f":"IF(EXACT([1]Feuil1!$C1487,[2]Feuil1!$C1487)=TRUE,[1]Feuil1!$C1487,\"X\")","v":0}]
[null,null,{"$f":"IF(EXACT([1]Feuil1!$C1488,[2]Feuil1!$C1488)=TRUE,[1]Feuil1!$C1488,\"X\")","v":0}]
[null,null,{"$f":"IF(EXACT([1]Feuil1!$C1489,[2]Feuil1!$C1489)=TRUE,[1]Feuil1!$C1489,\"X\")","v":0}]
[null,null,{"$f":"IF(EXACT([1]Feuil1!$C1490,[2]Feuil1!$C1490)=TRUE,[1]Feuil1!$C1490,\"X\")","v":0}]
[null,null,{"$f":"IF(EXACT([1]Feuil1!$C1491,[2]Feuil1!$C1491)=TRUE,[1]Feuil1!$C1491,\"X\")","v":0}]
[null,null,{"$f":"IF(EXACT([1]Feuil1!$C1492,[2]Feuil1!$C1492)=TRUE,[1]Feuil1!$C1492,\"X\")","v":0}]
[null,null,{"$f":"IF(EXACT([1]Feuil1!$C1493,[2]Feuil1!$C1493)=TRUE,[1]Feuil1!$C1493,\"X\")","v":0}]
[null,null,{"$f":"IF(EXACT([1]Feuil1!$C1494,[2]Feuil1!$C1494)=TRUE,[1]Feuil1!$C1494,\"X\")","v":0}]
[null,null,{"$f":"IF(EXACT([1]Feuil1!$C1495,[2]Feuil1!$C1495)=TRUE,[1]Feuil1!$C1495,\"X\")","v":0}]
[null,null,{"$f":"IF(EXACT([1]Feuil1!$C1496,[2]Feuil1!$C1496)=TRUE,[1]Feuil1!$C1496,\"X\")","v":0}]
[null,null,{"$f":"IF(EXACT([1]Feuil1!$C1497,[2]Feuil1!$C1497)=TRUE,[1]Feuil1!$C1497,\"X\")","v":0}]
[null,null,{"$f":"IF(EXACT([1]Feuil1!$C1498,[2]Feuil1!$C1498)=TRUE,[1]Feuil1!$C1498,\"X\")","v":0}]
[null,null,{"$f":"IF(EXACT([1]Feuil1!$C1499,[2]Feuil1!$C1499)=TRUE,[1]Feuil1!$C1499,\"X\")","v":0}]
[null,null,{"$f":"IF(EXACT([1]Feuil1!$C1500,[2]Feuil1!$C1500)=TRUE,[1]Feuil1!$C1500,\"X\")","v":0}]
[null,null,{"$f":"IF(EXACT([1]Feuil1!$C1501,[2]Feuil1!$C1501)=TRUE,[1]Feuil1!$C1501,\"X\")","v":0}]
[null,null,{"$f":"IF(EXACT([1]Feuil1!$C1502,[2]Feuil1!$C1502)=TRUE,[1]Feuil1!$C1502,\"X\")","v":0}]
[null,null,{"$f":"IF(EXACT([1]Feuil1!$C1503,[2]Feuil1!$C1503)=TRUE,[1]Feuil1!$C1503,\"X\")","v":0}]
[null,null,{"$f":"IF(EXACT([1]Feuil1!$C1504,[2]Feuil1!$C1504)=TRUE,[1]Feuil1!$C1504,\"X\")","v":0}]
[null,null,{"$f":"IF(EXACT([1]Feuil1!$C1505,[2]Feuil1!$C1505)=TRUE,[1]Feuil1!$C1505,\"X\")","v":0}]
[null,null,{"$f":"IF(EXACT([1]Feuil1!$C1506,[2]Feuil1!$C1506)=TRUE,[1]Feuil1!$C1506,\"X\")","v":0}]
[null,null,{"$f":"IF(EXACT([1]Feuil1!$C1507,[2]Feuil1!$C1507)=TRUE,[1]Feuil1!$C1507,\"X\")","v":0}]
[null,null,{"$f":"IF(EXACT([1]Feuil1!$C1508,[2]Feuil1!$C1508)=TRUE,[1]Feuil1!$C1508,\"X\")","v":0}]
[null,null,{"$f":"IF(EXACT([1]Feuil1!$C1509,[2]Feuil1!$C1509)=TRUE,[1]Feuil1!$C1509,\"X\")","v":0}]
[null,null,{"$f":"IF(EXACT([1]Feuil1!$C1510,[2]Feuil1!$C1510)=TRUE,[1]Feuil1!$C1510,\"X\")","v":0}]
[null,null,{"$f":"IF(EXACT([1]Feuil1!$C1511,[2]Feuil1!$C1511)=TRUE,[1]Feuil1!$C1511,\"X\")","v":0}]
[null,null,{"$f":"IF(EXACT([1]Feuil1!$C1512,[2]Feuil1!$C1512)=TRUE,[1]Feuil1!$C1512,\"X\")","v":0}]
[null,null,{"$f":"IF(EXACT([1]Feuil1!$C1513,[2]Feuil1!$C1513)=TRUE,[1]Feuil1!$C1513,\"X\")","v":0}]
[null,null,{"$f":"IF(EXACT([1]Feuil1!$C1514,[2]Feuil1!$C1514)=TRUE,[1]Feuil1!$C1514,\"X\")","v":0}]
[null,null,{"$f":"IF(EXACT([1]Feuil1!$C1515,[2]Feuil1!$C1515)=TRUE,[1]Feuil1!$C1515,\"X\")","v":0}]
[null,null,{"$f":"IF(EXACT([1]Feuil1!$C1516,[2]Feuil1!$C1516)=TRUE,[1]Feuil1!$C1516,\"X\")","v":0}]
[null,null,{"$f":"IF(EXACT([1]Feuil1!$C1517,[2]Feuil1!$C1517)=TRUE,[1]Feuil1!$C1517,\"X\")","v":0}]
[null,null,{"$f":"IF(EXACT([1]Feuil1!$C1518,[2]Feuil1!$C1518)=TRUE,[1]Feuil1!$C1518,\"X\")","v":0}]
[null,null,{"$f":"IF(EXACT([1]Feuil1!$C1519,[2]Feuil1!$C1519)=TRUE,[1]Feuil1!$C1519,\"X\")","v":0}]
[null,null,{"$f":"IF(EXACT([1]Feuil1!$C1520,[2]Feuil1!$C1520)=TRUE,[1]Feuil1!$C1520,\"X\")","v":0}]
[null,null,{"$f":"IF(EXACT([1]Feuil1!$C1521,[2]Feuil1!$C1521)=TRUE,[1]Feuil1!$C1521,\"X\")","v":0}]
[null,null,{"$f":"IF(EXACT([1]Feuil1!$C1522,[2]Feuil1!$C1522)=TRUE,[1]Feuil1!$C1522,\"X\")","v":0}]
[null,null,{"$f":"IF(EXACT([1]Feuil1!$C1523,[2]Feuil1!$C1523)=TRUE,[1]Feuil1!$C1523,\"X\")","v":0}]
[null,null,{"$f":"IF(EXACT([1]Feuil1!$C1524,[2]Feuil1!$C1524)=TRUE,[1]Feuil1!$C1524,\"X\")","v":0}]
[null,null,{"$f":"IF(EXACT([1]Feuil1!$C1525,[2]Feuil1!$C1525)=TRUE,[1]Feuil1!$C1525,\"X\")","v":0}]
[null,null,{"$f":"IF(EXACT([1]Feuil1!$C1526,[2]Feuil1!$C1526)=TRUE,[1]Feuil1!$C1526,\"X\")","v":0}]
[null,null,{"$f":"IF(EXACT([1]Feuil1!$C1527,[2]Feuil1!$C1527)=TRUE,[1]Feuil1!$C1527,\"X\")","v":0}]
[null,null,{"$f":"IF(EXACT([1]Feuil1!$C1528,[2]Feuil1!$C1528)=TRUE,[1]Feuil1!$C1528,\"X\")","v":0}]
[null,null,{"$f":"IF(EXACT([1]Feuil1!$C1529,[2]Feuil1!$C1529)=TRUE,[1]Feuil1!$C1529,\"X\")","v":0}]
[null,null,{"$f":"IF(EXACT([1]Feuil1!$C1530,[2]Feuil1!$C1530)=TRUE,[1]Feuil1!$C1530,\"X\")","v":0}]
[null,null,{"$f":"IF(EXACT([1]Feuil1!$C1531,[2]Feuil1!$C1531)=TRUE,[1]Feuil1!$C1531,\"X\")","v":0}]
[null,null,{"$f":"IF(EXACT([1]Feuil1!$C1532,[2]Feuil1!$C1532)=TRUE,[1]Feuil1!$C1532,\"X\")","v":0}]
[null,null,{"$f":"IF(EXACT([1]Feuil1!$C1533,[2]Feuil1!$C1533)=TRUE,[1]Feuil1!$C1533,\"X\")","v":0}]
[null,null,{"$f":"IF(EXACT([1]Feuil1!$C1534,[2]Feuil1!$C1534)=TRUE,[1]Feuil1!$C1534,\"X\")","v":0}]
[null,null,{"$f":"IF(EXACT([1]Feuil1!$C1535,[2]Feuil1!$C1535)=TRUE,[1]Feuil1!$C1535,\"X\")","v":0}]
[null,null,{"$f":"IF(EXACT([1]Feuil1!$C1536,[2]Feuil1!$C1536)=TRUE,[1]Feuil1!$C1536,\"X\")","v":0}]
[null,null,{"$f":"IF(EXACT([1]Feuil1!$C1537,[2]Feuil1!$C1537)=TRUE,[1]Feuil1!$C1537,\"X\")","v":0}]
[null,null,{"$f":"IF(EXACT([1]Feuil1!$C1538,[2]Feuil1!$C1538)=TRUE,[1]Feuil1!$C1538,\"X\")","v":0}]
[null,null,{"$f":"IF(EXACT([1]Feuil1!$C1539,[2]Feuil1!$C1539)=TRUE,[1]Feuil1!$C1539,\"X\")","v":0}]
[null,null,{"$f":"IF(EXACT([1]Feuil1!$C1540,[2]Feuil1!$C1540)=TRUE,[1]Feuil1!$C1540,\"X\")","v":0}]
[null,null,{"$f":"IF(EXACT([1]Feuil1!$C1541,[2]Feuil1!$C1541)=TRUE,[1]Feuil1!$C1541,\"X\")","v":0}]
[null,null,{"$f":"IF(EXACT([1]Feuil1!$C1542,[2]Feuil1!$C1542)=TRUE,[1]Feuil1!$C1542,\"X\")","v":0}]
[null,null,{"$f":"IF(EXACT([1]Feuil1!$C1543,[2]Feuil1!$C1543)=TRUE,[1]Feuil1!$C1543,\"X\")","v":0}]
[null,null,{"$f":"IF(EXACT([1]Feuil1!$C1544,[2]Feuil1!$C1544)=TRUE,[1]Feuil1!$C1544,\"X\")","v":0}]
[null,null,{"$f":"IF(EXACT([1]Feuil1!$C1545,[2]Feuil1!$C1545)=TRUE,[1]Feuil1!$C1545,\"X\")","v":0}]
[null,null,{"$f":"IF(EXACT([1]Feuil1!$C1546,[2]Feuil1!$C1546)=TRUE,[1]Feuil1!$C1546,\"X\")","v":0}]
[null,null,{"$f":"IF(EXACT([1]Feuil1!$C1547,[2]Feuil1!$C1547)=TRUE,[1]Feuil1!$C1547,\"X\")","v":0}]
[null,null,{"$f":"IF(EXACT([1]Feuil1!$C1548,[2]Feuil1!$C1548)=TRUE,[1]Feuil1!$C1548,\"X\")","v":0}]
[null,null,{"$f":"IF(EXACT([1]Feuil1!$C1549,[2]Feuil1!$C1549)=TRUE,[1]Feuil1!$C1549,\"X\")","v":0}]
[null,null,{"$f":"IF(EXACT([1]Feuil1!$C1550,[2]Feuil1!$C1550)=TRUE,[1]Feuil1!$C1550,\"X\")","v":0}]
[null,null,{"$f":"IF(EXACT([1]Feuil1!$C1551,[2]Feuil1!$C1551)=TRUE,[1]Feuil1!$C1551,\"X\")","v":0}]
[null,null,{"$f":"IF(EXACT([1]Feuil1!$C1552,[2]Feuil1!$C1552)=TRUE,[1]Feuil1!$C1552,\"X\")","v":0}]
[null,null,{"$f":"IF(EXACT([1]Feuil1!$C1553,[2]Feuil1!$C1553)=TRUE,[1]Feuil1!$C1553,\"X\")","v":0}]
[null,null,{"$f":"IF(EXACT([1]Feuil1!$C1554,[2]Feuil1!$C1554)=TRUE,[1]Feuil1!$C1554,\"X\")","v":0}]
[null,null,{"$f":"IF(EXACT([1]Feuil1!$C1555,[2]Feuil1!$C1555)=TRUE,[1]Feuil1!$C1555,\"X\")","v":0}]
[null,null,{"$f":"IF(EXACT([1]Feuil1!$C1556,[2]Feuil1!$C1556)=TRUE,[1]Feuil1!$C1556,\"X\")","v":0}]
[null,null,{"$f":"IF(EXACT([1]Feuil1!$C1557,[2]Feuil1!$C1557)=TRUE,[1]Feuil1!$C1557,\"X\")","v":0}]
[null,null,{"$f":"IF(EXACT([1]Feuil1!$C1558,[2]Feuil1!$C1558)=TRUE,[1]Feuil1!$C1558,\"X\")","v":0}]
[null,null,{"$f":"IF(EXACT([1]Feuil1!$C1559,[2]Feuil1!$C1559)=TRUE,[1]Feuil1!$C1559,\"X\")","v":0}]
[null,null,{"$f":"IF(EXACT([1]Feuil1!$C1560,[2]Feuil1!$C1560)=TRUE,[1]Feuil1!$C1560,\"X\")","v":0}]
[null,null,{"$f":"IF(EXACT([1]Feuil1!$C1561,[2]Feuil1!$C1561)=TRUE,[1]Feuil1!$C1561,\"X\")","v":0}]
[null,null,{"$f":"IF(EXACT([1]Feuil1!$C1562,[2]Feuil1!$C1562)=TRUE,[1]Feuil1!$C1562,\"X\")","v":0}]
[null,null,{"$f":"IF(EXACT([1]Feuil1!$C1563,[2]Feuil1!$C1563)=TRUE,[1]Feuil1!$C1563,\"X\")","v":0}]
[null,null,{"$f":"IF(EXACT([1]Feuil1!$C1564,[2]Feuil1!$C1564)=TRUE,[1]Feuil1!$C1564,\"X\")","v":0}]
[null,null,{"$f":"IF(EXACT([1]Feuil1!$C1565,[2]Feuil1!$C1565)=TRUE,[1]Feuil1!$C1565,\"X\")","v":0}]
[null,null,{"$f":"IF(EXACT([1]Feuil1!$C1566,[2]Feuil1!$C1566)=TRUE,[1]Feuil1!$C1566,\"X\")","v":0}]
[null,null,{"$f":"IF(EXACT([1]Feuil1!$C1567,[2]Feuil1!$C1567)=TRUE,[1]Feuil1!$C1567,\"X\")","v":0}]
[null,null,{"$f":"IF(EXACT([1]Feuil1!$C1568,[2]Feuil1!$C1568)=TRUE,[1]Feuil1!$C1568,\"X\")","v":0}]
[null,null,{"$f":"IF(EXACT([1]Feuil1!$C1569,[2]Feuil1!$C1569)=TRUE,[1]Feuil1!$C1569,\"X\")","v":0}]
[null,null,{"$f":"IF(EXACT([1]Feuil1!$C1570,[2]Feuil1!$C1570)=TRUE,[1]Feuil1!$C1570,\"X\")","v":0}]
[null,null,{"$f":"IF(EXACT([1]Feuil1!$C1571,[2]Feuil1!$C1571)=TRUE,[1]Feuil1!$C1571,\"X\")","v":0}]
[null,null,{"$f":"IF(EXACT([1]Feuil1!$C1572,[2]Feuil1!$C1572)=TRUE,[1]Feuil1!$C1572,\"X\")","v":0}]
[null,null,{"$f":"IF(EXACT([1]Feuil1!$C1573,[2]Feuil1!$C1573)=TRUE,[1]Feuil1!$C1573,\"X\")","v":0}]
[null,null,{"$f":"IF(EXACT([1]Feuil1!$C1574,[2]Feuil1!$C1574)=TRUE,[1]Feuil1!$C1574,\"X\")","v":0}]
[null,null,{"$f":"IF(EXACT([1]Feuil1!$C1575,[2]Feuil1!$C1575)=TRUE,[1]Feuil1!$C1575,\"X\")","v":0}]
[null,null,{"$f":"IF(EXACT([1]Feuil1!$C1576,[2]Feuil1!$C1576)=TRUE,[1]Feuil1!$C1576,\"X\")","v":0}]
[null,null,{"$f":"IF(EXACT([1]Feuil1!$C1577,[2]Feuil1!$C1577)=TRUE,[1]Feuil1!$C1577,\"X\")","v":0}]
[null,null,{"$f":"IF(EXACT([1]Feuil1!$C1578,[2]Feuil1!$C1578)=TRUE,[1]Feuil1!$C1578,\"X\")","v":0}]
[null,null,{"$f":"IF(EXACT([1]Feuil1!$C1579,[2]Feuil1!$C1579)=TRUE,[1]Feuil1!$C1579,\"X\")","v":0}]
[null,null,{"$f":"IF(EXACT([1]Feuil1!$C1580,[2]Feuil1!$C1580)=TRUE,[1]Feuil1!$C1580,\"X\")","v":0}]
[null,null,{"$f":"IF(EXACT([1]Feuil1!$C1581,[2]Feuil1!$C1581)=TRUE,[1]Feuil1!$C1581,\"X\")","v":0}]
[null,null,{"$f":"IF(EXACT([1]Feuil1!$C1582,[2]Feuil1!$C1582)=TRUE,[1]Feuil1!$C1582,\"X\")","v":0}]
[null,null,{"$f":"IF(EXACT([1]Feuil1!$C1583,[2]Feuil1!$C1583)=TRUE,[1]Feuil1!$C1583,\"X\")","v":0}]
[null,null,{"$f":"IF(EXACT([1]Feuil1!$C1584,[2]Feuil1!$C1584)=TRUE,[1]Feuil1!$C1584,\"X\")","v":0}]
[null,null,{"$f":"IF(EXACT([1]Feuil1!$C1585,[2]Feuil1!$C1585)=TRUE,[1]Feuil1!$C1585,\"X\")","v":0}]
[null,null,{"$f":"IF(EXACT([1]Feuil1!$C1586,[2]Feuil1!$C1586)=TRUE,[1]Feuil1!$C1586,\"X\")","v":0}]
[null,null,{"$f":"IF(EXACT([1]Feuil1!$C1587,[2]Feuil1!$C1587)=TRUE,[1]Feuil1!$C1587,\"X\")","v":0}]
[null,null,{"$f":"IF(EXACT([1]Feuil1!$C1588,[2]Feuil1!$C1588)=TRUE,[1]Feuil1!$C1588,\"X\")","v":0}]
[null,null,{"$f":"IF(EXACT([1]Feuil1!$C1589,[2]Feuil1!$C1589)=TRUE,[1]Feuil1!$C1589,\"X\")","v":0}]
[null,null,{"$f":"IF(EXACT([1]Feuil1!$C1590,[2]Feuil1!$C1590)=TRUE,[1]Feuil1!$C1590,\"X\")","v":0}]
[null,null,{"$f":"IF(EXACT([1]Feuil1!$C1591,[2]Feuil1!$C1591)=TRUE,[1]Feuil1!$C1591,\"X\")","v":0}]
[null,null,{"$f":"IF(EXACT([1]Feuil1!$C1592,[2]Feuil1!$C1592)=TRUE,[1]Feuil1!$C1592,\"X\")","v":0}]
[null,null,{"$f":"IF(EXACT([1]Feuil1!$C1593,[2]Feuil1!$C1593)=TRUE,[1]Feuil1!$C1593,\"X\")","v":0}]
[null,null,{"$f":"IF(EXACT([1]Feuil1!$C1594,[2]Feuil1!$C1594)=TRUE,[1]Feuil1!$C1594,\"X\")","v":0}]
[null,null,{"$f":"IF(EXACT([1]Feuil1!$C1595,[2]Feuil1!$C1595)=TRUE,[1]Feuil1!$C1595,\"X\")","v":0}]
[null,null,{"$f":"IF(EXACT([1]Feuil1!$C1596,[2]Feuil1!$C1596)=TRUE,[1]Feuil1!$C1596,\"X\")","v":0}]
[null,null,{"$f":"IF(EXACT([1]Feuil1!$C1597,[2]Feuil1!$C1597)=TRUE,[1]Feuil1!$C1597,\"X\")","v":0}]
[null,null,{"$f":"IF(EXACT([1]Feuil1!$C1598,[2]Feuil1!$C1598)=TRUE,[1]Feuil1!$C1598,\"X\")","v":0}]
[null,null,{"$f":"IF(EXACT([1]Feuil1!$C1599,[2]Feuil1!$C1599)=TRUE,[1]Feuil1!$C1599,\"X\")","v":0}]
[null,null,{"$f":"IF(EXACT([1]Feuil1!$C1600,[2]Feuil1!$C1600)=TRUE,[1]Feuil1!$C1600,\"X\")","v":0}]
[null,null,{"$f":"IF(EXACT([1]Feuil1!$C1601,[2]Feuil1!$C1601)=TRUE,[1]Feuil1!$C1601,\"X\")","v":0}]
[null,null,{"$f":"IF(EXACT([1]Feuil1!$C1602,[2]Feuil1!$C1602)=TRUE,[1]Feuil1!$C1602,\"X\")","v":0}]
[null,null,{"$f":"IF(EXACT([1]Feuil1!$C1603,[2]Feuil1!$C1603)=TRUE,[1]Feuil1!$C1603,\"X\")","v":0}]
[null,null,{"$f":"IF(EXACT([1]Feuil1!$C1604,[2]Feuil1!$C1604)=TRUE,[1]Feuil1!$C1604,\"X\")","v":0}]
[null,null,{"$f":"IF(EXACT([1]Feuil1!$C1605,[2]Feuil1!$C1605)=TRUE,[1]Feuil1!$C1605,\"X\")","v":0}]
[null,null,{"$f":"IF(EXACT([1]Feuil1!$C1606,[2]Feuil1!$C1606)=TRUE,[1]Feuil1!$C1606,\"X\")","v":0}]
[null,null,{"$f":"IF(EXACT([1]Feuil1!$C1607,[2]Feuil1!$C1607)=TRUE,[1]Feuil1!$C1607,\"X\")","v":0}]
[null,null,{"$f":"IF(EXACT([1]Feuil1!$C1608,[2]Feuil1!$C1608)=TRUE,[1]Feuil1!$C1608,\"X\")","v":0}]
[null,null,{"$f":"IF(EXACT([1]Feuil1!$C1609,[2]Feuil1!$C1609)=TRUE,[1]Feuil1!$C1609,\"X\")","v":0}]
[null,null,{"$f":"IF(EXACT([1]Feuil1!$C1610,[2]Feuil1!$C1610)=TRUE,[1]Feuil1!$C1610,\"X\")","v":0}]
[null,null,{"$f":"IF(EXACT([1]Feuil1!$C1611,[2]Feuil1!$C1611)=TRUE,[1]Feuil1!$C1611,\"X\")","v":0}]
[null,null,{"$f":"IF(EXACT([1]Feuil1!$C1612,[2]Feuil1!$C1612)=TRUE,[1]Feuil1!$C1612,\"X\")","v":0}]
[null,null,{"$f":"IF(EXACT([1]Feuil1!$C1613,[2]Feuil1!$C1613)=TRUE,[1]Feuil1!$C1613,\"X\")","v":0}]
[null,null,{"$f":"IF(EXACT([1]Feuil1!$C1614,[2]Feuil1!$C1614)=TRUE,[1]Feuil1!$C1614,\"X\")","v":0}]
[null,null,{"$f":"IF(EXACT([1]Feuil1!$C1615,[2]Feuil1!$C1615)=TRUE,[1]Feuil1!$C1615,\"X\")","v":0}]
[null,null,{"$f":"IF(EXACT([1]Feuil1!$C1616,[2]Feuil1!$C1616)=TRUE,[1]Feuil1!$C1616,\"X\")","v":0}]
[null,null,{"$f":"IF(EXACT([1]Feuil1!$C1617,[2]Feuil1!$C1617)=TRUE,[1]Feuil1!$C1617,\"X\")","v":0}]
[null,null,{"$f":"IF(EXACT([1]Feuil1!$C1618,[2]Feuil1!$C1618)=TRUE,[1]Feuil1!$C1618,\"X\")","v":0}]
[null,null,{"$f":"IF(EXACT([1]Feuil1!$C1619,[2]Feuil1!$C1619)=TRUE,[1]Feuil1!$C1619,\"X\")","v":0}]
[null,null,{"$f":"IF(EXACT([1]Feuil1!$C1620,[2]Feuil1!$C1620)=TRUE,[1]Feuil1!$C1620,\"X\")","v":0}]
[null,null,{"$f":"IF(EXACT([1]Feuil1!$C1621,[2]Feuil1!$C1621)=TRUE,[1]Feuil1!$C1621,\"X\")","v":0}]
[null,null,{"$f":"IF(EXACT([1]Feuil1!$C1622,[2]Feuil1!$C1622)=TRUE,[1]Feuil1!$C1622,\"X\")","v":0}]
[null,null,{"$f":"IF(EXACT([1]Feuil1!$C1623,[2]Feuil1!$C1623)=TRUE,[1]Feuil1!$C1623,\"X\")","v":0}]
[null,null,{"$f":"IF(EXACT([1]Feuil1!$C1624,[2]Feuil1!$C1624)=TRUE,[1]Feuil1!$C1624,\"X\")","v":0}]
[null,null,{"$f":"IF(EXACT([1]Feuil1!$C1625,[2]Feuil1!$C1625)=TRUE,[1]Feuil1!$C1625,\"X\")","v":0}]
[null,null,{"$f":"IF(EXACT([1]Feuil1!$C1626,[2]Feuil1!$C1626)=TRUE,[1]Feuil1!$C1626,\"X\")","v":0}]
[null,null,{"$f":"IF(EXACT([1]Feuil1!$C1627,[2]Feuil1!$C1627)=TRUE,[1]Feuil1!$C1627,\"X\")","v":0}]
[null,null,{"$f":"IF(EXACT([1]Feuil1!$C1628,[2]Feuil1!$C1628)=TRUE,[1]Feuil1!$C1628,\"X\")","v":0}]
[null,null,{"$f":"IF(EXACT([1]Feuil1!$C1629,[2]Feuil1!$C1629)=TRUE,[1]Feuil1!$C1629,\"X\")","v":0}]
[null,null,{"$f":"IF(EXACT([1]Feuil1!$C1630,[2]Feuil1!$C1630)=TRUE,[1]Feuil1!$C1630,\"X\")","v":0}]
[null,null,{"$f":"IF(EXACT([1]Feuil1!$C1631,[2]Feuil1!$C1631)=TRUE,[1]Feuil1!$C1631,\"X\")","v":0}]
[null,null,{"$f":"IF(EXACT([1]Feuil1!$C1632,[2]Feuil1!$C1632)=TRUE,[1]Feuil1!$C1632,\"X\")","v":0}]
[null,null,{"$f":"IF(EXACT([1]Feuil1!$C1633,[2]Feuil1!$C1633)=TRUE,[1]Feuil1!$C1633,\"X\")","v":0}]
[null,null,{"$f":"IF(EXACT([1]Feuil1!$C1634,[2]Feuil1!$C1634)=TRUE,[1]Feuil1!$C1634,\"X\")","v":0}]
[null,null,{"$f":"IF(EXACT([1]Feuil1!$C1635,[2]Feuil1!$C1635)=TRUE,[1]Feuil1!$C1635,\"X\")","v":0}]
[null,null,{"$f":"IF(EXACT([1]Feuil1!$C1636,[2]Feuil1!$C1636)=TRUE,[1]Feuil1!$C1636,\"X\")","v":0}]
[null,null,{"$f":"IF(EXACT([1]Feuil1!$C1637,[2]Feuil1!$C1637)=TRUE,[1]Feuil1!$C1637,\"X\")","v":0}]
[null,null,{"$f":"IF(EXACT([1]Feuil1!$C1638,[2]Feuil1!$C1638)=TRUE,[1]Feuil1!$C1638,\"X\")","v":0}]
[null,null,{"$f":"IF(EXACT([1]Feuil1!$C1639,[2]Feuil1!$C1639)=TRUE,[1]Feuil1!$C1639,\"X\")","v":0}]
[null,null,{"$f":"IF(EXACT([1]Feuil1!$C1640,[2]Feuil1!$C1640)=TRUE,[1]Feuil1!$C1640,\"X\")","v":0}]
[null,null,{"$f":"IF(EXACT([1]Feuil1!$C1641,[2]Feuil1!$C1641)=TRUE,[1]Feuil1!$C1641,\"X\")","v":0}]
[null,null,{"$f":"IF(EXACT([1]Feuil1!$C1642,[2]Feuil1!$C1642)=TRUE,[1]Feuil1!$C1642,\"X\")","v":0}]
[null,null,{"$f":"IF(EXACT([1]Feuil1!$C1643,[2]Feuil1!$C1643)=TRUE,[1]Feuil1!$C1643,\"X\")","v":0}]
[null,null,{"$f":"IF(EXACT([1]Feuil1!$C1644,[2]Feuil1!$C1644)=TRUE,[1]Feuil1!$C1644,\"X\")","v":0}]
[null,null,{"$f":"IF(EXACT([1]Feuil1!$C1645,[2]Feuil1!$C1645)=TRUE,[1]Feuil1!$C1645,\"X\")","v":0}]
[null,null,{"$f":"IF(EXACT([1]Feuil1!$C1646,[2]Feuil1!$C1646)=TRUE,[1]Feuil1!$C1646,\"X\")","v":0}]
[null,null,{"$f":"IF(EXACT([1]Feuil1!$C1647,[2]Feuil1!$C1647)=TRUE,[1]Feuil1!$C1647,\"X\")","v":0}]
[null,null,{"$f":"IF(EXACT([1]Feuil1!$C1648,[2]Feuil1!$C1648)=TRUE,[1]Feuil1!$C1648,\"X\")","v":0}]
[null,null,{"$f":"IF(EXACT([1]Feuil1!$C1649,[2]Feuil1!$C1649)=TRUE,[1]Feuil1!$C1649,\"X\")","v":0}]
[null,null,{"$f":"IF(EXACT([1]Feuil1!$C1650,[2]Feuil1!$C1650)=TRUE,[1]Feuil1!$C1650,\"X\")","v":0}]
[null,null,{"$f":"IF(EXACT([1]Feuil1!$C1651,[2]Feuil1!$C1651)=TRUE,[1]Feuil1!$C1651,\"X\")","v":0}]
[null,null,{"$f":"IF(EXACT([1]Feuil1!$C1652,[2]Feuil1!$C1652)=TRUE,[1]Feuil1!$C1652,\"X\")","v":0}]
[null,null,{"$f":"IF(EXACT([1]Feuil1!$C1653,[2]Feuil1!$C1653)=TRUE,[1]Feuil1!$C1653,\"X\")","v":0}]
[null,null,{"$f":"IF(EXACT([1]Feuil1!$C1654,[2]Feuil1!$C1654)=TRUE,[1]Feuil1!$C1654,\"X\")","v":0}]
[null,null,{"$f":"IF(EXACT([1]Feuil1!$C1655,[2]Feuil1!$C1655)=TRUE,[1]Feuil1!$C1655,\"X\")","v":0}]
[null,null,{"$f":"IF(EXACT([1]Feuil1!$C1656,[2]Feuil1!$C1656)=TRUE,[1]Feuil1!$C1656,\"X\")","v":0}]
[null,null,{"$f":"IF(EXACT([1]Feuil1!$C1657,[2]Feuil1!$C1657)=TRUE,[1]Feuil1!$C1657,\"X\")","v":0}]
[null,null,{"$f":"IF(EXACT([1]Feuil1!$C1658,[2]Feuil1!$C1658)=TRUE,[1]Feuil1!$C1658,\"X\")","v":0}]
[null,null,{"$f":"IF(EXACT([1]Feuil1!$C1659,[2]Feuil1!$C1659)=TRUE,[1]Feuil1!$C1659,\"X\")","v":0}]
[null,null,{"$f":"IF(EXACT([1]Feuil1!$C1660,[2]Feuil1!$C1660)=TRUE,[1]Feuil1!$C1660,\"X\")","v":0}]
[null,null,{"$f":"IF(EXACT([1]Feuil1!$C1661,[2]Feuil1!$C1661)=TRUE,[1]Feuil1!$C1661,\"X\")","v":0}]
[null,null,{"$f":"IF(EXACT([1]Feuil1!$C1662,[2]Feuil1!$C1662)=TRUE,[1]Feuil1!$C1662,\"X\")","v":0}]
[null,null,{"$f":"IF(EXACT([1]Feuil1!$C1663,[2]Feuil1!$C1663)=TRUE,[1]Feuil1!$C1663,\"X\")","v":0}]
[null,null,{"$f":"IF(EXACT([1]Feuil1!$C1664,[2]Feuil1!$C1664)=TRUE,[1]Feuil1!$C1664,\"X\")","v":0}]
[null,null,{"$f":"IF(EXACT([1]Feuil1!$C1665,[2]Feuil1!$C1665)=TRUE,[1]Feuil1!$C1665,\"X\")","v":0}]
[null,null,{"$f":"IF(EXACT([1]Feuil1!$C1666,[2]Feuil1!$C1666)=TRUE,[1]Feuil1!$C1666,\"X\")","v":0}]
[null,null,{"$f":"IF(EXACT([1]Feuil1!$C1667,[2]Feuil1!$C1667)=TRUE,[1]Feuil1!$C1667,\"X\")","v":0}]
[null,null,{"$f":"IF(EXACT([1]Feuil1!$C1668,[2]Feuil1!$C1668)=TRUE,[1]Feuil1!$C1668,\"X\")","v":0}]
[null,null,{"$f":"IF(EXACT([1]Feuil1!$C1669,[2]Feuil1!$C1669)=TRUE,[1]Feuil1!$C1669,\"X\")","v":0}]
[null,null,{"$f":"IF(EXACT([1]Feuil1!$C1670,[2]Feuil1!$C1670)=TRUE,[1]Feuil1!$C1670,\"X\")","v":0}]
[null,null,{"$f":"IF(EXACT([1]Feuil1!$C1671,[2]Feuil1!$C1671)=TRUE,[1]Feuil1!$C1671,\"X\")","v":0}]
[null,null,{"$f":"IF(EXACT([1]Feuil1!$C1672,[2]Feuil1!$C1672)=TRUE,[1]Feuil1!$C1672,\"X\")","v":0}]
[null,null,{"$f":"IF(EXACT([1]Feuil1!$C1673,[2]Feuil1!$C1673)=TRUE,[1]Feuil1!$C1673,\"X\")","v":0}]
[null,null,{"$f":"IF(EXACT([1]Feuil1!$C1674,[2]Feuil1!$C1674)=TRUE,[1]Feuil1!$C1674,\"X\")","v":0}]
[null,null,{"$f":"IF(EXACT([1]Feuil1!$C1675,[2]Feuil1!$C1675)=TRUE,[1]Feuil1!$C1675,\"X\")","v":0}]
[null,null,{"$f":"IF(EXACT([1]Feuil1!$C1676,[2]Feuil1!$C1676)=TRUE,[1]Feuil1!$C1676,\"X\")","v":0}]
[null,null,{"$f":"IF(EXACT([1]Feuil1!$C1677,[2]Feuil1!$C1677)=TRUE,[1]Feuil1!$C1677,\"X\")","v":0}]
[null,null,{"$f":"IF(EXACT([1]Feuil1!$C1678,[2]Feuil1!$C1678)=TRUE,[1]Feuil1!$C1678,\"X\")","v":0}]
[null,null,{"$f":"IF(EXACT([1]Feuil1!$C1679,[2]Feuil1!$C1679)=TRUE,[1]Feuil1!$C1679,\"X\")","v":0}]
[null,null,{"$f":"IF(EXACT([1]Feuil1!$C1680,[2]Feuil1!$C1680)=TRUE,[1]Feuil1!$C1680,\"X\")","v":0}]
[null,null,{"$f":"IF(EXACT([1]Feuil1!$C1681,[2]Feuil1!$C1681)=TRUE,[1]Feuil1!$C1681,\"X\")","v":0}]
[null,null,{"$f":"IF(EXACT([1]Feuil1!$C1682,[2]Feuil1!$C1682)=TRUE,[1]Feuil1!$C1682,\"X\")","v":0}]
[null,null,{"$f":"IF(EXACT([1]Feuil1!$C1683,[2]Feuil1!$C1683)=TRUE,[1]Feuil1!$C1683,\"X\")","v":0}]
[null,null,{"$f":"IF(EXACT([1]Feuil1!$C1684,[2]Feuil1!$C1684)=TRUE,[1]Feuil1!$C1684,\"X\")","v":0}]
[null,null,{"$f":"IF(EXACT([1]Feuil1!$C1685,[2]Feuil1!$C1685)=TRUE,[1]Feuil1!$C1685,\"X\")","v":0}]
[null,null,{"$f":"IF(EXACT([1]Feuil1!$C1686,[2]Feuil1!$C1686)=TRUE,[1]Feuil1!$C1686,\"X\")","v":0}]
[null,null,{"$f":"IF(EXACT([1]Feuil1!$C1687,[2]Feuil1!$C1687)=TRUE,[1]Feuil1!$C1687,\"X\")","v":0}]
[null,null,{"$f":"IF(EXACT([1]Feuil1!$C1688,[2]Feuil1!$C1688)=TRUE,[1]Feuil1!$C1688,\"X\")","v":0}]
[null,null,{"$f":"IF(EXACT([1]Feuil1!$C1689,[2]Feuil1!$C1689)=TRUE,[1]Feuil1!$C1689,\"X\")","v":0}]
[null,null,{"$f":"IF(EXACT([1]Feuil1!$C1690,[2]Feuil1!$C1690)=TRUE,[1]Feuil1!$C1690,\"X\")","v":0}]
[null,null,{"$f":"IF(EXACT([1]Feuil1!$C1691,[2]Feuil1!$C1691)=TRUE,[1]Feuil1!$C1691,\"X\")","v":0}]
[null,null,{"$f":"IF(EXACT([1]Feuil1!$C1692,[2]Feuil1!$C1692)=TRUE,[1]Feuil1!$C1692,\"X\")","v":0}]
[null,null,{"$f":"IF(EXACT([1]Feuil1!$C1693,[2]Feuil1!$C1693)=TRUE,[1]Feuil1!$C1693,\"X\")","v":0}]
[null,null,{"$f":"IF(EXACT([1]Feuil1!$C1694,[2]Feuil1!$C1694)=TRUE,[1]Feuil1!$C1694,\"X\")","v":0}]
[null,null,{"$f":"IF(EXACT([1]Feuil1!$C1695,[2]Feuil1!$C1695)=TRUE,[1]Feuil1!$C1695,\"X\")","v":0}]
[null,null,{"$f":"IF(EXACT([1]Feuil1!$C1696,[2]Feuil1!$C1696)=TRUE,[1]Feuil1!$C1696,\"X\")","v":0}]
[null,null,{"$f":"IF(EXACT([1]Feuil1!$C1697,[2]Feuil1!$C1697)=TRUE,[1]Feuil1!$C1697,\"X\")","v":0}]
[null,null,{"$f":"IF(EXACT([1]Feuil1!$C1698,[2]Feuil1!$C1698)=TRUE,[1]Feuil1!$C1698,\"X\")","v":0}]
[null,null,{"$f":"IF(EXACT([1]Feuil1!$C1699,[2]Feuil1!$C1699)=TRUE,[1]Feuil1!$C1699,\"X\")","v":0}]
[null,null,{"$f":"IF(EXACT([1]Feuil1!$C1700,[2]Feuil1!$C1700)=TRUE,[1]Feuil1!$C1700,\"X\")","v":0}]
[null,null,{"$f":"IF(EXACT([1]Feuil1!$C1701,[2]Feuil1!$C1701)=TRUE,[1]Feuil1!$C1701,\"X\")","v":0}]
[null,null,{"$f":"IF(EXACT([1]Feuil1!$C1702,[2]Feuil1!$C1702)=TRUE,[1]Feuil1!$C1702,\"X\")","v":0}]
[null,null,{"$f":"IF(EXACT([1]Feuil1!$C1703,[2]Feuil1!$C1703)=TRUE,[1]Feuil1!$C1703,\"X\")","v":0}]
[null,null,{"$f":"IF(EXACT([1]Feuil1!$C1704,[2]Feuil1!$C1704)=TRUE,[1]Feuil1!$C1704,\"X\")","v":0}]
[null,null,{"$f":"IF(EXACT([1]Feuil1!$C1705,[2]Feuil1!$C1705)=TRUE,[1]Feuil1!$C1705,\"X\")","v":0}]
[null,null,{"$f":"IF(EXACT([1]Feuil1!$C1706,[2]Feuil1!$C1706)=TRUE,[1]Feuil1!$C1706,\"X\")","v":0}]
[null,null,{"$f":"IF(EXACT([1]Feuil1!$C1707,[2]Feuil1!$C1707)=TRUE,[1]Feuil1!$C1707,\"X\")","v":0}]
[null,null,{"$f":"IF(EXACT([1]Feuil1!$C1708,[2]Feuil1!$C1708)=TRUE,[1]Feuil1!$C1708,\"X\")","v":0}]
[null,null,{"$f":"IF(EXACT([1]Feuil1!$C1709,[2]Feuil1!$C1709)=TRUE,[1]Feuil1!$C1709,\"X\")","v":0}]
[null,null,{"$f":"IF(EXACT([1]Feuil1!$C1710,[2]Feuil1!$C1710)=TRUE,[1]Feuil1!$C1710,\"X\")","v":0}]
[null,null,{"$f":"IF(EXACT([1]Feuil1!$C1711,[2]Feuil1!$C1711)=TRUE,[1]Feuil1!$C1711,\"X\")","v":0}]
[null,null,{"$f":"IF(EXACT([1]Feuil1!$C1712,[2]Feuil1!$C1712)=TRUE,[1]Feuil1!$C1712,\"X\")","v":0}]
[null,null,{"$f":"IF(EXACT([1]Feuil1!$C1713,[2]Feuil1!$C1713)=TRUE,[1]Feuil1!$C1713,\"X\")","v":0}]
[null,null,{"$f":"IF(EXACT([1]Feuil1!$C1714,[2]Feuil1!$C1714)=TRUE,[1]Feuil1!$C1714,\"X\")","v":0}]
[null,null,{"$f":"IF(EXACT([1]Feuil1!$C1715,[2]Feuil1!$C1715)=TRUE,[1]Feuil1!$C1715,\"X\")","v":0}]
[null,null,{"$f":"IF(EXACT([1]Feuil1!$C1716,[2]Feuil1!$C1716)=TRUE,[1]Feuil1!$C1716,\"X\")","v":0}]
[null,null,{"$f":"IF(EXACT([1]Feuil1!$C1717,[2]Feuil1!$C1717)=TRUE,[1]Feuil1!$C1717,\"X\")","v":0}]
[null,null,{"$f":"IF(EXACT([1]Feuil1!$C1718,[2]Feuil1!$C1718)=TRUE,[1]Feuil1!$C1718,\"X\")","v":0}]
[null,null,{"$f":"IF(EXACT([1]Feuil1!$C1719,[2]Feuil1!$C1719)=TRUE,[1]Feuil1!$C1719,\"X\")","v":0}]
[null,null,{"$f":"IF(EXACT([1]Feuil1!$C1720,[2]Feuil1!$C1720)=TRUE,[1]Feuil1!$C1720,\"X\")","v":0}]
[null,null,{"$f":"IF(EXACT([1]Feuil1!$C1721,[2]Feuil1!$C1721)=TRUE,[1]Feuil1!$C1721,\"X\")","v":0}]
[null,null,{"$f":"IF(EXACT([1]Feuil1!$C1722,[2]Feuil1!$C1722)=TRUE,[1]Feuil1!$C1722,\"X\")","v":0}]
[null,null,{"$f":"IF(EXACT([1]Feuil1!$C1723,[2]Feuil1!$C1723)=TRUE,[1]Feuil1!$C1723,\"X\")","v":0}]
[null,null,{"$f":"IF(EXACT([1]Feuil1!$C1724,[2]Feuil1!$C1724)=TRUE,[1]Feuil1!$C1724,\"X\")","v":0}]
[null,null,{"$f":"IF(EXACT([1]Feuil1!$C1725,[2]Feuil1!$C1725)=TRUE,[1]Feuil1!$C1725,\"X\")","v":0}]
[null,null,{"$f":"IF(EXACT([1]Feuil1!$C1726,[2]Feuil1!$C1726)=TRUE,[1]Feuil1!$C1726,\"X\")","v":0}]
[null,null,{"$f":"IF(EXACT([1]Feuil1!$C1727,[2]Feuil1!$C1727)=TRUE,[1]Feuil1!$C1727,\"X\")","v":0}]
[null,null,{"$f":"IF(EXACT([1]Feuil1!$C1728,[2]Feuil1!$C1728)=TRUE,[1]Feuil1!$C1728,\"X\")","v":0}]
[null,null,{"$f":"IF(EXACT([1]Feuil1!$C1729,[2]Feuil1!$C1729)=TRUE,[1]Feuil1!$C1729,\"X\")","v":0}]
[null,null,{"$f":"IF(EXACT([1]Feuil1!$C1730,[2]Feuil1!$C1730)=TRUE,[1]Feuil1!$C1730,\"X\")","v":0}]
[null,null,{"$f":"IF(EXACT([1]Feuil1!$C1731,[2]Feuil1!$C1731)=TRUE,[1]Feuil1!$C1731,\"X\")","v":0}]
[null,null,{"$f":"IF(EXACT([1]Feuil1!$C1732,[2]Feuil1!$C1732)=TRUE,[1]Feuil1!$C1732,\"X\")","v":0}]
[null,null,{"$f":"IF(EXACT([1]Feuil1!$C1733,[2]Feuil1!$C1733)=TRUE,[1]Feuil1!$C1733,\"X\")","v":0}]
[null,null,{"$f":"IF(EXACT([1]Feuil1!$C1734,[2]Feuil1!$C1734)=TRUE,[1]Feuil1!$C1734,\"X\")","v":0}]
[null,null,{"$f":"IF(EXACT([1]Feuil1!$C1735,[2]Feuil1!$C1735)=TRUE,[1]Feuil1!$C1735,\"X\")","v":0}]
[null,null,{"$f":"IF(EXACT([1]Feuil1!$C1736,[2]Feuil1!$C1736)=TRUE,[1]Feuil1!$C1736,\"X\")","v":0}]
[null,null,{"$f":"IF(EXACT([1]Feuil1!$C1737,[2]Feuil1!$C1737)=TRUE,[1]Feuil1!$C1737,\"X\")","v":0}]
[null,null,{"$f":"IF(EXACT([1]Feuil1!$C1738,[2]Feuil1!$C1738)=TRUE,[1]Feuil1!$C1738,\"X\")","v":0}]
[null,null,{"$f":"IF(EXACT([1]Feuil1!$C1739,[2]Feuil1!$C1739)=TRUE,[1]Feuil1!$C1739,\"X\")","v":0}]
[null,null,{"$f":"IF(EXACT([1]Feuil1!$C1740,[2]Feuil1!$C1740)=TRUE,[1]Feuil1!$C1740,\"X\")","v":0}]
[null,null,{"$f":"IF(EXACT([1]Feuil1!$C1741,[2]Feuil1!$C1741)=TRUE,[1]Feuil1!$C1741,\"X\")","v":0}]
[null,null,{"$f":"IF(EXACT([1]Feuil1!$C1742,[2]Feuil1!$C1742)=TRUE,[1]Feuil1!$C1742,\"X\")","v":0}]
[null,null,{"$f":"IF(EXACT([1]Feuil1!$C1743,[2]Feuil1!$C1743)=TRUE,[1]Feuil1!$C1743,\"X\")","v":0}]
[null,null,{"$f":"IF(EXACT([1]Feuil1!$C1744,[2]Feuil1!$C1744)=TRUE,[1]Feuil1!$C1744,\"X\")","v":0}]
[null,null,{"$f":"IF(EXACT([1]Feuil1!$C1745,[2]Feuil1!$C1745)=TRUE,[1]Feuil1!$C1745,\"X\")","v":0}]
[null,null,{"$f":"IF(EXACT([1]Feuil1!$C1746,[2]Feuil1!$C1746)=TRUE,[1]Feuil1!$C1746,\"X\")","v":0}]
[null,null,{"$f":"IF(EXACT([1]Feuil1!$C1747,[2]Feuil1!$C1747)=TRUE,[1]Feuil1!$C1747,\"X\")","v":0}]
[null,null,{"$f":"IF(EXACT([1]Feuil1!$C1748,[2]Feuil1!$C1748)=TRUE,[1]Feuil1!$C1748,\"X\")","v":0}]
[null,null,{"$f":"IF(EXACT([1]Feuil1!$C1749,[2]Feuil1!$C1749)=TRUE,[1]Feuil1!$C1749,\"X\")","v":0}]
[null,null,{"$f":"IF(EXACT([1]Feuil1!$C1750,[2]Feuil1!$C1750)=TRUE,[1]Feuil1!$C1750,\"X\")","v":0}]
[null,null,{"$f":"IF(EXACT([1]Feuil1!$C1751,[2]Feuil1!$C1751)=TRUE,[1]Feuil1!$C1751,\"X\")","v":0}]
[null,null,{"$f":"IF(EXACT([1]Feuil1!$C1752,[2]Feuil1!$C1752)=TRUE,[1]Feuil1!$C1752,\"X\")","v":0}]
[null,null,{"$f":"IF(EXACT([1]Feuil1!$C1753,[2]Feuil1!$C1753)=TRUE,[1]Feuil1!$C1753,\"X\")","v":0}]
[null,null,{"$f":"IF(EXACT([1]Feuil1!$C1754,[2]Feuil1!$C1754)=TRUE,[1]Feuil1!$C1754,\"X\")","v":0}]
[null,null,{"$f":"IF(EXACT([1]Feuil1!$C1755,[2]Feuil1!$C1755)=TRUE,[1]Feuil1!$C1755,\"X\")","v":0}]
[null,null,{"$f":"IF(EXACT([1]Feuil1!$C1756,[2]Feuil1!$C1756)=TRUE,[1]Feuil1!$C1756,\"X\")","v":0}]
[null,null,{"$f":"IF(EXACT([1]Feuil1!$C1757,[2]Feuil1!$C1757)=TRUE,[1]Feuil1!$C1757,\"X\")","v":0}]
[null,null,{"$f":"IF(EXACT([1]Feuil1!$C1758,[2]Feuil1!$C1758)=TRUE,[1]Feuil1!$C1758,\"X\")","v":0}]
[null,null,{"$f":"IF(EXACT([1]Feuil1!$C1759,[2]Feuil1!$C1759)=TRUE,[1]Feuil1!$C1759,\"X\")","v":0}]
[null,null,{"$f":"IF(EXACT([1]Feuil1!$C1760,[2]Feuil1!$C1760)=TRUE,[1]Feuil1!$C1760,\"X\")","v":0}]
[null,null,{"$f":"IF(EXACT([1]Feuil1!$C1761,[2]Feuil1!$C1761)=TRUE,[1]Feuil1!$C1761,\"X\")","v":0}]
[null,null,{"$f":"IF(EXACT([1]Feuil1!$C1762,[2]Feuil1!$C1762)=TRUE,[1]Feuil1!$C1762,\"X\")","v":0}]
[null,null,{"$f":"IF(EXACT([1]Feuil1!$C1763,[2]Feuil1!$C1763)=TRUE,[1]Feuil1!$C1763,\"X\")","v":0}]
[null,null,{"$f":"IF(EXACT([1]Feuil1!$C1764,[2]Feuil1!$C1764)=TRUE,[1]Feuil1!$C1764,\"X\")","v":0}]
[null,null,{"$f":"IF(EXACT([1]Feuil1!$C1765,[2]Feuil1!$C1765)=TRUE,[1]Feuil1!$C1765,\"X\")","v":0}]
[null,null,{"$f":"IF(EXACT([1]Feuil1!$C1766,[2]Feuil1!$C1766)=TRUE,[1]Feuil1!$C1766,\"X\")","v":0}]
[null,null,{"$f":"IF(EXACT([1]Feuil1!$C1767,[2]Feuil1!$C1767)=TRUE,[1]Feuil1!$C1767,\"X\")","v":0}]
[null,null,{"$f":"IF(EXACT([1]Feuil1!$C1768,[2]Feuil1!$C1768)=TRUE,[1]Feuil1!$C1768,\"X\")","v":0}]
[null,null,{"$f":"IF(EXACT([1]Feuil1!$C1769,[2]Feuil1!$C1769)=TRUE,[1]Feuil1!$C1769,\"X\")","v":0}]
[null,null,{"$f":"IF(EXACT([1]Feuil1!$C1770,[2]Feuil1!$C1770)=TRUE,[1]Feuil1!$C1770,\"X\")","v":0}]
[null,null,{"$f":"IF(EXACT([1]Feuil1!$C1771,[2]Feuil1!$C1771)=TRUE,[1]Feuil1!$C1771,\"X\")","v":0}]
[null,null,{"$f":"IF(EXACT([1]Feuil1!$C1772,[2]Feuil1!$C1772)=TRUE,[1]Feuil1!$C1772,\"X\")","v":0}]
[null,null,{"$f":"IF(EXACT([1]Feuil1!$C1773,[2]Feuil1!$C1773)=TRUE,[1]Feuil1!$C1773,\"X\")","v":0}]
[null,null,{"$f":"IF(EXACT([1]Feuil1!$C1774,[2]Feuil1!$C1774)=TRUE,[1]Feuil1!$C1774,\"X\")","v":0}]
[null,null,{"$f":"IF(EXACT([1]Feuil1!$C1775,[2]Feuil1!$C1775)=TRUE,[1]Feuil1!$C1775,\"X\")","v":0}]
[null,null,{"$f":"IF(EXACT([1]Feuil1!$C1776,[2]Feuil1!$C1776)=TRUE,[1]Feuil1!$C1776,\"X\")","v":0}]
[null,null,{"$f":"IF(EXACT([1]Feuil1!$C1777,[2]Feuil1!$C1777)=TRUE,[1]Feuil1!$C1777,\"X\")","v":0}]
[null,null,{"$f":"IF(EXACT([1]Feuil1!$C1778,[2]Feuil1!$C1778)=TRUE,[1]Feuil1!$C1778,\"X\")","v":0}]
[null,null,{"$f":"IF(EXACT([1]Feuil1!$C1779,[2]Feuil1!$C1779)=TRUE,[1]Feuil1!$C1779,\"X\")","v":0}]
[null,null,{"$f":"IF(EXACT([1]Feuil1!$C1780,[2]Feuil1!$C1780)=TRUE,[1]Feuil1!$C1780,\"X\")","v":0}]
[null,null,{"$f":"IF(EXACT([1]Feuil1!$C1781,[2]Feuil1!$C1781)=TRUE,[1]Feuil1!$C1781,\"X\")","v":0}]
[null,null,{"$f":"IF(EXACT([1]Feuil1!$C1782,[2]Feuil1!$C1782)=TRUE,[1]Feuil1!$C1782,\"X\")","v":0}]
[null,null,{"$f":"IF(EXACT([1]Feuil1!$C1783,[2]Feuil1!$C1783)=TRUE,[1]Feuil1!$C1783,\"X\")","v":0}]
[null,null,{"$f":"IF(EXACT([1]Feuil1!$C1784,[2]Feuil1!$C1784)=TRUE,[1]Feuil1!$C1784,\"X\")","v":0}]
[null,null,{"$f":"IF(EXACT([1]Feuil1!$C1785,[2]Feuil1!$C1785)=TRUE,[1]Feuil1!$C1785,\"X\")","v":0}]
[null,null,{"$f":"IF(EXACT([1]Feuil1!$C1786,[2]Feuil1!$C1786)=TRUE,[1]Feuil1!$C1786,\"X\")","v":0}]
[null,null,{"$f":"IF(EXACT([1]Feuil1!$C1787,[2]Feuil1!$C1787)=TRUE,[1]Feuil1!$C1787,\"X\")","v":0}]
[null,null,{"$f":"IF(EXACT([1]Feuil1!$C1788,[2]Feuil1!$C1788)=TRUE,[1]Feuil1!$C1788,\"X\")","v":0}]
[null,null,{"$f":"IF(EXACT([1]Feuil1!$C1789,[2]Feuil1!$C1789)=TRUE,[1]Feuil1!$C1789,\"X\")","v":0}]
[null,null,{"$f":"IF(EXACT([1]Feuil1!$C1790,[2]Feuil1!$C1790)=TRUE,[1]Feuil1!$C1790,\"X\")","v":0}]
[null,null,{"$f":"IF(EXACT([1]Feuil1!$C1791,[2]Feuil1!$C1791)=TRUE,[1]Feuil1!$C1791,\"X\")","v":0}]
[null,null,{"$f":"IF(EXACT([1]Feuil1!$C1792,[2]Feuil1!$C1792)=TRUE,[1]Feuil1!$C1792,\"X\")","v":0}]
[null,null,{"$f":"IF(EXACT([1]Feuil1!$C1793,[2]Feuil1!$C1793)=TRUE,[1]Feuil1!$C1793,\"X\")","v":0}]
[null,null,{"$f":"IF(EXACT([1]Feuil1!$C1794,[2]Feuil1!$C1794)=TRUE,[1]Feuil1!$C1794,\"X\")","v":0}]
[null,null,{"$f":"IF(EXACT([1]Feuil1!$C1795,[2]Feuil1!$C1795)=TRUE,[1]Feuil1!$C1795,\"X\")","v":0}]
[null,null,{"$f":"IF(EXACT([1]Feuil1!$C1796,[2]Feuil1!$C1796)=TRUE,[1]Feuil1!$C1796,\"X\")","v":0}]
[null,null,{"$f":"IF(EXACT([1]Feuil1!$C1797,[2]Feuil1!$C1797)=TRUE,[1]Feuil1!$C1797,\"X\")","v":0}]
[null,null,{"$f":"IF(EXACT([1]Feuil1!$C1798,[2]Feuil1!$C1798)=TRUE,[1]Feuil1!$C1798,\"X\")","v":0}]
[null,null,{"$f":"IF(EXACT([1]Feuil1!$C1799,[2]Feuil1!$C1799)=TRUE,[1]Feuil1!$C1799,\"X\")","v":0}]
[null,null,{"$f":"IF(EXACT([1]Feuil1!$C1800,[2]Feuil1!$C1800)=TRUE,[1]Feuil1!$C1800,\"X\")","v":0}]
[null,null,{"$f":"IF(EXACT([1]Feuil1!$C1801,[2]Feuil1!$C1801)=TRUE,[1]Feuil1!$C1801,\"X\")","v":0}]
[null,null,{"$f":"IF(EXACT([1]Feuil1!$C1802,[2]Feuil1!$C1802)=TRUE,[1]Feuil1!$C1802,\"X\")","v":0}]
[null,null,{"$f":"IF(EXACT([1]Feuil1!$C1803,[2]Feuil1!$C1803)=TRUE,[1]Feuil1!$C1803,\"X\")","v":0}]
[null,null,{"$f":"IF(EXACT([1]Feuil1!$C1804,[2]Feuil1!$C1804)=TRUE,[1]Feuil1!$C1804,\"X\")","v":0}]
[null,null,{"$f":"IF(EXACT([1]Feuil1!$C1805,[2]Feuil1!$C1805)=TRUE,[1]Feuil1!$C1805,\"X\")","v":0}]
[null,null,{"$f":"IF(EXACT([1]Feuil1!$C1806,[2]Feuil1!$C1806)=TRUE,[1]Feuil1!$C1806,\"X\")","v":0}]
[null,null,{"$f":"IF(EXACT([1]Feuil1!$C1807,[2]Feuil1!$C1807)=TRUE,[1]Feuil1!$C1807,\"X\")","v":0}]
[null,null,{"$f":"IF(EXACT([1]Feuil1!$C1808,[2]Feuil1!$C1808)=TRUE,[1]Feuil1!$C1808,\"X\")","v":0}]
[null,null,{"$f":"IF(EXACT([1]Feuil1!$C1809,[2]Feuil1!$C1809)=TRUE,[1]Feuil1!$C1809,\"X\")","v":0}]
[null,null,{"$f":"IF(EXACT([1]Feuil1!$C1810,[2]Feuil1!$C1810)=TRUE,[1]Feuil1!$C1810,\"X\")","v":0}]
[null,null,{"$f":"IF(EXACT([1]Feuil1!$C1811,[2]Feuil1!$C1811)=TRUE,[1]Feuil1!$C1811,\"X\")","v":0}]
[null,null,{"$f":"IF(EXACT([1]Feuil1!$C1812,[2]Feuil1!$C1812)=TRUE,[1]Feuil1!$C1812,\"X\")","v":0}]
[null,null,{"$f":"IF(EXACT([1]Feuil1!$C1813,[2]Feuil1!$C1813)=TRUE,[1]Feuil1!$C1813,\"X\")","v":0}]
[null,null,{"$f":"IF(EXACT([1]Feuil1!$C1814,[2]Feuil1!$C1814)=TRUE,[1]Feuil1!$C1814,\"X\")","v":0}]
[null,null,{"$f":"IF(EXACT([1]Feuil1!$C1815,[2]Feuil1!$C1815)=TRUE,[1]Feuil1!$C1815,\"X\")","v":0}]
[null,null,{"$f":"IF(EXACT([1]Feuil1!$C1816,[2]Feuil1!$C1816)=TRUE,[1]Feuil1!$C1816,\"X\")","v":0}]
[null,null,{"$f":"IF(EXACT([1]Feuil1!$C1817,[2]Feuil1!$C1817)=TRUE,[1]Feuil1!$C1817,\"X\")","v":0}]
[null,null,{"$f":"IF(EXACT([1]Feuil1!$C1818,[2]Feuil1!$C1818)=TRUE,[1]Feuil1!$C1818,\"X\")","v":0}]
[null,null,{"$f":"IF(EXACT([1]Feuil1!$C1819,[2]Feuil1!$C1819)=TRUE,[1]Feuil1!$C1819,\"X\")","v":0}]
[null,null,{"$f":"IF(EXACT([1]Feuil1!$C1820,[2]Feuil1!$C1820)=TRUE,[1]Feuil1!$C1820,\"X\")","v":0}]
[null,null,{"$f":"IF(EXACT([1]Feuil1!$C1821,[2]Feuil1!$C1821)=TRUE,[1]Feuil1!$C1821,\"X\")","v":0}]
[null,null,{"$f":"IF(EXACT([1]Feuil1!$C1822,[2]Feuil1!$C1822)=TRUE,[1]Feuil1!$C1822,\"X\")","v":0}]
[null,null,{"$f":"IF(EXACT([1]Feuil1!$C1823,[2]Feuil1!$C1823)=TRUE,[1]Feuil1!$C1823,\"X\")","v":0}]
[null,null,{"$f":"IF(EXACT([1]Feuil1!$C1824,[2]Feuil1!$C1824)=TRUE,[1]Feuil1!$C1824,\"X\")","v":0}]
[null,null,{"$f":"IF(EXACT([1]Feuil1!$C1825,[2]Feuil1!$C1825)=TRUE,[1]Feuil1!$C1825,\"X\")","v":0}]
[null,null,{"$f":"IF(EXACT([1]Feuil1!$C1826,[2]Feuil1!$C1826)=TRUE,[1]Feuil1!$C1826,\"X\")","v":0}]
[null,null,{"$f":"IF(EXACT([1]Feuil1!$C1827,[2]Feuil1!$C1827)=TRUE,[1]Feuil1!$C1827,\"X\")","v":0}]
[null,null,{"$f":"IF(EXACT([1]Feuil1!$C1828,[2]Feuil1!$C1828)=TRUE,[1]Feuil1!$C1828,\"X\")","v":0}]
[null,null,{"$f":"IF(EXACT([1]Feuil1!$C1829,[2]Feuil1!$C1829)=TRUE,[1]Feuil1!$C1829,\"X\")","v":0}]
[null,null,{"$f":"IF(EXACT([1]Feuil1!$C1830,[2]Feuil1!$C1830)=TRUE,[1]Feuil1!$C1830,\"X\")","v":0}]
[null,null,{"$f":"IF(EXACT([1]Feuil1!$C1831,[2]Feuil1!$C1831)=TRUE,[1]Feuil1!$C1831,\"X\")","v":0}]
[null,null,{"$f":"IF(EXACT([1]Feuil1!$C1832,[2]Feuil1!$C1832)=TRUE,[1]Feuil1!$C1832,\"X\")","v":0}]
[null,null,{"$f":"IF(EXACT([1]Feuil1!$C1833,[2]Feuil1!$C1833)=TRUE,[1]Feuil1!$C1833,\"X\")","v":0}]
[null,null,{"$f":"IF(EXACT([1]Feuil1!$C1834,[2]Feuil1!$C1834)=TRUE,[1]Feuil1!$C1834,\"X\")","v":0}]
[null,null,{"$f":"IF(EXACT([1]Feuil1!$C1835,[2]Feuil1!$C1835)=TRUE,[1]Feuil1!$C1835,\"X\")","v":0}]
[null,null,{"$f":"IF(EXACT([1]Feuil1!$C1836,[2]Feuil1!$C1836)=TRUE,[1]Feuil1!$C1836,\"X\")","v":0}]
[null,null,{"$f":"IF(EXACT([1]Feuil1!$C1837,[2]Feuil1!$C1837)=TRUE,[1]Feuil1!$C1837,\"X\")","v":0}]
[null,null,{"$f":"IF(EXACT([1]Feuil1!$C1838,[2]Feuil1!$C1838)=TRUE,[1]Feuil1!$C1838,\"X\")","v":0}]
[null,null,{"$f":"IF(EXACT([1]Feuil1!$C1839,[2]Feuil1!$C1839)=TRUE,[1]Feuil1!$C1839,\"X\")","v":0}]
[null,null,{"$f":"IF(EXACT([1]Feuil1!$C1840,[2]Feuil1!$C1840)=TRUE,[1]Feuil1!$C1840,\"X\")","v":0}]
[null,null,{"$f":"IF(EXACT([1]Feuil1!$C1841,[2]Feuil1!$C1841)=TRUE,[1]Feuil1!$C1841,\"X\")","v":0}]
[null,null,{"$f":"IF(EXACT([1]Feuil1!$C1842,[2]Feuil1!$C1842)=TRUE,[1]Feuil1!$C1842,\"X\")","v":0}]
[null,null,{"$f":"IF(EXACT([1]Feuil1!$C1843,[2]Feuil1!$C1843)=TRUE,[1]Feuil1!$C1843,\"X\")","v":0}]
[null,null,{"$f":"IF(EXACT([1]Feuil1!$C1844,[2]Feuil1!$C1844)=TRUE,[1]Feuil1!$C1844,\"X\")","v":0}]
[null,null,{"$f":"IF(EXACT([1]Feuil1!$C1845,[2]Feuil1!$C1845)=TRUE,[1]Feuil1!$C1845,\"X\")","v":0}]
[null,null,{"$f":"IF(EXACT([1]Feuil1!$C1846,[2]Feuil1!$C1846)=TRUE,[1]Feuil1!$C1846,\"X\")","v":0}]
[null,null,{"$f":"IF(EXACT([1]Feuil1!$C1847,[2]Feuil1!$C1847)=TRUE,[1]Feuil1!$C1847,\"X\")","v":0}]
[null,null,{"$f":"IF(EXACT([1]Feuil1!$C1848,[2]Feuil1!$C1848)=TRUE,[1]Feuil1!$C1848,\"X\")","v":0}]
[null,null,{"$f":"IF(EXACT([1]Feuil1!$C1849,[2]Feuil1!$C1849)=TRUE,[1]Feuil1!$C1849,\"X\")","v":0}]
[null,null,{"$f":"IF(EXACT([1]Feuil1!$C1850,[2]Feuil1!$C1850)=TRUE,[1]Feuil1!$C1850,\"X\")","v":0}]
[null,null,{"$f":"IF(EXACT([1]Feuil1!$C1851,[2]Feuil1!$C1851)=TRUE,[1]Feuil1!$C1851,\"X\")","v":0}]
[null,null,{"$f":"IF(EXACT([1]Feuil1!$C1852,[2]Feuil1!$C1852)=TRUE,[1]Feuil1!$C1852,\"X\")","v":0}]
[null,null,{"$f":"IF(EXACT([1]Feuil1!$C1853,[2]Feuil1!$C1853)=TRUE,[1]Feuil1!$C1853,\"X\")","v":0}]
[null,null,{"$f":"IF(EXACT([1]Feuil1!$C1854,[2]Feuil1!$C1854)=TRUE,[1]Feuil1!$C1854,\"X\")","v":0}]
[null,null,{"$f":"IF(EXACT([1]Feuil1!$C1855,[2]Feuil1!$C1855)=TRUE,[1]Feuil1!$C1855,\"X\")","v":0}]
[null,null,{"$f":"IF(EXACT([1]Feuil1!$C1856,[2]Feuil1!$C1856)=TRUE,[1]Feuil1!$C1856,\"X\")","v":0}]
[null,null,{"$f":"IF(EXACT([1]Feuil1!$C1857,[2]Feuil1!$C1857)=TRUE,[1]Feuil1!$C1857,\"X\")","v":0}]
[null,null,{"$f":"IF(EXACT([1]Feuil1!$C1858,[2]Feuil1!$C1858)=TRUE,[1]Feuil1!$C1858,\"X\")","v":0}]
[null,null,{"$f":"IF(EXACT([1]Feuil1!$C1859,[2]Feuil1!$C1859)=TRUE,[1]Feuil1!$C1859,\"X\")","v":0}]
[null,null,{"$f":"IF(EXACT([1]Feuil1!$C1860,[2]Feuil1!$C1860)=TRUE,[1]Feuil1!$C1860,\"X\")","v":0}]
[null,null,{"$f":"IF(EXACT([1]Feuil1!$C1861,[2]Feuil1!$C1861)=TRUE,[1]Feuil1!$C1861,\"X\")","v":0}]
[null,null,{"$f":"IF(EXACT([1]Feuil1!$C1862,[2]Feuil1!$C1862)=TRUE,[1]Feuil1!$C1862,\"X\")","v":0}]
[null,null,{"$f":"IF(EXACT([1]Feuil1!$C1863,[2]Feuil1!$C1863)=TRUE,[1]Feuil1!$C1863,\"X\")","v":0}]
[null,null,{"$f":"IF(EXACT([1]Feuil1!$C1864,[2]Feuil1!$C1864)=TRUE,[1]Feuil1!$C1864,\"X\")","v":0}]
[null,null,{"$f":"IF(EXACT([1]Feuil1!$C1865,[2]Feuil1!$C1865)=TRUE,[1]Feuil1!$C1865,\"X\")","v":0}]
[null,null,{"$f":"IF(EXACT([1]Feuil1!$C1866,[2]Feuil1!$C1866)=TRUE,[1]Feuil1!$C1866,\"X\")","v":0}]
[null,null,{"$f":"IF(EXACT([1]Feuil1!$C1867,[2]Feuil1!$C1867)=TRUE,[1]Feuil1!$C1867,\"X\")","v":0}]
[null,null,{"$f":"IF(EXACT([1]Feuil1!$C1868,[2]Feuil1!$C1868)=TRUE,[1]Feuil1!$C1868,\"X\")","v":0}]
[null,null,{"$f":"IF(EXACT([1]Feuil1!$C1869,[2]Feuil1!$C1869)=TRUE,[1]Feuil1!$C1869,\"X\")","v":0}]
[null,null,{"$f":"IF(EXACT([1]Feuil1!$C1870,[2]Feuil1!$C1870)=TRUE,[1]Feuil1!$C1870,\"X\")","v":0}]
[null,null,{"$f":"IF(EXACT([1]Feuil1!$C1871,[2]Feuil1!$C1871)=TRUE,[1]Feuil1!$C1871,\"X\")","v":0}]
[null,null,{"$f":"IF(EXACT([1]Feuil1!$C1872,[2]Feuil1!$C1872)=TRUE,[1]Feuil1!$C1872,\"X\")","v":0}]
[null,null,{"$f":"IF(EXACT([1]Feuil1!$C1873,[2]Feuil1!$C1873)=TRUE,[1]Feuil1!$C1873,\"X\")","v":0}]
[null,null,{"$f":"IF(EXACT([1]Feuil1!$C1874,[2]Feuil1!$C1874)=TRUE,[1]Feuil1!$C1874,\"X\")","v":0}]
[null,null,{"$f":"IF(EXACT([1]Feuil1!$C1875,[2]Feuil1!$C1875)=TRUE,[1]Feuil1!$C1875,\"X\")","v":0}]
[null,null,{"$f":"IF(EXACT([1]Feuil1!$C1876,[2]Feuil1!$C1876)=TRUE,[1]Feuil1!$C1876,\"X\")","v":0}]
[null,null,{"$f":"IF(EXACT([1]Feuil1!$C1877,[2]Feuil1!$C1877)=TRUE,[1]Feuil1!$C1877,\"X\")","v":0}]
[null,null,{"$f":"IF(EXACT([1]Feuil1!$C1878,[2]Feuil1!$C1878)=TRUE,[1]Feuil1!$C1878,\"X\")","v":0}]
[null,null,{"$f":"IF(EXACT([1]Feuil1!$C1879,[2]Feuil1!$C1879)=TRUE,[1]Feuil1!$C1879,\"X\")","v":0}]
[null,null,{"$f":"IF(EXACT([1]Feuil1!$C1880,[2]Feuil1!$C1880)=TRUE,[1]Feuil1!$C1880,\"X\")","v":0}]
[null,null,{"$f":"IF(EXACT([1]Feuil1!$C1881,[2]Feuil1!$C1881)=TRUE,[1]Feuil1!$C1881,\"X\")","v":0}]
[null,null,{"$f":"IF(EXACT([1]Feuil1!$C1882,[2]Feuil1!$C1882)=TRUE,[1]Feuil1!$C1882,\"X\")","v":0}]
[null,null,{"$f":"IF(EXACT([1]Feuil1!$C1883,[2]Feuil1!$C1883)=TRUE,[1]Feuil1!$C1883,\"X\")","v":0}]
[null,null,{"$f":"IF(EXACT([1]Feuil1!$C1884,[2]Feuil1!$C1884)=TRUE,[1]Feuil1!$C1884,\"X\")","v":0}]
[null,null,{"$f":"IF(EXACT([1]Feuil1!$C1885,[2]Feuil1!$C1885)=TRUE,[1]Feuil1!$C1885,\"X\")","v":0}]
[null,null,{"$f":"IF(EXACT([1]Feuil1!$C1886,[2]Feuil1!$C1886)=TRUE,[1]Feuil1!$C1886,\"X\")","v":0}]
[null,null,{"$f":"IF(EXACT([1]Feuil1!$C1887,[2]Feuil1!$C1887)=TRUE,[1]Feuil1!$C1887,\"X\")","v":0}]
[null,null,{"$f":"IF(EXACT([1]Feuil1!$C1888,[2]Feuil1!$C1888)=TRUE,[1]Feuil1!$C1888,\"X\")","v":0}]
[null,null,{"$f":"IF(EXACT([1]Feuil1!$C1889,[2]Feuil1!$C1889)=TRUE,[1]Feuil1!$C1889,\"X\")","v":0}]
[null,null,{"$f":"IF(EXACT([1]Feuil1!$C1890,[2]Feuil1!$C1890)=TRUE,[1]Feuil1!$C1890,\"X\")","v":0}]
[null,null,{"$f":"IF(EXACT([1]Feuil1!$C1891,[2]Feuil1!$C1891)=TRUE,[1]Feuil1!$C1891,\"X\")","v":0}]
[null,null,{"$f":"IF(EXACT([1]Feuil1!$C1892,[2]Feuil1!$C1892)=TRUE,[1]Feuil1!$C1892,\"X\")","v":0}]
[null,null,{"$f":"IF(EXACT([1]Feuil1!$C1893,[2]Feuil1!$C1893)=TRUE,[1]Feuil1!$C1893,\"X\")","v":0}]
[null,null,{"$f":"IF(EXACT([1]Feuil1!$C1894,[2]Feuil1!$C1894)=TRUE,[1]Feuil1!$C1894,\"X\")","v":0}]
[null,null,{"$f":"IF(EXACT([1]Feuil1!$C1895,[2]Feuil1!$C1895)=TRUE,[1]Feuil1!$C1895,\"X\")","v":0}]
[null,null,{"$f":"IF(EXACT([1]Feuil1!$C1896,[2]Feuil1!$C1896)=TRUE,[1]Feuil1!$C1896,\"X\")","v":0}]
[null,null,{"$f":"IF(EXACT([1]Feuil1!$C1897,[2]Feuil1!$C1897)=TRUE,[1]Feuil1!$C1897,\"X\")","v":0}]
[null,null,{"$f":"IF(EXACT([1]Feuil1!$C1898,[2]Feuil1!$C1898)=TRUE,[1]Feuil1!$C1898,\"X\")","v":0}]
[null,null,{"$f":"IF(EXACT([1]Feuil1!$C1899,[2]Feuil1!$C1899)=TRUE,[1]Feuil1!$C1899,\"X\")","v":0}]
[null,null,{"$f":"IF(EXACT([1]Feuil1!$C1900,[2]Feuil1!$C1900)=TRUE,[1]Feuil1!$C1900,\"X\")","v":0}]
[null,null,{"$f":"IF(EXACT([1]Feuil1!$C1901,[2]Feuil1!$C1901)=TRUE,[1]Feuil1!$C1901,\"X\")","v":0}]
[null,null,{"$f":"IF(EXACT([1]Feuil1!$C1902,[2]Feuil1!$C1902)=TRUE,[1]Feuil1!$C1902,\"X\")","v":0}]
[null,null,{"$f":"IF(EXACT([1]Feuil1!$C1903,[2]Feuil1!$C1903)=TRUE,[1]Feuil1!$C1903,\"X\")","v":0}]
[null,null,{"$f":"IF(EXACT([1]Feuil1!$C1904,[2]Feuil1!$C1904)=TRUE,[1]Feuil1!$C1904,\"X\")","v":0}]
[null,null,{"$f":"IF(EXACT([1]Feuil1!$C1905,[2]Feuil1!$C1905)=TRUE,[1]Feuil1!$C1905,\"X\")","v":0}]
[null,null,{"$f":"IF(EXACT([1]Feuil1!$C1906,[2]Feuil1!$C1906)=TRUE,[1]Feuil1!$C1906,\"X\")","v":0}]
[null,null,{"$f":"IF(EXACT([1]Feuil1!$C1907,[2]Feuil1!$C1907)=TRUE,[1]Feuil1!$C1907,\"X\")","v":0}]
[null,null,{"$f":"IF(EXACT([1]Feuil1!$C1908,[2]Feuil1!$C1908)=TRUE,[1]Feuil1!$C1908,\"X\")","v":0}]
[null,null,{"$f":"IF(EXACT([1]Feuil1!$C1909,[2]Feuil1!$C1909)=TRUE,[1]Feuil1!$C1909,\"X\")","v":0}]
[null,null,{"$f":"IF(EXACT([1]Feuil1!$C1910,[2]Feuil1!$C1910)=TRUE,[1]Feuil1!$C1910,\"X\")","v":0}]
[null,null,{"$f":"IF(EXACT([1]Feuil1!$C1911,[2]Feuil1!$C1911)=TRUE,[1]Feuil1!$C1911,\"X\")","v":0}]
[null,null,{"$f":"IF(EXACT([1]Feuil1!$C1912,[2]Feuil1!$C1912)=TRUE,[1]Feuil1!$C1912,\"X\")","v":0}]
[null,null,{"$f":"IF(EXACT([1]Feuil1!$C1913,[2]Feuil1!$C1913)=TRUE,[1]Feuil1!$C1913,\"X\")","v":0}]
[null,null,{"$f":"IF(EXACT([1]Feuil1!$C1914,[2]Feuil1!$C1914)=TRUE,[1]Feuil1!$C1914,\"X\")","v":0}]
[null,null,{"$f":"IF(EXACT([1]Feuil1!$C1915,[2]Feuil1!$C1915)=TRUE,[1]Feuil1!$C1915,\"X\")","v":0}]
[null,null,{"$f":"IF(EXACT([1]Feuil1!$C1916,[2]Feuil1!$C1916)=TRUE,[1]Feuil1!$C1916,\"X\")","v":0}]
[null,null,{"$f":"IF(EXACT([1]Feuil1!$C1917,[2]Feuil1!$C1917)=TRUE,[1]Feuil1!$C1917,\"X\")","v":0}]
[null,null,{"$f":"IF(EXACT([1]Feuil1!$C1918,[2]Feuil1!$C1918)=TRUE,[1]Feuil1!$C1918,\"X\")","v":0}]
[null,null,{"$f":"IF(EXACT([1]Feuil1!$C1919,[2]Feuil1!$C1919)=TRUE,[1]Feuil1!$C1919,\"X\")","v":0}]
[null,null,{"$f":"IF(EXACT([1]Feuil1!$C1920,[2]Feuil1!$C1920)=TRUE,[1]Feuil1!$C1920,\"X\")","v":0}]
[null,null,{"$f":"IF(EXACT([1]Feuil1!$C1921,[2]Feuil1!$C1921)=TRUE,[1]Feuil1!$C1921,\"X\")","v":0}]
[null,null,{"$f":"IF(EXACT([1]Feuil1!$C1922,[2]Feuil1!$C1922)=TRUE,[1]Feuil1!$C1922,\"X\")","v":0}]
[null,null,{"$f":"IF(EXACT([1]Feuil1!$C1923,[2]Feuil1!$C1923)=TRUE,[1]Feuil1!$C1923,\"X\")","v":0}]
[null,null,{"$f":"IF(EXACT([1]Feuil1!$C1924,[2]Feuil1!$C1924)=TRUE,[1]Feuil1!$C1924,\"X\")","v":0}]
[null,null,{"$f":"IF(EXACT([1]Feuil1!$C1925,[2]Feuil1!$C1925)=TRUE,[1]Feuil1!$C1925,\"X\")","v":0}]
[null,null,{"$f":"IF(EXACT([1]Feuil1!$C1926,[2]Feuil1!$C1926)=TRUE,[1]Feuil1!$C1926,\"X\")","v":0}]
[null,null,{"$f":"IF(EXACT([1]Feuil1!$C1927,[2]Feuil1!$C1927)=TRUE,[1]Feuil1!$C1927,\"X\")","v":0}]
[null,null,{"$f":"IF(EXACT([1]Feuil1!$C1928,[2]Feuil1!$C1928)=TRUE,[1]Feuil1!$C1928,\"X\")","v":0}]
[null,null,{"$f":"IF(EXACT([1]Feuil1!$C1929,[2]Feuil1!$C1929)=TRUE,[1]Feuil1!$C1929,\"X\")","v":0}]
[null,null,{"$f":"IF(EXACT([1]Feuil1!$C1930,[2]Feuil1!$C1930)=TRUE,[1]Feuil1!$C1930,\"X\")","v":0}]
[null,null,{"$f":"IF(EXACT([1]Feuil1!$C1931,[2]Feuil1!$C1931)=TRUE,[1]Feuil1!$C1931,\"X\")","v":0}]
[null,null,{"$f":"IF(EXACT([1]Feuil1!$C1932,[2]Feuil1!$C1932)=TRUE,[1]Feuil1!$C1932,\"X\")","v":0}]
[null,null,{"$f":"IF(EXACT([1]Feuil1!$C1933,[2]Feuil1!$C1933)=TRUE,[1]Feuil1!$C1933,\"X\")","v":0}]
[null,null,{"$f":"IF(EXACT([1]Feuil1!$C1934,[2]Feuil1!$C1934)=TRUE,[1]Feuil1!$C1934,\"X\")","v":0}]
[null,null,{"$f":"IF(EXACT([1]Feuil1!$C1935,[2]Feuil1!$C1935)=TRUE,[1]Feuil1!$C1935,\"X\")","v":0}]
[null,null,{"$f":"IF(EXACT([1]Feuil1!$C1936,[2]Feuil1!$C1936)=TRUE,[1]Feuil1!$C1936,\"X\")","v":0}]
[null,null,{"$f":"IF(EXACT([1]Feuil1!$C1937,[2]Feuil1!$C1937)=TRUE,[1]Feuil1!$C1937,\"X\")","v":0}]
[null,null,{"$f":"IF(EXACT([1]Feuil1!$C1938,[2]Feuil1!$C1938)=TRUE,[1]Feuil1!$C1938,\"X\")","v":0}]
[null,null,{"$f":"IF(EXACT([1]Feuil1!$C1939,[2]Feuil1!$C1939)=TRUE,[1]Feuil1!$C1939,\"X\")","v":0}]
[null,null,{"$f":"IF(EXACT([1]Feuil1!$C1940,[2]Feuil1!$C1940)=TRUE,[1]Feuil1!$C1940,\"X\")","v":0}]
[null,null,{"$f":"IF(EXACT([1]Feuil1!$C1941,[2]Feuil1!$C1941)=TRUE,[1]Feuil1!$C1941,\"X\")","v":0}]
[null,null,{"$f":"IF(EXACT([1]Feuil1!$C1942,[2]Feuil1!$C1942)=TRUE,[1]Feuil1!$C1942,\"X\")","v":0}]
[null,null,{"$f":"IF(EXACT([1]Feuil1!$C1943,[2]Feuil1!$C1943)=TRUE,[1]Feuil1!$C1943,\"X\")","v":0}]
[null,null,{"$f":"IF(EXACT([1]Feuil1!$C1944,[2]Feuil1!$C1944)=TRUE,[1]Feuil1!$C1944,\"X\")","v":0}]
[null,null,{"$f":"IF(EXACT([1]Feuil1!$C1945,[2]Feuil1!$C1945)=TRUE,[1]Feuil1!$C1945,\"X\")","v":0}]
[null,null,{"$f":"IF(EXACT([1]Feuil1!$C1946,[2]Feuil1!$C1946)=TRUE,[1]Feuil1!$C1946,\"X\")","v":0}]
[null,null,{"$f":"IF(EXACT([1]Feuil1!$C1947,[2]Feuil1!$C1947)=TRUE,[1]Feuil1!$C1947,\"X\")","v":0}]
[null,null,{"$f":"IF(EXACT([1]Feuil1!$C1948,[2]Feuil1!$C1948)=TRUE,[1]Feuil1!$C1948,\"X\")","v":0}]
[null,null,{"$f":"IF(EXACT([1]Feuil1!$C1949,[2]Feuil1!$C1949)=TRUE,[1]Feuil1!$C1949,\"X\")","v":0}]
[null,null,{"$f":"IF(EXACT([1]Feuil1!$C1950,[2]Feuil1!$C1950)=TRUE,[1]Feuil1!$C1950,\"X\")","v":0}]
[null,null,{"$f":"IF(EXACT([1]Feuil1!$C1951,[2]Feuil1!$C1951)=TRUE,[1]Feuil1!$C1951,\"X\")","v":0}]
[null,null,{"$f":"IF(EXACT([1]Feuil1!$C1952,[2]Feuil1!$C1952)=TRUE,[1]Feuil1!$C1952,\"X\")","v":0}]
[null,null,{"$f":"IF(EXACT([1]Feuil1!$C1953,[2]Feuil1!$C1953)=TRUE,[1]Feuil1!$C1953,\"X\")","v":0}]
[null,null,{"$f":"IF(EXACT([1]Feuil1!$C1954,[2]Feuil1!$C1954)=TRUE,[1]Feuil1!$C1954,\"X\")","v":0}]
[null,null,{"$f":"IF(EXACT([1]Feuil1!$C1955,[2]Feuil1!$C1955)=TRUE,[1]Feuil1!$C1955,\"X\")","v":0}]
[null,null,{"$f":"IF(EXACT([1]Feuil1!$C1956,[2]Feuil1!$C1956)=TRUE,[1]Feuil1!$C1956,\"X\")","v":0}]
[null,null,{"$f":"IF(EXACT([1]Feuil1!$C1957,[2]Feuil1!$C1957)=TRUE,[1]Feuil1!$C1957,\"X\")","v":0}]
[null,null,{"$f":"IF(EXACT([1]Feuil1!$C1958,[2]Feuil1!$C1958)=TRUE,[1]Feuil1!$C1958,\"X\")","v":0}]
[null,null,{"$f":"IF(EXACT([1]Feuil1!$C1959,[2]Feuil1!$C1959)=TRUE,[1]Feuil1!$C1959,\"X\")","v":0}]
[null,null,{"$f":"IF(EXACT([1]Feuil1!$C1960,[2]Feuil1!$C1960)=TRUE,[1]Feuil1!$C1960,\"X\")","v":0}]
[null,null,{"$f":"IF(EXACT([1]Feuil1!$C1961,[2]Feuil1!$C1961)=TRUE,[1]Feuil1!$C1961,\"X\")","v":0}]
[null,null,{"$f":"IF(EXACT([1]Feuil1!$C1962,[2]Feuil1!$C1962)=TRUE,[1]Feuil1!$C1962,\"X\")","v":0}]
[null,null,{"$f":"IF(EXACT([1]Feuil1!$C1963,[2]Feuil1!$C1963)=TRUE,[1]Feuil1!$C1963,\"X\")","v":0}]
[null,null,{"$f":"IF(EXACT([1]Feuil1!$C1964,[2]Feuil1!$C1964)=TRUE,[1]Feuil1!$C1964,\"X\")","v":0}]
[null,null,{"$f":"IF(EXACT([1]Feuil1!$C1965,[2]Feuil1!$C1965)=TRUE,[1]Feuil1!$C1965,\"X\")","v":0}]
[null,null,{"$f":"IF(EXACT([1]Feuil1!$C1966,[2]Feuil1!$C1966)=TRUE,[1]Feuil1!$C1966,\"X\")","v":0}]
[null,null,{"$f":"IF(EXACT([1]Feuil1!$C1967,[2]Feuil1!$C1967)=TRUE,[1]Feuil1!$C1967,\"X\")","v":0}]
[null,null,{"$f":"IF(EXACT([1]Feuil1!$C1968,[2]Feuil1!$C1968)=TRUE,[1]Feuil1!$C1968,\"X\")","v":0}]
[null,null,{"$f":"IF(EXACT([1]Feuil1!$C1969,[2]Feuil1!$C1969)=TRUE,[1]Feuil1!$C1969,\"X\")","v":0}]
[null,null,{"$f":"IF(EXACT([1]Feuil1!$C1970,[2]Feuil1!$C1970)=TRUE,[1]Feuil1!$C1970,\"X\")","v":0}]
[null,null,{"$f":"IF(EXACT([1]Feuil1!$C1971,[2]Feuil1!$C1971)=TRUE,[1]Feuil1!$C1971,\"X\")","v":0}]
[null,null,{"$f":"IF(EXACT([1]Feuil1!$C1972,[2]Feuil1!$C1972)=TRUE,[1]Feuil1!$C1972,\"X\")","v":0}]
[null,null,{"$f":"IF(EXACT([1]Feuil1!$C1973,[2]Feuil1!$C1973)=TRUE,[1]Feuil1!$C1973,\"X\")","v":0}]
[null,null,{"$f":"IF(EXACT([1]Feuil1!$C1974,[2]Feuil1!$C1974)=TRUE,[1]Feuil1!$C1974,\"X\")","v":0}]
[null,null,{"$f":"IF(EXACT([1]Feuil1!$C1975,[2]Feuil1!$C1975)=TRUE,[1]Feuil1!$C1975,\"X\")","v":0}]
[null,null,{"$f":"IF(EXACT([1]Feuil1!$C1976,[2]Feuil1!$C1976)=TRUE,[1]Feuil1!$C1976,\"X\")","v":0}]
[null,null,{"$f":"IF(EXACT([1]Feuil1!$C1977,[2]Feuil1!$C1977)=TRUE,[1]Feuil1!$C1977,\"X\")","v":0}]
[null,null,{"$f":"IF(EXACT([1]Feuil1!$C1978,[2]Feuil1!$C1978)=TRUE,[1]Feuil1!$C1978,\"X\")","v":0}]
[null,null,{"$f":"IF(EXACT([1]Feuil1!$C1979,[2]Feuil1!$C1979)=TRUE,[1]Feuil1!$C1979,\"X\")","v":0}]
[null,null,{"$f":"IF(EXACT([1]Feuil1!$C1980,[2]Feuil1!$C1980)=TRUE,[1]Feuil1!$C1980,\"X\")","v":0}]
[null,null,{"$f":"IF(EXACT([1]Feuil1!$C1981,[2]Feuil1!$C1981)=TRUE,[1]Feuil1!$C1981,\"X\")","v":0}]
[null,null,{"$f":"IF(EXACT([1]Feuil1!$C1982,[2]Feuil1!$C1982)=TRUE,[1]Feuil1!$C1982,\"X\")","v":0}]
[null,null,{"$f":"IF(EXACT([1]Feuil1!$C1983,[2]Feuil1!$C1983)=TRUE,[1]Feuil1!$C1983,\"X\")","v":0}]
[null,null,{"$f":"IF(EXACT([1]Feuil1!$C1984,[2]Feuil1!$C1984)=TRUE,[1]Feuil1!$C1984,\"X\")","v":0}]
[null,null,{"$f":"IF(EXACT([1]Feuil1!$C1985,[2]Feuil1!$C1985)=TRUE,[1]Feuil1!$C1985,\"X\")","v":0}]
[null,null,{"$f":"IF(EXACT([1]Feuil1!$C1986,[2]Feuil1!$C1986)=TRUE,[1]Feuil1!$C1986,\"X\")","v":0}]
[null,null,{"$f":"IF(EXACT([1]Feuil1!$C1987,[2]Feuil1!$C1987)=TRUE,[1]Feuil1!$C1987,\"X\")","v":0}]
[null,null,{"$f":"IF(EXACT([1]Feuil1!$C1988,[2]Feuil1!$C1988)=TRUE,[1]Feuil1!$C1988,\"X\")","v":0}]
[null,null,{"$f":"IF(EXACT([1]Feuil1!$C1989,[2]Feuil1!$C1989)=TRUE,[1]Feuil1!$C1989,\"X\")","v":0}]
[null,null,{"$f":"IF(EXACT([1]Feuil1!$C1990,[2]Feuil1!$C1990)=TRUE,[1]Feuil1!$C1990,\"X\")","v":0}]
[null,null,{"$f":"IF(EXACT([1]Feuil1!$C1991,[2]Feuil1!$C1991)=TRUE,[1]Feuil1!$C1991,\"X\")","v":0}]
[null,null,{"$f":"IF(EXACT([1]Feuil1!$C1992,[2]Feuil1!$C1992)=TRUE,[1]Feuil1!$C1992,\"X\")","v":0}]
[null,null,{"$f":"IF(EXACT([1]Feuil1!$C1993,[2]Feuil1!$C1993)=TRUE,[1]Feuil1!$C1993,\"X\")","v":0}]
[null,null,{"$f":"IF(EXACT([1]Feuil1!$C1994,[2]Feuil1!$C1994)=TRUE,[1]Feuil1!$C1994,\"X\")","v":0}]
[null,null,{"$f":"IF(EXACT([1]Feuil1!$C1995,[2]Feuil1!$C1995)=TRUE,[1]Feuil1!$C1995,\"X\")","v":0}]
[null,null,{"$f":"IF(EXACT([1]Feuil1!$C1996,[2]Feuil1!$C1996)=TRUE,[1]Feuil1!$C1996,\"X\")","v":0}]
[null,null,{"$f":"IF(EXACT([1]Feuil1!$C1997,[2]Feuil1!$C1997)=TRUE,[1]Feuil1!$C1997,\"X\")","v":0}]
[null,null,{"$f":"IF(EXACT([1]Feuil1!$C1998,[2]Feuil1!$C1998)=TRUE,[1]Feuil1!$C1998,\"X\")","v":0}]
[null,null,{"$f":"IF(EXACT([1]Feuil1!$C1999,[2]Feuil1!$C1999)=TRUE,[1]Feuil1!$C1999,\"X\")","v":0}]
[null,null,{"$f":"IF(EXACT([1]Feuil1!$C2000,[2]Feuil1!$C2000)=TRUE,[1]Feuil1!$C2000,\"X\")","v":0}]

{"sheet":"Feuil2","index":1,"n_rows":0,"n_cols":0,"rows_kept":0,"cut":false,"hidden":false,"merged":[]}

{"sheet":"Feuil3","index":2,"n_rows":0,"n_cols":0,"rows_kept":0,"cut":false,"hidden":false,"merged":[]}