{"text_format":"1","workbook":"xlsx","n_sheets":2,"sheets":["Drop List","Data"],"not_rendered":{"charts":0,"images":1,"macros":1,"external_links":0,"defined_names":6,"comments":0,"pivot_tables":0},"unopened":[],"bounds":{"document_bytes":16777216,"sheet_cells":100000,"rows_first":2000,"rows_last":500,"rows_between":2000,"halvings":0,"cell_chars":16384,"cell_head_chars":4096},"cells_cut":0,"cells_raw":0,"read":"whole","date_system":"1900"}

{"sheet":"Drop List","index":0,"n_rows":22,"n_cols":5,"rows_kept":22,"cut":false,"hidden":false,"merged":[]}
[]
[]
[]
[]
[null,null,null,null,"Lebnanon"]
[]
[]
[null,null,null,null,{"$f":"IFERROR(INDEX(INDEX(Data!$B$4:$E$13,,MATCH($E$5,Data!$B$3:$E$3,0)),ROWS($A$1:A1)),\"\")","v":"Beirut"}]
[null,null,null,null,{"$f":"IFERROR(INDEX(INDEX(Data!$B$4:$E$13,,MATCH($E$5,Data!$B$3:$E$3,0)),ROWS($A$1:A2)),\"\")","v":"Tripoli"}]
[null,null,null,null,{"$f":"IFERROR(INDEX(INDEX(Data!$B$4:$E$13,,MATCH($E$5,Data!$B$3:$E$3,0)),ROWS($A$1:A3)),\"\")","v":"Sidon"}]
[null,null,null,null,{"$f":"IFERROR(INDEX(INDEX(Data!$B$4:$E$13,,MATCH($E$5,Data!$B$3:$E$3,0)),ROWS($A$1:A4)),\"\")","v":"Tyre"}]
[null,null,null,null,{"$f":"IFERROR(INDEX(INDEX(Data!$B$4:$E$13,,MATCH($E$5,Data!$B$3:$E$3,0)),ROWS($A$1:A5)),\"\")","v":"Jounieh"}]
[null,null,null,null,{"$f":"IFERROR(INDEX(INDEX(Data!$B$4:$E$13,,MATCH($E$5,Data!$B$3:$E$3,0)),ROWS($A$1:A6)),\"\")","v":"Byblos"}]
[null,null,null,null,{"$f":"IFERROR(INDEX(INDEX(Data!$B$4:$E$13,,MATCH($E$5,Data!$B$3:$E$3,0)),ROWS($A$1:A7)),\"\")","v":"Aley"}]
[null,null,null,null,{"$f":"IFERROR(INDEX(INDEX(Data!$B$4:$E$13,,MATCH($E$5,Data!$B$3:$E$3,0)),ROWS($A$1:A8)),\"\")","v":"Nabatieh"}]
[null,null,null,null,{"$f":"IFERROR(INDEX(INDEX(Data!$B$4:$E$13,,MATCH($E$5,Data!$B$3:$E$3,0)),ROWS($A$1:A9)),\"\")","v":"Baalbek"}]
[null,null,null,null,{"$f":"IFERROR(INDEX(INDEX(Data!$B$4:$E$13,,MATCH($E$5,Data!$B$3:$E$3,0)),ROWS($A$1:A10)),\"\")","v":"Zahle"}]
[null,null,null,null,{"$f":"IFERROR(INDEX(INDEX(Data!$B$4:$E$13,,MATCH($E$5,Data!$B$3:$E$3,0)),ROWS($A$1:A11)),\"\")","v":""}]
[null,null,null,null,{"$f":"IFERROR(INDEX(INDEX(Data!$B$4:$E$13,,MATCH($E$5,Data!$B$3:$E$3,0)),ROWS($A$1:A12)),\"\")","v":""}]
[null,null,null,null,{"$f":"IFERROR(INDEX(INDEX(Data!$B$4:$E$13,,MATCH($E$5,Data!$B$3:$E$3,0)),ROWS($A$1:A13)),\"\")","v":""}]
[null,null,null,null,{"$f":"IFERROR(INDEX(INDEX(Data!$B$4:$E$13,,MATCH($E$5,Data!$B$3:$E$3,0)),ROWS($A$1:A14)),\"\")","v":""}]
[null,null,null,null,{"$f":"IFERROR(INDEX(INDEX(Data!$B$4:$E$13,,MATCH($E$5,Data!$B$3:$E$3,0)),ROWS($A$1:A15)),\"\")","v":""}]

{"sheet":"Data","index":1,"n_rows":13,"n_cols":5,"rows_kept":13,"cut":false,"hidden":false,"merged":[]}
[]
[]
["Egypt","Egypt","Lebnanon","Italia","America"]
["Lebnanon","Cairo","Beirut"]
["Italia","Alex","Tripoli"]
["America","Asuit","Sidon"]
[null,"Luxor","Tyre"]
[null,null,"Jounieh"]
[null,null,"Byblos"]
[null,null,"Aley"]
[null,null,"Nabatieh"]
[null,null,"Baalbek"]
[null,null,"Zahle"]