{"text_format":"1","workbook":"xlsx","n_sheets":5,"sheets":["data","names","legan (2)","Salim","legan"],"not_rendered":{"charts":0,"images":0,"macros":1,"external_links":2,"defined_names":15,"comments":0,"pivot_tables":0},"unopened":[],"bounds":{"document_bytes":16777216,"sheet_cells":100000,"rows_first":2000,"rows_last":500,"rows_between":2000,"halvings":0,"cell_chars":16384,"cell_head_chars":4096},"cells_cut":0,"cells_raw":0,"read":"whole","date_system":"1900"}

{"sheet":"data","index":0,"n_rows":78,"n_cols":31,"rows_kept":78,"cut":false,"hidden":true,"merged":[[4,14,4,27]]}
[]
[]
[]
[]
["م","الاسم","اللغة الثانية","الشعبة","المجال","النشاط","الديانة","تخصص1","تخصص1","تخصص2","تخصص2","الفصل","الحالة","تاريخ الميلاد","مواد الرسوب",null,null,null,null,null,null,null,null,null,null,null,null,null,"مواد الرسوب","مواد رفع المجموع","معرفة المتكرر"]
[1,"احمد جمال عبد المتعال احمد","فرنسي","علمي","زراعة","زراعي","مسلم","فيزياء","كيمياء","احياء","ميكانيكا",5,"نظامي",{"$f":"DATE(IF(LEFT($M6,1)=\"2\",MID($M6,2,2),\"20\"&MID($M6,2,2)),MID($M6,4,2),MID($M6,6,2))","v":{"$error":"#VALUE!"}},null,null,null,null,null,null,"الكيمياء",null,null,null,null,null,null,null,{"$f":"O6&\",\"&P6&\",\"&Q6&\",\"&R6&\",\"&S6&\",\"&\",\"&T6&\",\"&U6&\",\"&V6&\",\"&W6&\",\"&X6&\",\"&Y6&\",\"&Z6&\",\"&AA6&\",\"&AB6","v":",,,,,,,الكيمياء,,,,,,,"},null,{"$f":"IF(AND(B6<>\"\",COUNTIF($B$6:B6,B6)=1),COUNTIF($B$6:$B$76,B6),\"\")","v":1}]
[2,"احمد عادل زكي موسي","فرنسي","علمي","زراعة","زراعي","مسلم","فيزياء","كيمياء","احياء","ميكانيكا","منازل","منازل",{"$error":"#VALUE!"},"اللغة العربية","اللغة الانجليزية","اللغة الثانية",null,"التفاضل وحساب المثلثات","الاحياء","الكيمياء",null,"الميكانيكا","المجموع الكلي","الحاسب الالي","التربية الدينية",null,"التربية المهنية",{"$f":"O7&\",\"&P7&\",\"&Q7&\",\"&R7&\",\"&S7&\",\"&\",\"&T7&\",\"&U7&\",\"&V7&\",\"&W7&\",\"&X7&\",\"&Y7&\",\"&Z7&\",\"&AA7&\",\"&AB7","v":"اللغة العربية,اللغة الانجليزية,اللغة الثانية,,التفاضل وحساب المثلثات,,الاحياء,الكيمياء,,الميكانيكا,المجموع الكلي,الحاسب الالي,التربية الدينية,,التربية المهنية"},null,{"$f":"IF(AND(B7<>\"\",COUNTIF($B$6:B7,B7)=1),COUNTIF($B$6:$B$76,B7),\"\")","v":1}]
[3,"احمد محمد سعيد احمد","الماني","علمي","زراعة","مسرح","مسلم","فيزياء","كيمياء","احياء","ميكانيكا",2,"نظامي",{"$error":"#VALUE!"},null,null,"اللغة الثانية",null,null,null,"الكيمياء","الفيزياء","الميكانيكا","المجموع الكلي",null,null,null,null,",,اللغة الثانية,,,,,الكيمياء,الفيزياء,الميكانيكا,المجموع الكلي,,,,",null,{"$f":"IF(AND(B8<>\"\",COUNTIF($B$6:B8,B8)=1),COUNTIF($B$6:$B$76,B8),\"\")","v":1}]
[4,"احمد محمد علي عثمان","الماني","علمي","زراعة","زراعي","مسلم","فيزياء","كيمياء","احياء","ميكانيكا",2,"نظامي",{"$error":"#VALUE!"},null,null,null,null,null,null,null,null,null,null,null,null,"المواطنة وحقوق الانسان",null,",,,,,,,,,,,,,المواطنة وحقوق الانسان,",null,{"$f":"IF(AND(B9<>\"\",COUNTIF($B$6:B9,B9)=1),COUNTIF($B$6:$B$76,B9),\"\")","v":1}]
[5,"اسلام محمود خميس محمود","فرنسي","علمي","زراعة","مسرح","مسلم","فيزياء","كيمياء","احياء","ميكانيكا",5,"نظامي",{"$error":"#VALUE!"},null,"اللغة الانجليزية",null,null,"التفاضل وحساب المثلثات",null,null,null,null,null,null,null,null,null,",اللغة الانجليزية,,,التفاضل وحساب المثلثات,,,,,,,,,,",null,{"$f":"IF(AND(B10<>\"\",COUNTIF($B$6:B10,B10)=1),COUNTIF($B$6:$B$76,B10),\"\")","v":1}]
{"$rows_left_out":69}
{"sheet":"names","index":1,"n_rows":101,"n_cols":39,"rows_kept":101,"cut":false,"hidden":false,"merged":[[2,19,3,23],[2,15,2,18],[2,10,3,14],[3,0,4,0],[2,1,4,1],[2,8,4,8],[2,9,4,9],[2,7,4,7],[2,6,4,6],[2,2,4,2],[2,4,4,4],[2,5,4,5],[2,34,2,37],[26,32,26,34],[27,32,27,34],[28,32,28,34],[80,3,80,6],[2,27,4,27],[80,9,80,28],[2,26,4,26],[2,3,4,3],[79,7,81,8],[79,9,79,28],[79,3,79,6],[2,24,4,24],[2,25,4,25],[2,28,4,28],[78,3,78,28]]}
[]
[]
["م","رقم الجلوس","الاسم","الفصل","اللغة الثانية","المجال","النشاط","الحالة","التخصص","الديانة","مواد الرسوب",null,null,null,null,"علمي/ادبي",null,null,null,"مواد الرسوب",null,null,null,null,"مواد الرسوب","مواد رفع المجموع","المجموعة","رقم اللجنة","مقر اللجنة",null,null,null,null,null,"الصف الثاني"]
[null,null,null,null,"اللغة الثانية","التكنولوجيا",null,null,null,null,null,null,null,null,null,"تاريخ","جغرافيا","علم نفس","فلسفة ومنطق",null,null,null,null,null,null,null,null,null,null,null,null,null,null,null,null,{"$f":"COUNT(AJ6:AJ25)","v":5}]
[null,null,null,null,null,null,null,null,null,null,"عربي","انجليزي","اللغة الثانية","الجبر","التفاضل وحساب المثلثات","الاحياء","الكيمياء","الفيزياء","الميكانيكا","المجموع الكلي","الحاسب الالي","دين","المواطنة","التربية المهنية",null,null,null,null,null,"المكرر",null,null,"م","من","إلى","العدد","المجموعة","رقم اللجنة","مقر اللجنة"]
[1,110,"احمد جمال عبد المتعال احمد",5,"فرنسي","زراعة","زراعي","نظامي","علمي","مسلم",null,null,null,null,null,null,"الكيمياء",null,null,null,null,null,null,null,",,,,,,,الكيمياء,,,,,,,","عربي انجليزي فلسفة",{"$f":"IF(C6=\"\",\"\",INDEX($AK$6:$AK$25,MATCH(AB6,$AL$6:$AL$25,0)))","v":"العلمية"},1,"1-1",{"$f":"IF(AND(C6<>\"\",COUNTIF($C$6:C6,C6)=1),COUNTIF($C$6:$C$101,C6),\"\")","v":1},null,null,1,110,186,15,"العلمية",1,"1-1"]
[2,115,"احمد عادل زكي موسي","منازل","فرنسي","زراعة","زراعي","منازل","علمي","مسلم","اللغة العربية","اللغة الانجليزية","اللغة الثانية",null,"التفاضل وحساب المثلثات","الاحياء","الكيمياء",null,"الميكانيكا","المجموع الكلي","الحاسب الالي","التربية الدينية",null,"التربية المهنية","اللغة العربية,اللغة الانجليزية,اللغة الثانية,,التفاضل وحساب المثلثات,,الاحياء,الكيمياء,,الميكانيكا,المجموع الكلي,الحاسب الالي,التربية الدينية,,التربية المهنية",null,"العلمية",1,"1-1",{"$f":"IF(AND(C7<>\"\",COUNTIF($C$6:C7,C7)=1),COUNTIF($C$6:$C$101,C7),\"\")","v":1},null,null,2,189,294,14,"العلمية",2,"2-1"]
[3,123,"احمد محمد سعيد احمد",2,"الماني","زراعة","مسرح","نظامي","علمي","مسلم",null,null,"اللغة الثانية",null,null,null,"الكيمياء","الفيزياء","الميكانيكا","المجموع الكلي",null,null,null,null,",,اللغة الثانية,,,,,الكيمياء,الفيزياء,الميكانيكا,المجموع الكلي,,,,",null,"العلمية",1,"1-1",{"$f":"IF(AND(C8<>\"\",COUNTIF($C$6:C8,C8)=1),COUNTIF($C$6:$C$101,C8),\"\")","v":1},null,null,3,305,337,14,"الادبية",3,"3-1"]
[4,125,"احمد محمد علي عثمان",2,"الماني","زراعة","زراعي","نظامي","علمي","مسلم",null,null,null,null,null,null,null,null,null,null,null,null,"المواطنة وحقوق الانسان",null,",,,,,,,,,,,,,المواطنة وحقوق الانسان,",null,"العلمية",1,"1-1",{"$f":"IF(AND(C9<>\"\",COUNTIF($C$6:C9,C9)=1),COUNTIF($C$6:$C$101,C9),\"\")","v":1},null,null,4,338,359,14,"الادبية",4,"4-1"]
[5,136,"اسلام محمود خميس محمود",5,"فرنسي","زراعة","مسرح","نظامي","علمي","مسلم",null,"اللغة الانجليزية",null,null,"التفاضل وحساب المثلثات",null,null,null,null,null,null,null,null,null,",اللغة الانجليزية,,,التفاضل وحساب المثلثات,,,,,,,,,,",null,"العلمية",1,"1-1",{"$f":"IF(AND(C10<>\"\",COUNTIF($C$6:C10,C10)=1),COUNTIF($C$6:$C$101,C10),\"\")","v":1},null,null,5,360,394,14,"الادبية",5,"5-1"]
{"$rows_left_out":92}
{"sheet":"legan (2)","index":2,"n_rows":27,"n_cols":17,"rows_kept":27,"cut":false,"hidden":true,"merged":[[30,5,30,8],[1,2,1,3],[2,2,2,3],[3,2,3,8],[1,6,1,8],[2,6,2,8],[24,2,26,3]]}
[null,null,null,{"$f":"SUM(IF(ISNUMBER(FIND($M$3,names!$Y$6:$Y$76)),1,0))","v":7},"count"]
[null,null,"إدارة أسيوط التعليميـة",null,null,null,"الصـف الثانـي الثانـوي",null,null,null,null,null,"اسم المادة"]
[null,null,"مدرسة المشير الثانوية بنين",null,null,null,"امتحان الدور  الثاني 2019",null,null,null,null,null,"اللغة الثانية"]
[null,null,{"$f":"\"كشف باسماء الطلاب الممتحنين نظامي/ منازل \nفي مادة ( \"&$M$3&\"  ) \nالدور الثاني للعام الدراسي (2019 / 2018)\"","v":"كشف باسماء الطلاب الممتحنين نظامي/ منازل \nفي مادة ( اللغة الثانية  ) \nالدور الثاني للعام الدراسي (2019 / 2018)"}]
[null,null,null,null,null,null,null,null,null,null,null,null,null,null,null,null,"اللغة العربية"]
[null,null,null,null,"لجنة رقم","مقر اللجنة","العدد","الشعبة",null,null,null,null,null,null,null,null,"اللغة الانجليزية"]
[null,null,null,null,null,null,null,null,null,null,null,null,null,null,null,null,"اللغة الثانية"]
[null,null,"م","الاسم","رقم الجلوس","اللغة الثانية","الديانة","الحالة","ملاحظات",null,null,null,null,null,null,null,"الجبر"]
[null,null,{"$f":"IF(D9=\"\",\"\",MAX($C$8:C8)+1)","v":1},{"$f":"IF(ROWS($A$1:A1)>$D$1,\"\",INDEX(names!C$6:C$76,SMALL(IF(ISNUMBER(FIND($M$3,names!$Y$6:$Y$76)),ROW($Y$6:$Y$76)-ROW($Y$6)+1),ROWS($A$1:A1))))","v":"احمد عادل زكي موسي"},{"$f":"IF(ROWS($A$1:A1)>$D$1,\"\",INDEX(names!B$6:B$76,SMALL(IF(ISNUMBER(FIND($M$3,names!$Y$6:$Y$76)),ROW($Y$6:$Y$76)-ROW($Y$6)+1),ROWS($A$1:A1))))","v":115},{"$f":"IF(ROWS($A$1:A1)>$D$1,\"\",INDEX(names!E$6:E$76,SMALL(IF(ISNUMBER(FIND($M$3,names!$Y$6:$Y$76)),ROW($Y$6:$Y$76)-ROW($Y$6)+1),ROWS($A$1:A1))))","v":"فرنسي"},{"$f":"IF(ROWS($A$1:B1)>$D$1,\"\",INDEX(names!J$6:J$76,SMALL(IF(ISNUMBER(FIND($M$3,names!$Y$6:$Y$76)),ROW($Y$6:$Y$76)-ROW($Y$6)+1),ROWS($A$1:B1))))","v":"مسلم"},{"$f":"IF(ROWS($A$1:C1)>$D$1,\"\",INDEX(names!H$6:H$76,SMALL(IF(ISNUMBER(FIND($M$3,names!$Y$6:$Y$76)),ROW($Y$6:$Y$76)-ROW($Y$6)+1),ROWS($A$1:C1))))","v":"منازل"},null,null,null,null,null,null,null,null,"التفاضل وحساب المثلثات"]
[null,null,{"$f":"IF(D10=\"\",\"\",MAX($C$8:C9)+1)","v":2},{"$f":"IF(ROWS($A$1:A2)>$D$1,\"\",INDEX(names!C$6:C$76,SMALL(IF(ISNUMBER(FIND($M$3,names!$Y$6:$Y$76)),ROW($Y$6:$Y$76)-ROW($Y$6)+1),ROWS($A$1:A2))))","v":"احمد محمد سعيد احمد"},{"$f":"IF(ROWS($A$1:A2)>$D$1,\"\",INDEX(names!B$6:B$76,SMALL(IF(ISNUMBER(FIND($M$3,names!$Y$6:$Y$76)),ROW($Y$6:$Y$76)-ROW($Y$6)+1),ROWS($A$1:A2))))","v":123},{"$f":"IF(ROWS($A$1:A2)>$D$1,\"\",INDEX(names!E$6:E$76,SMALL(IF(ISNUMBER(FIND($M$3,names!$Y$6:$Y$76)),ROW($Y$6:$Y$76)-ROW($Y$6)+1),ROWS($A$1:A2))))","v":"الماني"},{"$f":"IF(ROWS($A$1:B2)>$D$1,\"\",INDEX(names!J$6:J$76,SMALL(IF(ISNUMBER(FIND($M$3,names!$Y$6:$Y$76)),ROW($Y$6:$Y$76)-ROW($Y$6)+1),ROWS($A$1:B2))))","v":"مسلم"},{"$f":"IF(ROWS($A$1:C2)>$D$1,\"\",INDEX(names!H$6:H$76,SMALL(IF(ISNUMBER(FIND($M$3,names!$Y$6:$Y$76)),ROW($Y$6:$Y$76)-ROW($Y$6)+1),ROWS($A$1:C2))))","v":"نظامي"},null,null,null,null,null,null,null,null,"الاحياء"]
{"$rows_left_out":18}
{"sheet":"Salim","index":3,"n_rows":27,"n_cols":17,"rows_kept":27,"cut":false,"hidden":false,"merged":[[30,5,30,8],[1,2,1,3],[1,6,1,8],[2,2,2,3],[2,6,2,8],[3,2,3,8],[24,2,26,3]]}
[null,null,null,15,"count"]
[null,null,"إدارة أسيوط التعليميـة",null,null,null,"الصـف الثانـي الثانـوي",null,null,null,null,null,"اسم المادة"]
[null,null,"مدرسة المشير الثانوية بنين",null,null,null,"امتحان الدور  الثاني 2019",null,null,null,null,null,"اللغة العربية"]
[null,null,{"$f":"\"كشف باسماء الطلاب الممتحنين نظامي/ منازل \nفي مادة ( \"&$M$3&\"  ) \nالدور الثاني للعام الدراسي (2019 / 2018)\"","v":"كشف باسماء الطلاب الممتحنين نظامي/ منازل \nفي مادة ( اللغة العربية  ) \nالدور الثاني للعام الدراسي (2019 / 2018)"}]
[null,null,null,null,null,null,null,null,null,null,null,null,null,null,null,null,"اللغة العربية"]
[null,null,null,null,"لجنة رقم","مقر اللجنة","العدد","الشعبة",null,null,null,null,null,null,null,null,"اللغة الانجليزية"]
[null,null,null,null,null,null,null,null,null,null,null,null,null,null,null,null,"اللغة الثانية"]
[null,null,"م","الاسم","رقم الجلوس","اللغة الثانية","الديانة","الحالة","ملاحظات",null,null,null,null,null,null,null,"الجبر"]
[null,null,2,"احمد عادل زكي موسي",115,"فرنسي","مسلم","منازل",null,null,null,null,null,null,null,null,"التفاضل وحساب المثلثات"]
[null,null,7,"بيتر جمال نصيف حنا",146,"فرنسي","مسيحي","نظامي",null,null,null,null,null,null,null,null,"الاحياء"]
{"$rows_left_out":18}
{"sheet":"legan","index":4,"n_rows":27,"n_cols":20,"rows_kept":27,"cut":false,"hidden":true,"merged":[[31,5,31,9],[1,2,1,3],[1,7,1,9],[24,2,26,3],[30,5,30,9],[2,2,2,3],[2,7,2,9],[3,2,3,9]]}
[]
[null,null,"إدارة أسيوط التعليميـة",null,null,null,null,"الصـف الثانـي الثانـوي",null,null,null,null,null,"رقم اللجنة","من","إلى","العدد","المجموعة","رقم اللجنة","مقر اللجنة"]
[null,null,"مدرسة المشير الثانوية بنين",null,null,null,null,"امتحان الدور  الثاني 2019",null,null,null,null,null,1,{"$f":"IF(N3>names!AJ4,\"\",INDEX(names!$AH6:$AH$25,MATCH($N$3,names!$AL$6:$AL$76,0)))","v":110},{"$f":"IF(N3>names!AJ4,\"\",INDEX(names!$AI6:$AI$25,MATCH($N$3,names!$AL$6:$AL$76,0)))","v":186},{"$f":"IF(N3>names!AJ4,\"\",INDEX(names!$AJ6:$AJ$25,MATCH($N$3,names!$AL$6:$AL$76,0)))","v":15},{"$f":"IF(N3>names!AJ4,\"\",INDEX(names!$AK6:$AK$25,MATCH($N$3,names!$AL$6:$AL$76,0)))","v":"العلمية"},{"$f":"IF(N3>names!AJ4,\"\",INDEX(names!$AL6:$AL$25,MATCH($N$3,names!$AL$6:$AL$76,0)))","v":1},{"$f":"IF(N3>names!AJ4,\"\",INDEX(names!$AM6:$AM$25,MATCH($N$3,names!$AL$6:$AL$76,0)))","v":"1-1"}]
[null,null,{"$f":"IF(R3=\"العلمية\",\"المجموعة الاولي العلمية\",\"المجموعة الثانية الادبية\") &\"(\"& IF(R3=\"العلمية\",\"أحيــاء - كيميــاء - فيزياء - ميكانيكا\",\"فلسفة - تاريخ - علم نفس - جغرافيا\")&\")\"","v":"المجموعة الاولي العلمية(أحيــاء - كيميــاء - فيزياء - ميكانيكا)"}]
[]
[null,null,null,null,"لجنة رقم","مقر اللجنة","العدد","الشعبة",null,"ارقام الجلوس"]
[null,null,null,null,{"$f":"N3","v":1},{"$f":"T3","v":"1-1"},{"$f":"Q3","v":15},{"$f":"R3","v":"العلمية"},null,{"$f":"$O$3 & \":\"& $P$3","v":"110:186"}]
[null,null,"م","الاسم","رقم الجلوس","اللغة الثانية","الديانة","الحالة","مواد الرسوب","مواد رفع المجموع"]
[null,null,{"$f":"IF($N$3>names!$AJ$4,\"\",IF(ROW()-8<=$Q$3,ROW()-8,\"\"))","v":1},{"$f":"IF(C9=\"\",\"\",INDEX(names!$C6:$C$76,MATCH($N$3,names!$AB$6:$AB$76,0)))","v":"احمد جمال عبد المتعال احمد"},{"$f":"IF($N$3>names!$AJ$4,\"\",INDEX(names!$B6:$B$76,MATCH($N$3,names!$AB$6:$AB$76,0)))","v":110},{"$f":"IF(C9=\"\",\"\",INDEX(names!$E6:$E$76,MATCH($N$3,names!$AB$6:$AB$76,0)))","v":"فرنسي"},{"$f":"IF(C9=\"\",\"\",INDEX(names!$J6:$J$76,MATCH($N$3,names!$AB$6:$AB$76,0)))","v":"مسلم"},{"$f":"IF(C9=\"\",\"\",INDEX(names!$H6:$H$76,MATCH($N$3,names!$AB$6:$AB$76,0)))","v":"نظامي"},{"$f":"IF(C9=\"\",\"\",INDEX(names!$Y6:$Y$76,MATCH($N$3,names!$AB$6:$AB$76,0)))","v":",,,,,,,الكيمياء,,,,,,,"},{"$f":"IF(C9=\"\",\"\",INDEX(names!$Z6:$Z$76,MATCH($N$3,names!$AB$6:$AB$76,0)))","v":"عربي انجليزي فلسفة"}]
[null,null,{"$f":"IF($N$3>names!$AJ$4,\"\",IF(ROW()-8<=$Q$3,ROW()-8,\"\"))","v":2},{"$f":"IF(C10=\"\",\"\",INDEX(names!$C7:$C$76,MATCH($N$3,names!$AB$6:$AB$76,0)))","v":"احمد عادل زكي موسي"},{"$f":"IF($N$3>names!$AJ$4,\"\",INDEX(names!$B7:$B$76,MATCH($N$3,names!$AB$6:$AB$76,0)))","v":115},{"$f":"IF(C10=\"\",\"\",INDEX(names!$E7:$E$76,MATCH($N$3,names!$AB$6:$AB$76,0)))","v":"فرنسي"},{"$f":"IF(C10=\"\",\"\",INDEX(names!$J7:$J$76,MATCH($N$3,names!$AB$6:$AB$76,0)))","v":"مسلم"},{"$f":"IF(C10=\"\",\"\",INDEX(names!$H7:$H$76,MATCH($N$3,names!$AB$6:$AB$76,0)))","v":"منازل"},{"$f":"IF(C10=\"\",\"\",INDEX(names!$Y7:$Y$76,MATCH($N$3,names!$AB$6:$AB$76,0)))","v":"اللغة العربية,اللغة الانجليزية,اللغة الثانية,,التفاضل وحساب المثلثات,,الاحياء,الكيمياء,,الميكانيكا,المجموع الكلي,الحاسب الالي,التربية الدينية,,التربية المهنية"},{"$f":"IF(C10=\"\",\"\",INDEX(names!$Z7:$Z$76,MATCH($N$3,names!$AB$6:$AB$76,0)))","v":0}]
{"$rows_left_out":17}