{"text_format":"1","workbook":"xlsx","n_sheets":2,"sheets":["Salim","Data"],"not_rendered":{"charts":0,"images":0,"macros":1,"external_links":0,"defined_names":0,"comments":0,"pivot_tables":0},"unopened":[],"bounds":{"document_bytes":16777216,"sheet_cells":100000,"rows_first":2000,"rows_last":500,"rows_between":2000,"halvings":0,"cell_chars":16384,"cell_head_chars":4096},"cells_cut":0,"cells_raw":0,"read":"whole","date_system":"1900"}

{"sheet":"Salim","index":0,"n_rows":232,"n_cols":5,"rows_kept":232,"cut":false,"hidden":false,"merged":[]}
["الصنف","الترجمة",null,null,"معادلة عادية"]
[1,"الاول",{"$f":"IF(A2=\"\",\"\",IF(N(A2)<=0,\"غير صالح\",OrdeUP100(A2)))","v":"الأوّل"},null,{"$f":"IF(A2=\"\",\"\",IF(ISNUMBER(A2)=TRUE,VLOOKUP($A2,Data!$B$3:$C$1000,2,0),\"غير صالح\"))","v":"الأول"}]
[3,"الثالث",{"$f":"IF(A3=\"\",\"\",IF(N(A3)<=0,\"غير صالح\",OrdeUP100(A3)))","v":"الثّالث"},null,{"$f":"IF(A3=\"\",\"\",IF(ISNUMBER(A3)=TRUE,VLOOKUP($A3,Data!$B$3:$C$1000,2,0),\"غير صالح\"))","v":"الثالث"}]
[4,"الرابع","الرّابع",null,{"$f":"IF(A4=\"\",\"\",IF(ISNUMBER(A4)=TRUE,VLOOKUP($A4,Data!$B$3:$C$1000,2,0),\"غير صالح\"))","v":"الرابع "}]
["EE","غير صالح","غير صالح",null,{"$f":"IF(A5=\"\",\"\",IF(ISNUMBER(A5)=TRUE,VLOOKUP($A5,Data!$B$3:$C$1000,2,0),\"غير صالح\"))","v":"غير صالح"}]
[25,null,"ЗбОЗгУ жЗбЪФСжд",null,{"$f":"IF(A6=\"\",\"\",IF(ISNUMBER(A6)=TRUE,VLOOKUP($A6,Data!$B$3:$C$1000,2,0),\"غير صالح\"))","v":"الخامس والعشرون"}]
[null,null,"",null,{"$f":"IF(A7=\"\",\"\",IF(ISNUMBER(A7)=TRUE,VLOOKUP($A7,Data!$B$3:$C$1000,2,0),\"غير صالح\"))","v":""}]
[null,null,"",null,{"$f":"IF(A8=\"\",\"\",IF(ISNUMBER(A8)=TRUE,VLOOKUP($A8,Data!$B$3:$C$1000,2,0),\"غير صالح\"))","v":""}]
[null,null,"",null,{"$f":"IF(A9=\"\",\"\",IF(ISNUMBER(A9)=TRUE,VLOOKUP($A9,Data!$B$3:$C$1000,2,0),\"غير صالح\"))","v":""}]
[null,null,""]
[null,null,"",null,{"$f":"IF(A11=\"\",\"\",IF(ISNUMBER(A11)=TRUE,VLOOKUP($A11,Data!$B$3:$C$1000,2,0),\"غير صالح\"))","v":""}]
[null,null,"",null,{"$f":"IF(A12=\"\",\"\",IF(ISNUMBER(A12)=TRUE,VLOOKUP($A12,Data!$B$3:$C$1000,2,0),\"غير صالح\"))","v":""}]
[null,null,"",null,{"$f":"IF(A13=\"\",\"\",IF(ISNUMBER(A13)=TRUE,VLOOKUP($A13,Data!$B$3:$C$1000,2,0),\"غير صالح\"))","v":""}]
[null,null,"",null,{"$f":"IF(A14=\"\",\"\",IF(ISNUMBER(A14)=TRUE,VLOOKUP($A14,Data!$B$3:$C$1000,2,0),\"غير صالح\"))","v":""}]
[null,null,null,null,{"$f":"IF(A15=\"\",\"\",IF(ISNUMBER(A15)=TRUE,VLOOKUP($A15,Data!$B$3:$C$1000,2,0),\"غير صالح\"))","v":""}]
[null,null,null,null,{"$f":"IF(A16=\"\",\"\",IF(ISNUMBER(A16)=TRUE,VLOOKUP($A16,Data!$B$3:$C$1000,2,0),\"غير صالح\"))","v":""}]
[null,null,null,null,{"$f":"IF(A17=\"\",\"\",IF(ISNUMBER(A17)=TRUE,VLOOKUP($A17,Data!$B$3:$C$1000,2,0),\"غير صالح\"))","v":""}]
[null,null,null,null,{"$f":"IF(A18=\"\",\"\",IF(ISNUMBER(A18)=TRUE,VLOOKUP($A18,Data!$B$3:$C$1000,2,0),\"غير صالح\"))","v":""}]
[null,null,null,null,{"$f":"IF(A19=\"\",\"\",IF(ISNUMBER(A19)=TRUE,VLOOKUP($A19,Data!$B$3:$C$1000,2,0),\"غير صالح\"))","v":""}]
[null,null,null,null,{"$f":"IF(A20=\"\",\"\",IF(ISNUMBER(A20)=TRUE,VLOOKUP($A20,Data!$B$3:$C$1000,2,0),\"غير صالح\"))","v":""}]
[null,null,null,null,{"$f":"IF(A21=\"\",\"\",IF(ISNUMBER(A21)=TRUE,VLOOKUP($A21,Data!$B$3:$C$1000,2,0),\"غير صالح\"))","v":""}]
[null,null,null,null,{"$f":"IF(A22=\"\",\"\",IF(ISNUMBER(A22)=TRUE,VLOOKUP($A22,Data!$B$3:$C$1000,2,0),\"غير صالح\"))","v":""}]
[null,null,null,null,{"$f":"IF(A23=\"\",\"\",IF(ISNUMBER(A23)=TRUE,VLOOKUP($A23,Data!$B$3:$C$1000,2,0),\"غير صالح\"))","v":""}]
[null,null,null,null,{"$f":"IF(A24=\"\",\"\",IF(ISNUMBER(A24)=TRUE,VLOOKUP($A24,Data!$B$3:$C$1000,2,0),\"غير صالح\"))","v":""}]
[null,null,null,null,{"$f":"IF(A25=\"\",\"\",IF(ISNUMBER(A25)=TRUE,VLOOKUP($A25,Data!$B$3:$C$1000,2,0),\"غير صالح\"))","v":""}]
[null,null,null,null,{"$f":"IF(A26=\"\",\"\",IF(ISNUMBER(A26)=TRUE,VLOOKUP($A26,Data!$B$3:$C$1000,2,0),\"غير صالح\"))","v":""}]
[null,null,null,null,{"$f":"IF(A27=\"\",\"\",IF(ISNUMBER(A27)=TRUE,VLOOKUP($A27,Data!$B$3:$C$1000,2,0),\"غير صالح\"))","v":""}]
[null,null,null,null,{"$f":"IF(A28=\"\",\"\",IF(ISNUMBER(A28)=TRUE,VLOOKUP($A28,Data!$B$3:$C$1000,2,0),\"غير صالح\"))","v":""}]
[null,null,null,null,{"$f":"IF(A29=\"\",\"\",IF(ISNUMBER(A29)=TRUE,VLOOKUP($A29,Data!$B$3:$C$1000,2,0),\"غير صالح\"))","v":""}]
[null,null,null,null,{"$f":"IF(A30=\"\",\"\",IF(ISNUMBER(A30)=TRUE,VLOOKUP($A30,Data!$B$3:$C$1000,2,0),\"غير صالح\"))","v":""}]
[null,null,null,null,{"$f":"IF(A31=\"\",\"\",IF(ISNUMBER(A31)=TRUE,VLOOKUP($A31,Data!$B$3:$C$1000,2,0),\"غير صالح\"))","v":""}]
[null,null,null,null,{"$f":"IF(A32=\"\",\"\",IF(ISNUMBER(A32)=TRUE,VLOOKUP($A32,Data!$B$3:$C$1000,2,0),\"غير صالح\"))","v":""}]
[null,null,null,null,{"$f":"IF(A33=\"\",\"\",IF(ISNUMBER(A33)=TRUE,VLOOKUP($A33,Data!$B$3:$C$1000,2,0),\"غير صالح\"))","v":""}]
[null,null,null,null,{"$f":"IF(A34=\"\",\"\",IF(ISNUMBER(A34)=TRUE,VLOOKUP($A34,Data!$B$3:$C$1000,2,0),\"غير صالح\"))","v":""}]
[null,null,null,null,{"$f":"IF(A35=\"\",\"\",IF(ISNUMBER(A35)=TRUE,VLOOKUP($A35,Data!$B$3:$C$1000,2,0),\"غير صالح\"))","v":""}]
[null,null,null,null,{"$f":"IF(A36=\"\",\"\",IF(ISNUMBER(A36)=TRUE,VLOOKUP($A36,Data!$B$3:$C$1000,2,0),\"غير صالح\"))","v":""}]
[null,null,null,null,{"$f":"IF(A37=\"\",\"\",IF(ISNUMBER(A37)=TRUE,VLOOKUP($A37,Data!$B$3:$C$1000,2,0),\"غير صالح\"))","v":""}]
[null,null,null,null,{"$f":"IF(A38=\"\",\"\",IF(ISNUMBER(A38)=TRUE,VLOOKUP($A38,Data!$B$3:$C$1000,2,0),\"غير صالح\"))","v":""}]
[null,null,null,null,{"$f":"IF(A39=\"\",\"\",IF(ISNUMBER(A39)=TRUE,VLOOKUP($A39,Data!$B$3:$C$1000,2,0),\"غير صالح\"))","v":""}]
[null,null,null,null,{"$f":"IF(A40=\"\",\"\",IF(ISNUMBER(A40)=TRUE,VLOOKUP($A40,Data!$B$3:$C$1000,2,0),\"غير صالح\"))","v":""}]
[null,null,null,null,{"$f":"IF(A41=\"\",\"\",IF(ISNUMBER(A41)=TRUE,VLOOKUP($A41,Data!$B$3:$C$1000,2,0),\"غير صالح\"))","v":""}]
[null,null,null,null,{"$f":"IF(A42=\"\",\"\",IF(ISNUMBER(A42)=TRUE,VLOOKUP($A42,Data!$B$3:$C$1000,2,0),\"غير صالح\"))","v":""}]
[null,null,null,null,{"$f":"IF(A43=\"\",\"\",IF(ISNUMBER(A43)=TRUE,VLOOKUP($A43,Data!$B$3:$C$1000,2,0),\"غير صالح\"))","v":""}]
[null,null,null,null,{"$f":"IF(A44=\"\",\"\",IF(ISNUMBER(A44)=TRUE,VLOOKUP($A44,Data!$B$3:$C$1000,2,0),\"غير صالح\"))","v":""}]
[null,null,null,null,{"$f":"IF(A45=\"\",\"\",IF(ISNUMBER(A45)=TRUE,VLOOKUP($A45,Data!$B$3:$C$1000,2,0),\"غير صالح\"))","v":""}]
[null,null,null,null,{"$f":"IF(A46=\"\",\"\",IF(ISNUMBER(A46)=TRUE,VLOOKUP($A46,Data!$B$3:$C$1000,2,0),\"غير صالح\"))","v":""}]
[null,null,null,null,{"$f":"IF(A47=\"\",\"\",IF(ISNUMBER(A47)=TRUE,VLOOKUP($A47,Data!$B$3:$C$1000,2,0),\"غير صالح\"))","v":""}]
[null,null,null,null,{"$f":"IF(A48=\"\",\"\",IF(ISNUMBER(A48)=TRUE,VLOOKUP($A48,Data!$B$3:$C$1000,2,0),\"غير صالح\"))","v":""}]
[null,null,null,null,{"$f":"IF(A49=\"\",\"\",IF(ISNUMBER(A49)=TRUE,VLOOKUP($A49,Data!$B$3:$C$1000,2,0),\"غير صالح\"))","v":""}]
[null,null,null,null,{"$f":"IF(A50=\"\",\"\",IF(ISNUMBER(A50)=TRUE,VLOOKUP($A50,Data!$B$3:$C$1000,2,0),\"غير صالح\"))","v":""}]
[null,null,null,null,{"$f":"IF(A51=\"\",\"\",IF(ISNUMBER(A51)=TRUE,VLOOKUP($A51,Data!$B$3:$C$1000,2,0),\"غير صالح\"))","v":""}]
[null,null,null,null,{"$f":"IF(A52=\"\",\"\",IF(ISNUMBER(A52)=TRUE,VLOOKUP($A52,Data!$B$3:$C$1000,2,0),\"غير صالح\"))","v":""}]
[null,null,null,null,{"$f":"IF(A53=\"\",\"\",IF(ISNUMBER(A53)=TRUE,VLOOKUP($A53,Data!$B$3:$C$1000,2,0),\"غير صالح\"))","v":""}]
[null,null,null,null,{"$f":"IF(A54=\"\",\"\",IF(ISNUMBER(A54)=TRUE,VLOOKUP($A54,Data!$B$3:$C$1000,2,0),\"غير صالح\"))","v":""}]
[null,null,null,null,{"$f":"IF(A55=\"\",\"\",IF(ISNUMBER(A55)=TRUE,VLOOKUP($A55,Data!$B$3:$C$1000,2,0),\"غير صالح\"))","v":""}]
[null,null,null,null,{"$f":"IF(A56=\"\",\"\",IF(ISNUMBER(A56)=TRUE,VLOOKUP($A56,Data!$B$3:$C$1000,2,0),\"غير صالح\"))","v":""}]
[null,null,null,null,{"$f":"IF(A57=\"\",\"\",IF(ISNUMBER(A57)=TRUE,VLOOKUP($A57,Data!$B$3:$C$1000,2,0),\"غير صالح\"))","v":""}]
[null,null,null,null,{"$f":"IF(A58=\"\",\"\",IF(ISNUMBER(A58)=TRUE,VLOOKUP($A58,Data!$B$3:$C$1000,2,0),\"غير صالح\"))","v":""}]
[null,null,null,null,{"$f":"IF(A59=\"\",\"\",IF(ISNUMBER(A59)=TRUE,VLOOKUP($A59,Data!$B$3:$C$1000,2,0),\"غير صالح\"))","v":""}]
[null,null,null,null,{"$f":"IF(A60=\"\",\"\",IF(ISNUMBER(A60)=TRUE,VLOOKUP($A60,Data!$B$3:$C$1000,2,0),\"غير صالح\"))","v":""}]
[null,null,null,null,{"$f":"IF(A61=\"\",\"\",IF(ISNUMBER(A61)=TRUE,VLOOKUP($A61,Data!$B$3:$C$1000,2,0),\"غير صالح\"))","v":""}]
[null,null,null,null,{"$f":"IF(A62=\"\",\"\",IF(ISNUMBER(A62)=TRUE,VLOOKUP($A62,Data!$B$3:$C$1000,2,0),\"غير صالح\"))","v":""}]
[null,null,null,null,{"$f":"IF(A63=\"\",\"\",IF(ISNUMBER(A63)=TRUE,VLOOKUP($A63,Data!$B$3:$C$1000,2,0),\"غير صالح\"))","v":""}]
[null,null,null,null,{"$f":"IF(A64=\"\",\"\",IF(ISNUMBER(A64)=TRUE,VLOOKUP($A64,Data!$B$3:$C$1000,2,0),\"غير صالح\"))","v":""}]
[null,null,null,null,{"$f":"IF(A65=\"\",\"\",IF(ISNUMBER(A65)=TRUE,VLOOKUP($A65,Data!$B$3:$C$1000,2,0),\"غير صالح\"))","v":""}]
[null,null,null,null,{"$f":"IF(A66=\"\",\"\",IF(ISNUMBER(A66)=TRUE,VLOOKUP($A66,Data!$B$3:$C$1000,2,0),\"غير صالح\"))","v":""}]
[null,null,null,null,{"$f":"IF(A67=\"\",\"\",IF(ISNUMBER(A67)=TRUE,VLOOKUP($A67,Data!$B$3:$C$1000,2,0),\"غير صالح\"))","v":""}]
[null,null,null,null,{"$f":"IF(A68=\"\",\"\",IF(ISNUMBER(A68)=TRUE,VLOOKUP($A68,Data!$B$3:$C$1000,2,0),\"غير صالح\"))","v":""}]
[null,null,null,null,{"$f":"IF(A69=\"\",\"\",IF(ISNUMBER(A69)=TRUE,VLOOKUP($A69,Data!$B$3:$C$1000,2,0),\"غير صالح\"))","v":""}]
[null,null,null,null,{"$f":"IF(A70=\"\",\"\",IF(ISNUMBER(A70)=TRUE,VLOOKUP($A70,Data!$B$3:$C$1000,2,0),\"غير صالح\"))","v":""}]
[null,null,null,null,{"$f":"IF(A71=\"\",\"\",IF(ISNUMBER(A71)=TRUE,VLOOKUP($A71,Data!$B$3:$C$1000,2,0),\"غير صالح\"))","v":""}]
[null,null,null,null,{"$f":"IF(A72=\"\",\"\",IF(ISNUMBER(A72)=TRUE,VLOOKUP($A72,Data!$B$3:$C$1000,2,0),\"غير صالح\"))","v":""}]
[null,null,null,null,{"$f":"IF(A73=\"\",\"\",IF(ISNUMBER(A73)=TRUE,VLOOKUP($A73,Data!$B$3:$C$1000,2,0),\"غير صالح\"))","v":""}]
[null,null,null,null,{"$f":"IF(A74=\"\",\"\",IF(ISNUMBER(A74)=TRUE,VLOOKUP($A74,Data!$B$3:$C$1000,2,0),\"غير صالح\"))","v":""}]
[null,null,null,null,{"$f":"IF(A75=\"\",\"\",IF(ISNUMBER(A75)=TRUE,VLOOKUP($A75,Data!$B$3:$C$1000,2,0),\"غير صالح\"))","v":""}]
[null,null,null,null,{"$f":"IF(A76=\"\",\"\",IF(ISNUMBER(A76)=TRUE,VLOOKUP($A76,Data!$B$3:$C$1000,2,0),\"غير صالح\"))","v":""}]
[null,null,null,null,{"$f":"IF(A77=\"\",\"\",IF(ISNUMBER(A77)=TRUE,VLOOKUP($A77,Data!$B$3:$C$1000,2,0),\"غير صالح\"))","v":""}]
[null,null,null,null,{"$f":"IF(A78=\"\",\"\",IF(ISNUMBER(A78)=TRUE,VLOOKUP($A78,Data!$B$3:$C$1000,2,0),\"غير صالح\"))","v":""}]
[null,null,null,null,{"$f":"IF(A79=\"\",\"\",IF(ISNUMBER(A79)=TRUE,VLOOKUP($A79,Data!$B$3:$C$1000,2,0),\"غير صالح\"))","v":""}]
[null,null,null,null,{"$f":"IF(A80=\"\",\"\",IF(ISNUMBER(A80)=TRUE,VLOOKUP($A80,Data!$B$3:$C$1000,2,0),\"غير صالح\"))","v":""}]
[null,null,null,null,{"$f":"IF(A81=\"\",\"\",IF(ISNUMBER(A81)=TRUE,VLOOKUP($A81,Data!$B$3:$C$1000,2,0),\"غير صالح\"))","v":""}]
[null,null,null,null,{"$f":"IF(A82=\"\",\"\",IF(ISNUMBER(A82)=TRUE,VLOOKUP($A82,Data!$B$3:$C$1000,2,0),\"غير صالح\"))","v":""}]
[null,null,null,null,{"$f":"IF(A83=\"\",\"\",IF(ISNUMBER(A83)=TRUE,VLOOKUP($A83,Data!$B$3:$C$1000,2,0),\"غير صالح\"))","v":""}]
[null,null,null,null,{"$f":"IF(A84=\"\",\"\",IF(ISNUMBER(A84)=TRUE,VLOOKUP($A84,Data!$B$3:$C$1000,2,0),\"غير صالح\"))","v":""}]
[null,null,null,null,{"$f":"IF(A85=\"\",\"\",IF(ISNUMBER(A85)=TRUE,VLOOKUP($A85,Data!$B$3:$C$1000,2,0),\"غير صالح\"))","v":""}]
[null,null,null,null,{"$f":"IF(A86=\"\",\"\",IF(ISNUMBER(A86)=TRUE,VLOOKUP($A86,Data!$B$3:$C$1000,2,0),\"غير صالح\"))","v":""}]
[null,null,null,null,{"$f":"IF(A87=\"\",\"\",IF(ISNUMBER(A87)=TRUE,VLOOKUP($A87,Data!$B$3:$C$1000,2,0),\"غير صالح\"))","v":""}]
[null,null,null,null,{"$f":"IF(A88=\"\",\"\",IF(ISNUMBER(A88)=TRUE,VLOOKUP($A88,Data!$B$3:$C$1000,2,0),\"غير صالح\"))","v":""}]
[null,null,null,null,{"$f":"IF(A89=\"\",\"\",IF(ISNUMBER(A89)=TRUE,VLOOKUP($A89,Data!$B$3:$C$1000,2,0),\"غير صالح\"))","v":""}]
[null,null,null,null,{"$f":"IF(A90=\"\",\"\",IF(ISNUMBER(A90)=TRUE,VLOOKUP($A90,Data!$B$3:$C$1000,2,0),\"غير صالح\"))","v":""}]
[null,null,null,null,{"$f":"IF(A91=\"\",\"\",IF(ISNUMBER(A91)=TRUE,VLOOKUP($A91,Data!$B$3:$C$1000,2,0),\"غير صالح\"))","v":""}]
[null,null,null,null,{"$f":"IF(A92=\"\",\"\",IF(ISNUMBER(A92)=TRUE,VLOOKUP($A92,Data!$B$3:$C$1000,2,0),\"غير صالح\"))","v":""}]
[null,null,null,null,{"$f":"IF(A93=\"\",\"\",IF(ISNUMBER(A93)=TRUE,VLOOKUP($A93,Data!$B$3:$C$1000,2,0),\"غير صالح\"))","v":""}]
[null,null,null,null,{"$f":"IF(A94=\"\",\"\",IF(ISNUMBER(A94)=TRUE,VLOOKUP($A94,Data!$B$3:$C$1000,2,0),\"غير صالح\"))","v":""}]
[null,null,null,null,{"$f":"IF(A95=\"\",\"\",IF(ISNUMBER(A95)=TRUE,VLOOKUP($A95,Data!$B$3:$C$1000,2,0),\"غير صالح\"))","v":""}]
[null,null,null,null,{"$f":"IF(A96=\"\",\"\",IF(ISNUMBER(A96)=TRUE,VLOOKUP($A96,Data!$B$3:$C$1000,2,0),\"غير صالح\"))","v":""}]
[null,null,null,null,{"$f":"IF(A97=\"\",\"\",IF(ISNUMBER(A97)=TRUE,VLOOKUP($A97,Data!$B$3:$C$1000,2,0),\"غير صالح\"))","v":""}]
[null,null,null,null,{"$f":"IF(A98=\"\",\"\",IF(ISNUMBER(A98)=TRUE,VLOOKUP($A98,Data!$B$3:$C$1000,2,0),\"غير صالح\"))","v":""}]
[null,null,null,null,{"$f":"IF(A99=\"\",\"\",IF(ISNUMBER(A99)=TRUE,VLOOKUP($A99,Data!$B$3:$C$1000,2,0),\"غير صالح\"))","v":""}]
[null,null,null,null,{"$f":"IF(A100=\"\",\"\",IF(ISNUMBER(A100)=TRUE,VLOOKUP($A100,Data!$B$3:$C$1000,2,0),\"غير صالح\"))","v":""}]
[null,null,null,null,{"$f":"IF(A101=\"\",\"\",IF(ISNUMBER(A101)=TRUE,VLOOKUP($A101,Data!$B$3:$C$1000,2,0),\"غير صالح\"))","v":""}]
[null,null,null,null,{"$f":"IF(A102=\"\",\"\",IF(ISNUMBER(A102)=TRUE,VLOOKUP($A102,Data!$B$3:$C$1000,2,0),\"غير صالح\"))","v":""}]
[null,null,null,null,{"$f":"IF(A103=\"\",\"\",IF(ISNUMBER(A103)=TRUE,VLOOKUP($A103,Data!$B$3:$C$1000,2,0),\"غير صالح\"))","v":""}]
[null,null,null,null,{"$f":"IF(A104=\"\",\"\",IF(ISNUMBER(A104)=TRUE,VLOOKUP($A104,Data!$B$3:$C$1000,2,0),\"غير صالح\"))","v":""}]
[null,null,null,null,{"$f":"IF(A105=\"\",\"\",IF(ISNUMBER(A105)=TRUE,VLOOKUP($A105,Data!$B$3:$C$1000,2,0),\"غير صالح\"))","v":""}]
[null,null,null,null,{"$f":"IF(A106=\"\",\"\",IF(ISNUMBER(A106)=TRUE,VLOOKUP($A106,Data!$B$3:$C$1000,2,0),\"غير صالح\"))","v":""}]
[null,null,null,null,{"$f":"IF(A107=\"\",\"\",IF(ISNUMBER(A107)=TRUE,VLOOKUP($A107,Data!$B$3:$C$1000,2,0),\"غير صالح\"))","v":""}]
[null,null,null,null,{"$f":"IF(A108=\"\",\"\",IF(ISNUMBER(A108)=TRUE,VLOOKUP($A108,Data!$B$3:$C$1000,2,0),\"غير صالح\"))","v":""}]
[null,null,null,null,{"$f":"IF(A109=\"\",\"\",IF(ISNUMBER(A109)=TRUE,VLOOKUP($A109,Data!$B$3:$C$1000,2,0),\"غير صالح\"))","v":""}]
[null,null,null,null,{"$f":"IF(A110=\"\",\"\",IF(ISNUMBER(A110)=TRUE,VLOOKUP($A110,Data!$B$3:$C$1000,2,0),\"غير صالح\"))","v":""}]
[null,null,null,null,{"$f":"IF(A111=\"\",\"\",IF(ISNUMBER(A111)=TRUE,VLOOKUP($A111,Data!$B$3:$C$1000,2,0),\"غير صالح\"))","v":""}]
[null,null,null,null,{"$f":"IF(A112=\"\",\"\",IF(ISNUMBER(A112)=TRUE,VLOOKUP($A112,Data!$B$3:$C$1000,2,0),\"غير صالح\"))","v":""}]
[null,null,null,null,{"$f":"IF(A113=\"\",\"\",IF(ISNUMBER(A113)=TRUE,VLOOKUP($A113,Data!$B$3:$C$1000,2,0),\"غير صالح\"))","v":""}]
[null,null,null,null,{"$f":"IF(A114=\"\",\"\",IF(ISNUMBER(A114)=TRUE,VLOOKUP($A114,Data!$B$3:$C$1000,2,0),\"غير صالح\"))","v":""}]
[null,null,null,null,{"$f":"IF(A115=\"\",\"\",IF(ISNUMBER(A115)=TRUE,VLOOKUP($A115,Data!$B$3:$C$1000,2,0),\"غير صالح\"))","v":""}]
[null,null,null,null,{"$f":"IF(A116=\"\",\"\",IF(ISNUMBER(A116)=TRUE,VLOOKUP($A116,Data!$B$3:$C$1000,2,0),\"غير صالح\"))","v":""}]
[null,null,null,null,{"$f":"IF(A117=\"\",\"\",IF(ISNUMBER(A117)=TRUE,VLOOKUP($A117,Data!$B$3:$C$1000,2,0),\"غير صالح\"))","v":""}]
[null,null,null,null,{"$f":"IF(A118=\"\",\"\",IF(ISNUMBER(A118)=TRUE,VLOOKUP($A118,Data!$B$3:$C$1000,2,0),\"غير صالح\"))","v":""}]
[null,null,null,null,{"$f":"IF(A119=\"\",\"\",IF(ISNUMBER(A119)=TRUE,VLOOKUP($A119,Data!$B$3:$C$1000,2,0),\"غير صالح\"))","v":""}]
[null,null,null,null,{"$f":"IF(A120=\"\",\"\",IF(ISNUMBER(A120)=TRUE,VLOOKUP($A120,Data!$B$3:$C$1000,2,0),\"غير صالح\"))","v":""}]
{"$rows_left_out":113}
{"sheet":"Data","index":1,"n_rows":31,"n_cols":3,"rows_kept":31,"cut":false,"hidden":false,"merged":[]}
[]
[]
[null,1,"الأول"]
[null,2,"الثانى"]
[null,3,"الثالث"]
[null,4,"الرابع "]
[null,5,"الخامس"]
[null,6,"السادس"]
[null,7,"السابع"]
[null,8,"الثامن"]
[null,9,"التاسع"]
[null,10,"العاشر"]
[null,11,"الحادى عشر"]
[null,12,"الثانى عشر"]
[null,13,"الثالث عشر"]
[null,14,"الرابع عشر"]
[null,15,"الخامس عشر"]
[null,16,"السادس عشر"]
[null,17,"السابع عشر"]
[null,18,"الثامن عشر"]
[null,19,"التاسع عشر"]
[null,20,"العشرون"]
[null,21,"الحادى والعشرون"]
[null,22,"الثانى والعشرون"]
[null,23,"الثالث والعشرون"]
[null,24,"الرابع والعشرون"]
[null,25,"الخامس والعشرون"]
[null,26,"السادس والعشرون"]
[null,27,"السابع والعشرون"]
[null,28,"الثامن والعشرون"]
[null,29,"التاسع والعشرون"]