{"text_format":"1","workbook":"xlsx","n_sheets":2,"sheets":["استعلام ","البصمة "],"not_rendered":{"charts":0,"images":0,"macros":1,"external_links":0,"defined_names":2,"comments":0,"pivot_tables":0},"unopened":[],"bounds":{"document_bytes":16777216,"sheet_cells":100000,"rows_first":2000,"rows_last":500,"rows_between":2000,"halvings":0,"cell_chars":16384,"cell_head_chars":4096},"cells_cut":0,"cells_raw":0,"read":"whole","date_system":"1900"}

{"sheet":"استعلام ","index":0,"n_rows":105,"n_cols":5,"rows_kept":105,"cut":false,"hidden":false,"merged":[[0,2,0,3]]}
[null,null,"محمد عبد الخضر",null,{"$f":"IFERROR(SUBTOTAL(9,$D$3:$D$105),\"\")","v":1.9569444444444444}]
["التاريخ","C/In","C/Out","صافي ساعات العمل للفترة ","الملاحظات"]
[{"$f":"IF(INDEX('البصمة '!$F:$F,MATCH(0,COUNTIF($A$2:$A2,'البصمة '!$F:$F),0))=0,\"\",INDEX('البصمة '!$F:$F,MATCH(0,COUNTIF($A$2:$A2,'البصمة '!$F:$F),0)))","v":"06/22/2019"},{"$f":"IFERROR(INDEX('البصمة '!$E:$E,MATCH($C$1&$A3&B$2,'البصمة '!$Y:$Y,0)),\"\")","v":"07:50"},{"$f":"IFERROR(INDEX('البصمة '!$E:$E,MATCH($C$1&$A3&C$2,'البصمة '!$Y:$Y,0)),\"\")","v":"21:14"},{"$f":"IFERROR(C3-B3,\"\")","v":0.55833333333333335}]
[{"$f":"IF(INDEX('البصمة '!$F:$F,MATCH(0,COUNTIF($A$2:$A3,'البصمة '!$F:$F),0))=0,\"\",INDEX('البصمة '!$F:$F,MATCH(0,COUNTIF($A$2:$A3,'البصمة '!$F:$F),0)))","v":"06/23/2019"},{"$f":"IFERROR(INDEX('البصمة '!$E:$E,MATCH($C$1&$A4&B$2,'البصمة '!$Y:$Y,0)),\"\")","v":"07:22"},{"$f":"IFERROR(INDEX('البصمة '!$E:$E,MATCH($C$1&$A4&C$2,'البصمة '!$Y:$Y,0)),\"\")","v":""},{"$f":"IFERROR(C4-B4,\"\")","v":""}]
[{"$f":"IF(INDEX('البصمة '!$F:$F,MATCH(0,COUNTIF($A$2:$A4,'البصمة '!$F:$F),0))=0,\"\",INDEX('البصمة '!$F:$F,MATCH(0,COUNTIF($A$2:$A4,'البصمة '!$F:$F),0)))","v":"06/24/2019"},{"$f":"IFERROR(INDEX('البصمة '!$E:$E,MATCH($C$1&$A5&B$2,'البصمة '!$Y:$Y,0)),\"\")","v":"07:20"},{"$f":"IFERROR(INDEX('البصمة '!$E:$E,MATCH($C$1&$A5&C$2,'البصمة '!$Y:$Y,0)),\"\")","v":"20:26"},0.54583333333333339]
[{"$f":"IF(INDEX('البصمة '!$F:$F,MATCH(0,COUNTIF($A$2:$A5,'البصمة '!$F:$F),0))=0,\"\",INDEX('البصمة '!$F:$F,MATCH(0,COUNTIF($A$2:$A5,'البصمة '!$F:$F),0)))","v":"06/25/2019"},{"$f":"IFERROR(INDEX('البصمة '!$E:$E,MATCH($C$1&$A6&B$2,'البصمة '!$Y:$Y,0)),\"\")","v":"07:38"},{"$f":"IFERROR(INDEX('البصمة '!$E:$E,MATCH($C$1&$A6&C$2,'البصمة '!$Y:$Y,0)),\"\")","v":"17:28"},0.40972222222222221]
[{"$f":"IF(INDEX('البصمة '!$F:$F,MATCH(0,COUNTIF($A$2:$A6,'البصمة '!$F:$F),0))=0,\"\",INDEX('البصمة '!$F:$F,MATCH(0,COUNTIF($A$2:$A6,'البصمة '!$F:$F),0)))","v":"06/26/2019"},{"$f":"IFERROR(INDEX('البصمة '!$E:$E,MATCH($C$1&$A7&B$2,'البصمة '!$Y:$Y,0)),\"\")","v":"07:32"},{"$f":"IFERROR(INDEX('البصمة '!$E:$E,MATCH($C$1&$A7&C$2,'البصمة '!$Y:$Y,0)),\"\")","v":"18:10"},0.44305555555555565]
[{"$f":"IF(INDEX('البصمة '!$F:$F,MATCH(0,COUNTIF($A$2:$A7,'البصمة '!$F:$F),0))=0,\"\",INDEX('البصمة '!$F:$F,MATCH(0,COUNTIF($A$2:$A7,'البصمة '!$F:$F),0)))","v":"06/27/2019"},{"$f":"IFERROR(INDEX('البصمة '!$E:$E,MATCH($C$1&$A8&B$2,'البصمة '!$Y:$Y,0)),\"\")","v":"07:51"},{"$f":"IFERROR(INDEX('البصمة '!$E:$E,MATCH($C$1&$A8&C$2,'البصمة '!$Y:$Y,0)),\"\")","v":""},""]
[{"$f":"IF(INDEX('البصمة '!$F:$F,MATCH(0,COUNTIF($A$2:$A8,'البصمة '!$F:$F),0))=0,\"\",INDEX('البصمة '!$F:$F,MATCH(0,COUNTIF($A$2:$A8,'البصمة '!$F:$F),0)))","v":""},{"$f":"IFERROR(INDEX('البصمة '!$E:$E,MATCH($C$1&$A9&B$2,'البصمة '!$Y:$Y,0)),\"\")","v":""},{"$f":"IFERROR(INDEX('البصمة '!$E:$E,MATCH($C$1&$A9&C$2,'البصمة '!$Y:$Y,0)),\"\")","v":""},""]
[{"$f":"IF(INDEX('البصمة '!$F:$F,MATCH(0,COUNTIF($A$2:$A9,'البصمة '!$F:$F),0))=0,\"\",INDEX('البصمة '!$F:$F,MATCH(0,COUNTIF($A$2:$A9,'البصمة '!$F:$F),0)))","v":""},{"$f":"IFERROR(INDEX('البصمة '!$E:$E,MATCH($C$1&$A10&B$2,'البصمة '!$Y:$Y,0)),\"\")","v":""},{"$f":"IFERROR(INDEX('البصمة '!$E:$E,MATCH($C$1&$A10&C$2,'البصمة '!$Y:$Y,0)),\"\")","v":""},""]
[{"$f":"IF(INDEX('البصمة '!$F:$F,MATCH(0,COUNTIF($A$2:$A10,'البصمة '!$F:$F),0))=0,\"\",INDEX('البصمة '!$F:$F,MATCH(0,COUNTIF($A$2:$A10,'البصمة '!$F:$F),0)))","v":""},{"$f":"IFERROR(INDEX('البصمة '!$E:$E,MATCH($C$1&$A11&B$2,'البصمة '!$Y:$Y,0)),\"\")","v":""},{"$f":"IFERROR(INDEX('البصمة '!$E:$E,MATCH($C$1&$A11&C$2,'البصمة '!$Y:$Y,0)),\"\")","v":""},""]
[{"$f":"IF(INDEX('البصمة '!$F:$F,MATCH(0,COUNTIF($A$2:$A11,'البصمة '!$F:$F),0))=0,\"\",INDEX('البصمة '!$F:$F,MATCH(0,COUNTIF($A$2:$A11,'البصمة '!$F:$F),0)))","v":""},{"$f":"IFERROR(INDEX('البصمة '!$E:$E,MATCH($C$1&$A12&B$2,'البصمة '!$Y:$Y,0)),\"\")","v":""},{"$f":"IFERROR(INDEX('البصمة '!$E:$E,MATCH($C$1&$A12&C$2,'البصمة '!$Y:$Y,0)),\"\")","v":""},""]
[{"$f":"IF(INDEX('البصمة '!$F:$F,MATCH(0,COUNTIF($A$2:$A12,'البصمة '!$F:$F),0))=0,\"\",INDEX('البصمة '!$F:$F,MATCH(0,COUNTIF($A$2:$A12,'البصمة '!$F:$F),0)))","v":""},{"$f":"IFERROR(INDEX('البصمة '!$E:$E,MATCH($C$1&$A13&B$2,'البصمة '!$Y:$Y,0)),\"\")","v":""},{"$f":"IFERROR(INDEX('البصمة '!$E:$E,MATCH($C$1&$A13&C$2,'البصمة '!$Y:$Y,0)),\"\")","v":""},""]
[{"$f":"IF(INDEX('البصمة '!$F:$F,MATCH(0,COUNTIF($A$2:$A13,'البصمة '!$F:$F),0))=0,\"\",INDEX('البصمة '!$F:$F,MATCH(0,COUNTIF($A$2:$A13,'البصمة '!$F:$F),0)))","v":""},{"$f":"IFERROR(INDEX('البصمة '!$E:$E,MATCH($C$1&$A14&B$2,'البصمة '!$Y:$Y,0)),\"\")","v":""},{"$f":"IFERROR(INDEX('البصمة '!$E:$E,MATCH($C$1&$A14&C$2,'البصمة '!$Y:$Y,0)),\"\")","v":""},""]
[{"$f":"IF(INDEX('البصمة '!$F:$F,MATCH(0,COUNTIF($A$2:$A14,'البصمة '!$F:$F),0))=0,\"\",INDEX('البصمة '!$F:$F,MATCH(0,COUNTIF($A$2:$A14,'البصمة '!$F:$F),0)))","v":""},{"$f":"IFERROR(INDEX('البصمة '!$E:$E,MATCH($C$1&$A15&B$2,'البصمة '!$Y:$Y,0)),\"\")","v":""},{"$f":"IFERROR(INDEX('البصمة '!$E:$E,MATCH($C$1&$A15&C$2,'البصمة '!$Y:$Y,0)),\"\")","v":""},""]
[{"$f":"IF(INDEX('البصمة '!$F:$F,MATCH(0,COUNTIF($A$2:$A15,'البصمة '!$F:$F),0))=0,\"\",INDEX('البصمة '!$F:$F,MATCH(0,COUNTIF($A$2:$A15,'البصمة '!$F:$F),0)))","v":""},{"$f":"IFERROR(INDEX('البصمة '!$E:$E,MATCH($C$1&$A16&B$2,'البصمة '!$Y:$Y,0)),\"\")","v":""},{"$f":"IFERROR(INDEX('البصمة '!$E:$E,MATCH($C$1&$A16&C$2,'البصمة '!$Y:$Y,0)),\"\")","v":""},""]
[{"$f":"IF(INDEX('البصمة '!$F:$F,MATCH(0,COUNTIF($A$2:$A16,'البصمة '!$F:$F),0))=0,\"\",INDEX('البصمة '!$F:$F,MATCH(0,COUNTIF($A$2:$A16,'البصمة '!$F:$F),0)))","v":""},{"$f":"IFERROR(INDEX('البصمة '!$E:$E,MATCH($C$1&$A17&B$2,'البصمة '!$Y:$Y,0)),\"\")","v":""},{"$f":"IFERROR(INDEX('البصمة '!$E:$E,MATCH($C$1&$A17&C$2,'البصمة '!$Y:$Y,0)),\"\")","v":""},""]
[{"$f":"IF(INDEX('البصمة '!$F:$F,MATCH(0,COUNTIF($A$2:$A17,'البصمة '!$F:$F),0))=0,\"\",INDEX('البصمة '!$F:$F,MATCH(0,COUNTIF($A$2:$A17,'البصمة '!$F:$F),0)))","v":""},{"$f":"IFERROR(INDEX('البصمة '!$E:$E,MATCH($C$1&$A18&B$2,'البصمة '!$Y:$Y,0)),\"\")","v":""},{"$f":"IFERROR(INDEX('البصمة '!$E:$E,MATCH($C$1&$A18&C$2,'البصمة '!$Y:$Y,0)),\"\")","v":""},""]
[{"$f":"IF(INDEX('البصمة '!$F:$F,MATCH(0,COUNTIF($A$2:$A18,'البصمة '!$F:$F),0))=0,\"\",INDEX('البصمة '!$F:$F,MATCH(0,COUNTIF($A$2:$A18,'البصمة '!$F:$F),0)))","v":""},{"$f":"IFERROR(INDEX('البصمة '!$E:$E,MATCH($C$1&$A19&B$2,'البصمة '!$Y:$Y,0)),\"\")","v":""},{"$f":"IFERROR(INDEX('البصمة '!$E:$E,MATCH($C$1&$A19&C$2,'البصمة '!$Y:$Y,0)),\"\")","v":""},""]
[{"$f":"IF(INDEX('البصمة '!$F:$F,MATCH(0,COUNTIF($A$2:$A19,'البصمة '!$F:$F),0))=0,\"\",INDEX('البصمة '!$F:$F,MATCH(0,COUNTIF($A$2:$A19,'البصمة '!$F:$F),0)))","v":""},{"$f":"IFERROR(INDEX('البصمة '!$E:$E,MATCH($C$1&$A20&B$2,'البصمة '!$Y:$Y,0)),\"\")","v":""},{"$f":"IFERROR(INDEX('البصمة '!$E:$E,MATCH($C$1&$A20&C$2,'البصمة '!$Y:$Y,0)),\"\")","v":""},""]
[{"$f":"IF(INDEX('البصمة '!$F:$F,MATCH(0,COUNTIF($A$2:$A20,'البصمة '!$F:$F),0))=0,\"\",INDEX('البصمة '!$F:$F,MATCH(0,COUNTIF($A$2:$A20,'البصمة '!$F:$F),0)))","v":""},{"$f":"IFERROR(INDEX('البصمة '!$E:$E,MATCH($C$1&$A21&B$2,'البصمة '!$Y:$Y,0)),\"\")","v":""},{"$f":"IFERROR(INDEX('البصمة '!$E:$E,MATCH($C$1&$A21&C$2,'البصمة '!$Y:$Y,0)),\"\")","v":""},""]
[{"$f":"IF(INDEX('البصمة '!$F:$F,MATCH(0,COUNTIF($A$2:$A21,'البصمة '!$F:$F),0))=0,\"\",INDEX('البصمة '!$F:$F,MATCH(0,COUNTIF($A$2:$A21,'البصمة '!$F:$F),0)))","v":""},{"$f":"IFERROR(INDEX('البصمة '!$E:$E,MATCH($C$1&$A22&B$2,'البصمة '!$Y:$Y,0)),\"\")","v":""},{"$f":"IFERROR(INDEX('البصمة '!$E:$E,MATCH($C$1&$A22&C$2,'البصمة '!$Y:$Y,0)),\"\")","v":""},""]
[{"$f":"IF(INDEX('البصمة '!$F:$F,MATCH(0,COUNTIF($A$2:$A22,'البصمة '!$F:$F),0))=0,\"\",INDEX('البصمة '!$F:$F,MATCH(0,COUNTIF($A$2:$A22,'البصمة '!$F:$F),0)))","v":""},{"$f":"IFERROR(INDEX('البصمة '!$E:$E,MATCH($C$1&$A23&B$2,'البصمة '!$Y:$Y,0)),\"\")","v":""},{"$f":"IFERROR(INDEX('البصمة '!$E:$E,MATCH($C$1&$A23&C$2,'البصمة '!$Y:$Y,0)),\"\")","v":""},""]
[null,{"$f":"IFERROR(INDEX('البصمة '!$E:$E,MATCH($C$1&$A24&B$2,'البصمة '!$Y:$Y,0)),\"\")","v":""},{"$f":"IFERROR(INDEX('البصمة '!$E:$E,MATCH($C$1&$A24&C$2,'البصمة '!$Y:$Y,0)),\"\")","v":""},""]
[{"$f":"IFERROR(INDEX('البصمة '!$F:$F,MATCH(0,COUNTIF($A$2:$A24,'البصمة '!$F:$F),0)),\"\")","v":"00:00:00"},{"$f":"IFERROR(INDEX('البصمة '!$E:$E,MATCH($C$1&$A25&B$2,'البصمة '!$Y:$Y,0)),\"\")","v":""},{"$f":"IFERROR(INDEX('البصمة '!$E:$E,MATCH($C$1&$A25&C$2,'البصمة '!$Y:$Y,0)),\"\")","v":""},""]
[{"$f":"IFERROR(INDEX('البصمة '!$F:$F,MATCH(0,COUNTIF($A$2:$A25,'البصمة '!$F:$F),0)),\"\")","v":""},{"$f":"IFERROR(INDEX('البصمة '!$E:$E,MATCH($C$1&$A26&B$2,'البصمة '!$Y:$Y,0)),\"\")","v":""},{"$f":"IFERROR(INDEX('البصمة '!$E:$E,MATCH($C$1&$A26&C$2,'البصمة '!$Y:$Y,0)),\"\")","v":""},""]
[{"$f":"IFERROR(INDEX('البصمة '!$F:$F,SMALL(IF('البصمة '!$A:$A=$C$1,ROW(A$2:A$105)-ROW(A$2)+1),ROWS($A$3:A27))),\"\")","v":""},{"$f":"IFERROR(INDEX('البصمة '!$E:$E,MATCH($C$1&$A27&B$2,'البصمة '!$Y:$Y,0)),\"\")","v":""},{"$f":"IFERROR(INDEX('البصمة '!$E:$E,MATCH($C$1&$A27&C$2,'البصمة '!$Y:$Y,0)),\"\")","v":""},""]
[{"$f":"IFERROR(INDEX('البصمة '!$F:$F,SMALL(IF('البصمة '!$A:$A=$C$1,ROW(A$2:A$105)-ROW(A$2)+1),ROWS($A$3:A28))),\"\")","v":""},{"$f":"IFERROR(INDEX('البصمة '!$E:$E,MATCH($C$1&$A28&B$2,'البصمة '!$Y:$Y,0)),\"\")","v":""},{"$f":"IFERROR(INDEX('البصمة '!$E:$E,MATCH($C$1&$A28&C$2,'البصمة '!$Y:$Y,0)),\"\")","v":""},""]
[{"$f":"IFERROR(INDEX('البصمة '!$F:$F,SMALL(IF('البصمة '!$A:$A=$C$1,ROW(A$2:A$105)-ROW(A$2)+1),ROWS($A$3:A29))),\"\")","v":""},{"$f":"IFERROR(INDEX('البصمة '!$E:$E,MATCH($C$1&$A29&B$2,'البصمة '!$Y:$Y,0)),\"\")","v":""},{"$f":"IFERROR(INDEX('البصمة '!$E:$E,MATCH($C$1&$A29&C$2,'البصمة '!$Y:$Y,0)),\"\")","v":""},""]
[{"$f":"IFERROR(INDEX('البصمة '!$F:$F,SMALL(IF('البصمة '!$A:$A=$C$1,ROW(A$2:A$105)-ROW(A$2)+1),ROWS($A$3:A30))),\"\")","v":""},{"$f":"IFERROR(INDEX('البصمة '!$E:$E,MATCH($C$1&$A30&B$2,'البصمة '!$Y:$Y,0)),\"\")","v":""},{"$f":"IFERROR(INDEX('البصمة '!$E:$E,MATCH($C$1&$A30&C$2,'البصمة '!$Y:$Y,0)),\"\")","v":""},""]
[{"$f":"IFERROR(INDEX('البصمة '!$F:$F,SMALL(IF('البصمة '!$A:$A=$C$1,ROW(A$2:A$105)-ROW(A$2)+1),ROWS($A$3:A31))),\"\")","v":""},{"$f":"IFERROR(INDEX('البصمة '!$E:$E,MATCH($C$1&$A31&B$2,'البصمة '!$Y:$Y,0)),\"\")","v":""},{"$f":"IFERROR(INDEX('البصمة '!$E:$E,MATCH($C$1&$A31&C$2,'البصمة '!$Y:$Y,0)),\"\")","v":""},""]
[{"$f":"IFERROR(INDEX('البصمة '!$F:$F,SMALL(IF('البصمة '!$A:$A=$C$1,ROW(A$2:A$105)-ROW(A$2)+1),ROWS($A$3:A32))),\"\")","v":""},{"$f":"IFERROR(INDEX('البصمة '!$E:$E,MATCH($C$1&$A32&B$2,'البصمة '!$Y:$Y,0)),\"\")","v":""},{"$f":"IFERROR(INDEX('البصمة '!$E:$E,MATCH($C$1&$A32&C$2,'البصمة '!$Y:$Y,0)),\"\")","v":""},""]
[{"$f":"IFERROR(INDEX('البصمة '!$F:$F,SMALL(IF('البصمة '!$A:$A=$C$1,ROW(A$2:A$105)-ROW(A$2)+1),ROWS($A$3:A33))),\"\")","v":""},{"$f":"IFERROR(INDEX('البصمة '!$E:$E,MATCH($C$1&$A33&B$2,'البصمة '!$Y:$Y,0)),\"\")","v":""},{"$f":"IFERROR(INDEX('البصمة '!$E:$E,MATCH($C$1&$A33&C$2,'البصمة '!$Y:$Y,0)),\"\")","v":""},""]
[{"$f":"IFERROR(INDEX('البصمة '!$F:$F,SMALL(IF('البصمة '!$A:$A=$C$1,ROW(A$2:A$105)-ROW(A$2)+1),ROWS($A$3:A34))),\"\")","v":""},{"$f":"IFERROR(INDEX('البصمة '!$E:$E,MATCH($C$1&$A34&B$2,'البصمة '!$Y:$Y,0)),\"\")","v":""},{"$f":"IFERROR(INDEX('البصمة '!$E:$E,MATCH($C$1&$A34&C$2,'البصمة '!$Y:$Y,0)),\"\")","v":""},""]
[{"$f":"IFERROR(INDEX('البصمة '!$F:$F,SMALL(IF('البصمة '!$A:$A=$C$1,ROW(A$2:A$105)-ROW(A$2)+1),ROWS($A$3:A35))),\"\")","v":""},{"$f":"IFERROR(INDEX('البصمة '!$E:$E,MATCH($C$1&$A35&B$2,'البصمة '!$Y:$Y,0)),\"\")","v":""},{"$f":"IFERROR(INDEX('البصمة '!$E:$E,MATCH($C$1&$A35&C$2,'البصمة '!$Y:$Y,0)),\"\")","v":""},""]
[{"$f":"IFERROR(INDEX('البصمة '!$F:$F,SMALL(IF('البصمة '!$A:$A=$C$1,ROW(A$2:A$105)-ROW(A$2)+1),ROWS($A$3:A36))),\"\")","v":""},{"$f":"IFERROR(INDEX('البصمة '!$E:$E,MATCH($C$1&$A36&B$2,'البصمة '!$Y:$Y,0)),\"\")","v":""},{"$f":"IFERROR(INDEX('البصمة '!$E:$E,MATCH($C$1&$A36&C$2,'البصمة '!$Y:$Y,0)),\"\")","v":""},""]
[{"$f":"IFERROR(INDEX('البصمة '!$F:$F,SMALL(IF('البصمة '!$A:$A=$C$1,ROW(A$2:A$105)-ROW(A$2)+1),ROWS($A$3:A37))),\"\")","v":""},{"$f":"IFERROR(INDEX('البصمة '!$E:$E,MATCH($C$1&$A37&B$2,'البصمة '!$Y:$Y,0)),\"\")","v":""},{"$f":"IFERROR(INDEX('البصمة '!$E:$E,MATCH($C$1&$A37&C$2,'البصمة '!$Y:$Y,0)),\"\")","v":""},""]
[{"$f":"IFERROR(INDEX('البصمة '!$F:$F,SMALL(IF('البصمة '!$A:$A=$C$1,ROW(A$2:A$105)-ROW(A$2)+1),ROWS($A$3:A38))),\"\")","v":""},{"$f":"IFERROR(INDEX('البصمة '!$E:$E,MATCH($C$1&$A38&B$2,'البصمة '!$Y:$Y,0)),\"\")","v":""},{"$f":"IFERROR(INDEX('البصمة '!$E:$E,MATCH($C$1&$A38&C$2,'البصمة '!$Y:$Y,0)),\"\")","v":""},""]
[{"$f":"IFERROR(INDEX('البصمة '!$F:$F,SMALL(IF('البصمة '!$A:$A=$C$1,ROW(A$2:A$105)-ROW(A$2)+1),ROWS($A$3:A39))),\"\")","v":""},{"$f":"IFERROR(INDEX('البصمة '!$E:$E,MATCH($C$1&$A39&B$2,'البصمة '!$Y:$Y,0)),\"\")","v":""},{"$f":"IFERROR(INDEX('البصمة '!$E:$E,MATCH($C$1&$A39&C$2,'البصمة '!$Y:$Y,0)),\"\")","v":""},""]
[{"$f":"IFERROR(INDEX('البصمة '!$F:$F,SMALL(IF('البصمة '!$A:$A=$C$1,ROW(A$2:A$105)-ROW(A$2)+1),ROWS($A$3:A40))),\"\")","v":""},{"$f":"IFERROR(INDEX('البصمة '!$E:$E,MATCH($C$1&$A40&B$2,'البصمة '!$Y:$Y,0)),\"\")","v":""},{"$f":"IFERROR(INDEX('البصمة '!$E:$E,MATCH($C$1&$A40&C$2,'البصمة '!$Y:$Y,0)),\"\")","v":""},""]
{"$rows_left_out":66}
{"sheet":"البصمة ","index":1,"n_rows":474,"n_cols":26,"rows_kept":474,"cut":false,"hidden":false,"merged":[]}
["اسم الموظف ","كود الموظف ","الوقت ","الدخول والخروج","الملاحظات","التاريخ"]
["محمد عبد الخضر","8","06/22/2019 07:50","C/In",{"$f":"IF($C2=\"\",\"\",RIGHT($C2,5))","v":"07:50"},{"$f":"IF($C2=\"\",\"\",LEFT($C2,10))","v":"06/22/2019"},null,{"$f":"IFERROR(INDEX($A$2:$A$474,MATCH(0,COUNTIF($G$1:$G1,$A$2:$A$474),0)),\"\")","v":""},null,null,null,null,null,null,null,null,null,null,null,null,null,null,null,null,{"$f":"A2&F2&D2","v":"محمد عبد الخضر06/22/2019C/In"},{"$f":"IFERROR(INDEX($A$2:$A$474,MATCH(0,COUNTIF($Z$1:$Z1,$A$2:$A$474),0)),\"\")","v":"محمد عبد الخضر"}]
["محمد عبد الخضر","8","06/22/2019 21:14","C/Out",{"$f":"IF(C3=\"\",\"\",RIGHT(C3,5))","v":"21:14"},{"$f":"IF($C3=\"\",\"\",LEFT($C3,10))","v":"06/22/2019"},null,null,null,null,null,null,null,null,null,null,null,null,null,null,null,null,null,null,{"$f":"A3&F3&D3","v":"محمد عبد الخضر06/22/2019C/Out"},{"$f":"IFERROR(INDEX($A$2:$A$474,MATCH(0,COUNTIF($Z$1:$Z2,$A$2:$A$474),0)),\"\")","v":"عباس سعيد محمد"}]
["محمد عبد الخضر","8","06/23/2019 07:22","C/In","07:22","06/23/2019",null,null,null,null,null,null,null,null,null,null,null,null,null,null,null,null,null,null,"محمد عبد الخضر06/23/2019C/In",{"$f":"IFERROR(INDEX($A$2:$A$474,MATCH(0,COUNTIF($Z$1:$Z3,$A$2:$A$474),0)),\"\")","v":"منار يوسف حميد"}]
["محمد عبد الخضر","8","06/24/2019 07:20","C/In","07:20","06/24/2019",null,null,null,null,null,null,null,null,null,null,null,null,null,null,null,null,null,null,"محمد عبد الخضر06/24/2019C/In",{"$f":"IFERROR(INDEX($A$2:$A$474,MATCH(0,COUNTIF($Z$1:$Z4,$A$2:$A$474),0)),\"\")","v":"مروان منصور"}]
["محمد عبد الخضر","8","06/24/2019 20:26","C/Out","20:26","06/24/2019",null,null,null,null,null,null,null,null,null,null,null,null,null,null,null,null,null,null,"محمد عبد الخضر06/24/2019C/Out",{"$f":"IFERROR(INDEX($A$2:$A$474,MATCH(0,COUNTIF($Z$1:$Z5,$A$2:$A$474),0)),\"\")","v":"عريف الاسلام"}]
["محمد عبد الخضر","8","06/25/2019 07:38","C/In","07:38",{"$f":"IF($C7=\"\",\"\",LEFT($C7,10))","v":"06/25/2019"},null,null,null,null,null,null,null,null,null,null,null,null,null,null,null,null,null,null,"محمد عبد الخضر06/25/2019C/In",{"$f":"IFERROR(INDEX($A$2:$A$474,MATCH(0,COUNTIF($Z$1:$Z6,$A$2:$A$474),0)),\"\")","v":"علي عبد الخضر"}]
["محمد عبد الخضر","8","06/25/2019 17:28","C/Out","17:28","06/25/2019",null,null,null,null,null,null,null,null,null,null,null,null,null,null,null,null,null,null,"محمد عبد الخضر06/25/2019C/Out",{"$f":"IFERROR(INDEX($A$2:$A$474,MATCH(0,COUNTIF($Z$1:$Z7,$A$2:$A$474),0)),\"\")","v":"نعمة كاظم سعد"}]
["محمد عبد الخضر","8","06/26/2019 07:32","C/In","07:32","06/26/2019",null,null,null,null,null,null,null,null,null,null,null,null,null,null,null,null,null,null,"محمد عبد الخضر06/26/2019C/In",{"$f":"IFERROR(INDEX($A$2:$A$474,MATCH(0,COUNTIF($Z$1:$Z8,$A$2:$A$474),0)),\"\")","v":"محمد صالح جياد"}]
["محمد عبد الخضر","8","06/26/2019 18:10","C/Out","18:10","06/26/2019",null,null,null,null,null,null,null,null,null,null,null,null,null,null,null,null,null,null,"محمد عبد الخضر06/26/2019C/Out",{"$f":"IFERROR(INDEX($A$2:$A$474,MATCH(0,COUNTIF($Z$1:$Z9,$A$2:$A$474),0)),\"\")","v":"الومكير محمد بنكلادش"}]
["محمد عبد الخضر","8","06/27/2019 07:51","C/In","07:51","06/27/2019",null,null,null,null,null,null,null,null,null,null,null,null,null,null,null,null,null,null,"محمد عبد الخضر06/27/2019C/In",{"$f":"IFERROR(INDEX($A$2:$A$474,MATCH(0,COUNTIF($Z$1:$Z10,$A$2:$A$474),0)),\"\")","v":"الومين"}]
["عباس سعيد محمد","12","06/22/2019 07:49","C/In","07:49","06/22/2019",null,null,null,null,null,null,null,null,null,null,null,null,null,null,null,null,null,null,"عباس سعيد محمد06/22/2019C/In",{"$f":"IFERROR(INDEX($A$2:$A$474,MATCH(0,COUNTIF($Z$1:$Z11,$A$2:$A$474),0)),\"\")","v":"حسين عبد الله بنكلادش"}]
["عباس سعيد محمد","12","06/22/2019 16:59","C/Out","16:59","06/22/2019",null,null,null,null,null,null,null,null,null,null,null,null,null,null,null,null,null,null,"عباس سعيد محمد06/22/2019C/Out",{"$f":"IFERROR(INDEX($A$2:$A$474,MATCH(0,COUNTIF($Z$1:$Z12,$A$2:$A$474),0)),\"\")","v":"توسلم"}]
["عباس سعيد محمد","12","06/24/2019 07:50","C/In","07:50","06/24/2019",null,null,null,null,null,null,null,null,null,null,null,null,null,null,null,null,null,null,"عباس سعيد محمد06/24/2019C/In",{"$f":"IFERROR(INDEX($A$2:$A$474,MATCH(0,COUNTIF($Z$1:$Z13,$A$2:$A$474),0)),\"\")","v":0}]
["عباس سعيد محمد","12","06/24/2019 17:09","C/Out","17:09","06/24/2019",null,null,null,null,null,null,null,null,null,null,null,null,null,null,null,null,null,null,"عباس سعيد محمد06/24/2019C/Out",{"$f":"IFERROR(INDEX($A$2:$A$474,MATCH(0,COUNTIF($Z$1:$Z14,$A$2:$A$474),0)),\"\")","v":""}]
["عباس سعيد محمد","12","06/25/2019 07:52","C/In","07:52","06/25/2019",null,null,null,null,null,null,null,null,null,null,null,null,null,null,null,null,null,null,"عباس سعيد محمد06/25/2019C/In",{"$f":"IFERROR(INDEX($A$2:$A$474,MATCH(0,COUNTIF($Z$1:$Z15,$A$2:$A$474),0)),\"\")","v":""}]
["عباس سعيد محمد","12","06/25/2019 17:03","C/Out","17:03","06/25/2019",null,null,null,null,null,null,null,null,null,null,null,null,null,null,null,null,null,null,"عباس سعيد محمد06/25/2019C/Out",{"$f":"IFERROR(INDEX($A$2:$A$474,MATCH(0,COUNTIF($Z$1:$Z16,$A$2:$A$474),0)),\"\")","v":""}]
["عباس سعيد محمد","12","06/27/2019 07:46","C/In","07:46","06/27/2019",null,null,null,null,null,null,null,null,null,null,null,null,null,null,null,null,null,null,"عباس سعيد محمد06/27/2019C/In",{"$f":"IFERROR(INDEX($A$2:$A$474,MATCH(0,COUNTIF($Z$1:$Z17,$A$2:$A$474),0)),\"\")","v":""}]
["منار يوسف حميد","14","06/22/2019 21:14","C/Out","21:14","06/22/2019",null,null,null,null,null,null,null,null,null,null,null,null,null,null,null,null,null,null,"منار يوسف حميد06/22/2019C/Out",{"$f":"IFERROR(INDEX($A$2:$A$474,MATCH(0,COUNTIF($Z$1:$Z18,$A$2:$A$474),0)),\"\")","v":""}]
["منار يوسف حميد","14","06/24/2019 07:52","C/In","07:52","06/24/2019",null,null,null,null,null,null,null,null,null,null,null,null,null,null,null,null,null,null,"منار يوسف حميد06/24/2019C/In",{"$f":"IFERROR(INDEX($A$2:$A$474,MATCH(0,COUNTIF($Z$1:$Z19,$A$2:$A$474),0)),\"\")","v":""}]
["منار يوسف حميد","14","06/24/2019 20:27","C/Out","20:27","06/24/2019",null,null,null,null,null,null,null,null,null,null,null,null,null,null,null,null,null,null,"منار يوسف حميد06/24/2019C/Out",{"$f":"IFERROR(INDEX($A$2:$A$474,MATCH(0,COUNTIF($Z$1:$Z20,$A$2:$A$474),0)),\"\")","v":""}]
["منار يوسف حميد","14","06/26/2019 07:53","C/In","07:53","06/26/2019",null,null,null,null,null,null,null,null,null,null,null,null,null,null,null,null,null,null,"منار يوسف حميد06/26/2019C/In",{"$f":"IFERROR(INDEX($A$2:$A$474,MATCH(0,COUNTIF($Z$1:$Z21,$A$2:$A$474),0)),\"\")","v":""}]
["منار يوسف حميد","14","06/27/2019 07:48","C/In","07:48","06/27/2019",null,null,null,null,null,null,null,null,null,null,null,null,null,null,null,null,null,null,"منار يوسف حميد06/27/2019C/In",{"$f":"IFERROR(INDEX($A$2:$A$474,MATCH(0,COUNTIF($Z$1:$Z22,$A$2:$A$474),0)),\"\")","v":""}]
["مروان منصور","15","06/22/2019 08:39","C/In","08:39","06/22/2019",null,null,null,null,null,null,null,null,null,null,null,null,null,null,null,null,null,null,"مروان منصور06/22/2019C/In",{"$f":"IFERROR(INDEX($A$2:$A$474,MATCH(0,COUNTIF($Z$1:$Z23,$A$2:$A$474),0)),\"\")","v":""}]
["مروان منصور","15","06/26/2019 08:08","C/In","08:08","06/26/2019",null,null,null,null,null,null,null,null,null,null,null,null,null,null,null,null,null,null,"مروان منصور06/26/2019C/In",{"$f":"IFERROR(INDEX($A$2:$A$474,MATCH(0,COUNTIF($Z$1:$Z24,$A$2:$A$474),0)),\"\")","v":""}]
["مروان منصور","15","06/26/2019 17:01","C/Out","17:01","06/26/2019",null,null,null,null,null,null,null,null,null,null,null,null,null,null,null,null,null,null,"مروان منصور06/26/2019C/Out",{"$f":"IFERROR(INDEX($A$2:$A$474,MATCH(0,COUNTIF($Z$1:$Z25,$A$2:$A$474),0)),\"\")","v":""}]
["عريف الاسلام","18","06/22/2019 08:00","C/In","08:00","06/22/2019",null,null,null,null,null,null,null,null,null,null,null,null,null,null,null,null,null,null,"عريف الاسلام06/22/2019C/In",{"$f":"IFERROR(INDEX($A$2:$A$474,MATCH(0,COUNTIF($Z$1:$Z26,$A$2:$A$474),0)),\"\")","v":""}]
["عريف الاسلام","18","06/22/2019 08:00","C/In","08:00","06/22/2019",null,null,null,null,null,null,null,null,null,null,null,null,null,null,null,null,null,null,"عريف الاسلام06/22/2019C/In",{"$f":"IFERROR(INDEX($A$2:$A$474,MATCH(0,COUNTIF($Z$1:$Z27,$A$2:$A$474),0)),\"\")","v":""}]
["عريف الاسلام","18","06/22/2019 17:13","C/Out","17:13","06/22/2019",null,null,null,null,null,null,null,null,null,null,null,null,null,null,null,null,null,null,"عريف الاسلام06/22/2019C/Out",{"$f":"IFERROR(INDEX($A$2:$A$474,MATCH(0,COUNTIF($Z$1:$Z28,$A$2:$A$474),0)),\"\")","v":""}]
["عريف الاسلام","18","06/22/2019 17:13","C/Out","17:13","06/22/2019",null,null,null,null,null,null,null,null,null,null,null,null,null,null,null,null,null,null,"عريف الاسلام06/22/2019C/Out",{"$f":"IFERROR(INDEX($A$2:$A$474,MATCH(0,COUNTIF($Z$1:$Z29,$A$2:$A$474),0)),\"\")","v":""}]
["عريف الاسلام","18","06/24/2019 07:54","C/In","07:54","06/24/2019",null,null,null,null,null,null,null,null,null,null,null,null,null,null,null,null,null,null,"عريف الاسلام06/24/2019C/In",{"$f":"IFERROR(INDEX($A$2:$A$474,MATCH(0,COUNTIF($Z$1:$Z30,$A$2:$A$474),0)),\"\")","v":""}]
["عريف الاسلام","18","06/24/2019 07:54","C/In","07:54","06/24/2019",null,null,null,null,null,null,null,null,null,null,null,null,null,null,null,null,null,null,"عريف الاسلام06/24/2019C/In",{"$f":"IFERROR(INDEX($A$2:$A$474,MATCH(0,COUNTIF($Z$1:$Z31,$A$2:$A$474),0)),\"\")","v":""}]
["عريف الاسلام","18","06/24/2019 20:38","C/Out","20:38","06/24/2019",null,null,null,null,null,null,null,null,null,null,null,null,null,null,null,null,null,null,"عريف الاسلام06/24/2019C/Out",{"$f":"IFERROR(INDEX($A$2:$A$474,MATCH(0,COUNTIF($Z$1:$Z32,$A$2:$A$474),0)),\"\")","v":""}]
["عريف الاسلام","18","06/25/2019 07:51","C/In","07:51","06/25/2019",null,null,null,null,null,null,null,null,null,null,null,null,null,null,null,null,null,null,"عريف الاسلام06/25/2019C/In",{"$f":"IFERROR(INDEX($A$2:$A$474,MATCH(0,COUNTIF($Z$1:$Z33,$A$2:$A$474),0)),\"\")","v":""}]
["عريف الاسلام","18","06/25/2019 07:51","C/In","07:51","06/25/2019",null,null,null,null,null,null,null,null,null,null,null,null,null,null,null,null,null,null,"عريف الاسلام06/25/2019C/In",{"$f":"IFERROR(INDEX($A$2:$A$474,MATCH(0,COUNTIF($Z$1:$Z34,$A$2:$A$474),0)),\"\")","v":""}]
["عريف الاسلام","18","06/25/2019 17:02","C/Out","17:02","06/25/2019",null,null,null,null,null,null,null,null,null,null,null,null,null,null,null,null,null,null,"عريف الاسلام06/25/2019C/Out",{"$f":"IFERROR(INDEX($A$2:$A$474,MATCH(0,COUNTIF($Z$1:$Z35,$A$2:$A$474),0)),\"\")","v":""}]
["عريف الاسلام","18","06/26/2019 07:58","C/In","07:58","06/26/2019",null,null,null,null,null,null,null,null,null,null,null,null,null,null,null,null,null,null,"عريف الاسلام06/26/2019C/In",{"$f":"IFERROR(INDEX($A$2:$A$474,MATCH(0,COUNTIF($Z$1:$Z36,$A$2:$A$474),0)),\"\")","v":""}]
["عريف الاسلام","18","06/26/2019 07:58","C/In","07:58","06/26/2019",null,null,null,null,null,null,null,null,null,null,null,null,null,null,null,null,null,null,"عريف الاسلام06/26/2019C/In",{"$f":"IFERROR(INDEX($A$2:$A$474,MATCH(0,COUNTIF($Z$1:$Z37,$A$2:$A$474),0)),\"\")","v":""}]
["عريف الاسلام","18","06/26/2019 16:58","C/Out","16:58","06/26/2019",null,null,null,null,null,null,null,null,null,null,null,null,null,null,null,null,null,null,"عريف الاسلام06/26/2019C/Out",{"$f":"IFERROR(INDEX($A$2:$A$474,MATCH(0,COUNTIF($Z$1:$Z38,$A$2:$A$474),0)),\"\")","v":""}]
["عريف الاسلام","18","06/26/2019 16:58","C/Out","16:58","06/26/2019",null,null,null,null,null,null,null,null,null,null,null,null,null,null,null,null,null,null,"عريف الاسلام06/26/2019C/Out",{"$f":"IFERROR(INDEX($A$2:$A$474,MATCH(0,COUNTIF($Z$1:$Z39,$A$2:$A$474),0)),\"\")","v":""}]
{"$rows_left_out":434}