{"text_format":"1","workbook":"xlsx","n_sheets":3,"sheets":["رقم 1","اعادة شغل بطاقات 2019 (2)","رقم 2"],"not_rendered":{"charts":0,"images":2,"macros":1,"external_links":2,"defined_names":58,"comments":0,"pivot_tables":0},"unopened":[],"bounds":{"document_bytes":16777216,"sheet_cells":100000,"rows_first":2000,"rows_last":500,"rows_between":2000,"halvings":0,"cell_chars":16384,"cell_head_chars":4096},"cells_cut":0,"cells_raw":0,"read":"whole","date_system":"1900"}

{"sheet":"رقم 1","index":0,"n_rows":57,"n_cols":29,"rows_kept":57,"cut":false,"hidden":false,"merged":[]}
[2017,"يعطي بيانة الي شيت 2",3,4,5,6,7,8,9,10,11,12,13,14,15,16,17,18,19,20,21,22,23,24,25,26,27,28]
["رقم","الاسم",{"$f":"INDEX([2]مفارد!$F$9:$F$28,MIN(IF([2]مفارد!$E$1:$E$28<>\"\",ROW([2]مفارد!$E$1:$E$28)-ROW([2]مفارد!$E$1)+1,\"\")))","v":"الأجر الوظيفي قبل التسوية"},{"$f":"INDEX([2]مفارد!$F$10:$F$28,MIN(IF([2]مفارد!$E$1:$E$28<>\"\",ROW([2]مفارد!$E$1:$E$28)-ROW([2]مفارد!$E$1)+1,\"\")))","v":"تسوية الأجر الوظيفى"},{"$f":"INDEX([2]مفارد!$F$11:$F$28,MIN(IF([2]مفارد!$E$1:$E$28<>\"\",ROW([2]مفارد!$E$1:$E$28)-ROW([2]مفارد!$E$1)+1,\"\")))","v":"الأجر الوظيفى"},{"$f":"INDEX([2]مفارد!$F$12:$F$28,MIN(IF([2]مفارد!$E$1:$E$28<>\"\",ROW([2]مفارد!$E$1:$E$28)-ROW([2]مفارد!$E$1)+1,\"\")))","v":"علاوة غلاء المعيشة"},{"$f":"INDEX([2]مفارد!$F$13:$F$28,MIN(IF([2]مفارد!$E$1:$E$28<>\"\",ROW([2]مفارد!$E$1:$E$28)-ROW([2]مفارد!$E$1)+1,\"\")))","v":"العلاوة الدورية 7 %"},{"$f":"INDEX([2]مفارد!$F$14:$F$28,MIN(IF([2]مفارد!$E$1:$E$28<>\"\",ROW([2]مفارد!$E$1:$E$28)-ROW([2]مفارد!$E$1)+1,\"\")))","v":"إجمالى الأجر الوظيفى"},{"$f":"INDEX([2]مفارد!$F$15:$F$28,MIN(IF([2]مفارد!$E$1:$E$28<>\"\",ROW([2]مفارد!$E$1:$E$28)-ROW([2]مفارد!$E$1)+1,\"\")))","v":"علاوة الترقية"},{"$f":"INDEX([2]مفارد!$F$16:$F$28,MIN(IF([2]مفارد!$E$1:$E$28<>\"\",ROW([2]مفارد!$E$1:$E$28)-ROW([2]مفارد!$E$1)+1,\"\")))","v":"علاوة تشجيعية"},{"$f":"INDEX([2]مفارد!$F$17:$F$28,MIN(IF([2]مفارد!$E$1:$E$28<>\"\",ROW([2]مفارد!$E$1:$E$28)-ROW([2]مفارد!$E$1)+1,\"\")))","v":"(أساسى 30-6)"},{"$f":"INDEX([2]مفارد!$F$18:$F$28,MIN(IF([2]مفارد!$E$1:$E$28<>\"\",ROW([2]مفارد!$E$1:$E$28)-ROW([2]مفارد!$E$1)+1,\"\")))","v":"أساسى التأمينات (أساسى 30-6 * 1.09)"},{"$f":"INDEX([2]مفارد!$F$19:$F$28,MIN(IF([2]مفارد!$E$1:$E$28<>\"\",ROW([2]مفارد!$E$1:$E$28)-ROW([2]مفارد!$E$1)+1,\"\")))","v":"الأجرالمكمل قبل التسوية"},{"$f":"INDEX([2]مفارد!$F$20:$F$28,MIN(IF([2]مفارد!$E$1:$E$28<>\"\",ROW([2]مفارد!$E$1:$E$28)-ROW([2]مفارد!$E$1)+1,\"\")))","v":"تسوية الأجر المكمل"},{"$f":"INDEX([2]مفارد!$F$21:$F$28,MIN(IF([2]مفارد!$E$1:$E$28<>\"\",ROW([2]مفارد!$E$1:$E$28)-ROW([2]مفارد!$E$1)+1,\"\")))","v":"الأجرالمكمل"},{"$f":"INDEX([2]مفارد!$F$22:$F$28,MIN(IF([2]مفارد!$E$1:$E$28<>\"\",ROW([2]مفارد!$E$1:$E$28)-ROW([2]مفارد!$E$1)+1,\"\")))","v":"حافز التميز العلمى"},{"$f":"INDEX([2]مفارد!$F$23:$F$28,MIN(IF([2]مفارد!$E$1:$E$28<>\"\",ROW([2]مفارد!$E$1:$E$28)-ROW([2]مفارد!$E$1)+1,\"\")))","v":"بدل إقامة - غير خاضع للضريبة"},{"$f":"INDEX([2]مفارد!$F$24:$F$28,MIN(IF([2]مفارد!$E$1:$E$28<>\"\",ROW([2]مفارد!$E$1:$E$28)-ROW([2]مفارد!$E$1)+1,\"\")))","v":"بدل نقدى - غير خاضع للمعاش"},{"$f":"INDEX([2]مفارد!$F$25:$F$28,MIN(IF([2]مفارد!$E$1:$E$28<>\"\",ROW([2]مفارد!$E$1:$E$28)-ROW([2]مفارد!$E$1)+1,\"\")))","v":"الحافز التعويضى"},{"$f":"INDEX([2]مفارد!$F$26:$F$28,MIN(IF([2]مفارد!$E$1:$E$28<>\"\",ROW([2]مفارد!$E$1:$E$28)-ROW([2]مفارد!$E$1)+1,\"\")))","v":"إجمالى الأجر المكمل"},{"$f":"INDEX([2]مفارد!$F$27:$F$28,MIN(IF([2]مفارد!$E$1:$E$28<>\"\",ROW([2]مفارد!$E$1:$E$28)-ROW([2]مفارد!$E$1)+1,\"\")))","v":"إجمالى متغير المعاشات"},{"$f":"INDEX([2]مفارد!$F$28:$F$28,MIN(IF([2]مفارد!$E$1:$E$28<>\"\",ROW([2]مفارد!$E$1:$E$28)-ROW([2]مفارد!$E$1)+1,\"\")))","v":"جملة المستحق"},{"$f":"INDEX([2]مفارد!$J$9:$J$28,MIN(IF([2]مفارد!$E$1:$E$28<>\"\",ROW([2]مفارد!$E$1:$E$28)-ROW([2]مفارد!$E$1)+1,\"\")))","v":"إيرادات"},{"$f":"INDEX([2]مفارد!$J$10:$J$28,MIN(IF([2]مفارد!$E$1:$E$28<>\"\",ROW([2]مفارد!$E$1:$E$28)-ROW([2]مفارد!$E$1)+1,\"\")))","v":"إجمالى المعاشات"},{"$f":"INDEX([2]مفارد!$J$11:$J$28,MIN(IF([2]مفارد!$E$1:$E$28<>\"\",ROW([2]مفارد!$E$1:$E$28)-ROW([2]مفارد!$E$1)+1,\"\")))","v":"الدمغة العادية"},{"$f":"INDEX([2]مفارد!$J$12:$J$28,MIN(IF([2]مفارد!$E$1:$E$28<>\"\",ROW([2]مفارد!$E$1:$E$28)-ROW([2]مفارد!$E$1)+1,\"\")))","v":"الضريبة الموحدة"},{"$f":"INDEX([2]مفارد!$J$13:$J$28,MIN(IF([2]مفارد!$E$1:$E$28<>\"\",ROW([2]مفارد!$E$1:$E$28)-ROW([2]مفارد!$E$1)+1,\"\")))","v":"إجمالى المتغير الخاضع"},{"$f":"INDEX([2]مفارد!$J$14:$J$28,MIN(IF([2]مفارد!$E$1:$E$28<>\"\",ROW([2]مفارد!$E$1:$E$28)-ROW([2]مفارد!$E$1)+1,\"\")))","v":"جملة المستقطع"}]
["يناير",{"$f":"INDEX([2]مفارد!$E$7:$E$7,MIN(IF([2]مفارد!$E$1:$E$28<>\"\",ROW([2]مفارد!$E$1:$E$28)-ROW([2]مفارد!$E$1)+1,\"\")))","v":"اماني يوسف عبدالعال"},{"$f":"INDEX([2]مفارد!$E$9:$E$28,MIN(IF([2]مفارد!$E$1:$E$28<>\"\",ROW([2]مفارد!$E$1:$E$28)-ROW([2]مفارد!$E$1)+1,\"\")))","v":0},{"$f":"INDEX([2]مفارد!$E$10:$E$28,MIN(IF([2]مفارد!$E$1:$E$28<>\"\",ROW([2]مفارد!$E$1:$E$28)-ROW([2]مفارد!$E$1)+1,\"\")))","v":0},{"$f":"INDEX([2]مفارد!$E$11:$E$28,MIN(IF([2]مفارد!$E$1:$E$28<>\"\",ROW([2]مفارد!$E$1:$E$28)-ROW([2]مفارد!$E$1)+1,\"\")))","v":1024.46},{"$f":"INDEX([2]مفارد!$E$12:$E$28,MIN(IF([2]مفارد!$E$1:$E$28<>\"\",ROW([2]مفارد!$E$1:$E$28)-ROW([2]مفارد!$E$1)+1,\"\")))","v":0},{"$f":"INDEX([2]مفارد!$E$13:$E$28,MIN(IF([2]مفارد!$E$1:$E$28<>\"\",ROW([2]مفارد!$E$1:$E$28)-ROW([2]مفارد!$E$1)+1,\"\")))","v":71.709999999999994},{"$f":"INDEX([2]مفارد!$E$14:$E$28,MIN(IF([2]مفارد!$E$1:$E$28<>\"\",ROW([2]مفارد!$E$1:$E$28)-ROW([2]مفارد!$E$1)+1,\"\")))","v":1096.17},{"$f":"INDEX([2]مفارد!$E$15:$E$28,MIN(IF([2]مفارد!$E$1:$E$28<>\"\",ROW([2]مفارد!$E$1:$E$28)-ROW([2]مفارد!$E$1)+1,\"\")))","v":0},{"$f":"INDEX([2]مفارد!$E$16:$E$28,MIN(IF([2]مفارد!$E$1:$E$28<>\"\",ROW([2]مفارد!$E$1:$E$28)-ROW([2]مفارد!$E$1)+1,\"\")))","v":0},{"$f":"INDEX([2]مفارد!$E$17:$E$28,MIN(IF([2]مفارد!$E$1:$E$28<>\"\",ROW([2]مفارد!$E$1:$E$28)-ROW([2]مفارد!$E$1)+1,\"\")))","v":260},{"$f":"INDEX([2]مفارد!$E$18:$E$28,MIN(IF([2]مفارد!$E$1:$E$28<>\"\",ROW([2]مفارد!$E$1:$E$28)-ROW([2]مفارد!$E$1)+1,\"\")))","v":308.91000000000003},{"$f":"INDEX([2]مفارد!$E$19:$E$28,MIN(IF([2]مفارد!$E$1:$E$28<>\"\",ROW([2]مفارد!$E$1:$E$28)-ROW([2]مفارد!$E$1)+1,\"\")))","v":0},{"$f":"INDEX([2]مفارد!$E$20:$E$28,MIN(IF([2]مفارد!$E$1:$E$28<>\"\",ROW([2]مفارد!$E$1:$E$28)-ROW([2]مفارد!$E$1)+1,\"\")))","v":0},{"$f":"INDEX([2]مفارد!$E$21:$E$28,MIN(IF([2]مفارد!$E$1:$E$28<>\"\",ROW([2]مفارد!$E$1:$E$28)-ROW([2]مفارد!$E$1)+1,\"\")))","v":0},{"$f":"INDEX([2]مفارد!$E$22:$E$28,MIN(IF([2]مفارد!$E$1:$E$28<>\"\",ROW([2]مفارد!$E$1:$E$28)-ROW([2]مفارد!$E$1)+1,\"\")))","v":0},{"$f":"INDEX([2]مفارد!$E$23:$E$28,MIN(IF([2]مفارد!$E$1:$E$28<>\"\",ROW([2]مفارد!$E$1:$E$28)-ROW([2]مفارد!$E$1)+1,\"\")))","v":14.4},{"$f":"INDEX([2]مفارد!$E$24:$E$28,MIN(IF([2]مفارد!$E$1:$E$28<>\"\",ROW([2]مفارد!$E$1:$E$28)-ROW([2]مفارد!$E$1)+1,\"\")))","v":50},{"$f":"INDEX([2]مفارد!$E$25:$E$28,MIN(IF([2]مفارد!$E$1:$E$28<>\"\",ROW([2]مفارد!$E$1:$E$28)-ROW([2]مفارد!$E$1)+1,\"\")))","v":5.47},{"$f":"INDEX([2]مفارد!$E$26:$E$28,MIN(IF([2]مفارد!$E$1:$E$28<>\"\",ROW([2]مفارد!$E$1:$E$28)-ROW([2]مفارد!$E$1)+1,\"\")))","v":69.87},{"$f":"INDEX([2]مفارد!$E$27:$E$28,MIN(IF([2]مفارد!$E$1:$E$28<>\"\",ROW([2]مفارد!$E$1:$E$28)-ROW([2]مفارد!$E$1)+1,\"\")))","v":807.14},{"$f":"INDEX([2]مفارد!$E$28:$E$28,MIN(IF([2]مفارد!$E$1:$E$28<>\"\",ROW([2]مفارد!$E$1:$E$28)-ROW([2]مفارد!$E$1)+1,\"\")))","v":0},{"$f":"INDEX([2]مفارد!$I$9:$I$28,MIN(IF([2]مفارد!$E$1:$E$28<>\"\",ROW([2]مفارد!$E$1:$E$28)-ROW([2]مفارد!$E$1)+1,\"\")))","v":0.03},{"$f":"INDEX([2]مفارد!$I$10:$I$28,MIN(IF([2]مفارد!$E$1:$E$28<>\"\",ROW([2]مفارد!$E$1:$E$28)-ROW([2]مفارد!$E$1)+1,\"\")))","v":311.77999999999997},{"$f":"INDEX([2]مفارد!$I$11:$I$28,MIN(IF([2]مفارد!$E$1:$E$28<>\"\",ROW([2]مفارد!$E$1:$E$28)-ROW([2]مفارد!$E$1)+1,\"\")))","v":7.35},{"$f":"INDEX([2]مفارد!$I$12:$I$28,MIN(IF([2]مفارد!$E$1:$E$28<>\"\",ROW([2]مفارد!$E$1:$E$28)-ROW([2]مفارد!$E$1)+1,\"\")))","v":0},{"$f":"INDEX([2]مفارد!$I$13:$I$28,MIN(IF([2]مفارد!$E$1:$E$28<>\"\",ROW([2]مفارد!$E$1:$E$28)-ROW([2]مفارد!$E$1)+1,\"\")))","v":807.14},{"$f":"INDEX([2]مفارد!$I$14:$I$28,MIN(IF([2]مفارد!$E$1:$E$28<>\"\",ROW([2]مفارد!$E$1:$E$28)-ROW([2]مفارد!$E$1)+1,\"\")))","v":319.16000000000003}]
["يوليو",{"$f":"INDEX([2]مفارد!$E$7:$E$7,MIN(IF([2]مفارد!$E$1:$E$28<>\"\",ROW([2]مفارد!$E$1:$E$28)-ROW([2]مفارد!$E$1)+1,\"\")))","v":"اماني يوسف عبدالعال"},{"$f":"INDEX([2]مفارد!$E$46:$E$65,MIN(IF([2]مفارد!$E$3:$E$65<>\"\",ROW([2]مفارد!$E$3:$E$65)-ROW([2]مفارد!$E$3)+1,\"\")))","v":1096.17},{"$f":"INDEX([2]مفارد!$E$47:$E$65,MIN(IF([2]مفارد!$E$3:$E$65<>\"\",ROW([2]مفارد!$E$3:$E$65)-ROW([2]مفارد!$E$3)+1,\"\")))","v":0},{"$f":"INDEX([2]مفارد!$E$48:$E$65,MIN(IF([2]مفارد!$E$3:$E$65<>\"\",ROW([2]مفارد!$E$3:$E$65)-ROW([2]مفارد!$E$3)+1,\"\")))","v":1096.17},{"$f":"INDEX([2]مفارد!$E$49:$E$65,MIN(IF([2]مفارد!$E$3:$E$65<>\"\",ROW([2]مفارد!$E$3:$E$65)-ROW([2]مفارد!$E$3)+1,\"\")))","v":76.73},{"$f":"INDEX([2]مفارد!$E$50:$E$65,MIN(IF([2]مفارد!$E$3:$E$65<>\"\",ROW([2]مفارد!$E$3:$E$65)-ROW([2]مفارد!$E$3)+1,\"\")))","v":76.73},{"$f":"INDEX([2]مفارد!$E$51:$E$65,MIN(IF([2]مفارد!$E$3:$E$65<>\"\",ROW([2]مفارد!$E$3:$E$65)-ROW([2]مفارد!$E$3)+1,\"\")))","v":1249.6300000000001},{"$f":"INDEX([2]مفارد!$E$52:$E$65,MIN(IF([2]مفارد!$E$3:$E$65<>\"\",ROW([2]مفارد!$E$3:$E$65)-ROW([2]مفارد!$E$3)+1,\"\")))","v":0},{"$f":"INDEX([2]مفارد!$E$53:$E$65,MIN(IF([2]مفارد!$E$3:$E$65<>\"\",ROW([2]مفارد!$E$3:$E$65)-ROW([2]مفارد!$E$3)+1,\"\")))","v":0},{"$f":"INDEX([2]مفارد!$E$54:$E$65,MIN(IF([2]مفارد!$E$3:$E$65<>\"\",ROW([2]مفارد!$E$3:$E$65)-ROW([2]مفارد!$E$3)+1,\"\")))","v":260},{"$f":"INDEX([2]مفارد!$E$55:$E$65,MIN(IF([2]مفارد!$E$3:$E$65<>\"\",ROW([2]مفارد!$E$3:$E$65)-ROW([2]مفارد!$E$3)+1,\"\")))","v":336.71},{"$f":"INDEX([2]مفارد!$E$56:$E$65,MIN(IF([2]مفارد!$E$3:$E$65<>\"\",ROW([2]مفارد!$E$3:$E$65)-ROW([2]مفارد!$E$3)+1,\"\")))","v":0},{"$f":"INDEX([2]مفارد!$E$57:$E$65,MIN(IF([2]مفارد!$E$3:$E$65<>\"\",ROW([2]مفارد!$E$3:$E$65)-ROW([2]مفارد!$E$3)+1,\"\")))","v":0},{"$f":"INDEX([2]مفارد!$E$58:$E$65,MIN(IF([2]مفارد!$E$3:$E$65<>\"\",ROW([2]مفارد!$E$3:$E$65)-ROW([2]مفارد!$E$3)+1,\"\")))","v":0},{"$f":"INDEX([2]مفارد!$E$59:$E$65,MIN(IF([2]مفارد!$E$3:$E$65<>\"\",ROW([2]مفارد!$E$3:$E$65)-ROW([2]مفارد!$E$3)+1,\"\")))","v":0},{"$f":"INDEX([2]مفارد!$E$60:$E$65,MIN(IF([2]مفارد!$E$3:$E$65<>\"\",ROW([2]مفارد!$E$3:$E$65)-ROW([2]مفارد!$E$3)+1,\"\")))","v":14.4},{"$f":"INDEX([2]مفارد!$E$61:$E$65,MIN(IF([2]مفارد!$E$3:$E$65<>\"\",ROW([2]مفارد!$E$3:$E$65)-ROW([2]مفارد!$E$3)+1,\"\")))","v":50},{"$f":"INDEX([2]مفارد!$E$62:$E$65,MIN(IF([2]مفارد!$E$3:$E$65<>\"\",ROW([2]مفارد!$E$3:$E$65)-ROW([2]مفارد!$E$3)+1,\"\")))","v":5.64},{"$f":"INDEX([2]مفارد!$E$63:$E$65,MIN(IF([2]مفارد!$E$3:$E$65<>\"\",ROW([2]مفارد!$E$3:$E$65)-ROW([2]مفارد!$E$3)+1,\"\")))","v":70.040000000000006},{"$f":"INDEX([2]مفارد!$E$64:$E$65,MIN(IF([2]مفارد!$E$3:$E$65<>\"\",ROW([2]مفارد!$E$3:$E$65)-ROW([2]مفارد!$E$3)+1,\"\")))","v":932.96},{"$f":"INDEX([2]مفارد!$E$65:$E$65,MIN(IF([2]مفارد!$E$3:$E$65<>\"\",ROW([2]مفارد!$E$3:$E$65)-ROW([2]مفارد!$E$3)+1,\"\")))","v":1567.64},{"$f":"INDEX([2]مفارد!$I$46:$I$65,MIN(IF([2]مفارد!$E$1:$E$28<>\"\",ROW([2]مفارد!$E$1:$E$28)-ROW([2]مفارد!$E$1)+1,\"\")))","v":0},{"$f":"INDEX([2]مفارد!$I$47:$I$65,MIN(IF([2]مفارد!$E$1:$E$28<>\"\",ROW([2]مفارد!$E$1:$E$28)-ROW([2]مفارد!$E$1)+1,\"\")))","v":397.74},{"$f":"INDEX([2]مفارد!$I$48:$I$65,MIN(IF([2]مفارد!$E$1:$E$28<>\"\",ROW([2]مفارد!$E$1:$E$28)-ROW([2]مفارد!$E$1)+1,\"\")))","v":8.3000000000000007},{"$f":"INDEX([2]مفارد!$I$49:$I$65,MIN(IF([2]مفارد!$E$1:$E$28<>\"\",ROW([2]مفارد!$E$1:$E$28)-ROW([2]مفارد!$E$1)+1,\"\")))","v":0},{"$f":"INDEX([2]مفارد!$I$50:$I$65,MIN(IF([2]مفارد!$E$1:$E$28<>\"\",ROW([2]مفارد!$E$1:$E$28)-ROW([2]مفارد!$E$1)+1,\"\")))","v":932.96},{"$f":"INDEX([2]مفارد!$I$51:$I$65,MIN(IF([2]مفارد!$E$1:$E$28<>\"\",ROW([2]مفارد!$E$1:$E$28)-ROW([2]مفارد!$E$1)+1,\"\")))","v":406.04}]
["فبراير"]
["يوليو"]
{"$rows_left_out":52}
{"sheet":"اعادة شغل بطاقات 2019 (2)","index":1,"n_rows":37,"n_cols":25,"rows_kept":37,"cut":false,"hidden":false,"merged":[[0,0,0,15],[0,17,0,22],[1,0,1,15],[2,1,2,2],[2,3,2,6],[2,12,4,14],[2,20,2,21],[3,1,3,2],[3,8,3,10],[4,1,4,2],[2,8,2,11],[4,3,4,5],[4,8,4,10],[23,11,23,12],[23,13,24,15],[25,4,25,6],[5,0,6,0],[5,10,6,10],[20,0,20,1],[22,11,22,12],[22,13,22,15],[21,1,21,2],[21,4,21,7],[22,0,23,2]]}
["بيان تفصيلي بالاجور المتغيرة المستقطع عنها معاشات خلال الفتره ",null,null,null,null,null,null,null,null,null,null,null,null,null,null,null,null,"    كلية الطب - الشئون الادارية"]
["من 2017/1/1 الى 2017/12/31       ",null,null,null,null,null,null,null,null,null,null,null,null,null,null,null,null,null,null,"المسدد عنها اشتراكات التأمين الاجتماعى عن الفترة من  2017/1/1 الى  2017/2/20م"]
[1,"الاســــم",null,{"$f":"VLOOKUP($A$3,'[2]يناير ويوليو 2016 (2)'!$A$3:$S$13,COLUMNS($A$1:B1),0)","v":0},null,null,null,null,"يأخذ بياناتة من يناير ويوليو",null,null,null,{"$f":"INDEX(#REF!,MATCH('[2]مستند معاشات رعاية طفل (2)'!$J$1,#REF!,0))","v":{"$error":"#REF!"}},null,null,null,null,"الرقم التأمينى",null,"اسم المؤمن عليه /",{"$f":"D3","v":0}]
[" ",null,null,3,null,null,null,null,"المرتب في 2015/6/30",null,null,{"$f":"I32","v":0}]
[null,"الدرجــــه",null,{"$f":"F37","v":"الثالثة"},null,null,null,null,"اساسي تأمينات  في 2016/1/1",null,null,{"$f":"J32","v":260},null,null,null,null,null,"الشهر","المتغير","المتغيرة","اجمالي","ملاحظات"]
["الشهور","الاجر الوظيفي","ع دورية","علاوات","اجر مكمل","حافز تعويضي","اساسي تأمينات","علاوات","بدل","بدل","جملة (1)","مكافآت","اجر","مكافآت","جملة","مجموع",null,null,"المرتبط","الاخرى","الاجور"]
{"$rows_left_out":32}
{"sheet":"رقم 2","index":2,"n_rows":28,"n_cols":24,"rows_kept":28,"cut":false,"hidden":false,"merged":[[14,2,14,10],[0,1,0,2],[0,3,0,9]]}
[]
["يناير","اسم الموظف","الأجر الوظيفي قبل التسوية","الأجر الوظيفى","علاوة\n غلاء المعيشة","العلاوة\n الدورية ٥ %","إجمالى الأجر الوظيفى","علاوة الترقية","اساسي\n/2015 30/6","اساسي\n التامينات","تسوية \nالاجر \nالمكمل","الاجر \nالمكمل","حافز \nالتميز","بدل \nاقامة","بدل \nنقدي","الحافز ا\nلتعويضي","اجمالي\n الاجر \nالمكمل","اجمالي\n متغير \nالمعاشات"]
[1,"اميرة إسماعيل تهامى إسماعيل",{"$f":"VLOOKUPAlsaqrhmk('رقم 1'!$A$3:$AB$500,$B3,2,$A$2,1,3,ROW()-$X3)","v":1024.46},{"$f":"VLOOKUPAlsaqrhmk('رقم 1'!$A$3:$AB$500,$B3,2,$A$2,1,5,ROW()-$X3)","v":1024.46},{"$f":"VLOOKUPAlsaqrhmk('رقم 1'!$A$3:$AB$500,$B3,2,$A$2,1,6,ROW()-$X3)","v":0},{"$f":"VLOOKUPAlsaqrhmk('رقم 1'!$A$3:$AB$500,$B3,2,$A$2,1,7,ROW()-$X3)","v":71.709999999999994},{"$f":"VLOOKUPAlsaqrhmk('رقم 1'!$A$3:$AB$500,$B3,2,$A$2,1,8,ROW()-$X3)","v":1096.17},{"$f":"VLOOKUPAlsaqrhmk('رقم 1'!$A$3:$AB$500,$B3,2,$A$2,1,9,ROW()-$X3)","v":0},{"$f":"VLOOKUPAlsaqrhmk('رقم 1'!$A$3:$AB$500,$B3,2,$A$2,1,11,ROW()-$X3)","v":260},{"$f":"VLOOKUPAlsaqrhmk('رقم 1'!$A$3:$AB$500,$B3,2,$A$2,1,12,ROW()-$X3)","v":308.91000000000003},{"$f":"VLOOKUPAlsaqrhmk('رقم 1'!$A$3:$AB$500,$B3,2,$A$2,1,14,ROW()-$X3)","v":0},{"$f":"VLOOKUPAlsaqrhmk('رقم 1'!$A$3:$AB$500,$B3,2,$A$2,1,15,ROW()-$X3)","v":0},{"$f":"VLOOKUPAlsaqrhmk('رقم 1'!$A$3:$AB$500,$B3,2,$A$2,1,16,ROW()-$X3)","v":0},{"$f":"VLOOKUPAlsaqrhmk('رقم 1'!$A$3:$AB$500,$B3,2,$A$2,1,17,ROW()-$X3)","v":14.4},{"$f":"VLOOKUPAlsaqrhmk('رقم 1'!$A$3:$AB$500,$B3,2,$A$2,1,18,ROW()-$X3)","v":50},{"$f":"VLOOKUPAlsaqrhmk('رقم 1'!$A$3:$AB$500,$B3,2,$A$2,1,19,ROW()-$X3)","v":5.64},{"$f":"VLOOKUPAlsaqrhmk('رقم 1'!$A$3:$AB$500,$B3,2,$A$2,1,20,ROW()-$X3)","v":70.040000000000006},{"$f":"VLOOKUPAlsaqrhmk('رقم 1'!$A$3:$AB$500,$B3,2,$A$2,1,21,ROW()-$X3)","v":807.3},null,null,null,null,null,{"$f":"ROW()-1","v":2}]
[2,"اماني يوسف عبدالعال",{"$f":"VLOOKUPAlsaqrhmk('رقم 1'!$A$3:$AB$500,$B4,2,$A$2,1,3,ROW()-$X4)","v":0},{"$f":"VLOOKUPAlsaqrhmk('رقم 1'!$A$3:$AB$500,$B4,2,$A$2,1,5,ROW()-$X4)","v":1024.46},{"$f":"VLOOKUPAlsaqrhmk('رقم 1'!$A$3:$AB$500,$B4,2,$A$2,1,6,ROW()-$X4)","v":0},{"$f":"VLOOKUPAlsaqrhmk('رقم 1'!$A$3:$AB$500,$B4,2,$A$2,1,7,ROW()-$X4)","v":71.709999999999994},{"$f":"VLOOKUPAlsaqrhmk('رقم 1'!$A$3:$AB$500,$B4,2,$A$2,1,8,ROW()-$X4)","v":1096.17},{"$f":"VLOOKUPAlsaqrhmk('رقم 1'!$A$3:$AB$500,$B4,2,$A$2,1,9,ROW()-$X4)","v":0},{"$f":"VLOOKUPAlsaqrhmk('رقم 1'!$A$3:$AB$500,$B4,2,$A$2,1,11,ROW()-$X4)","v":260},{"$f":"VLOOKUPAlsaqrhmk('رقم 1'!$A$3:$AB$500,$B4,2,$A$2,1,12,ROW()-$X4)","v":308.91000000000003},{"$f":"VLOOKUPAlsaqrhmk('رقم 1'!$A$3:$AB$500,$B4,2,$A$2,1,14,ROW()-$X4)","v":0},{"$f":"VLOOKUPAlsaqrhmk('رقم 1'!$A$3:$AB$500,$B4,2,$A$2,1,15,ROW()-$X4)","v":0},{"$f":"VLOOKUPAlsaqrhmk('رقم 1'!$A$3:$AB$500,$B4,2,$A$2,1,16,ROW()-$X4)","v":0},{"$f":"VLOOKUPAlsaqrhmk('رقم 1'!$A$3:$AB$500,$B4,2,$A$2,1,17,ROW()-$X4)","v":14.4},{"$f":"VLOOKUPAlsaqrhmk('رقم 1'!$A$3:$AB$500,$B4,2,$A$2,1,18,ROW()-$X4)","v":50},{"$f":"VLOOKUPAlsaqrhmk('رقم 1'!$A$3:$AB$500,$B4,2,$A$2,1,19,ROW()-$X4)","v":5.47},{"$f":"VLOOKUPAlsaqrhmk('رقم 1'!$A$3:$AB$500,$B4,2,$A$2,1,20,ROW()-$X4)","v":69.87},{"$f":"VLOOKUPAlsaqrhmk('رقم 1'!$A$3:$AB$500,$B4,2,$A$2,1,21,ROW()-$X4)","v":807.14},null,null,null,null,null,{"$f":"ROW()-1","v":3}]
[3,"إيمان أحمد بركات أحمد",{"$f":"VLOOKUPAlsaqrhmk('رقم 1'!$A$3:$AB$500,$B5,2,$A$2,1,3,ROW()-$X5)","v":1024.46},{"$f":"VLOOKUPAlsaqrhmk('رقم 1'!$A$3:$AB$500,$B5,2,$A$2,1,5,ROW()-$X5)","v":1024.46},{"$f":"VLOOKUPAlsaqrhmk('رقم 1'!$A$3:$AB$500,$B5,2,$A$2,1,6,ROW()-$X5)","v":0},{"$f":"VLOOKUPAlsaqrhmk('رقم 1'!$A$3:$AB$500,$B5,2,$A$2,1,7,ROW()-$X5)","v":71.709999999999994},{"$f":"VLOOKUPAlsaqrhmk('رقم 1'!$A$3:$AB$500,$B5,2,$A$2,1,8,ROW()-$X5)","v":1096.17},{"$f":"VLOOKUPAlsaqrhmk('رقم 1'!$A$3:$AB$500,$B5,2,$A$2,1,9,ROW()-$X5)","v":0},{"$f":"VLOOKUPAlsaqrhmk('رقم 1'!$A$3:$AB$500,$B5,2,$A$2,1,11,ROW()-$X5)","v":260},{"$f":"VLOOKUPAlsaqrhmk('رقم 1'!$A$3:$AB$500,$B5,2,$A$2,1,12,ROW()-$X5)","v":308.91000000000003},{"$f":"VLOOKUPAlsaqrhmk('رقم 1'!$A$3:$AB$500,$B5,2,$A$2,1,14,ROW()-$X5)","v":0},{"$f":"VLOOKUPAlsaqrhmk('رقم 1'!$A$3:$AB$500,$B5,2,$A$2,1,15,ROW()-$X5)","v":0},{"$f":"VLOOKUPAlsaqrhmk('رقم 1'!$A$3:$AB$500,$B5,2,$A$2,1,16,ROW()-$X5)","v":0},{"$f":"VLOOKUPAlsaqrhmk('رقم 1'!$A$3:$AB$500,$B5,2,$A$2,1,17,ROW()-$X5)","v":14.4},{"$f":"VLOOKUPAlsaqrhmk('رقم 1'!$A$3:$AB$500,$B5,2,$A$2,1,18,ROW()-$X5)","v":50},{"$f":"VLOOKUPAlsaqrhmk('رقم 1'!$A$3:$AB$500,$B5,2,$A$2,1,19,ROW()-$X5)","v":5.64},{"$f":"VLOOKUPAlsaqrhmk('رقم 1'!$A$3:$AB$500,$B5,2,$A$2,1,20,ROW()-$X5)","v":70.040000000000006},{"$f":"VLOOKUPAlsaqrhmk('رقم 1'!$A$3:$AB$500,$B5,2,$A$2,1,21,ROW()-$X5)","v":807.3},null,null,null,null,null,4]
[4,"إيمان جمال محمد سيف خليل",{"$f":"VLOOKUPAlsaqrhmk('رقم 1'!$A$3:$AB$500,$B6,2,$A$2,1,3,ROW()-$X6)","v":1031.8699999999999},{"$f":"VLOOKUPAlsaqrhmk('رقم 1'!$A$3:$AB$500,$B6,2,$A$2,1,5,ROW()-$X6)","v":1031.8699999999999},{"$f":"VLOOKUPAlsaqrhmk('رقم 1'!$A$3:$AB$500,$B6,2,$A$2,1,6,ROW()-$X6)","v":0},{"$f":"VLOOKUPAlsaqrhmk('رقم 1'!$A$3:$AB$500,$B6,2,$A$2,1,7,ROW()-$X6)","v":72.23},{"$f":"VLOOKUPAlsaqrhmk('رقم 1'!$A$3:$AB$500,$B6,2,$A$2,1,8,ROW()-$X6)","v":1104.0999999999999},{"$f":"VLOOKUPAlsaqrhmk('رقم 1'!$A$3:$AB$500,$B6,2,$A$2,1,9,ROW()-$X6)","v":0},{"$f":"VLOOKUPAlsaqrhmk('رقم 1'!$A$3:$AB$500,$B6,2,$A$2,1,11,ROW()-$X6)","v":263},{"$f":"VLOOKUPAlsaqrhmk('رقم 1'!$A$3:$AB$500,$B6,2,$A$2,1,12,ROW()-$X6)","v":312.47000000000003},{"$f":"VLOOKUPAlsaqrhmk('رقم 1'!$A$3:$AB$500,$B6,2,$A$2,1,14,ROW()-$X6)","v":0},{"$f":"VLOOKUPAlsaqrhmk('رقم 1'!$A$3:$AB$500,$B6,2,$A$2,1,15,ROW()-$X6)","v":0},{"$f":"VLOOKUPAlsaqrhmk('رقم 1'!$A$3:$AB$500,$B6,2,$A$2,1,16,ROW()-$X6)","v":0},{"$f":"VLOOKUPAlsaqrhmk('رقم 1'!$A$3:$AB$500,$B6,2,$A$2,1,17,ROW()-$X6)","v":14.4},{"$f":"VLOOKUPAlsaqrhmk('رقم 1'!$A$3:$AB$500,$B6,2,$A$2,1,18,ROW()-$X6)","v":50},{"$f":"VLOOKUPAlsaqrhmk('رقم 1'!$A$3:$AB$500,$B6,2,$A$2,1,19,ROW()-$X6)","v":5.68},{"$f":"VLOOKUPAlsaqrhmk('رقم 1'!$A$3:$AB$500,$B6,2,$A$2,1,20,ROW()-$X6)","v":70.08},{"$f":"VLOOKUPAlsaqrhmk('رقم 1'!$A$3:$AB$500,$B6,2,$A$2,1,21,ROW()-$X6)","v":811.71},null,null,null,null,null,5]
{"$rows_left_out":22}