{"text_format":"1","workbook":"xlsx","n_sheets":3,"sheets":["Main of Month","18-07-2019","20-07-2019"],"not_rendered":{"charts":0,"images":0,"macros":1,"external_links":0,"defined_names":8,"comments":0,"pivot_tables":0},"unopened":[],"bounds":{"document_bytes":16777216,"sheet_cells":100000,"rows_first":2000,"rows_last":500,"rows_between":2000,"halvings":0,"cell_chars":16384,"cell_head_chars":4096},"cells_cut":0,"cells_raw":0,"read":"whole","date_system":"1900"}

{"sheet":"Main of Month","index":0,"n_rows":500,"n_cols":16384,"rows_kept":500,"cut":false,"hidden":false,"merged":[[72,11,73,11],[72,12,73,12]]}
[null,null,null,null,null,null,null,null,null,null,null,null,null,null,"Official time","رجــــوع",null,null,null,null,null,null,null,null,null,null,null,null,null,null,null,null,null,null,null,null,null,null,null,null,null,null,null,null,null,null,null,null,null,null,null,null,null,null,null,null,null,null,null,null,null,null,null,null,null,null,null,null,null,null,null,null,null,null,null,null,null,null,null,null,null,null,null,null,null,null,null,null,null,null,null,null,null,null,null,null,null,null,null,null,null,null,null,null,null,null,null,null,null,null,null,null,null,null,null,null,null,null,null,null,null,null,null,null,null,null,null,null,null,null,null,null,null,null,null,null,null,null,null,null,null,null,null,null,null,null,null,null,null,null,null,null,null,null,null,null,null,null,null,null,null,null,null,null,null,null,null,null,null,null,null,null,null,null,null,null,null,null,null,null,null,null,null,null,null,null,null,null,null,null,null,null,null,null,null,null,null,null,null,null,null,null,null,null,null,null,null,null,null,null,null,null,null,null,null,null,null,null,null,null,null,null,null,null,null,null,null,null,null,null,null,null,null,null,null,null,null,null,null,null,null,null,null,null,null,null,null,null,null,null,null,null,null,null,null,null,null,null,null,null,null,null,null,null,null,null,null,null,null,null,null,null,null,null,null,null,null,null,null,null,null,null,null,null,null,null,null,null,null,null,null,null,null,null,null,null,null,null,null,null,null,null,null,null,null,null,null,null,null,null,null,null,null,null,null,null,null,null,null,null,null,null,null,null,null,null,null,null,null,null,null,null,null,null,null,null,null,null,null,null,null,null,null,null,null,null,null,null,null,null,null,null,null,null,null,null,null,null,null,null,null,null,null,null,null,null,null,null,null,null,null,null,null,null,null,null,null,null,null,null,null,null,null,null,null,null,null,null,null,null,null,null,null,null,null,null,null,null,null,null,null,null,null,null,null,null,null,null,null,null,null,null,null,null,null,null,null,null,null,null,null,null,null,null,null,null,null,null,null,null,null,null,null,null,null,null,null,null,null,null,null,null,null,null,null,null,null,null,null,null,null,null,null,null,null,null,null,null,null,null,null,null,null,null,null,null,null,null,null,null,null,null,null,null,null,null,null,null,null,null,null,null,null,null,null,null,null,null,null,null,null,null,null,null,null,null,null,null,null,null,null,null,null,null,null,null,null,null,null,null,null,null,null,null,null,null,null,null,null,null,null,null,null,null,null,null,null,null,null,null,null,null,null,null,null,null,null,null,null,null,null,null,null,null,null,null,null,null,null,null,null,null,null,null,null,null,null,null,null,null,null,null,null,null,null,null,null,null,null,null,null,null,null,null,null,null,null,null,null,null,null,null,null,null,null,null,null,null,null,null,null,null,null,null,null,null,null,null,null,null,null,null,null,null,null,null,null,null,null,null,null,null,null,null,null,null,null,null,null,null,null,null,null,null,null,null,null,null,null,null,null,null,null,null,null,null,null,null,null,null,null,null,null,null,null,null,null,null,null,null,null,null,null,null,null,null,null,null,null,null,null,null,null,null,null,null,null,null,null,null,null,null,null,null,null,null,null,null,null,null,null,null,null,null,null,null,null,null,null,null,null,null,null,null,null,null,null,null,null,null,null,null,null,null,null,null,null,null,null,null,null,null,null,null,null,null,null,null,null,null,null,null,null,null,null,null,null,null,null,null,null,null,null,null,null,null,null,null,null,null,null,null,null,null,null,null,null,null,null,null,null,null,null,null,null,null,null,null,null,null,null,null,null,null,null,null,null,null,null,null,null,null,null,null,null,null,null,null,null,null,null,null,null,null,null,null,null,null,null,null,null,null,null,null,null,null,null,null,null,null,null,null,null,null,null,null,null,null,null,null,null,null,null,null,null,null,null,null,null,null,null,null,null,null,null,null,null,null,null,null,null,null,null,null,null,null,null,null,null,null,null,null,null,null,null,null,null,null,null,null,null,null,null,null,null,null,null,null,null,null,null,null,null,null,null,null,null,null,null,null,null,null,null,null,null,null,null,null,null,null,null,null,null,null,null,null,null,null,null,null,null,null,null,null,null,null,null,null,null,null,null,null,null,null,null,null,null,null,null,null,null,null,null,null,null,null,null,null,null,null,null,null,null,null,null,null,null,null,null,null,null,null,null,null,null,null,null,null,null,null,null,null,null,null,null,null,null,null,null,null,null,null,null,null,null,null,null,null,null,null,null,null,null,null,null,null,null,null,null,null,null,null,null,null,null,null,null,null,null,null,null,null,null,null,null,null,null,null,null,null,null,null,null,null,null,null,null,null,null,null,null,null,null,null,null,null,null,null,null,null,null,null,null,null,null,null,null,null,null,null,null,null,null,null,null,null,null,null,null,null,null,null,null,null,null,null,null,null,null,null,null,null,null,null,null,null,null,null,null,null,null,null,null,null,null,null,null,null,null,null,null,null,null,null,null,null,null,null,null,null,null,null,null,null,null,null,null,null,null,null,null,null,null,null,null,null,null,null,null,null,null,null,null,null,null,null,null,null,null,null,null,null,null,null,null,null,null,null,null,null,null,null,null,null,null,null,null,null,null,null,null,null,null,null,null,null,null,null,null,null,null,null,null,null,null,null,null,null,null,null,null,null,null,null,null,null,null,null,null,null,null,null,null,null,null,null,null,null,null,null,null,null,null,null,null,null,null,null,null,null,null,null,null,null,null,null,null,null,null,null,null,null,null,null,null,null,null,null,null,null,null,null,null,null,null,null,null,null,null,null,null,null,null,null,null,null,null,null,null,null,null,null,null,null,null,null,null,null,null,null,null,null,null,null,null,null,null,null,null,null,null,null,null,null,null,null,null,null,null,null,null,null,null,null,null,null,null,null,null,null,null,null,null,null,null,null,null,null,null,null,null,null,null,null,null,null,null,null,null,null,null,null,null,null,null,null,null,null,null,null,null,null,null,null,null,null,null,null,null,null,null,null,null,null,null,null,null,null,null,null,null,null,null,null,null,null,null,null,null,null,null,null,null,null,null,null,null,null,null,null,null,null,null,null,null,null,null,null,null,null,null,null,null,null,null,null,null,null,null,null,null,null,null,null,null,null,null,null,null,null,null,null,null,null,null,null,null,null,null,null,null,null,null,null,null,null,null,null,null,null,null,null,null,null,null,null,null,null,null,null,null,null,null,null,null,null,null,null,null,null,null,null,null,null,null,null,null,null,null,null,null,null,null,null,null,null,null,null,null,null,null,null,null,null,null,null,null,null,null,null,null,null,null,null,null,null,null,null,null,null,null,null,null,null,null,null,null,null,null,null,null,null,null,null,null,null,null,null,null,null,null,null,null,null,null,null,null,null,null,null,null,null,null,null,null,null,null,null,null,null,null,null,null,null,null,null,null,null,null,null,null,null,null,null,null,null,null,null,null,null,null,null,null,null,null,null,null,null,null,null,null,null,null,null,null,null,null,null,null,null,null,null,null,null,null,null,null,null,null,null,null,null,null,null,null,null,null,null,null,null,null,null,null,null,null,null,null,null,null,null,null,null,null,null,null,null,null,null,null,null,null,null,null,null,null,null,null,null,null,null,null,null,null,null,null,null,null,null,null,null,null,null,null,null,null,null,null,null,null,null,null,null,null,null,null,null,null,null,null,null,null,null,null,null,null,null,null,null,null,null,null,null,null,null,null,null,null,null,null,null,null,null,null,null,null,null,null,null,null,null,null,null,null,null,null,null,null,null,null,null,null,null,null,null,null,null,null,null,null,null,null,null,null,null,null,null,null,null,null,null,null,null,null,null,null,null,null,null,null,null,null,null,null,null,null,null,null,null,null,null,null,null,null,null,null,null,null,null,null,null,null,null,null,null,null,null,null,null,null,null,null,null,null,null,null,null,null,null,null,null,null,null,null,null,null,null,null,null,null,null,null,null,null,null,null,null,null,null,null,null,null,null,null,null,null,null,null,null,null,null,null,null,null,null,null,null,null,null,null,null,null,null,null,null,null,null,null,null,null,null,null,null,null,null,null,null,null,null,null,null,null,null,null,null,null,null,null,null,null,null,null,null,null,null,null,null,null,null,null,null,null,null,null,null,null,null,null,null,null,null,null,null,null,null,null,null,null,null,null,null,null,null,null,null,null,null,null,null,null,null,null,null,null,null,null,null,null,null,null,null,null,null,null,null,null,null,null,null,null,null,null,null,null,null,null,null,null,null,null,null,null,null,null,null,null,null,null,null,null,null,null,null,null,null,null,null,null,null,null,null,null,null,null,null,null,null,null,null,null,null,null,null,null,null,null,null,null,null,null,null,null,null,null,null,null,null,null,null,null,null,null,null,null,null,null,null,null,null,null,null,null,null,null,null,null,null,null,null,null,null,null,null,null,null,null,null,null,null,null,null,null,null,null,null,null,null,null,null,null,null,null,null,null,null,null,null,null,null,null,null,null,null,null,null,null,null,null,null,null,null,null,null,null,null,null,null,null,null,null,null,null,null,null,null,null,null,null,null,null,null,null,null,null,null,null,null,null,null,null,null,null,null,null,null,null,null,null,null,null,null,null,null,null,null,null,null,null,null,null,null,null,null,null,null,null,null,null,null,null,null,null,null,null,null,null,null,null,null,null,null,null,null,null,null,null,null,null,null,null,null,null,null,null,null,null,null,null,null,null,null,null,null,null,null,null,null,null,null,null,null,null,null,null,null,null,null,null,null,null,null,null,null,null,null,null,null,null,null,null,null,null,null,null,null,null,null,null,null,null,null,null,null,null,null,null,null,null,null,null,null,null,null,null,null,null,null,null,null,null,null,null,null,null,null,null,null,null,null,null,null,null,null,null,null,null,null,null,null,null,null,null,null,null,null,null,null,null,null,null,null,null,null,null,null,null,null,null,null,null,null,null,null,null,null,null,null,null,null,null,null,null,null,null,null,null,null,null,null,null,null,null,null,null,null,null,null,null,null,null,null,null,null,null,null,null,null,null,null,null,null,null,null,null,null,null,null,null,null,null,null,null,null,null,null,null,null,null,null,null,null,null,null,null,null,null,null,null,null,null,null,null,null,null,null,null,null,null,null,null,null,null,null,null,null,null,null,null,null,null,null,null,null,null,null,null,null,null,null,null,null,null,null,null,null,null,null,null,null,null,null,null,null,null,null,null,null,null,null,null,null,null,null,null,null,null,null,null,null,null,null,null,null,null,null,null,null,null,null,null,null,null,null,null,null,null,null,null,null,null,null,null,null,null,null,null,null,null,null,null,null,null,null,null,null,null,null,null,null,null,null,null,null,null,null,null,null,null,null,null,null,null,null,null,null,null,null,null,null,null,null,null,null,null,null,null,null,null,null,null,null,null,null,null,null,null,null,null,null,null,null,null,null,null,null,null,null,null,null,null,null,null,null,null,null,null,null,null,null,null,null,null,null,null,null,null,null,null,null,null,null,null,null,null,null,null,null,null,null,null,null,null,null,null,null,null,null,null,null,null,null,null,null,null,null,null,null,null,null,null,null,null,null,null,null,null,null,null,null,null,null,null,null,null,null,null,null,null,null,null,null,null,null,null,null,null,null,null,null,null,null,null,null,null,null,null,null,null,null,null,null,null,null,null,null,null,null,null,null,null,null,null,null,null,null,null,null,null,null,null,null,null,null,null,null,null,null,null,null,null,null,null,null,null,null,null,null,null,null,null,null,null,null,null,null,null,null,null,null,null,null,null,null,null,null,null,null,null,null,null,null,null,null,null,null,null,null,null,null,null,null,null,null,null,null,null,null,null,null,null,null,null,null,null,null,null,null,null,null,null,null,null,null,null,null,null,null,null,null,null,null,null,null,null,null,null,null,null,null,null,null,null,null,null,null,null,null,null,null,null,null,null,null,null,null,null,null,null,null,null,null,null,null,null,null,null,null,null,null,null,null,null,null,null,null,null,null,null,null,null,null,null,null,null,null,null,null,null,null,null,null,null,null,null,null,null,null,null,null,null,null,null,null,null,null,null,null,null,null,null,null,null,null,null,null,null,null,null,null,null,null,null,null,null,null,null,null,null,null,null,null,null,null,null,null,null,null,null,null,null,null,null,null,null,null,null,null,null,null,null,null,null,null,null,null,null,null,null,null,null,null,null,null,null,null,null,null,null,null,null,null,null,null,null,null,null,null,null,null,null,null,null,null,null,null,null,null,null,null,null,null,null,null,null,null,null,null,null,null,null,null,null,null,null,null,null,null,null,null,null,null,null,null,null,null,null,null,null,null,null,null,null,null,null,null,null,null,null,null,null,null,null,null,null,null,null,null,null,null,null,null,null,null,null,null,null,null,null,null,null,null,null,null,null,null,null,null,null,null,null,null,null,null,null,null,null,null,null,null,null,null,null,null,null,null,null,null,null,null,null,null,null,null,null,null,null,null,null,null,null,null,null,null,null,null,null,null,null,null,null,null,null,null,null,null,null,null,null,null,null,null,null,null,null,null,null,null,null,null,null,null,null,null,null,null,null,null,null,null,null,null,null,null,null,null,null,null,null,null,null,null,null,null,null,null,null,null,null,null,null,null,null,null,null,null,null,null,null,null,null,null,null,null,null,null,null,null,null,null,null,null,null,null,null,null,null,null,null,null,null,null,null,null,null,null,null,null,null,null,null,null,null,null,null,null,null,null,null,null,null,null,null,null,null,null,null,null,null,null,null,null,null,null,null,null,null,null,null,null,null,null,null,null,null,null,null,null,null,null,null,null,null,null,null,null,null,null,null,null,null,null,null,null,null,null,null,null,null,null,null,null,null,null,null,null,null,null,null,null,null,null,null,null,null,null,null,null,null,null,null,null,null,null,null,null,null,null,null,null,null,null,null,null,null,null,null,null,null,null,null,null,null,null,null,null,null,null,null,null,null,null,null,null,null,null,null,null,null,null,null,null,null,null,null,null,null,null,null,null,null,null,null,null,null,null,null,null,null,null,null,null,null,null,null,null,null,null,null,null,null,null,null,null,null,null,null,null,null,null,null,null,null,null,null,null,null,null,null,null,null,null,null,null,null,null,null,null,null,null,null,null,null,null,null,null,null,null,null,null,null,null,null,null,null,null,null,null,null,null,null,null,null,null,null,null,null,null,null,null,null,null,null,null,null,null,null,null,null,null,null,null,null,null,null,null,null,null,null,null,null,null,null,null,null,null,null,null,null,null,null,null,null,null,null,null,null,null,null,null,null,null,null,null,null,null,null,null,null,null,null,null,null,null,null,null,null,null,null,null,null,null,null,null,null,null,null,null,null,null,null,null,null,null,null,null,null,null,null,null,null,null,null,null,null,null,null,null,null,null,null,null,null,null,null,null,null,null,null,null,null,null,null,null,null,null,null,null,null,null,null,null,null,null,null,null,null,null,null,null,null,null,null,null,null,null,null,null,null,null,null,null,null,null,null,null,null,null,null,null,null,null,null,null,null,null,null,null,null,null,null,null,null,null,null,null,null,null,null,null,null,null,null,null,null,null,null,null,null,null,null,null,null,null,null,null,null,null,null,null,null,null,null,null,null,null,null,null,null,null,null,null,null,null,null,null,null,null,null,null,null,null,null,null,null,null,null,null,null,null,null,null,null,null,null,null,null,null,null,null,null,null,null,null,null,null,null,null,null,null,null,null,null,null,null,null,null,null,null,null,null,null,null,null,null,null,null,null,null,null,null,null,null,null,null,null,null,null,null,null,null,null,null,null,null,null,null,null,null,null,null,null,null,null,null,null,null,null,null,null,null,null,null,null,null,null,null,null,null,null,null,null,null,null,null,null,null,null,null,null,null,null,null,null,null,null,null,null,null,null,null,null,null,null,null,null,null,null,null,null,null,null,null,null,null,null,null,null,null,null,null,null,null,null,null,null,null,null,null,null,null,null,null,null,null,null,null,null,null,null,null,null,null,null,null,null,null,null,null,null,null,null,null,null,null,null,null,null,null,null,null,null,null,null,null,null,null,null,null,null,null,null,null,null,null,null,null,null,null,null,null,null,null,null,null,null,null,null,null,null,null,null,null,null,null,null,null,null,null,null,null,null,null,null,null,null,null,null,null,null,null,null,null,null,null,null,null,null,null,null,null,null,null,null,null,null,null,null,null,null,null,null,null,null,null,null,null,null,null,null,null,null,null,null,null,null,null,null,null,null,null,null,null,null,null,null,null,null,null,null,null,null,null,null,null,null,null,null,null,null,null,null,null,null,null,null,null,null,null,null,null,null,null,null,null,null,null,null,null,null,null,null,null,null,null,null,null,null,null,null,null,null,null,null,null,null,null,null,null,null,null,null,null,null,null,null,null,null,null,null,null,null,null,null,null,null,null,null,null,null,null,null,null,null,null,null,null,null,null,null,null,null,null,null,null,null,null,null,null,null,null,null,null,null,null,null,null,null,null,null,null,null,null,null,null,null,null,null,null,null,null,null,null,null,null,null,null,null,null,null,null,null,null,null,null,null,null,null,null,null,null,null,null,null,null,null,null,null,null,null,null,null,null,null,null,null,null,null,null,null,null,null,null,null,null,null,null,null,null,null,null,null,null,null,null,null,null,null,null,null,null,null,null,null,null,null,null,null,null,null,null,null,null,null,null,null,null,null,null,null,null,null,null,null,null,null,null,null,null,null,null,null,null,null,null,null,null,null,null,null,null,null,null,null,null,null,null,null,null,null,null,null,null,null,null,null,null,null,null,null,null,null,null,null,null,null,null,null,null,null,null,null,null,null,null,null,null,null,null,null,null,null,null,null,null,null,null,null,null,null,null,null,null,null,null,null,null,null,null,null,null,null,null,null,null,null,null,null,null,null,null,null,null,null,null,null,null,null,null,null,null,null,null,null,null,null,null,null,null,null,null,null,null,null,null,null,null,null,null,null,null,null,null,null,null,null,null,null,null,null,null,null,null,null,null,null,null,null,null,null,null,null,null,null,null,null,null,null,null,null,null,null,null,null,null,null,null,null,null,null,null,null,null,null,null,null,null,null,null,null,null,null,null,null,null,null,null,null,null,null,null,null,null,null,null,null,null,null,null,null,null,null,null,null,null,null,null,null,null,null,null,null,null,null,null,null,null,null,null,null,null,null,null,null,null,null,null,null,null,null,null,null,null,null,null,null,null,null,null,null,null,null,null,null,null,null,null,null,null,null,null,null,null,null,null,null,null,null,null,null,null,null,null,null,null,null,null,null,null,null,null,null,null,null,null,null,null,null,null,null,null,null,null,null,null,null,null,null,null,null,null,null,null,null,null,null,null,null,null,null,null,null,null,null,null,null,null,null,null,null,null,null,null,null,null,null,null,null,null,null,null,null,null,null,null,null,null,null,null,null,null,null,null,null,null,null,null,null,null,null,null,null,null,null,null,null,null,null,null,null,null,null,null,null,null,null,null,null,null,null,null,null,null,null,null,null,null,null,null,null,null,null,null,null,null,null,null,null,null,null,null,null,null,null,null,null,null,null,null,null,null,null,null,null,null,null,null,null,null,null,null,null,null,null,null,null,null,null,null,null,null,null,null,null,null,null,null,null,null,null,null,null,null,null,null,null,null,null,null,null,null,null,null,null,null,null,null,null,null,null,null,null,null,null,null,null,null,null,null,null,null,null,null,null,null,null,null,null,null,null,null,null,null,null,null,null,null,null,null,null,null,null,null,null,null,null,null,null,null,null,null,null,null,null,null,null,null,null,null,null,null,null,null,null,null,null,null,null,null,null,null,null,null,null,null,null,null,null,null,null,null,null,null,null,null,null,null,null,null,null,null,null,null,null,null,null,null,null,null,null,null,null,null,null,null,null,null,null,null,null,null,null,null,null,null,null,null,null,null,null,null,null,null,null,null,null,null,null,null,null,null,null,null,null,null,null,null,null,null,null,null,null,null,null,null,null,null,null,null,null,null,null,null,null,null,null,null,null,null,null,null,null,null,null,null,null,null,null,null,null,null,null,null,null,null,null,null,null,null,null,null,null,null,null,null,null,null,null,null,null,null,null,null,null,null,null,null,null,null,null,null,null,null,null,null,null,null,null,null,null,null,null,null,null,null,null,null,null,null,null,null,null,null,null,null,null,null,null,null,null,null,null,null,null,null,null,null,null,null,null,null,null,null,null,null,null,null,null,null,null,null,null,null,null,null,null,null,null,null,null,null,null,null,null,null,null,null,null,null,null,null,null,null,null,null,null,null,null,null,null,null,null,null,null,null,null,null,null,null,null,null,null,null,null,null,null,null,null,null,null,null,null,null,null,null,null,null,null,null,null,null,null,null,null,null,null,null,null,null,null,null,null,null,null,null,null,null,null,null,null,null,null,null,null,null,null,null,null,null,null,null,null,null,null,null,null,null,null,null,null,null,null,null,null,null,null,null,null,null,null,null,null,null,null,null,null,null,null,null,null,null,null,null,null,null,null,null,null,null,null,null,null,null,null,null,null,null,null,null,null,null,null,null,null,null,null,null,null,null,null,null,null,null,null,null,null,null,null,null,null,null,null,null,null,null,null,null,null,null,null,null,null,null,null,null,null,null,null,null,null,null,null,null,null,null,null,null,null,null,null,null,null,null,null,null,null,null,null,null,null,null,null,null,null,null,null,null,null,null,null,null,null,null,null,null,null,null,null,null,null,null,null,null,null,null,null,null,null,null,null,null,null,null,null,null,null,null,null,null,null,null,null,null,null,null,null,null,null,null,null,null,null,null,null,null,null,null,null,null,null,null,null,null,null,null,null,null,null,null,null,null,null,null,null,null,null,null,null,null,null,null,null,null,null,null,null,null,null,null,null,null,null,null,null,null,null,null,null,null,null,null,null,null,null,null,null,null,null,null,null,null,null,null,null,null,null,null,null,null,null,null,null,null,null,null,null,null,null,null,null,null,null,null,null,null,null,null,null,null,null,null,null,null,null,null,null,null,null,null,null,null,null,null,null,null,null,null,null,null,null,null,null,null,null,null,null,null,null,null,null,null,null,null,null,null,null,null,null,null,null,null,null,null,null,null,null,null,null,null,null,null,null,null,null,null,null,null,null,null,null,null,null,null,null,null,null,null,null,null,null,null,null,null,null,null,null,null,null,null,null,null,null,null,null,null,null,null,null,null,null,null,null,null,null,null,null,null,null,null,null,null,null,null,null,null,null,null,null,null,null,null,null,null,null,null,null,null,null,null,null,null,null,null,null,null,null,null,null,null,null,null,null,null,null,null,null,null,null,null,null,null,null,null,null,null,null,null,null,null,null,null,null,null,null,null,null,null,null,null,null,null,null,null,null,null,null,null,null,null,null,null,null,null,null,null,null,null,null,null,null,null,null,null,null,null,null,null,null,null,null,null,null,null,null,null,null,null,null,null,null,null,null,null,null,null,null,null,null,null,null,null,null,null,null,null,null,null,null,null,null,null,null,null,null,null,null,null,null,null,null,null,null,null,null,null,null,null,null,null,null,null,null,null,null,null,null,null,null,null,null,null,null,null,null,null,null,null,null,null,null,null,null,null,null,null,null,null,null,null,null,null,null,null,null,null,null,null,null,null,null,null,null,null,null,null,null,null,null,null,null,null,null,null,null,null,null,null,null,null,null,null,null,null,null,null,null,null,null,null,null,null,null,null,null,null,null,null,null,null,null,null,null,null,null,null,null,null,null,null,null,null,null,null,null,null,null,null,null,null,null,null,null,null,null,null,null,null,null,null,null,null,null,null,null,null,null,null,null,null,null,null,null,null,null,null,null,null,null,null,null,null,null,null,null,null,null,null,null,null,null,null,null,null,null,null,null,null,null,null,null,null,null,null,null,null,null,null,null,null,null,null,null,null,null,null,null,null,null,null,null,null,null,null,null,null,null,null,null,null,null,null,null,null,null,null,null,null,null,null,null,null,null,null,null,null,null,null,null,null,null,null,null,null,null,null,null,null,null,null,null,null,null,null,null,null,null,null,null,null,null,null,null,null,null,null,null,null,null,null,null,null,null,null,null,null,null,null,null,null,null,null,null,null,null,null,null,null,null,null,null,null,null,null,null,null,null,null,null,null,null,null,null,null,null,null,null,null,null,null,null,null,null,null,null,null,null,null,null,null,null,null,null,null,null,null,null,null,null,null,null,null,null,null,null,null,null,null,null,null,null,null,null,null,null,null,null,null,null,null,null,null,null,null,null,null,null,null,null,null,null,null,null,null,null,null,null,null,null,null,null,null,null,null,null,null,null,null,null,null,null,null,null,null,null,null,null,null,null,null,null,null,null,null,null,null,null,null,null,null,null,null,null,null,null,null,null,null,null,null,null,null,null,null,null,null,null,null,null,null,null,null,null,null,null,null,null,null,null,null,null,null,null,null,null,null,null,null,null,null,null,null,null,null,null,null,null,null,null,null,null,null,null,null,null,null,null,null,null,null,null,null,null,null,null,null,null,null,null,null,null,null,null,null,null,null,null,null,null,null,null,null,null,null,null,null,null,null,null,null,null,null,null,null,null,null,null,null,null,null,null,null,null,null,null,null,null,null,null,null,null,null,null,null,null,null,null,null,null,null,null,null,null,null,null,null,null,null,null,null,null,null,null,null,null,null,null,null,null,null,null,null,null,null,null,null,null,null,null,null,null,null,null,null,null,null,null,null,null,null,null,null,null,null,null,null,null,null,null,null,null,null,null,null,null,null,null,null,null,null,null,null,null,null,null,null,null,null,null,null,null,null,null,null,null,null,null,null,null,null,null,null,null,null,null,null,null,null,null,null,null,null,null,null,null,null,null,null,null,null,null,null,null,null,null,null,null,null,null,null,null,null,null,null,null,null,null,null,null,null,null,null,null,null,null,null,null,null,null,null,null,null,null,null,null,null,null,null,null,null,null,null,null,null,null,null,null,null,null,null,null,null,null,null,null,null,null,null,null,null,null,null,null,null,null,null,null,null,null,null,null,null,null,null,null,null,null,null,null,null,null,null,null,null,null,null,null,null,null,null,null,null,null,null,null,null,null,null,null,null,null,null,null,null,null,null,null,null,null,null,null,null,null,null,null,null,null,null,null,null,null,null,null,null,null,null,null,null,null,null,null,null,null,null,null,null,null,null,null,null,null,null,null,null,null,null,null,null,null,null,null,null,null,null,null,null,null,null,null,null,null,null,null,null,null,null,null,null,null,null,null,null,null,null,null,null,null,null,null,null,null,null,null,null,null,null,null,null,null,null,null,null,null,null,null,null,null,null,null,null,null,null,null,null,null,null,null,null,null,null,null,null,null,null,null,null,null,null,null,null,null,null,null,null,null,null,null,null,null,null,null,null,null,null,null,null,null,null,null,null,null,null,null,null,null,null,null,null,null,null,null,null,null,null,null,null,null,null,null,null,null,null,null,null,null,null,null,null,null,null,null,null,null,null,null,null,null,null,null,null,null,null,null,null,null,null,null,null,null,null,null,null,null,null,null,null,null,null,null,null,null,null,null,null,null,null,null,null,null,null,null,null,null,null,null,null,null,null,null,null,null,null,null,null,null,null,null,null,null,null,null,null,null,null,null,null,null,null,null,null,null,null,null,null,null,null,null,null,null,null,null,null,null,null,null,null,null,null,null,null,null,null,null,null,null,null,null,null,null,null,null,null,null,null,null,null,null,null,null,null,null,null,null,null,null,null,null,null,null,null,null,null,null,null,null,null,null,null,null,null,null,null,null,null,null,null,null,null,null,null,null,null,null,null,null,null,null,null,null,null,null,null,null,null,null,null,null,null,null,null,null,null,null,null,null,null,null,null,null,null,null,null,null,null,null,null,null,null,null,null,null,null,null,null,null,null,null,null,null,null,null,null,null,null,null,null,null,null,null,null,null,null,null,null,null,null,null,null,null,null,null,null,null,null,null,null,null,null,null,null,null,null,null,null,null,null,null,null,null,null,null,null,null,null,null,null,null,null,null,null,null,null,null,null,null,null,null,null,null,null,null,null,null,null,null,null,null,null,null,null,null,null,null,null,null,null,null,null,null,null,null,null,null,null,null,null,null,null,null,null,null,null,null,null,null,null,null,null,null,null,null,null,null,null,null,null,null,null,null,null,null,null,null,null,null,null,null,null,null,null,null,null,null,null,null,null,null,null,null,null,null,null,null,null,null,null,null,null,null,null,null,null,null,null,null,null,null,null,null,null,null,null,null,null,null,null,null,null,null,null,null,null,null,null,null,null,null,null,null,null,null,null,null,null,null,null,null,null,null,null,null,null,null,null,null,null,null,null,null,null,null,null,null,null,null,null,null,null,null,null,null,null,null,null,null,null,null,null,null,null,null,null,null,null,null,null,null,null,null,null,null,null,null,null,null,null,null,null,null,null,null,null,null,null,null,null,null,null,null,null,null,null,null,null,null,null,null,null,null,null,null,null,null,null,null,null,null,null,null,null,null,null,null,null,null,null,null,null,null,null,null,null,null,null,null,null,null,null,null,null,null,null,null,null,null,null,null,null,null,null,null,null,null,null,null,null,null,null,null,null,null,null,null,null,null,null,null,null,null,null,null,null,null,null,null,null,null,null,null,null,null,null,null,null,null,null,null,null,null,null,null,null,null,null,null,null,null,null,null,null,null,null,null,null,null,null,null,null,null,null,null,null,null,null,null,null,null,null,null,null,null,null,null,null,null,null,null,null,null,null,null,null,null,null,null,null,null,null,null,null,null,null,null,null,null,null,null,null,null,null,null,null,null,null,null,null,null,null,null,null,null,null,null,null,null,null,null,null,null,null,null,null,null,null,null,null,null,null,null,null,null,null,null,null,null,null,null,null,null,null,null,null,null,null,null,null,null,null,null,null,null,null,null,null,null,null,null,null,null,null,null,null,null,null,null,null,null,null,null,null,null,null,null,null,null,null,null,null,null,null,null,null,null,null,null,null,null,null,null,null,null,null,null,null,null,null,null,null,null,null,null,null,null,null,null,null,null,null,null,null,null,null,null,null,null,null,null,null,null,null,null,null,null,null,null,null,null,null,null,null,null,null,null,null,null,null,null,null,null,null,null,null,null,null,null,null,null,null,null,null,null,null,null,null,null,null,null,null,null,null,null,null,null,null,null,null,null,null,null,null,null,null,null,null,null,null,null,null,null,null,null,null,null,null,null,null,null,null,null,null,null,null,null,null,null,null,null,null,null,null,null,null,null,null,null,null,null,null,null,null,null,null,null,null,null,null,null,null,null,null,null,null,null,null,null,null,null,null,null,null,null,null,null,null,null,null,null,null,null,null,null,null,null,null,null,null,null,null,null,null,null,null,null,null,null,null,null,null,null,null,null,null,null,null,null,null,null,null,null,null,null,null,null,null,null,null,null,null,null,null,null,null,null,null,null,null,null,null,null,null,null,null,null,null,null,null,null,null,null,null,null,null,null,null,null,null,null,null,null,null,null,null,null,null,null,null,null,null,null,null,null,null,null,null,null,null,null,null,null,null,null,null,null,null,null,null,null,null,null,null,null,null,null,null,null,null,null,null,null,null,null,null,null,null,null,null,null,null,null,null,null,null,null,null,null,null,null,null,null,null,null,null,null,null,null,null,null,null,null,null,null,null,null,null,null,null,null,null,null,null,null,null,null,null,null,null,null,null,null,null,null,null,null,null,null,null,null,null,null,null,null,null,null,null,null,null,null,null,null,null,null,null,null,null,null,null,null,null,null,null,null,null,null,null,null,null,null,null,null,null,null,null,null,null,null,null,null,null,null,null,null,null,null,null,null,null,null,null,null,null,null,null,null,null,null,null,null,null,null,null,null,null,null,null,null,null,null,null,null,null,null,null,null,null,null,null,null,null,null,null,null,null,null,null,null,null,null,null,null,null,null,null,null,null,null,null,null,null,null,null,null,null,null,null,null,null,null,null,null,null,null,null,null,null,null,null,null,null,null,null,null,null,null,null,null,null,null,null,null,null,null,null,null,null,null,null,null,null,null,null,null,null,null,null,null,null,null,null,null,null,null,null,null,null,null,null,null,null,null,null,null,null,null,null,null,null,null,null,null,null,null,null,null,null,null,null,null,null,null,null,null,null,null,null,null,null,null,null,null,null,null,null,null,null,null,null,null,null,null,null,null,null,null,null,null,null,null,null,null,null,null,null,null,null,null,null,null,null,null,null,null,null,null,null,null,null,null,null,null,null,null,null,null,null,null,null,null,null,null,null,null,null,null,null,null,null,null,null,null,null,null,null,null,null,null,null,null,null,null,null,null,null,null,null,null,null,null,null,null,null,null,null,null,null,null,null,null,null,null,null,null,null,null,null,null,null,null,null,null,null,null,null,null,null,null,null,null,null,null,null,null,null,null,null,null,null,null,null,null,null,null,null,null,null,null,null,null,null,null,null,null,null,null,null,null,null,null,null,null,null,null,null,null,null,null,null,null,null,null,null,null,null,null,null,null,null,null,null,null,null,null,null,null,null,null,null,null,null,null,null,null,null,null,null,null,null,null,null,null,null,null,null,null,null,null,null,null,null,null,null,null,null,null,null,null,null,null,null,null,null,null,null,null,null,null,null,null,null,null,null,null,null,null,null,null,null,null,null,null,null,null,null,null,null,null,null,null,null,null,null,null,null,null,null,null,null,null,null,null,null,null,null,null,null,null,null,null,null,null,null,null,null,null,null,null,null,null,null,null,null,null,null,null,null,null,null,null,null,null,null,null,null,null,null,null,null,null,null,null,null,null,null,null,null,null,null,null,null,null,null,null,null,null,null,null,null,null,null,null,null,null,null,null,null,null,null,null,null,null,null,null,null,null,null,null,null,null,null,null,null,null,null,null,null,null,null,null,null,null,null,null,null,null,null,null,null,null,null,null,null,null,null,null,null,null,null,null,null,null,null,null,null,null,null,null,null,null,null,null,null,null,null,null,null,null,null,null,null,null,null,null,null,null,null,null,null,null,null,null,null,null,null,null,null,null,null,null,null,null,null,null,null,null,null,null,null,null,null,null,null,null,null,null,null,null,null,null,null,null,null,null,null,null,null,null,null,null,null,null,null,null,null,null,null,null,null,null,null,null,null,null,null,null,null,null,null,null,null,null,null,null,null,null,null,null,null,null,null,null,null,null,null,null,null,null,null,null,null,null,null,null,null,null,null,null,null,null,null,null,null,null,null,null,null,null,null,null,null,null,null,null,null,null,null,null,null,null,null,null,null,null,null,null,null,null,null,null,null,null,null,null,null,null,null,null,null,null,null,null,null,null,null,null,null,null,null,null,null,null,null,null,null,null,null,null,null,null,null,null,null,null,null,null,null,null,null,null,null,null,null,null,null,null,null,null,null,null,null,null,null,null,null,null,null,null,null,null,null,null,null,null,null,null,null,null,null,null,null,null,null,null,null,null,null,null,null,null,null,null,null,null,null,null,null,null,null,null,null,null,null,null,null,null,null,null,null,null,null,null,null,null,null,null,null,null,null,null,null,null,null,null,null,null,null,null,null,null,null,null,null,null,null,null,null,null,null,null,null,null,null,null,null,null,null,null,null,null,null,null,null,null,null,null,null,null,null,null,null,null,null,null,null,null,null,null,null,null,null,null,null,null,null,null,null,null,null,null,null,null,null,null,null,null,null,null,null,null,null,null,null,null,null,null,null,null,null,null,null,null,null,null,null,null,null,null,null,null,null,null,null,null,null,null,null,null,null,null,null,null,null,null,null,null,null,null,null,null,null,null,null,null,null,null,null,null,null,null,null,null,null,null,null,null,null,null,null,null,null,null,null,null,null,null,null,null,null,null,null,null,null,null,null,null,null,null,null,null,null,null,null,null,null,null,null,null,null,null,null,null,null,null,null,null,null,null,null,null,null,null,null,null,null,null,null,null,null,null,null,null,null,null,null,null,null,null,null,null,null,null,null,null,null,null,null,null,null,null,null,null,null,null,null,null,null,null,null,null,null,null,null,null,null,null,null,null,null,null,null,null,null,null,null,null,null,null,null,null,null,null,null,null,null,null,null,null,null,null,null,null,null,null,null,null,null,null,null,null,null,null,null,null,null,null,null,null,null,null,null,null,null,null,null,null,null,null,null,null,null,null,null,null,null,null,null,null,null,null,null,null,null,null,null,null,null,null,null,null,null,null,null,null,null,null,null,null,null,null,null,null,null,null,null,null,null,null,null,null,null,null,null,null,null,null,null,null,null,null,null,null,null,null,null,null,null,null,null,null,null,null,null,null,null,null,null,null,null,null,null,null,null,null,null,null,null,null,null,null,null,null,null,null,null,null,null,null,null,null,null,null,null,null,null,null,null,null,null,null,null,null,null,null,null,null,null,null,null,null,null,null,null,null,null,null,null,null,null,null,null,null,null,null,null,null,null,null,null,null,null,null,null,null,null,null,null,null,null,null,null,null,null,null,null,null,null,null,null,null,null,null,null,null,null,null,null,null,null,null,null,null,null,null,null,null,null,null,null,null,null,null,null,null,null,null,null,null,null,null,null,null,null,null,null,null,null,null,null,null,null,null,null,null,null,null,null,null,null,null,null,null,null,null,null,null,null,null,null,null,null,null,null,null,null,null,null,null,null,null,null,null,null,null,null,null,null,null,null,null,null,null,null,null,null,null,null,null,null,null,null,null,null,null,null,null,null,null,null,null,null,null,null,null,null,null,null,null,null,null,null,null,null,null,null,null,null,null,null,null,null,null,null,null,null,null,null,null,null,null,null,null,null,null,null,null,null,null,null,null,null,null,null,null,null,null,null,null,null,null,null,null,null,null,null,null,null,null,null,null,null,null,null,null,null,null,null,null,null,null,null,null,null,null,null,null,null,null,null,null,null,null,null,null,null,null,null,null,null,null,null,null,null,null,null,null,null,null,null,null,null,null,null,null,null,null,null,null,null,null,null,null,null,null,null,null,null,null,null,null,null,null,null,null,null,null,null,null,null,null,null,null,null,null,null,null,null,null,null,null,null,null,null,null,null,null,null,null,null,null,null,null,null,null,null,null,null,null,null,null,null,null,null,null,null,null,null,null,null,null,null,null,null,null,null,null,null,null,null,null,null,null,null,null,null,null,null,null,null,null,null,null,null,null,null,null,null,null,null,null,null,null,null,null,null,null,null,null,null,null,null,null,null,null,null,null,null,null,null,null,null,null,null,null,null,null,null,null,null,null,null,null,null,null,null,null,null,null,null,null,null,null,null,null,null,null,null,null,null,null,null,null,null,null,null,null,null,null,null,null,null,null,null,null,null,null,null,null,null,null,null,null,null,null,null,null,null,null,null,null,null,null,null,null,null,null,null,null,null,null,null,null,null,null,null,null,null,null,null,null,null,null,null,null,null,null,null,null,null,null,null,null,null,null,null,null,null,null,null,null,null,null,null,null,null,null,null,null,null,null,null,null,null,null,null,null,null,null,null,null,null,null,null,null,null,null,null,null,null,null,null,null,null,null,null,null,null,null,null,null,null,null,null,null,null,null,null,null,null,null,null,null,null,null,null,null,null,null,null,null,null,null,null,null,null,null,null,null,null,null,null,null,null,null,null,null,null,null,null,null,null,null,null,null,null,null,null,null,null,null,null,null,null,null,null,null,null,null,null,null,null,null,null,null,null,null,null,null,null,null,null,null,null,null,null,null,null,null,null,null,null,null,null,null,null,null,null,null,null,null,null,null,null,null,null,null,null,null,null,null,null,null,null,null,null,null,null,null,null,null,null,null,null,null,null,null,null,null,null,null,null,null,null,null,null,null,null,null,null,null,null,null,null,null,null,null,null,null,null,null,null,null,null,null,null,null,null,null,null,null,null,null,null,null,null,null,null,null,null,null,null,null,null,null,null,null,null,null,null,null,null,null,null,null,null,null,null,null,null,null,null,null,null,null,null,null,null,null,null,null,null,null,null,null,null,null,null,null,null,null,null,null,null,null,null,null,null,null,null,null,null,null,null,null,null,null,null,null,null,null,null,null,null,null,null,null,null,null,null,null,null,null,null,null,null,null,null,null,null,null,null,null,null,null,null,null,null,null,null,null,null,null,null,null,null,null,null,null,null,null,null,null,null,null,null,null,null,null,null,null,null,null,null,null,null,null,null,null,null,null,null,null,null,null,null,null,null,null,null,null,null,null,null,null,null,null,null,null,null,null,null,null,null,null,null,null,null,null,null,null,null,null,null,null,null,null,null,null,null,null,null,null,null,null,null,null,null,null,null,null,null,null,null,null,null,null,null,null,null,null,null,null,null,null,null,null,null,null,null,null,null,null,null,null,null,null,null,null,null,null,null,null,null,null,null,null,null,null,null,null,null,null,null,null,null,null,null,null,null,null,null,null,null,null,null,null,null,null,null,null,null,null,null,null,null,null,null,null,null,null,null,null,null,null,null,null,null,null,null,null,null,null,null,null,null,null,null,null,null,null,null,null,null,null,null,null,null,null,null,null,null,null,null,null,null,null,null,null,null,null,null,null,null,null,null,null,null,null,null,null,null,null,null,null,null,null,null,null,null,null,null,null,null,null,null,null,null,null,null,null,null,null,null,null,null,null,null,null,null,null,null,null,null,null,null,null,null,null,null,null,null,null,null,null,null,null,null,null,null,null,null,null,null,null,null,null,null,null,null,null,null,null,null,null,null,null,null,null,null,null,null,null,null,null,null,null,null,null,null,null,null,null,null,null,null,null,null,null,null,null,null,null,null,null,null,null,null,null,null,null,null,null,null,null,null,null,null,null,null,null,null,null,null,null,null,null,null,null,null,null,null,null,null,null,null,null,null,null,null,null,null,null,null,null,null,null,null,null,null,null,null,null,null,null,null,null,null,null,null,null,null,null,null,null,null,null,null,null,null,null,null,null,null,null,null,null,null,null,null,null,null,null,null,null,null,null,null,null,null,null,null,null,null,null,null,null,null,null,null,null,null,null,null,null,null,null,null,null,null,null,null,null,null,null,null,null,null,null,null,null,null,null,null,null,null,null,null,null,null,null,null,null,null,null,null,null,null,null,null,null,null,null,null,null,null,null,null,null,null,null,null,null,null,null,null,null,null,null,null,null,null,null,null,null,null,null,null,null,null,null,null,null,null,null,null,null,null,null,null,null,null,null,null,null,null,null,null,null,null,null,null,null,null,null,null,null,null,null,null,null,null,null,null,null,null,null,null,null,null,null,null,null,null,null,null,null,null,null,null,null,null,null,null,null,null,null,null,null,null,null,null,null,null,null,null,null,null,null,null,null,null,null,null,null,null,null,null,null,null,null,null,null,null,null,null,null,null,null,null,null,null,null,null,null,null,null,null,null,null,null,null,null,null,null,null,null,null,null,null,null,null,null,null,null,null,null,null,null,null,null,null,null,null,null,null,null,null,null,null,null,null,null,null,null,null,null,null,null,null,null,null,null,null,null,null,null,null,null,null,null,null,null,null,null,null,null,null,null,null,null,null,null,null,null,null,null,null,null,null,null,null,null,null,null,null,null,null,null,null,null,null,null,null,null,null,null,null,null,null,null,null,null,null,null,null,null,null,null,null,null,null,null,null,null,null,null,null,null,null,null,null,null,null,null,null,null,null,null,null,null,null,null,null,null,null,null,null,null,null,null,null,null,null,null,null,null,null,null,null,null,null,null,null,null,null,null,null,null,null,null,null,null,null,null,null,null,null,null,null,null,null,null,null,null,null,null,null,null,null,null,null,null,null,null,null,null,null,null,null,null,null,null,null,null,null,null,null,null,null,null,null,null,null,null,null,null,null,null,null,null,null,null,null,null,null,null,null,null,null,null,null,null,null,null,null,null,null,null,null,null,null,null,null,null,null,null,null,null,null,null,null,null,null,null,null,null,null,null,null,null,null,null,null,null,null,null,null,null,null,null,null,null,null,null,null,null,null,null,null,null,null,null,null,null,null,null,null,null,null,null,null,null,null,null,null,null,null,null,null,null,null,null,null,null,null,null,null,null,null,null,null,null,null,null,null,null,null,null,null,null,null,null,null,null,null,null,null,null,null,null,null,null,null,null,null,null,null,null,null,null,null,null,null,null,null,null,null,null,null,null,null,null,null,null,null,null,null,null,null,null,null,null,null,null,null,null,null,null,null,null,null,null,null,null,null,null,null,null,null,null,null,null,null,null,null,null,null,null,null,null,null,null,null,null,null,null,null,null,null,null,null,null,null,null,null,null,null,null,null,null,null,null,null,null,null,null,null,null,null,null,null,null,null,null,null,null,null,null,null,null,null,null,null,null,null,null,null,null,null,null,null,null,null,null,null,null,null,null,null,null,null,null,null,null,null,null,null,null,null,null,null,null,null,null,null,null,null,null,null,null,null,null,null,null,null,null,null,null,null,null,null,null,null,null,null,null,null,null,null,null,null,null,null,null,null,null,null,null,null,null,null,null,null,null,null,null,null,null,null,null,null,null,null,null,null,null,null,null,null,null,null,null,null,null,null,null,null,null,null,null,null,null,null,null,null,null,null,null,null,null,null,null,null,null,null,null,null,null,null,null,null,null,null,null,null,null,null,null,null,null,null,null,null,null,null,null,null,null,null,null,null,null,null,null,null,null,null,null,null,null,null,null,null,null,null,null,null,null,null,null,null,null,null,null,null,null,null,null,null,null,null,null,null,null,null,null,null,null,null,null,null,null,null,null,null,null,null,null,null,null,null,null,null,null,null,null,null,null,null,null,null,null,null,null,null,null,null,null,null,null,null,null,null,null,null,null,null,null,null,null,null,null,null,null,null,null,null,null,null,null,null,null,null,null,null,null,null,null,null,null,null,null,null,null,null,null,null,null,null,null,null,null,null,null,null,null,null,null,null,null,null,null,null,null,null,null,null,null,null,null,null,null,null,null,null,null,null,null,null,null,null,null,null,null,null,null,null,null,null,null,null,null,null,null,null,null,null,null,null,null,null,null,null,null,null,null,null,null,null,null,null,null,null,null,null,null,null,null,null,null,null,null,null,null,null,null,null,null,null,null,null,null,null,null,null,null,null,null,null,null,null,null,null,null,null,null,null,null,null,null,null,null,null,null,null,null,null,null,null,null,null,null,null,null,null,null,null,null,null,null,null,null,null,null,null,null,null,null,null,null,null,null,null,null,null,null,null,null,null,null,null,null,null,null,null,null,null,null,null,null,null,null,null,null,null,null,null,null,null,null,null,null,null,null,null,null,null,null,null,null,null,null,null,null,null,null,null,null,null,null,null,null,null,null,null,null,null,null,null,null,null,null,null,null,null,null,null,null,null,null,null,null,null,null,null,null,null,null,null,null,null,null,null,null,null,null,null,null,null,null,null,null,null,null,null,null,null,null,null,null,null,null,null,null,null,null,null,null,null,null,null,null,null,null,null,null,null,null,null,null,null,null,null,null,null,null,null,null,null,null,null,null,null,null,null,null,null,null,null,null,null,null,null,null,null,null,null,null,null,null,null,null,null,null,null,null,null,null,null,null,null,null,null,null,null,null,null,null,null,null,null,null,null,null,null,null,null,null,null,null,null,null,null,null,null,null,null,null,null,null,null,null,null,null,null,null,null,null,null,null,null,null,null,null,null,null,null,null,null,null,null,null,null,null,null,null,null,null,null,null,null,null,null,null,null,null,null,null,null,null,null,null,null,null,null,null,null,null,null,null,null,null,null,null,null,null,null,null,null,null,null,null,null,null,null,null,null,null,null,null,null,null,null,null,null,null,null,null,null,null,null,null,null,null,null,null,null,null,null,null,null,null,null,null,null,null,null,null,null,null,null,null,null,null,null,null,null,null,null,null,null,null,null,null,null,null,null,null,null,null,null,null,null,null,null,null,null,null,null,null,null,null,null,null,null,null,null,null,null,null,null,null,null,null,null,null,null,null,null,null,null,null,null,null,null,null,null,null,null,null,null,null,null,null,null,null,null,null,null,null,null,null,null,null,null,null,null,null,null,null,null,null,null,null,null,null,null,null,null,null,null,null,null,null,null,null,null,null,null,null,null,null,null,null,null,null,null,null,null,null,null,null,null,null,null,null,null,null,null,null,null,null,null,null,null,null,null,null,null,null,null,null,null,null,null,null,null,null,null,null,null,null,null,null,null,null,null,null,null,null,null,null,null,null,null,null,null,null,null,null,null,null,null,null,null,null,null,null,null,null,null,null,null,null,null,null,null,null,null,null,null,null,null,null,null,null,null,null,null,null,null,null,null,null,null,null,null,null,null,null,null,null,null,null,null,null,null,null,null,null,null,null,null,null,null,null,null,null,null,null,null,null,null,null,null,null,null,null,null,null,null,null,null,null,null,null,null,null,null,null,null,null,null,null,null,null,null,null,null,null,null,null,null,null,null,null,null,null,null,null,null,null,null,null,null,null,null,null,null,null,null,null,null,null,null,null,null,null,null,null,null,null,null,null,null,null,null,null,null,null,null,null,null,null,null,null,null,null,null,null,null,null,null,null,null,null,null,null,null,null,null,null,null,null,null,null,null,null,null,null,null,null,null,null,null,null,null,null,null,null,null,null,null,null,null,null,null,null,null,null,null,null,null,null,null,null,null,null,null,null,null,null,null,null,null,null,null,null,null,null,null,null,null,null,null,null,null,null,null,null,null,null,null,null,null,null,null,null,null,null,null,null,null,null,null,null,null,null,null,null,null,null,null,null,null,null,null,null,null,null,null,null,null,null,null,null,null,null,null,null,null,null,null,null,null,null,null,null,null,null,null,null,null,null,null,null,null,null,null,null,null,null,null,null,null,null,null,null,null,null,null,null,null,null,null,null,null,null,null,null,null,null,null,null,null,null,null,null,null,null,null,null,null,null,null,null,null,null,null,null,null,null,null,null,null,null,null,null,null,null,null,null,null,null,null,null,null,null,null,null,null,null,null,null,null,null,null,null,null,null,null,null,null,null,null,null,null,null,null,null,null,null,null,null,null,null,null,null,null,null,null,null,null,null,null,null,null,null,null,null,null,null,null,null,null,null,null,null,null,null,null,null,null,null,null,null,null,null,null,null,null,null,null,null,null,null,null,null,null,null,null,null,null,null,null,null,null,null,null,null,null,null,null,null,null,null,null,null,null,null,null,null,null,null,null,null,null,null,null,null,null,null,null,null,null,null,null,null,null,null,null,null,null,null,null,null,null,null,null,null,null,null,null,null,null,null,null,null,null,null,null,null,null,null,null,null,null,null,null,null,null,null,null,null,null,null,null,null,null,null,null,null,null,null,null,null,null,null,null,null,null,null,null,null,null,null,null,null,null,null,null,null,null,null,null,null,null,null,null,null,null,null,null,null,null,null,null,null,null,null,null,null,null,null,null,null,null,null,null,null,null,null,null,null,null,null,null,null,null,null,null,null,null,null,null,null,null,null,null,null,null,null,null,null,null,null,null,null,null,null,null,null,null,null,null,null,null,null,null,null,null,null,null,null,null,null,null,null,null,null,null,null,null,null,null,null,null,null,null,null,null,null,null,null,null,null,null,null,null,null,null,null,null,null,null,null,null,null,null,null,null,null,null,null,null,null,null,null,null,null,null,null,null,null,null,null,null,null,null,null,null,null,null,null,null,null,null,null,null,null,null,null,null,null,null,null,null,null,null,null,null,null,null,null,null,null,null,null,null,null,null,null,null,null,null,null,null,null,null,null,null,null,null,null,null,null,null,null,null,null,null,null,null,null,null,null,null,null,null,null,null,null,null,null,null,null,null,null,null,null,null,null,null,null,null,null,null,null,null,null,null,null,null,null,null,null,null,null,null,null,null,null,null,null,null,null,null,null,null,null,null,null,null,null,null,null,null,null,null,null,null,null,null,null,null,null,null,null,null,null,null,null,null,null,null,null,null,null,null,null,null,null,null,null,null,null,null,null,null,null,null,null,null,null,null,null,null,null,null,null,null,null,null,null,null,null,null,null,null,null,null,null,null,null,null,null,null,null,null,null,null,null,null,null,null,null,null,null,null,null,null,null,null,null,null,null,null,null,null,null,null,null,null,null,null,null,null,null,null,null,null,null,null,null,null,null,null,null,null,null,null,null,null,null,null,null,null,null,null,null,null,null,null,null,null,null,null,null,null,null,null,null,null,null,null,null,null,null,null,null,null,null,null,null,null,null,null,null,null,null,null,null,null,null,null,null,null,null,null,null,null,null,null,null,null,null,null,null,null,null,null,null,null,null,null,null,null,null,null,null,null,null,null,null,null,null,null,null,null,null,null,null,null,null,null,null,null,null,null,null,null,null,null,null,null,null,null,null,null,null,null,null,null,null,null,null,null,null,null,null,null,null,null,null,null,null,null,null,null,null,null,null,null,null,null,null,null,null,null,null,null,null,null,null,null,null,null,null,null,null,null,null,null,null,null,null,null,null,null,null,null,null,null,null,null,null,null,null,null,null,null,null,null,null,null,null,null,null,null,null,null,null,null,null,null,null,null,null,null,null,null,null,null,null,null,null,null,null,null,null,null,null,null,null,null,null,null,null,null,null,null,null,null,null,null,null,null,null,null,null,null,null,null,null,null,null,null,null,null,null,null,null,null,null,null,null,null,null,null,null,null,null,null,null,null,null,null,null,null,null,null,null,null,null,null,null,null,null,null,null,null,null,null,null,null,null,null,null,null,null,null,null,null,null,null,null,null,null,null,null,null,null,null,null,null,null,null,null,null,null,null,null,null,null,null,null,null,null,null,null,null,null,null,null,null,null,null,null,null,null,null,null,null,null,null,null,null,null,null,null,null,null,null,null,null,null,null,null,null,null,null,null,null,null,null,null,null,null,null,null,null,null,null,null,null,null,null,null,null,null,null,null,null,null,null,null,null,null,null,null,null,null,null,null,null,null,null,null,null,null,null,null,null,null,null,null,null,null,null,null,null,null,null,null,null,null,null,null,null,null,null,null,null,null,null,null,null,null,null,null,null,null,null,null,null,null,null,null,null,null,null,null,null,null,null,null,null,null,null,null,null,null,null,null,null,null,null,null,null,null,null,null,null,null,null,null,null,null,null,null,null,null,null,null,null,null,null,null,null,null,null,null,null,null,null,null,null,null,null,null,null,null,null,null,null,null,null,null,null,null,null,null,null,null,null,null,null,null,null,null,null,null,null,null,null,null,null,null,null,null,null,null,null,null,null,null,null,null,null,null,null,null,null,null,null,null,null,null,null,null,null,null,null,null,null,null,null,null,null,null,null,null,null,null,null,null,null,null,null,null,null,null,null,null,null,null,null,null,null,null,null,null,null,null,null,null,null,null,null,null,null,null,null,null,null,null,null,null,null,null,null,null,null,null,null,null,null,null,null,null,null,null,null,null,null,null,null,null,null,null,null,null,null,null,null,null,null,null,null,null,null,null,null,null,null,null,null,null,null,null,null,null,null,null,null,null,null,null,null,null,null,null,null,null,null,null,null,null,null,null,null,null,null,null,null,null,null,null,null,null,null,null,null,null,null,null,null,null,null,null,null,null,null,null,null,null,null,null,null,null,null,null,null,null,null,null,null,null,null,null,null,null,null,null,null,null,null,null,null,null,null,null,null,null,null,null,null,null,null,null,null,null,null,null,null,null,null,null,null,null,null,null,null,null,null,null,null,null,null,null,null,null,null,null,null,null,null,null,null,null,null,null,null,null,null,null,null,null,null,null,null,null,null,null,null,null,null,null,null,null,null,null,null,null,null,null,null,null,null,null,null,null,null,null,null,null,null,null,null,null,null,null,null,null,null,null,null,null,null,null,null,null,null,null,null,null,null,null,null,null,null,null,null,null,null,null,null,null,null,null,null,null,null,null,null,null,null,null,null,null,null,null,null,null,null,null,null,null,null,null,null,null,null,null,null,null,null,null,null,null,null,null,null,null,null,null,null,null,null,null,null,null,null,null,null,null,null,null,null,null,null,null,null,null,null,null,null,null,null,null,null,null,null,null,null,null,null,null,null,null,null,null,null,null,null,null,null,null,null,null,null,null,null,null,null,null,null,null,null,null,null,null,null,null,null,null,null,null,null,null,null,null,null,null,null,null,null,null,null,null,null,null,null,null,null,null,null,null,null,null,null,null,null,null,null,null,null,null,null,null,null,null,null,null,null,null,null,null,null,null,null,null,null,null,null,null,null,null,null,null,null,null,null,null,null,null,null,null,null,null,null,null,null,null,null,null,null,null,null,null,null,null,null,null,null,null,null,null,null,null,null,null,null,null,null,null,null,null,null,null,null,null,null,null,null,null,null,null,null,null,null,null,null,null,null,null,null,null,null,null,null,null,null,null,null,null,null,null,null,null,null,null,null,null,null,null,null,null,null,null,null,null,null,null,null,null,null,null,null,null,null,null,null,null,null,null,null,null,null,null,null,null,null,null,null,null,null,null,null,null,null,null,null,null,null,null,null,null,null,null,null,null,null,null,null,null,null,null,null,null,null,null,null,null,null,null,null,null,null,null,null,null,null,null,null,null,null,null,null,null,null,null,null,null,null,null,null,null,null,null,null,null,null,null,null,null,null,null,null,null,null,null,null,null,null,null,null,null,null,null,null,null,null,null,null,null,null,null,null,null,null,null,null,null,null,null,null,null,null,null,null,null,null,null,null,null,null,null,null,null,null,null,null,null,null,null,null,null,null,null,null,null,null,null,null,null,null,null,null,null,null,null,null,null,null,null,null,null,null,null,null,null,null,null,null,null,null,null,null,null,null,null,null,null,null,null,null,null,null,null,null,null,null,null,null,null,null,null,null,null,null,null,null,null,null,null,null,null,null,null,null,null,null,null,null,null,null,null,null,null,null,null,null,null,null,null,null,null,null,null,null,null,null,null,null,null,null,null,null,null,null,null,null,null,null,null,null,null,null,null,null,null,null,null,null,null,null,null,null,null,null,null,null,null,null,null,null,null,null,null,null,null,null,null,null,null,null,null,null,null,null,null,null,null,null,null,null,null,null,null,null,null,null,null,null,null,null,null,null,null,null,null,null,null,null,null,null,null,null,null,null,null,null,null,null,null,null,null,null,null,null,null,null,null,null,null,null,null,null,null,null,null,null,null,null,null,null,null,null,null,null,null,null,null,null,null,null,null,null,null,null,null,null,null,null,null,null,null,null,null,null,null,null,null,null,null,null,null,null,null,null,null,null,null,null,null,null,null,null,null,null,null,null,null,null,null,null,null,null,null,null,null,null,null,null,null,null,null,null,null,null,null,null,null,null,null,null,null,null,null,null,null,null,null,null,null,null,null,null,null,null,null,null,null,null,null,null,null,null,null,null,null,null,null,null,null,null,null,null,null,null,null,null,null,null,null,null,null,null,null,null,null,null,null,null,null,null,null,null,null,null,null,null,null,null,null,null,null,null,null,null,null,null,null,null,null,null,null,null,null,null,null,null,null,null,null,null,null,null,null,null,null,null,null,null,null,null,null,null,null,null,null,null,null,null,null,null,null,null,null,null,null,null,null,null,null,null,null,null,null,null,null,null,null,null,null,null,null,null,null,null,null,null,null,null,null,null,null,null,null,null,null,null,null,null,null,null,null,null,null,null,null,null,null,null,null,null,null,null,null,null,null,null,null,null,null,null,null,null,null,null,null,null,null,null,null,null,null,null,null,null,null,null,null,null,null,null,null,null,null,null,null,null,null,null,null,null,null,null,null,null,null,null,null,null,null,null,null,null,null,null,null,null,null,null,null,null,null,null,null,null,null,null,null,null,null,null,null,null,null,null,null,null,null,null,null,null,null,null,null,null,null,null,null,null,null,null,null,null,null,null,null,null,null,null,null,null,null,null,null,null,null,null,null,null,null,null,null,null,null,null,null,null,null,null,null,null,null,null,null,null,null,null,null,null,null,null,null,null,null,null,null,null,null,null,null,null,null,null,null,null,null,null,null,null,null,null,null,null,null,null,null,null,null,null,null,null,null,null,null,null,null,null,null,null,null,null,null,null,null,null,null,null,null,null,null,null,null,null,null,null,null,null,null,null,null,null,null,null,null,null,null,null,null,null,null,null,null,null,null,null,null,null,null,null,null,null,null,null,null,null,null,null,null,null,null,null,null,null,null,null,null,null,null,null,null,null,null,null,null,null,null,null,null,null,null,null,null,null,null,null,null,null,null,null,null,null,null,null,null,null,null,null,null,null,null,null,null,null,null,null,null,null,null,null,null,null,null,null,null,null,null,null,null,null,null,null,null,null,null,null,null,null,null,null,null,null,null,null,null,null,null,null,null,null,null,null,null,null,null,null,null,null,null,null,null,null,null,null,null,null,null,null,null,null,null,null,null,null,null,null,null,null,null,null,null,null,null,null,null,null,null,null,null,null,null,null,null,null,null,null,null,null,null,null,null,null,null,null,null,null,null,null,null,null,null,null,null,null,null,null,null,null,null,null,null,null,null,null,null,null,null,null,null,null,null,null,null,null,null,null,null,null,null,null,null,null,null,null,null,null,null,null,null,null,null,null,null,null,null,null,null,null,null,null,null,null,null,null,null,null,null,null,null,null,null,null,null,null,null,null,null,null,null,null,null,null,null,null,null,null,null,null,null,null,null,null,null,null,null,null,null,null,null,null,null,null,null,null,null,null,null,null,null,null,null,null,null,null,null,null,null,null,null,null,null,null,null,null,null,null,null,null,null,null,null,null,null,null,null,null,null,null,null,null,null,null,null,null,null,null,null,null,null,null,null,null,null,null,null,null,null,null,null,null,null,null,null,null,null,null,null,null,null,null,null,null,null,null,null,null,null,null,null,null,null,null,null,null,null,null,null,null,null,null,null,null,null,null,null,null,null,null,null,null,null,null,null,null,null,null,null,null,null,null,null,null,null,null,null,null,null,null,null,null,null,null,null,null,null,null,null,null,null,null,null,null,null,null,null,null,null,null,null,null,null,null,null,null,null,null,null,null,null,null,null,null,null,null,null,null,null,null,null,null,null,null,null,null,null,null,null,null,null,null,null,null,null,null,null,null,null,null,null,null,null,null,null,null,null,null,null,null,null,null,null,null,null,null,null,null,null,null,null,null,null,null,null,null,null,null,null,null,null,null,null,null,null,null,null,null,null,null,null,null,null,null,null,null,null,null,null,null,null,null,null,null,null,null,null,null,null,null,null,null,null,null,null,null,null,null,null,null,null,null,null,null,null,null,null,null,null,null,null,null,null,null,null,null,null,null,null,null,null,null,null,null,null,null,null,null,null,null,null,null,null,null,null,null,null,null,null,null,null,null,null,null,null,null,null,null,null,null,null,null,null,null,null,null,null,null,null,null,null,null,null,null,null,null,null,null,null,null,null,null,null,null,null,null,null,null,null,null,null,null,null,null,null,null,null,null,null,null,null,null,null,null,null,null,null,null,null,null,null,null,null,null,null,null,null,null,null,null,null,null,null,null,null,null,null,null,null,null,null,null,null,null,null,null,null,null,null,null,null,null,null,null,null,null,null,null,null,null,null,null,null,null,null,null,null,null,null,null,null,null,null,null,null,null,null,null,null,null,null,null,null,null,null,null,null,null,null,null,null,null,null,null,null,null,null,null,null,null,null,null,null,null,null,null,null,null,null,null,null,null,null,null,null,null,null,null,null,null,null,null,null,null,null,null,null,null,null,null,null,null,null,null,null,null,null,null,null,null,null,null,null,null,null,null,null,null,null,null,null,null,null,null,null,null,null,null,null,null,null,null,null,null,null,null,null,null,null,null,null,null,null,null,null,null,null,null,null,null,null,null,null,null,null,null,null,null,null,null,null,null,null,null,null,null,null,null,null,null,null,null,null,null,null,null,null,null,null,null,null,null,null,null,null,null,null,null,null,null,null,null,null,null,null,null,null,null,null,null,null,null,null,null,null,null,null,null,null,null,null,null,null,null,null,null,null,null,null,null,null,null,null,null,null,null,null,null,null,null,null,null,null,null,null,null,null,null,null,null,null,null,null,null,null,null,null,null,null,null,null,null,null,null,null,null,null,null,null,null,null,null,null,null,null,null,null,null,null,null,null,null,null,null,null,null,null,null,null,null,null,null,null,null,null,null,null,null,null,null,null,null,null,null,null,null,null,null,null,null,null,null,null,null,null,null,null,null,null,null,null,null,null,null,null,null,null,null,null,null,null,null,null,null,null,null,null,null,null,null,null,null,null,null,null,null,null,null,null,null,null,null,null,null,null,null,null,null,null,null,null,null,null,null,null,null,null,null,null,null,null,null,null,null,null,null,null,null,null,null,null,null,null,null,null,null,null,null,null,null,null,null,null,null,null,null,null,null,null,null,null,null,null,null,null,null,null,null,null,null,null,null,null,null,null,null,null,null,null,null,null,null,null,null,null,null,null,null,null,null,null,null,null,null,null,null,null,null,null,null,null,null,null,null,null,null,null,null,null,null,null,null,null,null,null,null,null,null,null,null,null,null,null,null,null,null,null,null,null,null,null,null,null,null,null,null,null,null,null,null,null,null,null,null,null,null,null,null,null,null,null,null,null,null,null,null,null,null,null,null,null,null,null,null,null,null,null,null,null,null,null,null,null,null,null,null,null,null,null,null,null,null,null,null,null,null,null,null,null,null,null,null,null,null,null,null,null,null,null,null,null,null,null,null,null,null,null,null,null,null,null,null,null,null,null,null,null,null,null,null,null,null,null,null,null,null,null,null,null,null,null,null,null,null,null,null,null,null,null,null,null,null,null,null,null,null,null,null,null,null,null,null,null,null,null,null,null,null,null,null,null,null,null,null,null,null,null,null,null,null,null,null,null,null,null,null,null,null,null,null,null,null,null,null,null,null,null,null,null,null,null,null,null,null,null,null,null,null,null,null,null,null,null,null,null,null,null,null,null,null,null,null,null,null,null,null,null,null,null,null,null,null,null,null,null,null,null,null,null,null,null,null,null,null,null,null,null,null,null,null,null,null,null,null,null,null,null,null,null,null,null,null,null,null,null,null,null,null,null,null,null,null,null,null,null,null,null,null,null,null,null,null,null,null,null,null,null,null,null,null,null,null,null,null,null,null,null,null,null,null,null,null,null,null,null,null,null,null,null,null,null,null,null,null,null,null,null,null,null,null,null,null,null,null,null,null,null,null,null,null,null,null,null,null,null,null,null,null,null,null,null,null,null,null,null,null,null,null,null,null,null,null,null,null,null,null,null,null,null,null,null,null,null,null,null,null,null,null,null,null,null,null,null,null,null,null,null,null,null,null,null,null,null,null,null,null,null,null,null,null,null,null,null,null,null,null,null,null,null,null,null,null,null,null,null,null,null,null,null,null,null,null,null,null,null,null,null,null,null,null,null,null,null,null,null,null,null,null,null,null,null,null,null,null,null,null,null,null,null,null,null,null,null,null,null,null,null,null,null,null,null,null,null,null,null,null,null,null,null,null,null,null,null,null,null,null,null,null,null,null,null,null,null,null,null,null,null,null,null,null,null,null,null,null,null,null,null,null,null,null,null,null,null,null,null,null,null,null,null,null,null,null,null,null,null,null,null,null,null,null,null,null,null,null,null,null,null,null,null,null,null,null,null,null,null,null,null,null,null,null,null,null,null,null,null,null,null,null,null,null,null,null,null,null,null,null,null,null,null,null,null,null,null,null,null,null,null,null,null,null,null,null,null,null,null,null,null,null,null,null,null,null,null,null,null,null,null,null,null,null,null,null,null,null,null,null,null,null,null,null,null,null,null,null,null,null,null,null,null,null,null,null,null,null,null,null,null,null,null,null,null,null,null,null,null,null,null,null,null,null,null,null,null,null,null,null,null,null,null,null,null,null,null,null,null,null,null,null,null,null,null,null,null,null,null,null,null,null,null,null,null,null,null,null,null,null,null,null,null,null,null,null,null,null,null,null,null,null,null,null,null,null,null,null,null,null,null,null,null,null,null,null,null,null,null,null,null,null,null,null,null,null,null,null,null,null,null,null,null,null,null,null,null,null,null,null,null,null,null,null,null,null,null,null,null,null,null,null,null,null,null,null,null,null,null,null,null,null,null,null,null,null,null,null,null,null,null,null,null,null,null,null,null,null,null,null,null,null,null,null,null,null,null,null,null,null,null,null,null,null,null,null,null,null,null,null,null,null,null,null,null,null,null,null,null,null,null,null,null,null,null,null,null,null,null,null,null,null,null,null,null,null,null,null,null,null,null,null,null,null,null,null,null,null,null,null,null,null,null,null,null,null,null,null,null,null,null,null,null,null,null,null,null,null,null,null,null,null,null,null,null,null,null,null,null,null,null,null,null,null,null,null,null,null,null,null,null,null,null,null,null,null,null,null,null,null,null,null,null,null,null,null,null,null,null,null,null,null,null,null,null,null,null,null,null,null,null,null,null,null,null,null,null,null,null,null,null,null,null,null,null,null,null,null,null,null,null,null,null,null,null,null,null,null,null,null,null,null,null,null,null,null,null,null,null,null,null,null,null,null,null,null,null,null,null,null,null,null,null,null,null,null,null,null,null,null,null,null,null,null,null,null,null,null,null,null,null,null,null,null,null,null,null,null,null,null,null,null,null,null,null,null,null,null,null,null,null,null,null,null,null,null,null,null,null,null,null,null,null,null,null,null,null,null,null,null,null,null,null,null,null,null,null,null,null,null,null,null,null,null,null,null,null,null,null,null,null,null,null,null,null,null,null,null,null,null,null,null,null,null,null,null,null,null,null,null,null,null,null,null,null,null,null,null,null,null,null,null,null,null,null,null,null,null,null,null,null,null,null,null,null,null,null,null,null,null,null,null,null,null,null,null,null,null,null,null,null,null,null,null,null,null,null,null,null,null,null,null,null,null,null,null,null,null,null,null,null,null,null,null,null,null,null,null,null,null,null,null,null,null,null,null,null,null,null,null,null,null,null,null,null,null,null,null,null,null,null,null,null,null,null,null,null,null,null,null,null,null,null,null,null,null,null,null,null,null,null,null,null,null,null,null,null,null,null,null,null,null,null,null,null,null,null,null,null,null,null,null,null,null,null,null,null,null,null,null,null,null,null,null,null,null,null,null,null,null,null,null,null,null,null,null,null,null,null,null,null,null,null,null,null,null,null,null,null,null,null,null,null,null,null,null,null,null,null,null,null,null,null,null,null,null,null,null,null,null,null,null,null,null,null,null,null,null,null,null,null,null,null,null,null,null,null,null,null,null,null,null,null,null,null,null,null,null,null,null,null,null,null,null,null,null,null,null,null,null,null,null,null,null,null,null,null,null,null,null,null,null,null,null,null,null,null,null,null,null,null,null,null,null,null,null,null,null,null,null,null,null,null,null,null,null,null,null,null,null,null,null,null,null,null,null,null,null,null,null,null,null,null,null,null,null,null,null,null,null,null,null,null,null,null,null,null,null,null,null,null,null,null,null,null,null,null,null,null,null,null,null,null,null,null,null,null,null,null,null,null,null,null,null,null,null,null,null,null,null,null,null,null,null,null,null,null,null,null,null,null,null,null,null,null,null,null,null,null,null,null,null,null,null,null,null,null,null,null,null,null,null,null,null,null,null,null,null,null,null,null,null,null,null,null,null,null,null,null,null,null,null,null,null,null,null,null,null,null,null,null,null,null,null,null,null,null,null,null,null,null,null,null,null,null,null,null,null,null,null,null,null,null,null,null,null,null,null,null,null,null,null,null,null,null,null,null,null,null,null,null,null,null,null,null,null,null,null,null,null,null,null,null,null,null,null,null,null,null,null,null,null,null,null,null,null,null,null,null,null,null,null,null,null,null,null,null,null,null,null,null,null,null,null,null,null,null,null,null,null,null,null,null,null,null,null,null,null,null,null,null,null,null,null,null,null,null,null,null,null,null,null,null,null,null,null,null,null,null,null,null,null,null,null,null,null,null,null,null,null,null,null,null,null,null,null,null,null,null,null,null,null,null,null,null,null,null,null,null,null,null,null,null,null,null,null,null,null,null,null,null,null,null,null,null,null,null,null,null,null,null,null,null,null,null,null,null,null,null,null,null,null,null,null,null,null,null,null,null,null,null,null,null,null,null,null,null,null,null,null,null,null,null,null,null,null,null,null,null,null,null,null,null,null,null,null,null,null,null,null,null,null,null,null,null,null,null,null,null,null,null,null,null,null,null,null,null,null,null,null,null,null,null,null,null,null,null,null,null,null,null,null,null,null,null,null,null,null,null,null,null,null,null,null,null,null,null,null,null,null,null,null,null,null,null,null,null,null,null,null,null,null,null,null,null,null,null,null,null,null,null,null,null,null,null,null,null,null,null,null,null,null,null,null,null,null,null,null,null,null,null,null,null,null,null,null,null,null,null,null,null,null,null,null,null,null,null,null,null,null,null,null,null,null,null,null,null,null,null,null,null,null,null,null,null,null,null,null,null,null,null,null,null,null,null,null,null,null,null,null,null,null,null,null,null,null,null,null,null,null,null,null,null,null,null,null,null,null,null,null,null,null,null,null,null,null,null,null,null,null,null,null,null,null,null,null,null,null,null,null,null,null,null,null,null,null,null,null,null,null,null,null,null,null,null,null,null,null,null,null,null,null,null,null,null,null,null,null,null,null,null,null,null,null,null,null,null,null,null,null,null,null,null,null,null,null,null,null,null,null,null,null,null,null,null,null,null,null,null,null,null,null,null,null,null,null,null,null,null,null,null,null,null,null,null,null,null,null,null,null,null,null,null,null,null,null,null,null,null,null,null,null,null,null,null,null,null,null,null,null,null,null,null,null,null,null,null,null,null,null,null,null,null,null,null,null,null,null,null,null,null,null,null,null,null,null,null,null,null,null,null,null,null,null,null,null,null,null,null,null,null,null,null,null,null,null,null,null,null,null,null,null,null,null,null,null,null,null,null,null,null,null,null,null,null,null,null,null,null,null,null,null,null,null,null,null,null,null,null,null,null,null,null,null,null,null,null,null,null,null,null,null,null,null,null,null,null,null,null,null,null,null,null,null,null,null,null,null,null,null,null,null,null,null,null,null,null,null,null,null,null,null,null,null,null,null,null,null,null,null,null,null,null,null,null,null,null,null,null,null,null,null,null,null,null,null,null,null,null,null,null,null,null,null,null,null,null,null,null,null,null,null,null,null,null,null,null,null,null,null,null,null,null,null,null,null,null,null,null,null,null,null,null,null,null,null,null,null,null,null,null,null,null,null,null,null,null,null,null,null,null,null,null,null,null,null,null,null,null,null,null,null,null,null,null,null,null,null,null,null,null,null,null,null,null,null,null,null,null,null,null,null,null,null,null,null,null,null,null,null,null,null,null,null,null,null,null,null,null,null,null,null,null,null,null,null,null,null,null,null,{"$f":"IF($A$1=\"عطلة رسمية\",\"False\",IF($A$1=\"دوام رسمى\",\"True\",\"AAA\"))","v":"AAA"}]
[null,"App. Date","Name","Surname","Pasaport No.","Date of birth",null,null,"Date","No. of App","Total of Paid $","Total of Paid $","Total of Unpaid $",null,"Official holiday","2019-07-17"]
[null,"2019-04-24T15:00:35.577","KHAYRI ATEEYAH ALMAHDI","ALGHOUL","RGZ10H6R","1973-05-08",null,null,{"$f":"IF(P3=\"\",\"\",P3)","v":43663},{"$f":"IF(I3=\"\",\"\",INDIRECT(\"'\"&$I3&\"'!$q9\"))","v":{"$error":"#REF!"}},{"$f":"IF(I3=\"\",\"\",INDIRECT(\"'\"&$I3&\"'!$o4\"))","v":{"$error":"#REF!"}},{"$f":"IF(I3=\"\",\"\",INDIRECT(\"'\"&$I3&\"'!$o7\"))","v":{"$error":"#REF!"}},{"$f":"IF(I3=\"\",\"\",INDIRECT(\"'\"&$I3&\"'!$T23\"))","v":{"$error":"#REF!"}},null,"Other","2019-07-17"]
[null,"2019-04-28T12:39:44.370","ALZUBAYR FARAJ HASAN","ALMUZOUGHI","LPC37G85","1993-11-21",null,null,{"$f":"IF(P4=\"\",\"\",P4)","v":"2019-07-16"},{"$f":"IF(I4=\"\",\"\",INDIRECT(\"'\"&TEXT($I4,\"dd-mm-yyyy\")&\"'!$q9\"))","v":{"$error":"#REF!"}},{"$f":"IF(I4=\"\",\"\",INDIRECT(\"'\"&TEXT($I4,\"dd-mm-yyyy\")&\"'!$o4\"))","v":{"$error":"#REF!"}},{"$f":"IF(I4=\"\",\"\",INDIRECT(\"'\"&TEXT($I4,\"dd-mm-yyyy\")&\"'!$o7\"))","v":{"$error":"#REF!"}},{"$f":"IF(I4=\"\",\"\",INDIRECT(\"'\"&TEXT($I4,\"dd-mm-yyyy\")&\"'!$T23\"))","v":{"$error":"#REF!"}},null,null,"2019-07-16"]
[null,"2019-04-28T13:13:30.707","ZAKRIA","ALMOZGI","GL35GN54","1991-12-02",null,null,{"$f":"IF(P5=\"\",\"\",P5)","v":"2019-07-17"},{"$f":"IF(I5=\"\",\"\",INDIRECT(\"'\"&TEXT($I5,\"dd-mm-yyyy\")&\"'!$q9\"))","v":{"$error":"#REF!"}},{"$f":"IF(I5=\"\",\"\",INDIRECT(\"'\"&TEXT($I5,\"dd-mm-yyyy\")&\"'!$o4\"))","v":{"$error":"#REF!"}},{"$f":"IF(I5=\"\",\"\",INDIRECT(\"'\"&TEXT($I5,\"dd-mm-yyyy\")&\"'!$o7\"))","v":{"$error":"#REF!"}},{"$f":"IF(I5=\"\",\"\",INDIRECT(\"'\"&TEXT($I5,\"dd-mm-yyyy\")&\"'!$T23\"))","v":{"$error":"#REF!"}},null,null,"2019-07-17"]
[null,"2019-04-29T13:36:16.330","OMAR","ELMOHASHSH","NCJRH93G","1990-09-28",null,null,"","","","",""]
[null,"2019-04-29T13:42:27.433","HIND","OSMAN","C5NR6798","1994-05-01",null,null,"","","","",""]
[null,"2019-05-02T16:57:01.433","MOHAMED","ALBIJOU","RJH6LLCZ","1991-04-24",null,null,"","","","",""]
[null,"2019-05-02T17:04:28.613","SANA","ELHASSI","HCJ6L6PK","1991-09-29",null,null,"","","","",""]
[null,"2019-05-08T12:55:30.870","AISHA","ALSAKLOUL","NPJ3YZH4","1979-05-25",null,null,"","","","",""]
[null,"2019-05-08T13:03:32.563","ESLAM","ALSAKLOUL","NPNKR1RZ","1990-01-15",null,null,"","","","",""]
[null,"2019-05-12T15:21:28.803","ESLAM","ALSAKLOUL","-NPNKR1RZ","1996-01-15",null,null,"","","","",""]
[null,"2019-05-16T13:48:08.413","MUHANAD","ELBURKI","J7G3JY60","1984-01-21",null,null,"","","","",""]
[null,"2019-05-16T13:53:24.300","ENAS","IKJAM","R4HHCPY4","1985-02-06",null,null,"","","","",""]
[null,"2019-05-19T13:26:46.853","LAILA","BEN ISMAIL","K2P1N4N8","1966-04-06",null,null,"","","","",""]
[null,"2019-05-19T13:31:45.700","YASMIN","EL SAHLI","PCPY0PG9","2005-05-15",null,null,"","","","",""]
[null,"2019-05-19T13:35:47.647","YASMIN","EL SAHLI","PCR55NJP","2002-02-27",null,null,"","","","",""]
[null,"2019-05-21T16:16:50.417","YASMIN","AGILA","P81G5CK1","1978-01-05",null,null,"","","","",""]
[null,"2019-05-21T16:21:20.403","YASMIN","EJBALI","C771KFP5","1983-08-06",null,null,"","","","",""]
[null,"2019-05-22T13:16:38.180","YASMIN","KRAIM","F9K1J6G5","1977-04-21",null,null,"","","","",""]
[null,"2019-05-23T12:28:57.527","RAMADHAN","GARGOM","000C6236LL1","1983-10-01",null,null,"","","","",""]
[null,"2019-05-28T17:03:35.457","ABTISAM  ","HOUSSEIN","HZLY9H3G","1985-04-08",null,null,"","","","",""]
[null,"2019-05-29T18:56:52.767","ABOBAKER ","ALSHADLI","NGR095HY","1976-02-20",null,null,"","","","",""]
[null,"2019-05-30T13:15:29.767","KHALED","BUSHIBA","++P0Y3KC9H","1991-04-24",null,null,"","","","",""]
[null,"2019-05-30T13:18:57.317","NAWARA","ATLOUBAH","NG9FP4YL","1981-10-06",null,null,"","","","",""]
[null,"2019-06-02T18:39:18.367","ALLAELDIN","ABDELHALIM","924679","1995-05-05",null,null,"","","","",""]
[null,"2019-06-09T12:00:50.073","ADEL","ALABYADH","RG2KYP15","1975-03-01",null,null,"","","","",""]
[null,"2019-06-09T13:19:06.617","MOHAMED","ALBIJOU","+RJH6LLCZ","1971-10-12",null,null,"","","","",""]
[null,"2019-06-09T13:42:41.223","ALMAHDI","ALBAHLOUL","P28YYP83","1975-04-01",null,null,"","","","",""]
[null,"2019-06-09T15:32:46.743","KHADIJA","AGILA","HN058N7F","1976-10-04",null,null,"","","","",""]
[null,"2019-06-10T13:58:24.787","MUNIR","ELAGOURI","FPFGG8YP","1982-06-10",null,null,"","","","",""]
[null,"2019-06-10T14:15:21.727","ABDULBASIT","ALTAHIR","LCLRC5F0","1990-11-22",null,null,"","","","",""]
[null,"2019-06-10T14:32:41.430","OMAR","ALTAHIR","HP52ZG24","1987-06-03",null,null,"","","","",""]
[null,"2019-06-10T16:05:09.850","OSAMA","BELGASEM","QY84LPJY","1994-02-06",null,null,"","","","",""]
[null,"2019-06-10T16:08:07.367","NESRIN","MOHAMED","GY8Y7L1N","1955-12-25",null,null,"","","","",""]
[null,"2019-06-10T16:45:00.743","OMAR","ELHMRRI","HYY6NGL2","1994-08-02",null,null,"","","","",""]
[null,"2019-06-10T16:50:13.033","GHALIYAH","ALHAMRI","CKN315PH","1959-01-01",null,null,"","","","",""]
[null,"2019-06-11T12:02:25.957","BRAA","ELMANGOSH","+C0881J9P","1990-08-19",null,null,"","","","",""]
[null,"2019-06-11T12:06:47.277","ZAINAB","ELSADEG","L0KPKR13","1968-09-04",null,null,"","","","",""]
[null,"2019-06-11T12:24:45.843","ASEIDA","AHNESH","JZ3PC669","1974-06-08",null,null,"","","","",""]
[null,"2019-06-11T14:08:21.950","NASSER","BENHALLOUM","CGJJFN87","2007-05-14",null,null,"","","","",""]
[null,"2019-06-11T14:12:07.113","ABDULLAH","BINHALLOUM","HRC82HFJ","1990-11-22",null,null,"","","","",""]
[null,"2019-06-12T13:06:19.563","ALAADIN","ALSHARKSI","LL2JC154","1966-01-01",null,null,"","","","",""]
[null,"2019-06-12T13:11:53.757","AHLAM","ABDALLAH","LL00C60N","1976-05-25",null,null,"","","","",""]
[null,"2019-06-12T13:15:23.813","ALAA","ALSHARKASI","L22L1RCP","1990-09-24",null,null,"","","","",""]
[null,"2019-06-13T15:33:52.910","OMAR","ELHMRRI","+HYY6NGL2","1965-08-28",null,null,"","","","",""]
[null,"2019-06-13T15:39:21.060","LAYLAY","BOUSHEEHAH","HYZG20YC","1992-01-04",null,null,"","","","",""]
[null,"2019-06-17T12:12:51.307","SALAH EDDIN","SHAHOMI","GY1JRP7P","1995-10-06",null,null,"","","","",""]
[null,"2019-06-17T12:17:44.810","MARWA","ASHTITI","GY42C07F","1984-01-11",null,null,"","","","",""]
[null,"2019-06-17T12:51:47.780","ZAHRAH","BOURAWI","P7RLF9J0","1996-12-26",null,null,"","","","",""]
[null,"2019-06-17T12:56:59.610","ABDELRAHIM","ALSHATEETI","GR3P9FZK","1984-03-12",null,null,"","","","",""]
[null,"2019-06-17T13:02:00.187","AHMED","ALSHATEETI","FRF2YK0C","1990-01-21",null,null,"","","","",""]
[null,"2019-06-18T12:24:59.867","IBRAHIM","ELGAHANI","H07H239J","1996-02-13",null,null,"","","","",""]
[null,"2019-06-18T12:28:44.510","NADAY","ALARJ","CFJ2L289","1963-01-01",null,null,"","","","",""]
[null,"2019-06-18T17:22:15.387","OMAR","ALBISHARI","LN0G4RC3","2006-07-31",null,null,"","","","",""]
[null,"2019-06-18T17:54:11.480","SHIMA","ALBASHARI","HF7F2F8N","2004-01-20",null,null,"","","","",""]
[null,"2019-06-20T11:42:46.477","MARWA","ELMAHDI","CK5R6GCC","1970-01-01",null,null,"","","","",""]
[null,"2019-06-20T12:12:00.130","BALGEIS","BADI","GN575LJ5","1971-02-06",null,null,"","","","",""]
[null,"2019-06-20T12:18:10.100","MIRA","GLESSA","GN3FZG0P","2002-09-04",null,null,"","","","",""]
[null,"2019-06-20T12:27:13.480","HANI","GLESSA","GN755ZZJ","2004-01-11",null,null,"","","","",""]
[null,"2019-06-20T14:38:24.320","YAHIA","ELFALLAH","JKP7CGP2","1979-10-06",null,null,"","","","",""]
[null,"2019-06-20T14:43:13.117","ABTESAM","BADER","C9127619","1989-03-22",null,null,"","","","",""]
[null,"2019-06-20T14:46:41.963","NOOR","ALFALLAH","C8RRLPH0","1959-08-28",null,null,"","","","",""]
[null,"2019-06-20T14:53:30.030","ISLAM","ALFALLAH","C8LCJ63Y","1958-01-01",null,null,"","","","",""]
[null,"2019-06-20T16:10:06.907","AHMED","BEDA","H9941GK0","1991-02-12",null,null,"","","","",""]
[null,"2019-06-20T16:26:14.793","ESRAA","GINI","H973R816","1996-12-22",null,null,"","","","",""]
[null,"2019-06-20T18:11:23.413","ABDELJAUL","ELAYTIE","FRNFL9ZK","1966-11-21",null,null,"","","","",""]
[null,"2019-06-20T18:14:02.773","SALMA","ELZEWI","FRYCP0P3","1973-10-25",null,null,"","","","",""]
[null,"2019-06-20T18:17:26.260","MARWA","ELSAYTIE","FRN4NYCF","1980-09-28",null,null,{"$f":"IF(P69=\"\",\"\",P69)","v":""},{"$f":"IF(I69=\"\",\"\",INDIRECT(\"'\"&TEXT($I69,\"dd-mm-yyyy\")&\"'!$q9\"))","v":""},{"$f":"IF(I69=\"\",\"\",INDIRECT(\"'\"&TEXT($I69,\"dd-mm-yyyy\")&\"'!$o4\"))","v":""},{"$f":"IF(I69=\"\",\"\",INDIRECT(\"'\"&TEXT($I69,\"dd-mm-yyyy\")&\"'!$o7\"))","v":""},{"$f":"IF(I69=\"\",\"\",INDIRECT(\"'\"&TEXT($I69,\"dd-mm-yyyy\")&\"'!$T23\"))","v":""}]
[null,"2019-06-20T18:23:05.277","ALI","ALSAEITI","GG019KY0","1987-09-02",null,null,"","","","",""]
[null,"2019-06-20T19:09:13.237","KHADEEJAH","ALZAWI","F1KY0LK0","1994-08-06",null,null,"","","","",""]
[null,"2019-06-20T19:17:53.300","AIDAH","BEIDA","G15PZZ2F","2001-07-10",null,null,null,null,null,{"$f":"IF(I72=\"\",\"\",SUM('18-07-2019'!I:I))","v":""},{"$f":"IF(J72=\"\",\"\",SUM('18-07-2019'!K:K))","v":""}]
[null,{"$f":"IF('18-07-2019'!B72=\"\",\"\",'18-07-2019'!B72)","v":"2019-06-20T20:01:13.625"},{"$f":"IF('18-07-2019'!C72=\"\",\"\",'18-07-2019'!C72)","v":"KHADEEJAH"},{"$f":"IF('18-07-2019'!D72=\"\",\"\",'18-07-2019'!D72)","v":"ALZAWI"},{"$f":"IF('18-07-2019'!E72=\"\",\"\",'18-07-2019'!E72)","v":"F1KY0LK3"},{"$f":"IF('18-07-2019'!F72=\"\",\"\",'18-07-2019'!F72)","v":"2008-06-13"},null,null,null,null,null,{"$f":"SUM(L3:L72)","v":{"$error":"#REF!"}},{"$f":"SUM(M3:M72)","v":{"$error":"#REF!"}}]
[null,{"$f":"IF('18-07-2019'!B73=\"\",\"\",'18-07-2019'!B73)","v":"2019-06-20T20:09:53.690"},{"$f":"IF('18-07-2019'!C73=\"\",\"\",'18-07-2019'!C73)","v":"AIDAH"},{"$f":"IF('18-07-2019'!D73=\"\",\"\",'18-07-2019'!D73)","v":"BEIDA"},{"$f":"IF('18-07-2019'!E73=\"\",\"\",'18-07-2019'!E73)","v":"G15PZZ2F"},"2001-07-11"]
[null,{"$f":"IF('18-07-2019'!B74=\"\",\"\",'18-07-2019'!B74)","v":"2019-06-20T20:18:33.755"},{"$f":"IF('18-07-2019'!C74=\"\",\"\",'18-07-2019'!C74)","v":"KHADEEJAH"},{"$f":"IF('18-07-2019'!D74=\"\",\"\",'18-07-2019'!D74)","v":"ALZAWI"},{"$f":"IF('18-07-2019'!E74=\"\",\"\",'18-07-2019'!E74)","v":"F1KY0LK4"},{"$f":"IF('18-07-2019'!F74=\"\",\"\",'18-07-2019'!F74)","v":"2022-04-21"}]
[null,{"$f":"IF('18-07-2019'!B75=\"\",\"\",'18-07-2019'!B75)","v":"2019-06-20T20:27:13.820"},{"$f":"IF('18-07-2019'!C75=\"\",\"\",'18-07-2019'!C75)","v":"AIDAH"},{"$f":"IF('18-07-2019'!D75=\"\",\"\",'18-07-2019'!D75)","v":"BEIDA"},{"$f":"IF('18-07-2019'!E75=\"\",\"\",'18-07-2019'!E75)","v":"G15PZZ2F"},"2001-07-12"]
[null,{"$f":"IF('18-07-2019'!B76=\"\",\"\",'18-07-2019'!B76)","v":"2019-06-20T20:35:53.885"},{"$f":"IF('18-07-2019'!C76=\"\",\"\",'18-07-2019'!C76)","v":"KHADEEJAH"},{"$f":"IF('18-07-2019'!D76=\"\",\"\",'18-07-2019'!D76)","v":"ALZAWI"},{"$f":"IF('18-07-2019'!E76=\"\",\"\",'18-07-2019'!E76)","v":"F1KY0LK5"},{"$f":"IF('18-07-2019'!F76=\"\",\"\",'18-07-2019'!F76)","v":"2036-02-27"}]
[null,{"$f":"IF('18-07-2019'!B77=\"\",\"\",'18-07-2019'!B77)","v":"2019-06-20T20:44:33.950"},{"$f":"IF('18-07-2019'!C77=\"\",\"\",'18-07-2019'!C77)","v":"AIDAH"},{"$f":"IF('18-07-2019'!D77=\"\",\"\",'18-07-2019'!D77)","v":"BEIDA"},{"$f":"IF('18-07-2019'!E77=\"\",\"\",'18-07-2019'!E77)","v":"G15PZZ2F"},{"$f":"IF('18-07-2019'!F77=\"\",\"\",'18-07-2019'!F77)","v":"2043-01-31"}]
[null,{"$f":"IF('18-07-2019'!B78=\"\",\"\",'18-07-2019'!B78)","v":""},{"$f":"IF('18-07-2019'!C78=\"\",\"\",'18-07-2019'!C78)","v":""},{"$f":"IF('18-07-2019'!D78=\"\",\"\",'18-07-2019'!D78)","v":""},{"$f":"IF('18-07-2019'!E78=\"\",\"\",'18-07-2019'!E78)","v":""},{"$f":"IF('18-07-2019'!F78=\"\",\"\",'18-07-2019'!F78)","v":""}]
[null,{"$f":"IF('18-07-2019'!B79=\"\",\"\",'18-07-2019'!B79)","v":""},{"$f":"IF('18-07-2019'!C79=\"\",\"\",'18-07-2019'!C79)","v":""},{"$f":"IF('18-07-2019'!D79=\"\",\"\",'18-07-2019'!D79)","v":""},{"$f":"IF('18-07-2019'!E79=\"\",\"\",'18-07-2019'!E79)","v":""},{"$f":"IF('18-07-2019'!F79=\"\",\"\",'18-07-2019'!F79)","v":""}]
[null,{"$f":"IF('18-07-2019'!B80=\"\",\"\",'18-07-2019'!B80)","v":""},{"$f":"IF('18-07-2019'!C80=\"\",\"\",'18-07-2019'!C80)","v":""},{"$f":"IF('18-07-2019'!D80=\"\",\"\",'18-07-2019'!D80)","v":""},{"$f":"IF('18-07-2019'!E80=\"\",\"\",'18-07-2019'!E80)","v":""},{"$f":"IF('18-07-2019'!F80=\"\",\"\",'18-07-2019'!F80)","v":""}]
[null,{"$f":"IF('18-07-2019'!B81=\"\",\"\",'18-07-2019'!B81)","v":""},{"$f":"IF('18-07-2019'!C81=\"\",\"\",'18-07-2019'!C81)","v":""},{"$f":"IF('18-07-2019'!D81=\"\",\"\",'18-07-2019'!D81)","v":""},{"$f":"IF('18-07-2019'!E81=\"\",\"\",'18-07-2019'!E81)","v":""},{"$f":"IF('18-07-2019'!F81=\"\",\"\",'18-07-2019'!F81)","v":""}]
[null,{"$f":"IF('18-07-2019'!B82=\"\",\"\",'18-07-2019'!B82)","v":""},{"$f":"IF('18-07-2019'!C82=\"\",\"\",'18-07-2019'!C82)","v":""},{"$f":"IF('18-07-2019'!D82=\"\",\"\",'18-07-2019'!D82)","v":""},{"$f":"IF('18-07-2019'!E82=\"\",\"\",'18-07-2019'!E82)","v":""},{"$f":"IF('18-07-2019'!F82=\"\",\"\",'18-07-2019'!F82)","v":""}]
[null,{"$f":"IF('18-07-2019'!B83=\"\",\"\",'18-07-2019'!B83)","v":""},{"$f":"IF('18-07-2019'!C83=\"\",\"\",'18-07-2019'!C83)","v":""},{"$f":"IF('18-07-2019'!D83=\"\",\"\",'18-07-2019'!D83)","v":""},{"$f":"IF('18-07-2019'!E83=\"\",\"\",'18-07-2019'!E83)","v":""},{"$f":"IF('18-07-2019'!F83=\"\",\"\",'18-07-2019'!F83)","v":""}]
[null,{"$f":"IF('18-07-2019'!B84=\"\",\"\",'18-07-2019'!B84)","v":""},{"$f":"IF('18-07-2019'!C84=\"\",\"\",'18-07-2019'!C84)","v":""},{"$f":"IF('18-07-2019'!D84=\"\",\"\",'18-07-2019'!D84)","v":""},{"$f":"IF('18-07-2019'!E84=\"\",\"\",'18-07-2019'!E84)","v":""},{"$f":"IF('18-07-2019'!F84=\"\",\"\",'18-07-2019'!F84)","v":""}]
[null,{"$f":"IF('18-07-2019'!B85=\"\",\"\",'18-07-2019'!B85)","v":""},{"$f":"IF('18-07-2019'!C85=\"\",\"\",'18-07-2019'!C85)","v":""},{"$f":"IF('18-07-2019'!D85=\"\",\"\",'18-07-2019'!D85)","v":""},{"$f":"IF('18-07-2019'!E85=\"\",\"\",'18-07-2019'!E85)","v":""},{"$f":"IF('18-07-2019'!F85=\"\",\"\",'18-07-2019'!F85)","v":""}]
[null,{"$f":"IF('18-07-2019'!B86=\"\",\"\",'18-07-2019'!B86)","v":""},{"$f":"IF('18-07-2019'!C86=\"\",\"\",'18-07-2019'!C86)","v":""},{"$f":"IF('18-07-2019'!D86=\"\",\"\",'18-07-2019'!D86)","v":""},{"$f":"IF('18-07-2019'!E86=\"\",\"\",'18-07-2019'!E86)","v":""},{"$f":"IF('18-07-2019'!F86=\"\",\"\",'18-07-2019'!F86)","v":""}]
[null,{"$f":"IF('18-07-2019'!B87=\"\",\"\",'18-07-2019'!B87)","v":""},{"$f":"IF('18-07-2019'!C87=\"\",\"\",'18-07-2019'!C87)","v":""},{"$f":"IF('18-07-2019'!D87=\"\",\"\",'18-07-2019'!D87)","v":""},{"$f":"IF('18-07-2019'!E87=\"\",\"\",'18-07-2019'!E87)","v":""},{"$f":"IF('18-07-2019'!F87=\"\",\"\",'18-07-2019'!F87)","v":""}]
[null,{"$f":"IF('18-07-2019'!B88=\"\",\"\",'18-07-2019'!B88)","v":""},{"$f":"IF('18-07-2019'!C88=\"\",\"\",'18-07-2019'!C88)","v":""},{"$f":"IF('18-07-2019'!D88=\"\",\"\",'18-07-2019'!D88)","v":""},{"$f":"IF('18-07-2019'!E88=\"\",\"\",'18-07-2019'!E88)","v":""},{"$f":"IF('18-07-2019'!F88=\"\",\"\",'18-07-2019'!F88)","v":""}]
[null,{"$f":"IF('18-07-2019'!B89=\"\",\"\",'18-07-2019'!B89)","v":""},{"$f":"IF('18-07-2019'!C89=\"\",\"\",'18-07-2019'!C89)","v":""},{"$f":"IF('18-07-2019'!D89=\"\",\"\",'18-07-2019'!D89)","v":""},{"$f":"IF('18-07-2019'!E89=\"\",\"\",'18-07-2019'!E89)","v":""},{"$f":"IF('18-07-2019'!F89=\"\",\"\",'18-07-2019'!F89)","v":""}]
[null,{"$f":"IF('18-07-2019'!B90=\"\",\"\",'18-07-2019'!B90)","v":""},{"$f":"IF('18-07-2019'!C90=\"\",\"\",'18-07-2019'!C90)","v":""},{"$f":"IF('18-07-2019'!D90=\"\",\"\",'18-07-2019'!D90)","v":""},{"$f":"IF('18-07-2019'!E90=\"\",\"\",'18-07-2019'!E90)","v":""},{"$f":"IF('18-07-2019'!F90=\"\",\"\",'18-07-2019'!F90)","v":""}]
[null,{"$f":"IF('18-07-2019'!B91=\"\",\"\",'18-07-2019'!B91)","v":""},{"$f":"IF('18-07-2019'!C91=\"\",\"\",'18-07-2019'!C91)","v":""},{"$f":"IF('18-07-2019'!D91=\"\",\"\",'18-07-2019'!D91)","v":""},{"$f":"IF('18-07-2019'!E91=\"\",\"\",'18-07-2019'!E91)","v":""},{"$f":"IF('18-07-2019'!F91=\"\",\"\",'18-07-2019'!F91)","v":""}]
[null,{"$f":"IF('18-07-2019'!B92=\"\",\"\",'18-07-2019'!B92)","v":""},{"$f":"IF('18-07-2019'!C92=\"\",\"\",'18-07-2019'!C92)","v":""},{"$f":"IF('18-07-2019'!D92=\"\",\"\",'18-07-2019'!D92)","v":""},{"$f":"IF('18-07-2019'!E92=\"\",\"\",'18-07-2019'!E92)","v":""},{"$f":"IF('18-07-2019'!F92=\"\",\"\",'18-07-2019'!F92)","v":""}]
[null,{"$f":"IF('18-07-2019'!B93=\"\",\"\",'18-07-2019'!B93)","v":""},{"$f":"IF('18-07-2019'!C93=\"\",\"\",'18-07-2019'!C93)","v":""},{"$f":"IF('18-07-2019'!D93=\"\",\"\",'18-07-2019'!D93)","v":""},{"$f":"IF('18-07-2019'!E93=\"\",\"\",'18-07-2019'!E93)","v":""},{"$f":"IF('18-07-2019'!F93=\"\",\"\",'18-07-2019'!F93)","v":""}]
[null,{"$f":"IF('18-07-2019'!B94=\"\",\"\",'18-07-2019'!B94)","v":""},{"$f":"IF('18-07-2019'!C94=\"\",\"\",'18-07-2019'!C94)","v":""},{"$f":"IF('18-07-2019'!D94=\"\",\"\",'18-07-2019'!D94)","v":""},{"$f":"IF('18-07-2019'!E94=\"\",\"\",'18-07-2019'!E94)","v":""},{"$f":"IF('18-07-2019'!F94=\"\",\"\",'18-07-2019'!F94)","v":""}]
[null,{"$f":"IF('18-07-2019'!B95=\"\",\"\",'18-07-2019'!B95)","v":""},{"$f":"IF('18-07-2019'!C95=\"\",\"\",'18-07-2019'!C95)","v":""},{"$f":"IF('18-07-2019'!D95=\"\",\"\",'18-07-2019'!D95)","v":""},{"$f":"IF('18-07-2019'!E95=\"\",\"\",'18-07-2019'!E95)","v":""},{"$f":"IF('18-07-2019'!F95=\"\",\"\",'18-07-2019'!F95)","v":""}]
[null,{"$f":"IF('18-07-2019'!B96=\"\",\"\",'18-07-2019'!B96)","v":""},{"$f":"IF('18-07-2019'!C96=\"\",\"\",'18-07-2019'!C96)","v":""},{"$f":"IF('18-07-2019'!D96=\"\",\"\",'18-07-2019'!D96)","v":""},{"$f":"IF('18-07-2019'!E96=\"\",\"\",'18-07-2019'!E96)","v":""},{"$f":"IF('18-07-2019'!F96=\"\",\"\",'18-07-2019'!F96)","v":""}]
[null,{"$f":"IF('18-07-2019'!B97=\"\",\"\",'18-07-2019'!B97)","v":""},{"$f":"IF('18-07-2019'!C97=\"\",\"\",'18-07-2019'!C97)","v":""},{"$f":"IF('18-07-2019'!D97=\"\",\"\",'18-07-2019'!D97)","v":""},{"$f":"IF('18-07-2019'!E97=\"\",\"\",'18-07-2019'!E97)","v":""},{"$f":"IF('18-07-2019'!F97=\"\",\"\",'18-07-2019'!F97)","v":""}]
[null,{"$f":"IF('18-07-2019'!B98=\"\",\"\",'18-07-2019'!B98)","v":""},{"$f":"IF('18-07-2019'!C98=\"\",\"\",'18-07-2019'!C98)","v":""},{"$f":"IF('18-07-2019'!D98=\"\",\"\",'18-07-2019'!D98)","v":""},{"$f":"IF('18-07-2019'!E98=\"\",\"\",'18-07-2019'!E98)","v":""},{"$f":"IF('18-07-2019'!F98=\"\",\"\",'18-07-2019'!F98)","v":""}]
[null,{"$f":"IF('18-07-2019'!B99=\"\",\"\",'18-07-2019'!B99)","v":""},{"$f":"IF('18-07-2019'!C99=\"\",\"\",'18-07-2019'!C99)","v":""},{"$f":"IF('18-07-2019'!D99=\"\",\"\",'18-07-2019'!D99)","v":""},{"$f":"IF('18-07-2019'!E99=\"\",\"\",'18-07-2019'!E99)","v":""},{"$f":"IF('18-07-2019'!F99=\"\",\"\",'18-07-2019'!F99)","v":""}]
[null,{"$f":"IF('18-07-2019'!B100=\"\",\"\",'18-07-2019'!B100)","v":""},{"$f":"IF('18-07-2019'!C100=\"\",\"\",'18-07-2019'!C100)","v":""},{"$f":"IF('18-07-2019'!D100=\"\",\"\",'18-07-2019'!D100)","v":""},{"$f":"IF('18-07-2019'!E100=\"\",\"\",'18-07-2019'!E100)","v":""},{"$f":"IF('18-07-2019'!F100=\"\",\"\",'18-07-2019'!F100)","v":""}]
[null,{"$f":"IF('18-07-2019'!B101=\"\",\"\",'18-07-2019'!B101)","v":""},{"$f":"IF('18-07-2019'!C101=\"\",\"\",'18-07-2019'!C101)","v":""},{"$f":"IF('18-07-2019'!D101=\"\",\"\",'18-07-2019'!D101)","v":""},{"$f":"IF('18-07-2019'!E101=\"\",\"\",'18-07-2019'!E101)","v":""},{"$f":"IF('18-07-2019'!F101=\"\",\"\",'18-07-2019'!F101)","v":""}]
[null,{"$f":"IF('18-07-2019'!B102=\"\",\"\",'18-07-2019'!B102)","v":""},{"$f":"IF('18-07-2019'!C102=\"\",\"\",'18-07-2019'!C102)","v":""},{"$f":"IF('18-07-2019'!D102=\"\",\"\",'18-07-2019'!D102)","v":""},{"$f":"IF('18-07-2019'!E102=\"\",\"\",'18-07-2019'!E102)","v":""},{"$f":"IF('18-07-2019'!F102=\"\",\"\",'18-07-2019'!F102)","v":""}]
[null,{"$f":"IF('18-07-2019'!B103=\"\",\"\",'18-07-2019'!B103)","v":""},{"$f":"IF('18-07-2019'!C103=\"\",\"\",'18-07-2019'!C103)","v":""},{"$f":"IF('18-07-2019'!D103=\"\",\"\",'18-07-2019'!D103)","v":""},{"$f":"IF('18-07-2019'!E103=\"\",\"\",'18-07-2019'!E103)","v":""},{"$f":"IF('18-07-2019'!F103=\"\",\"\",'18-07-2019'!F103)","v":""}]
[null,{"$f":"IF('18-07-2019'!B104=\"\",\"\",'18-07-2019'!B104)","v":""},{"$f":"IF('18-07-2019'!C104=\"\",\"\",'18-07-2019'!C104)","v":""},{"$f":"IF('18-07-2019'!D104=\"\",\"\",'18-07-2019'!D104)","v":""},{"$f":"IF('18-07-2019'!E104=\"\",\"\",'18-07-2019'!E104)","v":""},{"$f":"IF('18-07-2019'!F104=\"\",\"\",'18-07-2019'!F104)","v":""}]
[null,{"$f":"IF('18-07-2019'!B105=\"\",\"\",'18-07-2019'!B105)","v":""},{"$f":"IF('18-07-2019'!C105=\"\",\"\",'18-07-2019'!C105)","v":""},{"$f":"IF('18-07-2019'!D105=\"\",\"\",'18-07-2019'!D105)","v":""},{"$f":"IF('18-07-2019'!E105=\"\",\"\",'18-07-2019'!E105)","v":""},{"$f":"IF('18-07-2019'!F105=\"\",\"\",'18-07-2019'!F105)","v":""}]
[null,{"$f":"IF('18-07-2019'!B106=\"\",\"\",'18-07-2019'!B106)","v":""},{"$f":"IF('18-07-2019'!C106=\"\",\"\",'18-07-2019'!C106)","v":""},{"$f":"IF('18-07-2019'!D106=\"\",\"\",'18-07-2019'!D106)","v":""},{"$f":"IF('18-07-2019'!E106=\"\",\"\",'18-07-2019'!E106)","v":""},{"$f":"IF('18-07-2019'!F106=\"\",\"\",'18-07-2019'!F106)","v":""}]
[null,{"$f":"IF('18-07-2019'!B107=\"\",\"\",'18-07-2019'!B107)","v":""},{"$f":"IF('18-07-2019'!C107=\"\",\"\",'18-07-2019'!C107)","v":""},{"$f":"IF('18-07-2019'!D107=\"\",\"\",'18-07-2019'!D107)","v":""},{"$f":"IF('18-07-2019'!E107=\"\",\"\",'18-07-2019'!E107)","v":""},{"$f":"IF('18-07-2019'!F107=\"\",\"\",'18-07-2019'!F107)","v":""}]
[null,{"$f":"IF('18-07-2019'!B108=\"\",\"\",'18-07-2019'!B108)","v":""},{"$f":"IF('18-07-2019'!C108=\"\",\"\",'18-07-2019'!C108)","v":""},{"$f":"IF('18-07-2019'!D108=\"\",\"\",'18-07-2019'!D108)","v":""},{"$f":"IF('18-07-2019'!E108=\"\",\"\",'18-07-2019'!E108)","v":""},{"$f":"IF('18-07-2019'!F108=\"\",\"\",'18-07-2019'!F108)","v":""}]
[null,{"$f":"IF('18-07-2019'!B109=\"\",\"\",'18-07-2019'!B109)","v":""},{"$f":"IF('18-07-2019'!C109=\"\",\"\",'18-07-2019'!C109)","v":""},{"$f":"IF('18-07-2019'!D109=\"\",\"\",'18-07-2019'!D109)","v":""},{"$f":"IF('18-07-2019'!E109=\"\",\"\",'18-07-2019'!E109)","v":""},{"$f":"IF('18-07-2019'!F109=\"\",\"\",'18-07-2019'!F109)","v":""}]
[null,{"$f":"IF('18-07-2019'!B110=\"\",\"\",'18-07-2019'!B110)","v":""},{"$f":"IF('18-07-2019'!C110=\"\",\"\",'18-07-2019'!C110)","v":""},{"$f":"IF('18-07-2019'!D110=\"\",\"\",'18-07-2019'!D110)","v":""},{"$f":"IF('18-07-2019'!E110=\"\",\"\",'18-07-2019'!E110)","v":""},{"$f":"IF('18-07-2019'!F110=\"\",\"\",'18-07-2019'!F110)","v":""}]
[null,{"$f":"IF('18-07-2019'!B111=\"\",\"\",'18-07-2019'!B111)","v":""},{"$f":"IF('18-07-2019'!C111=\"\",\"\",'18-07-2019'!C111)","v":""},{"$f":"IF('18-07-2019'!D111=\"\",\"\",'18-07-2019'!D111)","v":""},{"$f":"IF('18-07-2019'!E111=\"\",\"\",'18-07-2019'!E111)","v":""},{"$f":"IF('18-07-2019'!F111=\"\",\"\",'18-07-2019'!F111)","v":""}]
[null,{"$f":"IF('18-07-2019'!B112=\"\",\"\",'18-07-2019'!B112)","v":""},{"$f":"IF('18-07-2019'!C112=\"\",\"\",'18-07-2019'!C112)","v":""},{"$f":"IF('18-07-2019'!D112=\"\",\"\",'18-07-2019'!D112)","v":""},{"$f":"IF('18-07-2019'!E112=\"\",\"\",'18-07-2019'!E112)","v":""},{"$f":"IF('18-07-2019'!F112=\"\",\"\",'18-07-2019'!F112)","v":""}]
[null,{"$f":"IF('18-07-2019'!B113=\"\",\"\",'18-07-2019'!B113)","v":""},{"$f":"IF('18-07-2019'!C113=\"\",\"\",'18-07-2019'!C113)","v":""},{"$f":"IF('18-07-2019'!D113=\"\",\"\",'18-07-2019'!D113)","v":""},{"$f":"IF('18-07-2019'!E113=\"\",\"\",'18-07-2019'!E113)","v":""},{"$f":"IF('18-07-2019'!F113=\"\",\"\",'18-07-2019'!F113)","v":""}]
[null,{"$f":"IF('18-07-2019'!B114=\"\",\"\",'18-07-2019'!B114)","v":""},{"$f":"IF('18-07-2019'!C114=\"\",\"\",'18-07-2019'!C114)","v":""},{"$f":"IF('18-07-2019'!D114=\"\",\"\",'18-07-2019'!D114)","v":""},{"$f":"IF('18-07-2019'!E114=\"\",\"\",'18-07-2019'!E114)","v":""},{"$f":"IF('18-07-2019'!F114=\"\",\"\",'18-07-2019'!F114)","v":""}]
[null,{"$f":"IF('18-07-2019'!B115=\"\",\"\",'18-07-2019'!B115)","v":""},{"$f":"IF('18-07-2019'!C115=\"\",\"\",'18-07-2019'!C115)","v":""},{"$f":"IF('18-07-2019'!D115=\"\",\"\",'18-07-2019'!D115)","v":""},{"$f":"IF('18-07-2019'!E115=\"\",\"\",'18-07-2019'!E115)","v":""},{"$f":"IF('18-07-2019'!F115=\"\",\"\",'18-07-2019'!F115)","v":""}]
[null,{"$f":"IF('18-07-2019'!B116=\"\",\"\",'18-07-2019'!B116)","v":""},{"$f":"IF('18-07-2019'!C116=\"\",\"\",'18-07-2019'!C116)","v":""},{"$f":"IF('18-07-2019'!D116=\"\",\"\",'18-07-2019'!D116)","v":""},{"$f":"IF('18-07-2019'!E116=\"\",\"\",'18-07-2019'!E116)","v":""},{"$f":"IF('18-07-2019'!F116=\"\",\"\",'18-07-2019'!F116)","v":""}]
[null,{"$f":"IF('18-07-2019'!B117=\"\",\"\",'18-07-2019'!B117)","v":""},{"$f":"IF('18-07-2019'!C117=\"\",\"\",'18-07-2019'!C117)","v":""},{"$f":"IF('18-07-2019'!D117=\"\",\"\",'18-07-2019'!D117)","v":""},{"$f":"IF('18-07-2019'!E117=\"\",\"\",'18-07-2019'!E117)","v":""},{"$f":"IF('18-07-2019'!F117=\"\",\"\",'18-07-2019'!F117)","v":""}]
[null,{"$f":"IF('18-07-2019'!B118=\"\",\"\",'18-07-2019'!B118)","v":""},{"$f":"IF('18-07-2019'!C118=\"\",\"\",'18-07-2019'!C118)","v":""},{"$f":"IF('18-07-2019'!D118=\"\",\"\",'18-07-2019'!D118)","v":""},{"$f":"IF('18-07-2019'!E118=\"\",\"\",'18-07-2019'!E118)","v":""},{"$f":"IF('18-07-2019'!F118=\"\",\"\",'18-07-2019'!F118)","v":""}]
[null,{"$f":"IF('18-07-2019'!B119=\"\",\"\",'18-07-2019'!B119)","v":""},{"$f":"IF('18-07-2019'!C119=\"\",\"\",'18-07-2019'!C119)","v":""},{"$f":"IF('18-07-2019'!D119=\"\",\"\",'18-07-2019'!D119)","v":""},{"$f":"IF('18-07-2019'!E119=\"\",\"\",'18-07-2019'!E119)","v":""},{"$f":"IF('18-07-2019'!F119=\"\",\"\",'18-07-2019'!F119)","v":""}]
[null,{"$f":"IF('18-07-2019'!B120=\"\",\"\",'18-07-2019'!B120)","v":""},{"$f":"IF('18-07-2019'!C120=\"\",\"\",'18-07-2019'!C120)","v":""},{"$f":"IF('18-07-2019'!D120=\"\",\"\",'18-07-2019'!D120)","v":""},{"$f":"IF('18-07-2019'!E120=\"\",\"\",'18-07-2019'!E120)","v":""},{"$f":"IF('18-07-2019'!F120=\"\",\"\",'18-07-2019'!F120)","v":""}]
[null,{"$f":"IF('18-07-2019'!B121=\"\",\"\",'18-07-2019'!B121)","v":""},{"$f":"IF('18-07-2019'!C121=\"\",\"\",'18-07-2019'!C121)","v":""},{"$f":"IF('18-07-2019'!D121=\"\",\"\",'18-07-2019'!D121)","v":""},{"$f":"IF('18-07-2019'!E121=\"\",\"\",'18-07-2019'!E121)","v":""},{"$f":"IF('18-07-2019'!F121=\"\",\"\",'18-07-2019'!F121)","v":""}]
[null,{"$f":"IF('18-07-2019'!B122=\"\",\"\",'18-07-2019'!B122)","v":""},{"$f":"IF('18-07-2019'!C122=\"\",\"\",'18-07-2019'!C122)","v":""},{"$f":"IF('18-07-2019'!D122=\"\",\"\",'18-07-2019'!D122)","v":""},{"$f":"IF('18-07-2019'!E122=\"\",\"\",'18-07-2019'!E122)","v":""},{"$f":"IF('18-07-2019'!F122=\"\",\"\",'18-07-2019'!F122)","v":""}]
[null,{"$f":"IF('18-07-2019'!B123=\"\",\"\",'18-07-2019'!B123)","v":""},{"$f":"IF('18-07-2019'!C123=\"\",\"\",'18-07-2019'!C123)","v":""},{"$f":"IF('18-07-2019'!D123=\"\",\"\",'18-07-2019'!D123)","v":""},{"$f":"IF('18-07-2019'!E123=\"\",\"\",'18-07-2019'!E123)","v":""},{"$f":"IF('18-07-2019'!F123=\"\",\"\",'18-07-2019'!F123)","v":""}]
[null,{"$f":"IF('18-07-2019'!B124=\"\",\"\",'18-07-2019'!B124)","v":""},{"$f":"IF('18-07-2019'!C124=\"\",\"\",'18-07-2019'!C124)","v":""},{"$f":"IF('18-07-2019'!D124=\"\",\"\",'18-07-2019'!D124)","v":""},{"$f":"IF('18-07-2019'!E124=\"\",\"\",'18-07-2019'!E124)","v":""},{"$f":"IF('18-07-2019'!F124=\"\",\"\",'18-07-2019'!F124)","v":""}]
[null,{"$f":"IF('18-07-2019'!B125=\"\",\"\",'18-07-2019'!B125)","v":""},{"$f":"IF('18-07-2019'!C125=\"\",\"\",'18-07-2019'!C125)","v":""},{"$f":"IF('18-07-2019'!D125=\"\",\"\",'18-07-2019'!D125)","v":""},{"$f":"IF('18-07-2019'!E125=\"\",\"\",'18-07-2019'!E125)","v":""},{"$f":"IF('18-07-2019'!F125=\"\",\"\",'18-07-2019'!F125)","v":""}]
[null,{"$f":"IF('18-07-2019'!B126=\"\",\"\",'18-07-2019'!B126)","v":""},{"$f":"IF('18-07-2019'!C126=\"\",\"\",'18-07-2019'!C126)","v":""},{"$f":"IF('18-07-2019'!D126=\"\",\"\",'18-07-2019'!D126)","v":""},{"$f":"IF('18-07-2019'!E126=\"\",\"\",'18-07-2019'!E126)","v":""},{"$f":"IF('18-07-2019'!F126=\"\",\"\",'18-07-2019'!F126)","v":""}]
[null,{"$f":"IF('18-07-2019'!B127=\"\",\"\",'18-07-2019'!B127)","v":""},{"$f":"IF('18-07-2019'!C127=\"\",\"\",'18-07-2019'!C127)","v":""},{"$f":"IF('18-07-2019'!D127=\"\",\"\",'18-07-2019'!D127)","v":""},{"$f":"IF('18-07-2019'!E127=\"\",\"\",'18-07-2019'!E127)","v":""},{"$f":"IF('18-07-2019'!F127=\"\",\"\",'18-07-2019'!F127)","v":""}]
[null,{"$f":"IF('18-07-2019'!B128=\"\",\"\",'18-07-2019'!B128)","v":""},{"$f":"IF('18-07-2019'!C128=\"\",\"\",'18-07-2019'!C128)","v":""},{"$f":"IF('18-07-2019'!D128=\"\",\"\",'18-07-2019'!D128)","v":""},{"$f":"IF('18-07-2019'!E128=\"\",\"\",'18-07-2019'!E128)","v":""},{"$f":"IF('18-07-2019'!F128=\"\",\"\",'18-07-2019'!F128)","v":""}]
[null,{"$f":"IF('18-07-2019'!B129=\"\",\"\",'18-07-2019'!B129)","v":""},{"$f":"IF('18-07-2019'!C129=\"\",\"\",'18-07-2019'!C129)","v":""},{"$f":"IF('18-07-2019'!D129=\"\",\"\",'18-07-2019'!D129)","v":""},{"$f":"IF('18-07-2019'!E129=\"\",\"\",'18-07-2019'!E129)","v":""},{"$f":"IF('18-07-2019'!F129=\"\",\"\",'18-07-2019'!F129)","v":""}]
[null,{"$f":"IF('18-07-2019'!B130=\"\",\"\",'18-07-2019'!B130)","v":""},{"$f":"IF('18-07-2019'!C130=\"\",\"\",'18-07-2019'!C130)","v":""},{"$f":"IF('18-07-2019'!D130=\"\",\"\",'18-07-2019'!D130)","v":""},{"$f":"IF('18-07-2019'!E130=\"\",\"\",'18-07-2019'!E130)","v":""},{"$f":"IF('18-07-2019'!F130=\"\",\"\",'18-07-2019'!F130)","v":""}]
[null,{"$f":"IF('18-07-2019'!B131=\"\",\"\",'18-07-2019'!B131)","v":""},{"$f":"IF('18-07-2019'!C131=\"\",\"\",'18-07-2019'!C131)","v":""},{"$f":"IF('18-07-2019'!D131=\"\",\"\",'18-07-2019'!D131)","v":""},{"$f":"IF('18-07-2019'!E131=\"\",\"\",'18-07-2019'!E131)","v":""},{"$f":"IF('18-07-2019'!F131=\"\",\"\",'18-07-2019'!F131)","v":""}]
[null,{"$f":"IF('18-07-2019'!B132=\"\",\"\",'18-07-2019'!B132)","v":""},{"$f":"IF('18-07-2019'!C132=\"\",\"\",'18-07-2019'!C132)","v":""},{"$f":"IF('18-07-2019'!D132=\"\",\"\",'18-07-2019'!D132)","v":""},{"$f":"IF('18-07-2019'!E132=\"\",\"\",'18-07-2019'!E132)","v":""},{"$f":"IF('18-07-2019'!F132=\"\",\"\",'18-07-2019'!F132)","v":""}]
[null,{"$f":"IF('18-07-2019'!B133=\"\",\"\",'18-07-2019'!B133)","v":""},{"$f":"IF('18-07-2019'!C133=\"\",\"\",'18-07-2019'!C133)","v":""},{"$f":"IF('18-07-2019'!D133=\"\",\"\",'18-07-2019'!D133)","v":""},{"$f":"IF('18-07-2019'!E133=\"\",\"\",'18-07-2019'!E133)","v":""},{"$f":"IF('18-07-2019'!F133=\"\",\"\",'18-07-2019'!F133)","v":""}]
[null,{"$f":"IF('18-07-2019'!B134=\"\",\"\",'18-07-2019'!B134)","v":""},{"$f":"IF('18-07-2019'!C134=\"\",\"\",'18-07-2019'!C134)","v":""},{"$f":"IF('18-07-2019'!D134=\"\",\"\",'18-07-2019'!D134)","v":""},{"$f":"IF('18-07-2019'!E134=\"\",\"\",'18-07-2019'!E134)","v":""},{"$f":"IF('18-07-2019'!F134=\"\",\"\",'18-07-2019'!F134)","v":""}]
[null,{"$f":"IF('18-07-2019'!B135=\"\",\"\",'18-07-2019'!B135)","v":""},{"$f":"IF('18-07-2019'!C135=\"\",\"\",'18-07-2019'!C135)","v":""},{"$f":"IF('18-07-2019'!D135=\"\",\"\",'18-07-2019'!D135)","v":""},{"$f":"IF('18-07-2019'!E135=\"\",\"\",'18-07-2019'!E135)","v":""},{"$f":"IF('18-07-2019'!F135=\"\",\"\",'18-07-2019'!F135)","v":""}]
[null,{"$f":"IF('18-07-2019'!B136=\"\",\"\",'18-07-2019'!B136)","v":""},{"$f":"IF('18-07-2019'!C136=\"\",\"\",'18-07-2019'!C136)","v":""},{"$f":"IF('18-07-2019'!D136=\"\",\"\",'18-07-2019'!D136)","v":""},{"$f":"IF('18-07-2019'!E136=\"\",\"\",'18-07-2019'!E136)","v":""},{"$f":"IF('18-07-2019'!F136=\"\",\"\",'18-07-2019'!F136)","v":""}]
[null,{"$f":"IF('18-07-2019'!B137=\"\",\"\",'18-07-2019'!B137)","v":""},{"$f":"IF('18-07-2019'!C137=\"\",\"\",'18-07-2019'!C137)","v":""},{"$f":"IF('18-07-2019'!D137=\"\",\"\",'18-07-2019'!D137)","v":""},{"$f":"IF('18-07-2019'!E137=\"\",\"\",'18-07-2019'!E137)","v":""},{"$f":"IF('18-07-2019'!F137=\"\",\"\",'18-07-2019'!F137)","v":""}]
[null,{"$f":"IF('18-07-2019'!B138=\"\",\"\",'18-07-2019'!B138)","v":""},{"$f":"IF('18-07-2019'!C138=\"\",\"\",'18-07-2019'!C138)","v":""},{"$f":"IF('18-07-2019'!D138=\"\",\"\",'18-07-2019'!D138)","v":""},{"$f":"IF('18-07-2019'!E138=\"\",\"\",'18-07-2019'!E138)","v":""},{"$f":"IF('18-07-2019'!F138=\"\",\"\",'18-07-2019'!F138)","v":""}]
[null,{"$f":"IF('18-07-2019'!B139=\"\",\"\",'18-07-2019'!B139)","v":""},{"$f":"IF('18-07-2019'!C139=\"\",\"\",'18-07-2019'!C139)","v":""},{"$f":"IF('18-07-2019'!D139=\"\",\"\",'18-07-2019'!D139)","v":""},{"$f":"IF('18-07-2019'!E139=\"\",\"\",'18-07-2019'!E139)","v":""},{"$f":"IF('18-07-2019'!F139=\"\",\"\",'18-07-2019'!F139)","v":""}]
[null,{"$f":"IF('18-07-2019'!B140=\"\",\"\",'18-07-2019'!B140)","v":""},{"$f":"IF('18-07-2019'!C140=\"\",\"\",'18-07-2019'!C140)","v":""},{"$f":"IF('18-07-2019'!D140=\"\",\"\",'18-07-2019'!D140)","v":""},{"$f":"IF('18-07-2019'!E140=\"\",\"\",'18-07-2019'!E140)","v":""},{"$f":"IF('18-07-2019'!F140=\"\",\"\",'18-07-2019'!F140)","v":""}]
[null,{"$f":"IF('18-07-2019'!B141=\"\",\"\",'18-07-2019'!B141)","v":""},{"$f":"IF('18-07-2019'!C141=\"\",\"\",'18-07-2019'!C141)","v":""},{"$f":"IF('18-07-2019'!D141=\"\",\"\",'18-07-2019'!D141)","v":""},{"$f":"IF('18-07-2019'!E141=\"\",\"\",'18-07-2019'!E141)","v":""},{"$f":"IF('18-07-2019'!F141=\"\",\"\",'18-07-2019'!F141)","v":""}]
[null,{"$f":"IF('18-07-2019'!B142=\"\",\"\",'18-07-2019'!B142)","v":""},{"$f":"IF('18-07-2019'!C142=\"\",\"\",'18-07-2019'!C142)","v":""},{"$f":"IF('18-07-2019'!D142=\"\",\"\",'18-07-2019'!D142)","v":""},{"$f":"IF('18-07-2019'!E142=\"\",\"\",'18-07-2019'!E142)","v":""},{"$f":"IF('18-07-2019'!F142=\"\",\"\",'18-07-2019'!F142)","v":""}]
[null,{"$f":"IF('18-07-2019'!B143=\"\",\"\",'18-07-2019'!B143)","v":""},{"$f":"IF('18-07-2019'!C143=\"\",\"\",'18-07-2019'!C143)","v":""},{"$f":"IF('18-07-2019'!D143=\"\",\"\",'18-07-2019'!D143)","v":""},{"$f":"IF('18-07-2019'!E143=\"\",\"\",'18-07-2019'!E143)","v":""},{"$f":"IF('18-07-2019'!F143=\"\",\"\",'18-07-2019'!F143)","v":""}]
[null,{"$f":"IF('18-07-2019'!B144=\"\",\"\",'18-07-2019'!B144)","v":""},{"$f":"IF('18-07-2019'!C144=\"\",\"\",'18-07-2019'!C144)","v":""},{"$f":"IF('18-07-2019'!D144=\"\",\"\",'18-07-2019'!D144)","v":""},{"$f":"IF('18-07-2019'!E144=\"\",\"\",'18-07-2019'!E144)","v":""},{"$f":"IF('18-07-2019'!F144=\"\",\"\",'18-07-2019'!F144)","v":""}]
[null,{"$f":"IF('18-07-2019'!B145=\"\",\"\",'18-07-2019'!B145)","v":""},{"$f":"IF('18-07-2019'!C145=\"\",\"\",'18-07-2019'!C145)","v":""},{"$f":"IF('18-07-2019'!D145=\"\",\"\",'18-07-2019'!D145)","v":""},{"$f":"IF('18-07-2019'!E145=\"\",\"\",'18-07-2019'!E145)","v":""},{"$f":"IF('18-07-2019'!F145=\"\",\"\",'18-07-2019'!F145)","v":""}]
[null,{"$f":"IF('18-07-2019'!B146=\"\",\"\",'18-07-2019'!B146)","v":""},{"$f":"IF('18-07-2019'!C146=\"\",\"\",'18-07-2019'!C146)","v":""},{"$f":"IF('18-07-2019'!D146=\"\",\"\",'18-07-2019'!D146)","v":""},{"$f":"IF('18-07-2019'!E146=\"\",\"\",'18-07-2019'!E146)","v":""},{"$f":"IF('18-07-2019'!F146=\"\",\"\",'18-07-2019'!F146)","v":""}]
[null,{"$f":"IF('18-07-2019'!B147=\"\",\"\",'18-07-2019'!B147)","v":""},{"$f":"IF('18-07-2019'!C147=\"\",\"\",'18-07-2019'!C147)","v":""},{"$f":"IF('18-07-2019'!D147=\"\",\"\",'18-07-2019'!D147)","v":""},{"$f":"IF('18-07-2019'!E147=\"\",\"\",'18-07-2019'!E147)","v":""},{"$f":"IF('18-07-2019'!F147=\"\",\"\",'18-07-2019'!F147)","v":""}]
[null,{"$f":"IF('18-07-2019'!B148=\"\",\"\",'18-07-2019'!B148)","v":""},{"$f":"IF('18-07-2019'!C148=\"\",\"\",'18-07-2019'!C148)","v":""},{"$f":"IF('18-07-2019'!D148=\"\",\"\",'18-07-2019'!D148)","v":""},{"$f":"IF('18-07-2019'!E148=\"\",\"\",'18-07-2019'!E148)","v":""},{"$f":"IF('18-07-2019'!F148=\"\",\"\",'18-07-2019'!F148)","v":""}]
[null,{"$f":"IF('18-07-2019'!B149=\"\",\"\",'18-07-2019'!B149)","v":""},{"$f":"IF('18-07-2019'!C149=\"\",\"\",'18-07-2019'!C149)","v":""},{"$f":"IF('18-07-2019'!D149=\"\",\"\",'18-07-2019'!D149)","v":""},{"$f":"IF('18-07-2019'!E149=\"\",\"\",'18-07-2019'!E149)","v":""},{"$f":"IF('18-07-2019'!F149=\"\",\"\",'18-07-2019'!F149)","v":""}]
[null,{"$f":"IF('18-07-2019'!B150=\"\",\"\",'18-07-2019'!B150)","v":""},{"$f":"IF('18-07-2019'!C150=\"\",\"\",'18-07-2019'!C150)","v":""},{"$f":"IF('18-07-2019'!D150=\"\",\"\",'18-07-2019'!D150)","v":""},{"$f":"IF('18-07-2019'!E150=\"\",\"\",'18-07-2019'!E150)","v":""},{"$f":"IF('18-07-2019'!F150=\"\",\"\",'18-07-2019'!F150)","v":""}]
[null,{"$f":"IF('18-07-2019'!B151=\"\",\"\",'18-07-2019'!B151)","v":""},{"$f":"IF('18-07-2019'!C151=\"\",\"\",'18-07-2019'!C151)","v":""},{"$f":"IF('18-07-2019'!D151=\"\",\"\",'18-07-2019'!D151)","v":""},{"$f":"IF('18-07-2019'!E151=\"\",\"\",'18-07-2019'!E151)","v":""},{"$f":"IF('18-07-2019'!F151=\"\",\"\",'18-07-2019'!F151)","v":""}]
[null,{"$f":"IF('18-07-2019'!B152=\"\",\"\",'18-07-2019'!B152)","v":""},{"$f":"IF('18-07-2019'!C152=\"\",\"\",'18-07-2019'!C152)","v":""},{"$f":"IF('18-07-2019'!D152=\"\",\"\",'18-07-2019'!D152)","v":""},{"$f":"IF('18-07-2019'!E152=\"\",\"\",'18-07-2019'!E152)","v":""},{"$f":"IF('18-07-2019'!F152=\"\",\"\",'18-07-2019'!F152)","v":""}]
[null,{"$f":"IF('18-07-2019'!B153=\"\",\"\",'18-07-2019'!B153)","v":""},{"$f":"IF('18-07-2019'!C153=\"\",\"\",'18-07-2019'!C153)","v":""},{"$f":"IF('18-07-2019'!D153=\"\",\"\",'18-07-2019'!D153)","v":""},{"$f":"IF('18-07-2019'!E153=\"\",\"\",'18-07-2019'!E153)","v":""},{"$f":"IF('18-07-2019'!F153=\"\",\"\",'18-07-2019'!F153)","v":""}]
[null,{"$f":"IF('18-07-2019'!B154=\"\",\"\",'18-07-2019'!B154)","v":""},{"$f":"IF('18-07-2019'!C154=\"\",\"\",'18-07-2019'!C154)","v":""},{"$f":"IF('18-07-2019'!D154=\"\",\"\",'18-07-2019'!D154)","v":""},{"$f":"IF('18-07-2019'!E154=\"\",\"\",'18-07-2019'!E154)","v":""},{"$f":"IF('18-07-2019'!F154=\"\",\"\",'18-07-2019'!F154)","v":""}]
[null,{"$f":"IF('18-07-2019'!B155=\"\",\"\",'18-07-2019'!B155)","v":""},{"$f":"IF('18-07-2019'!C155=\"\",\"\",'18-07-2019'!C155)","v":""},{"$f":"IF('18-07-2019'!D155=\"\",\"\",'18-07-2019'!D155)","v":""},{"$f":"IF('18-07-2019'!E155=\"\",\"\",'18-07-2019'!E155)","v":""},{"$f":"IF('18-07-2019'!F155=\"\",\"\",'18-07-2019'!F155)","v":""}]
[null,{"$f":"IF('18-07-2019'!B156=\"\",\"\",'18-07-2019'!B156)","v":""},{"$f":"IF('18-07-2019'!C156=\"\",\"\",'18-07-2019'!C156)","v":""},{"$f":"IF('18-07-2019'!D156=\"\",\"\",'18-07-2019'!D156)","v":""},{"$f":"IF('18-07-2019'!E156=\"\",\"\",'18-07-2019'!E156)","v":""},{"$f":"IF('18-07-2019'!F156=\"\",\"\",'18-07-2019'!F156)","v":""}]
[null,{"$f":"IF('18-07-2019'!B157=\"\",\"\",'18-07-2019'!B157)","v":""},{"$f":"IF('18-07-2019'!C157=\"\",\"\",'18-07-2019'!C157)","v":""},{"$f":"IF('18-07-2019'!D157=\"\",\"\",'18-07-2019'!D157)","v":""},{"$f":"IF('18-07-2019'!E157=\"\",\"\",'18-07-2019'!E157)","v":""},{"$f":"IF('18-07-2019'!F157=\"\",\"\",'18-07-2019'!F157)","v":""}]
[null,{"$f":"IF('18-07-2019'!B158=\"\",\"\",'18-07-2019'!B158)","v":""},{"$f":"IF('18-07-2019'!C158=\"\",\"\",'18-07-2019'!C158)","v":""},{"$f":"IF('18-07-2019'!D158=\"\",\"\",'18-07-2019'!D158)","v":""},{"$f":"IF('18-07-2019'!E158=\"\",\"\",'18-07-2019'!E158)","v":""},{"$f":"IF('18-07-2019'!F158=\"\",\"\",'18-07-2019'!F158)","v":""}]
[null,{"$f":"IF('18-07-2019'!B159=\"\",\"\",'18-07-2019'!B159)","v":""},{"$f":"IF('18-07-2019'!C159=\"\",\"\",'18-07-2019'!C159)","v":""},{"$f":"IF('18-07-2019'!D159=\"\",\"\",'18-07-2019'!D159)","v":""},{"$f":"IF('18-07-2019'!E159=\"\",\"\",'18-07-2019'!E159)","v":""},{"$f":"IF('18-07-2019'!F159=\"\",\"\",'18-07-2019'!F159)","v":""}]
[null,{"$f":"IF('18-07-2019'!B160=\"\",\"\",'18-07-2019'!B160)","v":""},{"$f":"IF('18-07-2019'!C160=\"\",\"\",'18-07-2019'!C160)","v":""},{"$f":"IF('18-07-2019'!D160=\"\",\"\",'18-07-2019'!D160)","v":""},{"$f":"IF('18-07-2019'!E160=\"\",\"\",'18-07-2019'!E160)","v":""},{"$f":"IF('18-07-2019'!F160=\"\",\"\",'18-07-2019'!F160)","v":""}]
[null,{"$f":"IF('18-07-2019'!B161=\"\",\"\",'18-07-2019'!B161)","v":""},{"$f":"IF('18-07-2019'!C161=\"\",\"\",'18-07-2019'!C161)","v":""},{"$f":"IF('18-07-2019'!D161=\"\",\"\",'18-07-2019'!D161)","v":""},{"$f":"IF('18-07-2019'!E161=\"\",\"\",'18-07-2019'!E161)","v":""},{"$f":"IF('18-07-2019'!F161=\"\",\"\",'18-07-2019'!F161)","v":""}]
[null,{"$f":"IF('18-07-2019'!B162=\"\",\"\",'18-07-2019'!B162)","v":""},{"$f":"IF('18-07-2019'!C162=\"\",\"\",'18-07-2019'!C162)","v":""},{"$f":"IF('18-07-2019'!D162=\"\",\"\",'18-07-2019'!D162)","v":""},{"$f":"IF('18-07-2019'!E162=\"\",\"\",'18-07-2019'!E162)","v":""},{"$f":"IF('18-07-2019'!F162=\"\",\"\",'18-07-2019'!F162)","v":""}]
[null,{"$f":"IF('18-07-2019'!B163=\"\",\"\",'18-07-2019'!B163)","v":""},{"$f":"IF('18-07-2019'!C163=\"\",\"\",'18-07-2019'!C163)","v":""},{"$f":"IF('18-07-2019'!D163=\"\",\"\",'18-07-2019'!D163)","v":""},{"$f":"IF('18-07-2019'!E163=\"\",\"\",'18-07-2019'!E163)","v":""},{"$f":"IF('18-07-2019'!F163=\"\",\"\",'18-07-2019'!F163)","v":""}]
[null,{"$f":"IF('18-07-2019'!B164=\"\",\"\",'18-07-2019'!B164)","v":""},{"$f":"IF('18-07-2019'!C164=\"\",\"\",'18-07-2019'!C164)","v":""},{"$f":"IF('18-07-2019'!D164=\"\",\"\",'18-07-2019'!D164)","v":""},{"$f":"IF('18-07-2019'!E164=\"\",\"\",'18-07-2019'!E164)","v":""},{"$f":"IF('18-07-2019'!F164=\"\",\"\",'18-07-2019'!F164)","v":""}]
[null,{"$f":"IF('18-07-2019'!B165=\"\",\"\",'18-07-2019'!B165)","v":""},{"$f":"IF('18-07-2019'!C165=\"\",\"\",'18-07-2019'!C165)","v":""},{"$f":"IF('18-07-2019'!D165=\"\",\"\",'18-07-2019'!D165)","v":""},{"$f":"IF('18-07-2019'!E165=\"\",\"\",'18-07-2019'!E165)","v":""},{"$f":"IF('18-07-2019'!F165=\"\",\"\",'18-07-2019'!F165)","v":""}]
[null,{"$f":"IF('18-07-2019'!B166=\"\",\"\",'18-07-2019'!B166)","v":""},{"$f":"IF('18-07-2019'!C166=\"\",\"\",'18-07-2019'!C166)","v":""},{"$f":"IF('18-07-2019'!D166=\"\",\"\",'18-07-2019'!D166)","v":""},{"$f":"IF('18-07-2019'!E166=\"\",\"\",'18-07-2019'!E166)","v":""},{"$f":"IF('18-07-2019'!F166=\"\",\"\",'18-07-2019'!F166)","v":""}]
[null,{"$f":"IF('18-07-2019'!B167=\"\",\"\",'18-07-2019'!B167)","v":""},{"$f":"IF('18-07-2019'!C167=\"\",\"\",'18-07-2019'!C167)","v":""},{"$f":"IF('18-07-2019'!D167=\"\",\"\",'18-07-2019'!D167)","v":""},{"$f":"IF('18-07-2019'!E167=\"\",\"\",'18-07-2019'!E167)","v":""},{"$f":"IF('18-07-2019'!F167=\"\",\"\",'18-07-2019'!F167)","v":""}]
[null,{"$f":"IF('18-07-2019'!B168=\"\",\"\",'18-07-2019'!B168)","v":""},{"$f":"IF('18-07-2019'!C168=\"\",\"\",'18-07-2019'!C168)","v":""},{"$f":"IF('18-07-2019'!D168=\"\",\"\",'18-07-2019'!D168)","v":""},{"$f":"IF('18-07-2019'!E168=\"\",\"\",'18-07-2019'!E168)","v":""},{"$f":"IF('18-07-2019'!F168=\"\",\"\",'18-07-2019'!F168)","v":""}]
[null,{"$f":"IF('18-07-2019'!B169=\"\",\"\",'18-07-2019'!B169)","v":""},{"$f":"IF('18-07-2019'!C169=\"\",\"\",'18-07-2019'!C169)","v":""},{"$f":"IF('18-07-2019'!D169=\"\",\"\",'18-07-2019'!D169)","v":""},{"$f":"IF('18-07-2019'!E169=\"\",\"\",'18-07-2019'!E169)","v":""},{"$f":"IF('18-07-2019'!F169=\"\",\"\",'18-07-2019'!F169)","v":""}]
[null,{"$f":"IF('18-07-2019'!B170=\"\",\"\",'18-07-2019'!B170)","v":""},{"$f":"IF('18-07-2019'!C170=\"\",\"\",'18-07-2019'!C170)","v":""},{"$f":"IF('18-07-2019'!D170=\"\",\"\",'18-07-2019'!D170)","v":""},{"$f":"IF('18-07-2019'!E170=\"\",\"\",'18-07-2019'!E170)","v":""},{"$f":"IF('18-07-2019'!F170=\"\",\"\",'18-07-2019'!F170)","v":""}]
[null,{"$f":"IF('18-07-2019'!B171=\"\",\"\",'18-07-2019'!B171)","v":""},{"$f":"IF('18-07-2019'!C171=\"\",\"\",'18-07-2019'!C171)","v":""},{"$f":"IF('18-07-2019'!D171=\"\",\"\",'18-07-2019'!D171)","v":""},{"$f":"IF('18-07-2019'!E171=\"\",\"\",'18-07-2019'!E171)","v":""},{"$f":"IF('18-07-2019'!F171=\"\",\"\",'18-07-2019'!F171)","v":""}]
[null,{"$f":"IF('18-07-2019'!B172=\"\",\"\",'18-07-2019'!B172)","v":""},{"$f":"IF('18-07-2019'!C172=\"\",\"\",'18-07-2019'!C172)","v":""},{"$f":"IF('18-07-2019'!D172=\"\",\"\",'18-07-2019'!D172)","v":""},{"$f":"IF('18-07-2019'!E172=\"\",\"\",'18-07-2019'!E172)","v":""},{"$f":"IF('18-07-2019'!F172=\"\",\"\",'18-07-2019'!F172)","v":""}]
[null,{"$f":"IF('18-07-2019'!B173=\"\",\"\",'18-07-2019'!B173)","v":""},{"$f":"IF('18-07-2019'!C173=\"\",\"\",'18-07-2019'!C173)","v":""},{"$f":"IF('18-07-2019'!D173=\"\",\"\",'18-07-2019'!D173)","v":""},{"$f":"IF('18-07-2019'!E173=\"\",\"\",'18-07-2019'!E173)","v":""},{"$f":"IF('18-07-2019'!F173=\"\",\"\",'18-07-2019'!F173)","v":""}]
[null,{"$f":"IF('18-07-2019'!B174=\"\",\"\",'18-07-2019'!B174)","v":""},{"$f":"IF('18-07-2019'!C174=\"\",\"\",'18-07-2019'!C174)","v":""},{"$f":"IF('18-07-2019'!D174=\"\",\"\",'18-07-2019'!D174)","v":""},{"$f":"IF('18-07-2019'!E174=\"\",\"\",'18-07-2019'!E174)","v":""},{"$f":"IF('18-07-2019'!F174=\"\",\"\",'18-07-2019'!F174)","v":""}]
[null,{"$f":"IF('18-07-2019'!B175=\"\",\"\",'18-07-2019'!B175)","v":""},{"$f":"IF('18-07-2019'!C175=\"\",\"\",'18-07-2019'!C175)","v":""},{"$f":"IF('18-07-2019'!D175=\"\",\"\",'18-07-2019'!D175)","v":""},{"$f":"IF('18-07-2019'!E175=\"\",\"\",'18-07-2019'!E175)","v":""},{"$f":"IF('18-07-2019'!F175=\"\",\"\",'18-07-2019'!F175)","v":""}]
[null,{"$f":"IF('18-07-2019'!B176=\"\",\"\",'18-07-2019'!B176)","v":""},{"$f":"IF('18-07-2019'!C176=\"\",\"\",'18-07-2019'!C176)","v":""},{"$f":"IF('18-07-2019'!D176=\"\",\"\",'18-07-2019'!D176)","v":""},{"$f":"IF('18-07-2019'!E176=\"\",\"\",'18-07-2019'!E176)","v":""},{"$f":"IF('18-07-2019'!F176=\"\",\"\",'18-07-2019'!F176)","v":""}]
[null,{"$f":"IF('18-07-2019'!B177=\"\",\"\",'18-07-2019'!B177)","v":""},{"$f":"IF('18-07-2019'!C177=\"\",\"\",'18-07-2019'!C177)","v":""},{"$f":"IF('18-07-2019'!D177=\"\",\"\",'18-07-2019'!D177)","v":""},{"$f":"IF('18-07-2019'!E177=\"\",\"\",'18-07-2019'!E177)","v":""},{"$f":"IF('18-07-2019'!F177=\"\",\"\",'18-07-2019'!F177)","v":""}]
[null,{"$f":"IF('18-07-2019'!B178=\"\",\"\",'18-07-2019'!B178)","v":""},{"$f":"IF('18-07-2019'!C178=\"\",\"\",'18-07-2019'!C178)","v":""},{"$f":"IF('18-07-2019'!D178=\"\",\"\",'18-07-2019'!D178)","v":""},{"$f":"IF('18-07-2019'!E178=\"\",\"\",'18-07-2019'!E178)","v":""},{"$f":"IF('18-07-2019'!F178=\"\",\"\",'18-07-2019'!F178)","v":""}]
[null,{"$f":"IF('18-07-2019'!B179=\"\",\"\",'18-07-2019'!B179)","v":""},{"$f":"IF('18-07-2019'!C179=\"\",\"\",'18-07-2019'!C179)","v":""},{"$f":"IF('18-07-2019'!D179=\"\",\"\",'18-07-2019'!D179)","v":""},{"$f":"IF('18-07-2019'!E179=\"\",\"\",'18-07-2019'!E179)","v":""},{"$f":"IF('18-07-2019'!F179=\"\",\"\",'18-07-2019'!F179)","v":""}]
[null,{"$f":"IF('18-07-2019'!B180=\"\",\"\",'18-07-2019'!B180)","v":""},{"$f":"IF('18-07-2019'!C180=\"\",\"\",'18-07-2019'!C180)","v":""},{"$f":"IF('18-07-2019'!D180=\"\",\"\",'18-07-2019'!D180)","v":""},{"$f":"IF('18-07-2019'!E180=\"\",\"\",'18-07-2019'!E180)","v":""},{"$f":"IF('18-07-2019'!F180=\"\",\"\",'18-07-2019'!F180)","v":""}]
[null,{"$f":"IF('18-07-2019'!B181=\"\",\"\",'18-07-2019'!B181)","v":""},{"$f":"IF('18-07-2019'!C181=\"\",\"\",'18-07-2019'!C181)","v":""},{"$f":"IF('18-07-2019'!D181=\"\",\"\",'18-07-2019'!D181)","v":""},{"$f":"IF('18-07-2019'!E181=\"\",\"\",'18-07-2019'!E181)","v":""},{"$f":"IF('18-07-2019'!F181=\"\",\"\",'18-07-2019'!F181)","v":""}]
[null,{"$f":"IF('18-07-2019'!B182=\"\",\"\",'18-07-2019'!B182)","v":""},{"$f":"IF('18-07-2019'!C182=\"\",\"\",'18-07-2019'!C182)","v":""},{"$f":"IF('18-07-2019'!D182=\"\",\"\",'18-07-2019'!D182)","v":""},{"$f":"IF('18-07-2019'!E182=\"\",\"\",'18-07-2019'!E182)","v":""},{"$f":"IF('18-07-2019'!F182=\"\",\"\",'18-07-2019'!F182)","v":""}]
[null,{"$f":"IF('18-07-2019'!B183=\"\",\"\",'18-07-2019'!B183)","v":""},{"$f":"IF('18-07-2019'!C183=\"\",\"\",'18-07-2019'!C183)","v":""},{"$f":"IF('18-07-2019'!D183=\"\",\"\",'18-07-2019'!D183)","v":""},{"$f":"IF('18-07-2019'!E183=\"\",\"\",'18-07-2019'!E183)","v":""},{"$f":"IF('18-07-2019'!F183=\"\",\"\",'18-07-2019'!F183)","v":""}]
[null,{"$f":"IF('18-07-2019'!B184=\"\",\"\",'18-07-2019'!B184)","v":""},{"$f":"IF('18-07-2019'!C184=\"\",\"\",'18-07-2019'!C184)","v":""},{"$f":"IF('18-07-2019'!D184=\"\",\"\",'18-07-2019'!D184)","v":""},{"$f":"IF('18-07-2019'!E184=\"\",\"\",'18-07-2019'!E184)","v":""},{"$f":"IF('18-07-2019'!F184=\"\",\"\",'18-07-2019'!F184)","v":""}]
[null,{"$f":"IF('18-07-2019'!B185=\"\",\"\",'18-07-2019'!B185)","v":""},{"$f":"IF('18-07-2019'!C185=\"\",\"\",'18-07-2019'!C185)","v":""},{"$f":"IF('18-07-2019'!D185=\"\",\"\",'18-07-2019'!D185)","v":""},{"$f":"IF('18-07-2019'!E185=\"\",\"\",'18-07-2019'!E185)","v":""},{"$f":"IF('18-07-2019'!F185=\"\",\"\",'18-07-2019'!F185)","v":""}]
[null,{"$f":"IF('18-07-2019'!B186=\"\",\"\",'18-07-2019'!B186)","v":""},{"$f":"IF('18-07-2019'!C186=\"\",\"\",'18-07-2019'!C186)","v":""},{"$f":"IF('18-07-2019'!D186=\"\",\"\",'18-07-2019'!D186)","v":""},{"$f":"IF('18-07-2019'!E186=\"\",\"\",'18-07-2019'!E186)","v":""},{"$f":"IF('18-07-2019'!F186=\"\",\"\",'18-07-2019'!F186)","v":""}]
[null,{"$f":"IF('18-07-2019'!B187=\"\",\"\",'18-07-2019'!B187)","v":""},{"$f":"IF('18-07-2019'!C187=\"\",\"\",'18-07-2019'!C187)","v":""},{"$f":"IF('18-07-2019'!D187=\"\",\"\",'18-07-2019'!D187)","v":""},{"$f":"IF('18-07-2019'!E187=\"\",\"\",'18-07-2019'!E187)","v":""},{"$f":"IF('18-07-2019'!F187=\"\",\"\",'18-07-2019'!F187)","v":""}]
[null,{"$f":"IF('18-07-2019'!B188=\"\",\"\",'18-07-2019'!B188)","v":""},{"$f":"IF('18-07-2019'!C188=\"\",\"\",'18-07-2019'!C188)","v":""},{"$f":"IF('18-07-2019'!D188=\"\",\"\",'18-07-2019'!D188)","v":""},{"$f":"IF('18-07-2019'!E188=\"\",\"\",'18-07-2019'!E188)","v":""},{"$f":"IF('18-07-2019'!F188=\"\",\"\",'18-07-2019'!F188)","v":""}]
[null,{"$f":"IF('18-07-2019'!B189=\"\",\"\",'18-07-2019'!B189)","v":""},{"$f":"IF('18-07-2019'!C189=\"\",\"\",'18-07-2019'!C189)","v":""},{"$f":"IF('18-07-2019'!D189=\"\",\"\",'18-07-2019'!D189)","v":""},{"$f":"IF('18-07-2019'!E189=\"\",\"\",'18-07-2019'!E189)","v":""},{"$f":"IF('18-07-2019'!F189=\"\",\"\",'18-07-2019'!F189)","v":""}]
[null,{"$f":"IF('18-07-2019'!B190=\"\",\"\",'18-07-2019'!B190)","v":""},{"$f":"IF('18-07-2019'!C190=\"\",\"\",'18-07-2019'!C190)","v":""},{"$f":"IF('18-07-2019'!D190=\"\",\"\",'18-07-2019'!D190)","v":""},{"$f":"IF('18-07-2019'!E190=\"\",\"\",'18-07-2019'!E190)","v":""},{"$f":"IF('18-07-2019'!F190=\"\",\"\",'18-07-2019'!F190)","v":""}]
[null,{"$f":"IF('18-07-2019'!B191=\"\",\"\",'18-07-2019'!B191)","v":""},{"$f":"IF('18-07-2019'!C191=\"\",\"\",'18-07-2019'!C191)","v":""},{"$f":"IF('18-07-2019'!D191=\"\",\"\",'18-07-2019'!D191)","v":""},{"$f":"IF('18-07-2019'!E191=\"\",\"\",'18-07-2019'!E191)","v":""},{"$f":"IF('18-07-2019'!F191=\"\",\"\",'18-07-2019'!F191)","v":""}]
[null,{"$f":"IF('18-07-2019'!B192=\"\",\"\",'18-07-2019'!B192)","v":""},{"$f":"IF('18-07-2019'!C192=\"\",\"\",'18-07-2019'!C192)","v":""},{"$f":"IF('18-07-2019'!D192=\"\",\"\",'18-07-2019'!D192)","v":""},{"$f":"IF('18-07-2019'!E192=\"\",\"\",'18-07-2019'!E192)","v":""},{"$f":"IF('18-07-2019'!F192=\"\",\"\",'18-07-2019'!F192)","v":""}]
[null,{"$f":"IF('18-07-2019'!B193=\"\",\"\",'18-07-2019'!B193)","v":""},{"$f":"IF('18-07-2019'!C193=\"\",\"\",'18-07-2019'!C193)","v":""},{"$f":"IF('18-07-2019'!D193=\"\",\"\",'18-07-2019'!D193)","v":""},{"$f":"IF('18-07-2019'!E193=\"\",\"\",'18-07-2019'!E193)","v":""},{"$f":"IF('18-07-2019'!F193=\"\",\"\",'18-07-2019'!F193)","v":""}]
[null,{"$f":"IF('18-07-2019'!B194=\"\",\"\",'18-07-2019'!B194)","v":""},{"$f":"IF('18-07-2019'!C194=\"\",\"\",'18-07-2019'!C194)","v":""},{"$f":"IF('18-07-2019'!D194=\"\",\"\",'18-07-2019'!D194)","v":""},{"$f":"IF('18-07-2019'!E194=\"\",\"\",'18-07-2019'!E194)","v":""},{"$f":"IF('18-07-2019'!F194=\"\",\"\",'18-07-2019'!F194)","v":""}]
[null,{"$f":"IF('18-07-2019'!B195=\"\",\"\",'18-07-2019'!B195)","v":""},{"$f":"IF('18-07-2019'!C195=\"\",\"\",'18-07-2019'!C195)","v":""},{"$f":"IF('18-07-2019'!D195=\"\",\"\",'18-07-2019'!D195)","v":""},{"$f":"IF('18-07-2019'!E195=\"\",\"\",'18-07-2019'!E195)","v":""},{"$f":"IF('18-07-2019'!F195=\"\",\"\",'18-07-2019'!F195)","v":""}]
[null,{"$f":"IF('18-07-2019'!B196=\"\",\"\",'18-07-2019'!B196)","v":""},{"$f":"IF('18-07-2019'!C196=\"\",\"\",'18-07-2019'!C196)","v":""},{"$f":"IF('18-07-2019'!D196=\"\",\"\",'18-07-2019'!D196)","v":""},{"$f":"IF('18-07-2019'!E196=\"\",\"\",'18-07-2019'!E196)","v":""},{"$f":"IF('18-07-2019'!F196=\"\",\"\",'18-07-2019'!F196)","v":""}]
[null,{"$f":"IF('18-07-2019'!B197=\"\",\"\",'18-07-2019'!B197)","v":""},{"$f":"IF('18-07-2019'!C197=\"\",\"\",'18-07-2019'!C197)","v":""},{"$f":"IF('18-07-2019'!D197=\"\",\"\",'18-07-2019'!D197)","v":""},{"$f":"IF('18-07-2019'!E197=\"\",\"\",'18-07-2019'!E197)","v":""},{"$f":"IF('18-07-2019'!F197=\"\",\"\",'18-07-2019'!F197)","v":""}]
[null,{"$f":"IF('18-07-2019'!B198=\"\",\"\",'18-07-2019'!B198)","v":""},{"$f":"IF('18-07-2019'!C198=\"\",\"\",'18-07-2019'!C198)","v":""},{"$f":"IF('18-07-2019'!D198=\"\",\"\",'18-07-2019'!D198)","v":""},{"$f":"IF('18-07-2019'!E198=\"\",\"\",'18-07-2019'!E198)","v":""},{"$f":"IF('18-07-2019'!F198=\"\",\"\",'18-07-2019'!F198)","v":""}]
[null,{"$f":"IF('18-07-2019'!B199=\"\",\"\",'18-07-2019'!B199)","v":""},{"$f":"IF('18-07-2019'!C199=\"\",\"\",'18-07-2019'!C199)","v":""},{"$f":"IF('18-07-2019'!D199=\"\",\"\",'18-07-2019'!D199)","v":""},{"$f":"IF('18-07-2019'!E199=\"\",\"\",'18-07-2019'!E199)","v":""},{"$f":"IF('18-07-2019'!F199=\"\",\"\",'18-07-2019'!F199)","v":""}]
[null,{"$f":"IF('18-07-2019'!B200=\"\",\"\",'18-07-2019'!B200)","v":""},{"$f":"IF('18-07-2019'!C200=\"\",\"\",'18-07-2019'!C200)","v":""},{"$f":"IF('18-07-2019'!D200=\"\",\"\",'18-07-2019'!D200)","v":""},{"$f":"IF('18-07-2019'!E200=\"\",\"\",'18-07-2019'!E200)","v":""},{"$f":"IF('18-07-2019'!F200=\"\",\"\",'18-07-2019'!F200)","v":""}]
[null,{"$f":"IF('18-07-2019'!B201=\"\",\"\",'18-07-2019'!B201)","v":""},{"$f":"IF('18-07-2019'!C201=\"\",\"\",'18-07-2019'!C201)","v":""},{"$f":"IF('18-07-2019'!D201=\"\",\"\",'18-07-2019'!D201)","v":""},{"$f":"IF('18-07-2019'!E201=\"\",\"\",'18-07-2019'!E201)","v":""},{"$f":"IF('18-07-2019'!F201=\"\",\"\",'18-07-2019'!F201)","v":""}]
[null,{"$f":"IF('18-07-2019'!B202=\"\",\"\",'18-07-2019'!B202)","v":""},{"$f":"IF('18-07-2019'!C202=\"\",\"\",'18-07-2019'!C202)","v":""},{"$f":"IF('18-07-2019'!D202=\"\",\"\",'18-07-2019'!D202)","v":""},{"$f":"IF('18-07-2019'!E202=\"\",\"\",'18-07-2019'!E202)","v":""},{"$f":"IF('18-07-2019'!F202=\"\",\"\",'18-07-2019'!F202)","v":""}]
[null,{"$f":"IF('18-07-2019'!B203=\"\",\"\",'18-07-2019'!B203)","v":""},{"$f":"IF('18-07-2019'!C203=\"\",\"\",'18-07-2019'!C203)","v":""},{"$f":"IF('18-07-2019'!D203=\"\",\"\",'18-07-2019'!D203)","v":""},{"$f":"IF('18-07-2019'!E203=\"\",\"\",'18-07-2019'!E203)","v":""},{"$f":"IF('18-07-2019'!F203=\"\",\"\",'18-07-2019'!F203)","v":""}]
[null,{"$f":"IF('18-07-2019'!B204=\"\",\"\",'18-07-2019'!B204)","v":""},{"$f":"IF('18-07-2019'!C204=\"\",\"\",'18-07-2019'!C204)","v":""},{"$f":"IF('18-07-2019'!D204=\"\",\"\",'18-07-2019'!D204)","v":""},{"$f":"IF('18-07-2019'!E204=\"\",\"\",'18-07-2019'!E204)","v":""},{"$f":"IF('18-07-2019'!F204=\"\",\"\",'18-07-2019'!F204)","v":""}]
[null,{"$f":"IF('18-07-2019'!B205=\"\",\"\",'18-07-2019'!B205)","v":""},{"$f":"IF('18-07-2019'!C205=\"\",\"\",'18-07-2019'!C205)","v":""},{"$f":"IF('18-07-2019'!D205=\"\",\"\",'18-07-2019'!D205)","v":""},{"$f":"IF('18-07-2019'!E205=\"\",\"\",'18-07-2019'!E205)","v":""},{"$f":"IF('18-07-2019'!F205=\"\",\"\",'18-07-2019'!F205)","v":""}]
[null,{"$f":"IF('18-07-2019'!B206=\"\",\"\",'18-07-2019'!B206)","v":""},{"$f":"IF('18-07-2019'!C206=\"\",\"\",'18-07-2019'!C206)","v":""},{"$f":"IF('18-07-2019'!D206=\"\",\"\",'18-07-2019'!D206)","v":""},{"$f":"IF('18-07-2019'!E206=\"\",\"\",'18-07-2019'!E206)","v":""},{"$f":"IF('18-07-2019'!F206=\"\",\"\",'18-07-2019'!F206)","v":""}]
[null,{"$f":"IF('18-07-2019'!B207=\"\",\"\",'18-07-2019'!B207)","v":""},{"$f":"IF('18-07-2019'!C207=\"\",\"\",'18-07-2019'!C207)","v":""},{"$f":"IF('18-07-2019'!D207=\"\",\"\",'18-07-2019'!D207)","v":""},{"$f":"IF('18-07-2019'!E207=\"\",\"\",'18-07-2019'!E207)","v":""},{"$f":"IF('18-07-2019'!F207=\"\",\"\",'18-07-2019'!F207)","v":""}]
[null,{"$f":"IF('18-07-2019'!B208=\"\",\"\",'18-07-2019'!B208)","v":""},{"$f":"IF('18-07-2019'!C208=\"\",\"\",'18-07-2019'!C208)","v":""},{"$f":"IF('18-07-2019'!D208=\"\",\"\",'18-07-2019'!D208)","v":""},{"$f":"IF('18-07-2019'!E208=\"\",\"\",'18-07-2019'!E208)","v":""},{"$f":"IF('18-07-2019'!F208=\"\",\"\",'18-07-2019'!F208)","v":""}]
[null,{"$f":"IF('18-07-2019'!B209=\"\",\"\",'18-07-2019'!B209)","v":""},{"$f":"IF('18-07-2019'!C209=\"\",\"\",'18-07-2019'!C209)","v":""},{"$f":"IF('18-07-2019'!D209=\"\",\"\",'18-07-2019'!D209)","v":""},{"$f":"IF('18-07-2019'!E209=\"\",\"\",'18-07-2019'!E209)","v":""},{"$f":"IF('18-07-2019'!F209=\"\",\"\",'18-07-2019'!F209)","v":""}]
[null,{"$f":"IF('18-07-2019'!B210=\"\",\"\",'18-07-2019'!B210)","v":""},{"$f":"IF('18-07-2019'!C210=\"\",\"\",'18-07-2019'!C210)","v":""},{"$f":"IF('18-07-2019'!D210=\"\",\"\",'18-07-2019'!D210)","v":""},{"$f":"IF('18-07-2019'!E210=\"\",\"\",'18-07-2019'!E210)","v":""},{"$f":"IF('18-07-2019'!F210=\"\",\"\",'18-07-2019'!F210)","v":""}]
[null,{"$f":"IF('18-07-2019'!B211=\"\",\"\",'18-07-2019'!B211)","v":""},{"$f":"IF('18-07-2019'!C211=\"\",\"\",'18-07-2019'!C211)","v":""},{"$f":"IF('18-07-2019'!D211=\"\",\"\",'18-07-2019'!D211)","v":""},{"$f":"IF('18-07-2019'!E211=\"\",\"\",'18-07-2019'!E211)","v":""},{"$f":"IF('18-07-2019'!F211=\"\",\"\",'18-07-2019'!F211)","v":""}]
[null,{"$f":"IF('18-07-2019'!B212=\"\",\"\",'18-07-2019'!B212)","v":""},{"$f":"IF('18-07-2019'!C212=\"\",\"\",'18-07-2019'!C212)","v":""},{"$f":"IF('18-07-2019'!D212=\"\",\"\",'18-07-2019'!D212)","v":""},{"$f":"IF('18-07-2019'!E212=\"\",\"\",'18-07-2019'!E212)","v":""},{"$f":"IF('18-07-2019'!F212=\"\",\"\",'18-07-2019'!F212)","v":""}]
[null,{"$f":"IF('18-07-2019'!B213=\"\",\"\",'18-07-2019'!B213)","v":""},{"$f":"IF('18-07-2019'!C213=\"\",\"\",'18-07-2019'!C213)","v":""},{"$f":"IF('18-07-2019'!D213=\"\",\"\",'18-07-2019'!D213)","v":""},{"$f":"IF('18-07-2019'!E213=\"\",\"\",'18-07-2019'!E213)","v":""},{"$f":"IF('18-07-2019'!F213=\"\",\"\",'18-07-2019'!F213)","v":""}]
[null,{"$f":"IF('18-07-2019'!B214=\"\",\"\",'18-07-2019'!B214)","v":""},{"$f":"IF('18-07-2019'!C214=\"\",\"\",'18-07-2019'!C214)","v":""},{"$f":"IF('18-07-2019'!D214=\"\",\"\",'18-07-2019'!D214)","v":""},{"$f":"IF('18-07-2019'!E214=\"\",\"\",'18-07-2019'!E214)","v":""},{"$f":"IF('18-07-2019'!F214=\"\",\"\",'18-07-2019'!F214)","v":""}]
[null,{"$f":"IF('18-07-2019'!B215=\"\",\"\",'18-07-2019'!B215)","v":""},{"$f":"IF('18-07-2019'!C215=\"\",\"\",'18-07-2019'!C215)","v":""},{"$f":"IF('18-07-2019'!D215=\"\",\"\",'18-07-2019'!D215)","v":""},{"$f":"IF('18-07-2019'!E215=\"\",\"\",'18-07-2019'!E215)","v":""},{"$f":"IF('18-07-2019'!F215=\"\",\"\",'18-07-2019'!F215)","v":""}]
[null,{"$f":"IF('18-07-2019'!B216=\"\",\"\",'18-07-2019'!B216)","v":""},{"$f":"IF('18-07-2019'!C216=\"\",\"\",'18-07-2019'!C216)","v":""},{"$f":"IF('18-07-2019'!D216=\"\",\"\",'18-07-2019'!D216)","v":""},{"$f":"IF('18-07-2019'!E216=\"\",\"\",'18-07-2019'!E216)","v":""},{"$f":"IF('18-07-2019'!F216=\"\",\"\",'18-07-2019'!F216)","v":""}]
[null,{"$f":"IF('18-07-2019'!B217=\"\",\"\",'18-07-2019'!B217)","v":""},{"$f":"IF('18-07-2019'!C217=\"\",\"\",'18-07-2019'!C217)","v":""},{"$f":"IF('18-07-2019'!D217=\"\",\"\",'18-07-2019'!D217)","v":""},{"$f":"IF('18-07-2019'!E217=\"\",\"\",'18-07-2019'!E217)","v":""},{"$f":"IF('18-07-2019'!F217=\"\",\"\",'18-07-2019'!F217)","v":""}]
[null,{"$f":"IF('18-07-2019'!B218=\"\",\"\",'18-07-2019'!B218)","v":""},{"$f":"IF('18-07-2019'!C218=\"\",\"\",'18-07-2019'!C218)","v":""},{"$f":"IF('18-07-2019'!D218=\"\",\"\",'18-07-2019'!D218)","v":""},{"$f":"IF('18-07-2019'!E218=\"\",\"\",'18-07-2019'!E218)","v":""},{"$f":"IF('18-07-2019'!F218=\"\",\"\",'18-07-2019'!F218)","v":""}]
[null,{"$f":"IF('18-07-2019'!B219=\"\",\"\",'18-07-2019'!B219)","v":""},{"$f":"IF('18-07-2019'!C219=\"\",\"\",'18-07-2019'!C219)","v":""},{"$f":"IF('18-07-2019'!D219=\"\",\"\",'18-07-2019'!D219)","v":""},{"$f":"IF('18-07-2019'!E219=\"\",\"\",'18-07-2019'!E219)","v":""},{"$f":"IF('18-07-2019'!F219=\"\",\"\",'18-07-2019'!F219)","v":""}]
[null,{"$f":"IF('18-07-2019'!B220=\"\",\"\",'18-07-2019'!B220)","v":""},{"$f":"IF('18-07-2019'!C220=\"\",\"\",'18-07-2019'!C220)","v":""},{"$f":"IF('18-07-2019'!D220=\"\",\"\",'18-07-2019'!D220)","v":""},{"$f":"IF('18-07-2019'!E220=\"\",\"\",'18-07-2019'!E220)","v":""},{"$f":"IF('18-07-2019'!F220=\"\",\"\",'18-07-2019'!F220)","v":""}]
[null,{"$f":"IF('18-07-2019'!B221=\"\",\"\",'18-07-2019'!B221)","v":""},{"$f":"IF('18-07-2019'!C221=\"\",\"\",'18-07-2019'!C221)","v":""},{"$f":"IF('18-07-2019'!D221=\"\",\"\",'18-07-2019'!D221)","v":""},{"$f":"IF('18-07-2019'!E221=\"\",\"\",'18-07-2019'!E221)","v":""},{"$f":"IF('18-07-2019'!F221=\"\",\"\",'18-07-2019'!F221)","v":""}]
[null,{"$f":"IF('18-07-2019'!B222=\"\",\"\",'18-07-2019'!B222)","v":""},{"$f":"IF('18-07-2019'!C222=\"\",\"\",'18-07-2019'!C222)","v":""},{"$f":"IF('18-07-2019'!D222=\"\",\"\",'18-07-2019'!D222)","v":""},{"$f":"IF('18-07-2019'!E222=\"\",\"\",'18-07-2019'!E222)","v":""},{"$f":"IF('18-07-2019'!F222=\"\",\"\",'18-07-2019'!F222)","v":""}]
[null,{"$f":"IF('18-07-2019'!B223=\"\",\"\",'18-07-2019'!B223)","v":""},{"$f":"IF('18-07-2019'!C223=\"\",\"\",'18-07-2019'!C223)","v":""},{"$f":"IF('18-07-2019'!D223=\"\",\"\",'18-07-2019'!D223)","v":""},{"$f":"IF('18-07-2019'!E223=\"\",\"\",'18-07-2019'!E223)","v":""},{"$f":"IF('18-07-2019'!F223=\"\",\"\",'18-07-2019'!F223)","v":""}]
[null,{"$f":"IF('18-07-2019'!B224=\"\",\"\",'18-07-2019'!B224)","v":""},{"$f":"IF('18-07-2019'!C224=\"\",\"\",'18-07-2019'!C224)","v":""},{"$f":"IF('18-07-2019'!D224=\"\",\"\",'18-07-2019'!D224)","v":""},{"$f":"IF('18-07-2019'!E224=\"\",\"\",'18-07-2019'!E224)","v":""},{"$f":"IF('18-07-2019'!F224=\"\",\"\",'18-07-2019'!F224)","v":""}]
[null,{"$f":"IF('18-07-2019'!B225=\"\",\"\",'18-07-2019'!B225)","v":""},{"$f":"IF('18-07-2019'!C225=\"\",\"\",'18-07-2019'!C225)","v":""},{"$f":"IF('18-07-2019'!D225=\"\",\"\",'18-07-2019'!D225)","v":""},{"$f":"IF('18-07-2019'!E225=\"\",\"\",'18-07-2019'!E225)","v":""},{"$f":"IF('18-07-2019'!F225=\"\",\"\",'18-07-2019'!F225)","v":""}]
[null,{"$f":"IF('18-07-2019'!B226=\"\",\"\",'18-07-2019'!B226)","v":""},{"$f":"IF('18-07-2019'!C226=\"\",\"\",'18-07-2019'!C226)","v":""},{"$f":"IF('18-07-2019'!D226=\"\",\"\",'18-07-2019'!D226)","v":""},{"$f":"IF('18-07-2019'!E226=\"\",\"\",'18-07-2019'!E226)","v":""},{"$f":"IF('18-07-2019'!F226=\"\",\"\",'18-07-2019'!F226)","v":""}]
[null,{"$f":"IF('18-07-2019'!B227=\"\",\"\",'18-07-2019'!B227)","v":""},{"$f":"IF('18-07-2019'!C227=\"\",\"\",'18-07-2019'!C227)","v":""},{"$f":"IF('18-07-2019'!D227=\"\",\"\",'18-07-2019'!D227)","v":""},{"$f":"IF('18-07-2019'!E227=\"\",\"\",'18-07-2019'!E227)","v":""},{"$f":"IF('18-07-2019'!F227=\"\",\"\",'18-07-2019'!F227)","v":""}]
[null,{"$f":"IF('18-07-2019'!B228=\"\",\"\",'18-07-2019'!B228)","v":""},{"$f":"IF('18-07-2019'!C228=\"\",\"\",'18-07-2019'!C228)","v":""},{"$f":"IF('18-07-2019'!D228=\"\",\"\",'18-07-2019'!D228)","v":""},{"$f":"IF('18-07-2019'!E228=\"\",\"\",'18-07-2019'!E228)","v":""},{"$f":"IF('18-07-2019'!F228=\"\",\"\",'18-07-2019'!F228)","v":""}]
[null,{"$f":"IF('18-07-2019'!B229=\"\",\"\",'18-07-2019'!B229)","v":""},{"$f":"IF('18-07-2019'!C229=\"\",\"\",'18-07-2019'!C229)","v":""},{"$f":"IF('18-07-2019'!D229=\"\",\"\",'18-07-2019'!D229)","v":""},{"$f":"IF('18-07-2019'!E229=\"\",\"\",'18-07-2019'!E229)","v":""},{"$f":"IF('18-07-2019'!F229=\"\",\"\",'18-07-2019'!F229)","v":""}]
[null,{"$f":"IF('18-07-2019'!B230=\"\",\"\",'18-07-2019'!B230)","v":""},{"$f":"IF('18-07-2019'!C230=\"\",\"\",'18-07-2019'!C230)","v":""},{"$f":"IF('18-07-2019'!D230=\"\",\"\",'18-07-2019'!D230)","v":""},{"$f":"IF('18-07-2019'!E230=\"\",\"\",'18-07-2019'!E230)","v":""},{"$f":"IF('18-07-2019'!F230=\"\",\"\",'18-07-2019'!F230)","v":""}]
[null,{"$f":"IF('18-07-2019'!B231=\"\",\"\",'18-07-2019'!B231)","v":""},{"$f":"IF('18-07-2019'!C231=\"\",\"\",'18-07-2019'!C231)","v":""},{"$f":"IF('18-07-2019'!D231=\"\",\"\",'18-07-2019'!D231)","v":""},{"$f":"IF('18-07-2019'!E231=\"\",\"\",'18-07-2019'!E231)","v":""},{"$f":"IF('18-07-2019'!F231=\"\",\"\",'18-07-2019'!F231)","v":""}]
[null,{"$f":"IF('18-07-2019'!B232=\"\",\"\",'18-07-2019'!B232)","v":""},{"$f":"IF('18-07-2019'!C232=\"\",\"\",'18-07-2019'!C232)","v":""},{"$f":"IF('18-07-2019'!D232=\"\",\"\",'18-07-2019'!D232)","v":""},{"$f":"IF('18-07-2019'!E232=\"\",\"\",'18-07-2019'!E232)","v":""},{"$f":"IF('18-07-2019'!F232=\"\",\"\",'18-07-2019'!F232)","v":""}]
[null,{"$f":"IF('18-07-2019'!B233=\"\",\"\",'18-07-2019'!B233)","v":""},{"$f":"IF('18-07-2019'!C233=\"\",\"\",'18-07-2019'!C233)","v":""},{"$f":"IF('18-07-2019'!D233=\"\",\"\",'18-07-2019'!D233)","v":""},{"$f":"IF('18-07-2019'!E233=\"\",\"\",'18-07-2019'!E233)","v":""},{"$f":"IF('18-07-2019'!F233=\"\",\"\",'18-07-2019'!F233)","v":""}]
[null,{"$f":"IF('18-07-2019'!B234=\"\",\"\",'18-07-2019'!B234)","v":""},{"$f":"IF('18-07-2019'!C234=\"\",\"\",'18-07-2019'!C234)","v":""},{"$f":"IF('18-07-2019'!D234=\"\",\"\",'18-07-2019'!D234)","v":""},{"$f":"IF('18-07-2019'!E234=\"\",\"\",'18-07-2019'!E234)","v":""},{"$f":"IF('18-07-2019'!F234=\"\",\"\",'18-07-2019'!F234)","v":""}]
[null,{"$f":"IF('18-07-2019'!B235=\"\",\"\",'18-07-2019'!B235)","v":""},{"$f":"IF('18-07-2019'!C235=\"\",\"\",'18-07-2019'!C235)","v":""},{"$f":"IF('18-07-2019'!D235=\"\",\"\",'18-07-2019'!D235)","v":""},{"$f":"IF('18-07-2019'!E235=\"\",\"\",'18-07-2019'!E235)","v":""},{"$f":"IF('18-07-2019'!F235=\"\",\"\",'18-07-2019'!F235)","v":""}]
[null,{"$f":"IF('18-07-2019'!B236=\"\",\"\",'18-07-2019'!B236)","v":""},{"$f":"IF('18-07-2019'!C236=\"\",\"\",'18-07-2019'!C236)","v":""},{"$f":"IF('18-07-2019'!D236=\"\",\"\",'18-07-2019'!D236)","v":""},{"$f":"IF('18-07-2019'!E236=\"\",\"\",'18-07-2019'!E236)","v":""},{"$f":"IF('18-07-2019'!F236=\"\",\"\",'18-07-2019'!F236)","v":""}]
[null,{"$f":"IF('18-07-2019'!B237=\"\",\"\",'18-07-2019'!B237)","v":""},{"$f":"IF('18-07-2019'!C237=\"\",\"\",'18-07-2019'!C237)","v":""},{"$f":"IF('18-07-2019'!D237=\"\",\"\",'18-07-2019'!D237)","v":""},{"$f":"IF('18-07-2019'!E237=\"\",\"\",'18-07-2019'!E237)","v":""},{"$f":"IF('18-07-2019'!F237=\"\",\"\",'18-07-2019'!F237)","v":""}]
[null,{"$f":"IF('18-07-2019'!B238=\"\",\"\",'18-07-2019'!B238)","v":""},{"$f":"IF('18-07-2019'!C238=\"\",\"\",'18-07-2019'!C238)","v":""},{"$f":"IF('18-07-2019'!D238=\"\",\"\",'18-07-2019'!D238)","v":""},{"$f":"IF('18-07-2019'!E238=\"\",\"\",'18-07-2019'!E238)","v":""},{"$f":"IF('18-07-2019'!F238=\"\",\"\",'18-07-2019'!F238)","v":""}]
[null,{"$f":"IF('18-07-2019'!B239=\"\",\"\",'18-07-2019'!B239)","v":""},{"$f":"IF('18-07-2019'!C239=\"\",\"\",'18-07-2019'!C239)","v":""},{"$f":"IF('18-07-2019'!D239=\"\",\"\",'18-07-2019'!D239)","v":""},{"$f":"IF('18-07-2019'!E239=\"\",\"\",'18-07-2019'!E239)","v":""},{"$f":"IF('18-07-2019'!F239=\"\",\"\",'18-07-2019'!F239)","v":""}]
[null,{"$f":"IF('18-07-2019'!B240=\"\",\"\",'18-07-2019'!B240)","v":""},{"$f":"IF('18-07-2019'!C240=\"\",\"\",'18-07-2019'!C240)","v":""},{"$f":"IF('18-07-2019'!D240=\"\",\"\",'18-07-2019'!D240)","v":""},{"$f":"IF('18-07-2019'!E240=\"\",\"\",'18-07-2019'!E240)","v":""},{"$f":"IF('18-07-2019'!F240=\"\",\"\",'18-07-2019'!F240)","v":""}]
[null,{"$f":"IF('18-07-2019'!B241=\"\",\"\",'18-07-2019'!B241)","v":""},{"$f":"IF('18-07-2019'!C241=\"\",\"\",'18-07-2019'!C241)","v":""},{"$f":"IF('18-07-2019'!D241=\"\",\"\",'18-07-2019'!D241)","v":""},{"$f":"IF('18-07-2019'!E241=\"\",\"\",'18-07-2019'!E241)","v":""},{"$f":"IF('18-07-2019'!F241=\"\",\"\",'18-07-2019'!F241)","v":""}]
[null,{"$f":"IF('18-07-2019'!B242=\"\",\"\",'18-07-2019'!B242)","v":""},{"$f":"IF('18-07-2019'!C242=\"\",\"\",'18-07-2019'!C242)","v":""},{"$f":"IF('18-07-2019'!D242=\"\",\"\",'18-07-2019'!D242)","v":""},{"$f":"IF('18-07-2019'!E242=\"\",\"\",'18-07-2019'!E242)","v":""},{"$f":"IF('18-07-2019'!F242=\"\",\"\",'18-07-2019'!F242)","v":""}]
[null,{"$f":"IF('18-07-2019'!B243=\"\",\"\",'18-07-2019'!B243)","v":""},{"$f":"IF('18-07-2019'!C243=\"\",\"\",'18-07-2019'!C243)","v":""},{"$f":"IF('18-07-2019'!D243=\"\",\"\",'18-07-2019'!D243)","v":""},{"$f":"IF('18-07-2019'!E243=\"\",\"\",'18-07-2019'!E243)","v":""},{"$f":"IF('18-07-2019'!F243=\"\",\"\",'18-07-2019'!F243)","v":""}]
[null,{"$f":"IF('18-07-2019'!B244=\"\",\"\",'18-07-2019'!B244)","v":""},{"$f":"IF('18-07-2019'!C244=\"\",\"\",'18-07-2019'!C244)","v":""},{"$f":"IF('18-07-2019'!D244=\"\",\"\",'18-07-2019'!D244)","v":""},{"$f":"IF('18-07-2019'!E244=\"\",\"\",'18-07-2019'!E244)","v":""},{"$f":"IF('18-07-2019'!F244=\"\",\"\",'18-07-2019'!F244)","v":""}]
[null,{"$f":"IF('18-07-2019'!B245=\"\",\"\",'18-07-2019'!B245)","v":""},{"$f":"IF('18-07-2019'!C245=\"\",\"\",'18-07-2019'!C245)","v":""},{"$f":"IF('18-07-2019'!D245=\"\",\"\",'18-07-2019'!D245)","v":""},{"$f":"IF('18-07-2019'!E245=\"\",\"\",'18-07-2019'!E245)","v":""},{"$f":"IF('18-07-2019'!F245=\"\",\"\",'18-07-2019'!F245)","v":""}]
[null,{"$f":"IF('18-07-2019'!B246=\"\",\"\",'18-07-2019'!B246)","v":""},{"$f":"IF('18-07-2019'!C246=\"\",\"\",'18-07-2019'!C246)","v":""},{"$f":"IF('18-07-2019'!D246=\"\",\"\",'18-07-2019'!D246)","v":""},{"$f":"IF('18-07-2019'!E246=\"\",\"\",'18-07-2019'!E246)","v":""},{"$f":"IF('18-07-2019'!F246=\"\",\"\",'18-07-2019'!F246)","v":""}]
[null,{"$f":"IF('18-07-2019'!B247=\"\",\"\",'18-07-2019'!B247)","v":""},{"$f":"IF('18-07-2019'!C247=\"\",\"\",'18-07-2019'!C247)","v":""},{"$f":"IF('18-07-2019'!D247=\"\",\"\",'18-07-2019'!D247)","v":""},{"$f":"IF('18-07-2019'!E247=\"\",\"\",'18-07-2019'!E247)","v":""},{"$f":"IF('18-07-2019'!F247=\"\",\"\",'18-07-2019'!F247)","v":""}]
[null,{"$f":"IF('18-07-2019'!B248=\"\",\"\",'18-07-2019'!B248)","v":""},{"$f":"IF('18-07-2019'!C248=\"\",\"\",'18-07-2019'!C248)","v":""},{"$f":"IF('18-07-2019'!D248=\"\",\"\",'18-07-2019'!D248)","v":""},{"$f":"IF('18-07-2019'!E248=\"\",\"\",'18-07-2019'!E248)","v":""},{"$f":"IF('18-07-2019'!F248=\"\",\"\",'18-07-2019'!F248)","v":""}]
[null,{"$f":"IF('18-07-2019'!B249=\"\",\"\",'18-07-2019'!B249)","v":""},{"$f":"IF('18-07-2019'!C249=\"\",\"\",'18-07-2019'!C249)","v":""},{"$f":"IF('18-07-2019'!D249=\"\",\"\",'18-07-2019'!D249)","v":""},{"$f":"IF('18-07-2019'!E249=\"\",\"\",'18-07-2019'!E249)","v":""},{"$f":"IF('18-07-2019'!F249=\"\",\"\",'18-07-2019'!F249)","v":""}]
[null,{"$f":"IF('18-07-2019'!B250=\"\",\"\",'18-07-2019'!B250)","v":""},{"$f":"IF('18-07-2019'!C250=\"\",\"\",'18-07-2019'!C250)","v":""},{"$f":"IF('18-07-2019'!D250=\"\",\"\",'18-07-2019'!D250)","v":""},{"$f":"IF('18-07-2019'!E250=\"\",\"\",'18-07-2019'!E250)","v":""},{"$f":"IF('18-07-2019'!F250=\"\",\"\",'18-07-2019'!F250)","v":""}]
[null,{"$f":"IF('18-07-2019'!B251=\"\",\"\",'18-07-2019'!B251)","v":""},{"$f":"IF('18-07-2019'!C251=\"\",\"\",'18-07-2019'!C251)","v":""},{"$f":"IF('18-07-2019'!D251=\"\",\"\",'18-07-2019'!D251)","v":""},{"$f":"IF('18-07-2019'!E251=\"\",\"\",'18-07-2019'!E251)","v":""},{"$f":"IF('18-07-2019'!F251=\"\",\"\",'18-07-2019'!F251)","v":""}]
[null,{"$f":"IF('18-07-2019'!B252=\"\",\"\",'18-07-2019'!B252)","v":""},{"$f":"IF('18-07-2019'!C252=\"\",\"\",'18-07-2019'!C252)","v":""},{"$f":"IF('18-07-2019'!D252=\"\",\"\",'18-07-2019'!D252)","v":""},{"$f":"IF('18-07-2019'!E252=\"\",\"\",'18-07-2019'!E252)","v":""},{"$f":"IF('18-07-2019'!F252=\"\",\"\",'18-07-2019'!F252)","v":""}]
[null,{"$f":"IF('18-07-2019'!B253=\"\",\"\",'18-07-2019'!B253)","v":""},{"$f":"IF('18-07-2019'!C253=\"\",\"\",'18-07-2019'!C253)","v":""},{"$f":"IF('18-07-2019'!D253=\"\",\"\",'18-07-2019'!D253)","v":""},{"$f":"IF('18-07-2019'!E253=\"\",\"\",'18-07-2019'!E253)","v":""},{"$f":"IF('18-07-2019'!F253=\"\",\"\",'18-07-2019'!F253)","v":""}]
[null,{"$f":"IF('18-07-2019'!B254=\"\",\"\",'18-07-2019'!B254)","v":""},{"$f":"IF('18-07-2019'!C254=\"\",\"\",'18-07-2019'!C254)","v":""},{"$f":"IF('18-07-2019'!D254=\"\",\"\",'18-07-2019'!D254)","v":""},{"$f":"IF('18-07-2019'!E254=\"\",\"\",'18-07-2019'!E254)","v":""},{"$f":"IF('18-07-2019'!F254=\"\",\"\",'18-07-2019'!F254)","v":""}]
[null,{"$f":"IF('18-07-2019'!B255=\"\",\"\",'18-07-2019'!B255)","v":""},{"$f":"IF('18-07-2019'!C255=\"\",\"\",'18-07-2019'!C255)","v":""},{"$f":"IF('18-07-2019'!D255=\"\",\"\",'18-07-2019'!D255)","v":""},{"$f":"IF('18-07-2019'!E255=\"\",\"\",'18-07-2019'!E255)","v":""},{"$f":"IF('18-07-2019'!F255=\"\",\"\",'18-07-2019'!F255)","v":""}]
[null,{"$f":"IF('18-07-2019'!B256=\"\",\"\",'18-07-2019'!B256)","v":""},{"$f":"IF('18-07-2019'!C256=\"\",\"\",'18-07-2019'!C256)","v":""},{"$f":"IF('18-07-2019'!D256=\"\",\"\",'18-07-2019'!D256)","v":""},{"$f":"IF('18-07-2019'!E256=\"\",\"\",'18-07-2019'!E256)","v":""},{"$f":"IF('18-07-2019'!F256=\"\",\"\",'18-07-2019'!F256)","v":""}]
[null,{"$f":"IF('18-07-2019'!B257=\"\",\"\",'18-07-2019'!B257)","v":""},{"$f":"IF('18-07-2019'!C257=\"\",\"\",'18-07-2019'!C257)","v":""},{"$f":"IF('18-07-2019'!D257=\"\",\"\",'18-07-2019'!D257)","v":""},{"$f":"IF('18-07-2019'!E257=\"\",\"\",'18-07-2019'!E257)","v":""},{"$f":"IF('18-07-2019'!F257=\"\",\"\",'18-07-2019'!F257)","v":""}]
[null,{"$f":"IF('18-07-2019'!B258=\"\",\"\",'18-07-2019'!B258)","v":""},{"$f":"IF('18-07-2019'!C258=\"\",\"\",'18-07-2019'!C258)","v":""},{"$f":"IF('18-07-2019'!D258=\"\",\"\",'18-07-2019'!D258)","v":""},{"$f":"IF('18-07-2019'!E258=\"\",\"\",'18-07-2019'!E258)","v":""},{"$f":"IF('18-07-2019'!F258=\"\",\"\",'18-07-2019'!F258)","v":""}]
[null,{"$f":"IF('18-07-2019'!B259=\"\",\"\",'18-07-2019'!B259)","v":""},{"$f":"IF('18-07-2019'!C259=\"\",\"\",'18-07-2019'!C259)","v":""},{"$f":"IF('18-07-2019'!D259=\"\",\"\",'18-07-2019'!D259)","v":""},{"$f":"IF('18-07-2019'!E259=\"\",\"\",'18-07-2019'!E259)","v":""},{"$f":"IF('18-07-2019'!F259=\"\",\"\",'18-07-2019'!F259)","v":""}]
[null,{"$f":"IF('18-07-2019'!B260=\"\",\"\",'18-07-2019'!B260)","v":""},{"$f":"IF('18-07-2019'!C260=\"\",\"\",'18-07-2019'!C260)","v":""},{"$f":"IF('18-07-2019'!D260=\"\",\"\",'18-07-2019'!D260)","v":""},{"$f":"IF('18-07-2019'!E260=\"\",\"\",'18-07-2019'!E260)","v":""},{"$f":"IF('18-07-2019'!F260=\"\",\"\",'18-07-2019'!F260)","v":""}]
[null,{"$f":"IF('18-07-2019'!B261=\"\",\"\",'18-07-2019'!B261)","v":""},{"$f":"IF('18-07-2019'!C261=\"\",\"\",'18-07-2019'!C261)","v":""},{"$f":"IF('18-07-2019'!D261=\"\",\"\",'18-07-2019'!D261)","v":""},{"$f":"IF('18-07-2019'!E261=\"\",\"\",'18-07-2019'!E261)","v":""},{"$f":"IF('18-07-2019'!F261=\"\",\"\",'18-07-2019'!F261)","v":""}]
[null,{"$f":"IF('18-07-2019'!B262=\"\",\"\",'18-07-2019'!B262)","v":""},{"$f":"IF('18-07-2019'!C262=\"\",\"\",'18-07-2019'!C262)","v":""},{"$f":"IF('18-07-2019'!D262=\"\",\"\",'18-07-2019'!D262)","v":""},{"$f":"IF('18-07-2019'!E262=\"\",\"\",'18-07-2019'!E262)","v":""},{"$f":"IF('18-07-2019'!F262=\"\",\"\",'18-07-2019'!F262)","v":""}]
[null,{"$f":"IF('18-07-2019'!B263=\"\",\"\",'18-07-2019'!B263)","v":""},{"$f":"IF('18-07-2019'!C263=\"\",\"\",'18-07-2019'!C263)","v":""},{"$f":"IF('18-07-2019'!D263=\"\",\"\",'18-07-2019'!D263)","v":""},{"$f":"IF('18-07-2019'!E263=\"\",\"\",'18-07-2019'!E263)","v":""},{"$f":"IF('18-07-2019'!F263=\"\",\"\",'18-07-2019'!F263)","v":""}]
[null,{"$f":"IF('18-07-2019'!B264=\"\",\"\",'18-07-2019'!B264)","v":""},{"$f":"IF('18-07-2019'!C264=\"\",\"\",'18-07-2019'!C264)","v":""},{"$f":"IF('18-07-2019'!D264=\"\",\"\",'18-07-2019'!D264)","v":""},{"$f":"IF('18-07-2019'!E264=\"\",\"\",'18-07-2019'!E264)","v":""},{"$f":"IF('18-07-2019'!F264=\"\",\"\",'18-07-2019'!F264)","v":""}]
[null,{"$f":"IF('18-07-2019'!B265=\"\",\"\",'18-07-2019'!B265)","v":""},{"$f":"IF('18-07-2019'!C265=\"\",\"\",'18-07-2019'!C265)","v":""},{"$f":"IF('18-07-2019'!D265=\"\",\"\",'18-07-2019'!D265)","v":""},{"$f":"IF('18-07-2019'!E265=\"\",\"\",'18-07-2019'!E265)","v":""},{"$f":"IF('18-07-2019'!F265=\"\",\"\",'18-07-2019'!F265)","v":""}]
[null,{"$f":"IF('18-07-2019'!B266=\"\",\"\",'18-07-2019'!B266)","v":""},{"$f":"IF('18-07-2019'!C266=\"\",\"\",'18-07-2019'!C266)","v":""},{"$f":"IF('18-07-2019'!D266=\"\",\"\",'18-07-2019'!D266)","v":""},{"$f":"IF('18-07-2019'!E266=\"\",\"\",'18-07-2019'!E266)","v":""},{"$f":"IF('18-07-2019'!F266=\"\",\"\",'18-07-2019'!F266)","v":""}]
[null,{"$f":"IF('18-07-2019'!B267=\"\",\"\",'18-07-2019'!B267)","v":""},{"$f":"IF('18-07-2019'!C267=\"\",\"\",'18-07-2019'!C267)","v":""},{"$f":"IF('18-07-2019'!D267=\"\",\"\",'18-07-2019'!D267)","v":""},{"$f":"IF('18-07-2019'!E267=\"\",\"\",'18-07-2019'!E267)","v":""},{"$f":"IF('18-07-2019'!F267=\"\",\"\",'18-07-2019'!F267)","v":""}]
[null,{"$f":"IF('18-07-2019'!B268=\"\",\"\",'18-07-2019'!B268)","v":""},{"$f":"IF('18-07-2019'!C268=\"\",\"\",'18-07-2019'!C268)","v":""},{"$f":"IF('18-07-2019'!D268=\"\",\"\",'18-07-2019'!D268)","v":""},{"$f":"IF('18-07-2019'!E268=\"\",\"\",'18-07-2019'!E268)","v":""},{"$f":"IF('18-07-2019'!F268=\"\",\"\",'18-07-2019'!F268)","v":""}]
[null,{"$f":"IF('18-07-2019'!B269=\"\",\"\",'18-07-2019'!B269)","v":""},{"$f":"IF('18-07-2019'!C269=\"\",\"\",'18-07-2019'!C269)","v":""},{"$f":"IF('18-07-2019'!D269=\"\",\"\",'18-07-2019'!D269)","v":""},{"$f":"IF('18-07-2019'!E269=\"\",\"\",'18-07-2019'!E269)","v":""},{"$f":"IF('18-07-2019'!F269=\"\",\"\",'18-07-2019'!F269)","v":""}]
[null,{"$f":"IF('18-07-2019'!B270=\"\",\"\",'18-07-2019'!B270)","v":""},{"$f":"IF('18-07-2019'!C270=\"\",\"\",'18-07-2019'!C270)","v":""},{"$f":"IF('18-07-2019'!D270=\"\",\"\",'18-07-2019'!D270)","v":""},{"$f":"IF('18-07-2019'!E270=\"\",\"\",'18-07-2019'!E270)","v":""},{"$f":"IF('18-07-2019'!F270=\"\",\"\",'18-07-2019'!F270)","v":""}]
[null,{"$f":"IF('18-07-2019'!B271=\"\",\"\",'18-07-2019'!B271)","v":""},{"$f":"IF('18-07-2019'!C271=\"\",\"\",'18-07-2019'!C271)","v":""},{"$f":"IF('18-07-2019'!D271=\"\",\"\",'18-07-2019'!D271)","v":""},{"$f":"IF('18-07-2019'!E271=\"\",\"\",'18-07-2019'!E271)","v":""},{"$f":"IF('18-07-2019'!F271=\"\",\"\",'18-07-2019'!F271)","v":""}]
[null,{"$f":"IF('18-07-2019'!B272=\"\",\"\",'18-07-2019'!B272)","v":""},{"$f":"IF('18-07-2019'!C272=\"\",\"\",'18-07-2019'!C272)","v":""},{"$f":"IF('18-07-2019'!D272=\"\",\"\",'18-07-2019'!D272)","v":""},{"$f":"IF('18-07-2019'!E272=\"\",\"\",'18-07-2019'!E272)","v":""},{"$f":"IF('18-07-2019'!F272=\"\",\"\",'18-07-2019'!F272)","v":""}]
[null,{"$f":"IF('18-07-2019'!B273=\"\",\"\",'18-07-2019'!B273)","v":""},{"$f":"IF('18-07-2019'!C273=\"\",\"\",'18-07-2019'!C273)","v":""},{"$f":"IF('18-07-2019'!D273=\"\",\"\",'18-07-2019'!D273)","v":""},{"$f":"IF('18-07-2019'!E273=\"\",\"\",'18-07-2019'!E273)","v":""},{"$f":"IF('18-07-2019'!F273=\"\",\"\",'18-07-2019'!F273)","v":""}]
[null,{"$f":"IF('18-07-2019'!B274=\"\",\"\",'18-07-2019'!B274)","v":""},{"$f":"IF('18-07-2019'!C274=\"\",\"\",'18-07-2019'!C274)","v":""},{"$f":"IF('18-07-2019'!D274=\"\",\"\",'18-07-2019'!D274)","v":""},{"$f":"IF('18-07-2019'!E274=\"\",\"\",'18-07-2019'!E274)","v":""},{"$f":"IF('18-07-2019'!F274=\"\",\"\",'18-07-2019'!F274)","v":""}]
[null,{"$f":"IF('18-07-2019'!B275=\"\",\"\",'18-07-2019'!B275)","v":""},{"$f":"IF('18-07-2019'!C275=\"\",\"\",'18-07-2019'!C275)","v":""},{"$f":"IF('18-07-2019'!D275=\"\",\"\",'18-07-2019'!D275)","v":""},{"$f":"IF('18-07-2019'!E275=\"\",\"\",'18-07-2019'!E275)","v":""},{"$f":"IF('18-07-2019'!F275=\"\",\"\",'18-07-2019'!F275)","v":""}]
[null,{"$f":"IF('18-07-2019'!B276=\"\",\"\",'18-07-2019'!B276)","v":""},{"$f":"IF('18-07-2019'!C276=\"\",\"\",'18-07-2019'!C276)","v":""},{"$f":"IF('18-07-2019'!D276=\"\",\"\",'18-07-2019'!D276)","v":""},{"$f":"IF('18-07-2019'!E276=\"\",\"\",'18-07-2019'!E276)","v":""},{"$f":"IF('18-07-2019'!F276=\"\",\"\",'18-07-2019'!F276)","v":""}]
[null,{"$f":"IF('18-07-2019'!B277=\"\",\"\",'18-07-2019'!B277)","v":""},{"$f":"IF('18-07-2019'!C277=\"\",\"\",'18-07-2019'!C277)","v":""},{"$f":"IF('18-07-2019'!D277=\"\",\"\",'18-07-2019'!D277)","v":""},{"$f":"IF('18-07-2019'!E277=\"\",\"\",'18-07-2019'!E277)","v":""},{"$f":"IF('18-07-2019'!F277=\"\",\"\",'18-07-2019'!F277)","v":""}]
[null,{"$f":"IF('18-07-2019'!B278=\"\",\"\",'18-07-2019'!B278)","v":""},{"$f":"IF('18-07-2019'!C278=\"\",\"\",'18-07-2019'!C278)","v":""},{"$f":"IF('18-07-2019'!D278=\"\",\"\",'18-07-2019'!D278)","v":""},{"$f":"IF('18-07-2019'!E278=\"\",\"\",'18-07-2019'!E278)","v":""},{"$f":"IF('18-07-2019'!F278=\"\",\"\",'18-07-2019'!F278)","v":""}]
[null,{"$f":"IF('18-07-2019'!B279=\"\",\"\",'18-07-2019'!B279)","v":""},{"$f":"IF('18-07-2019'!C279=\"\",\"\",'18-07-2019'!C279)","v":""},{"$f":"IF('18-07-2019'!D279=\"\",\"\",'18-07-2019'!D279)","v":""},{"$f":"IF('18-07-2019'!E279=\"\",\"\",'18-07-2019'!E279)","v":""},{"$f":"IF('18-07-2019'!F279=\"\",\"\",'18-07-2019'!F279)","v":""}]
[null,{"$f":"IF('18-07-2019'!B280=\"\",\"\",'18-07-2019'!B280)","v":""},{"$f":"IF('18-07-2019'!C280=\"\",\"\",'18-07-2019'!C280)","v":""},{"$f":"IF('18-07-2019'!D280=\"\",\"\",'18-07-2019'!D280)","v":""},{"$f":"IF('18-07-2019'!E280=\"\",\"\",'18-07-2019'!E280)","v":""},{"$f":"IF('18-07-2019'!F280=\"\",\"\",'18-07-2019'!F280)","v":""}]
[null,{"$f":"IF('18-07-2019'!B281=\"\",\"\",'18-07-2019'!B281)","v":""},{"$f":"IF('18-07-2019'!C281=\"\",\"\",'18-07-2019'!C281)","v":""},{"$f":"IF('18-07-2019'!D281=\"\",\"\",'18-07-2019'!D281)","v":""},{"$f":"IF('18-07-2019'!E281=\"\",\"\",'18-07-2019'!E281)","v":""},{"$f":"IF('18-07-2019'!F281=\"\",\"\",'18-07-2019'!F281)","v":""}]
[null,{"$f":"IF('18-07-2019'!B282=\"\",\"\",'18-07-2019'!B282)","v":""},{"$f":"IF('18-07-2019'!C282=\"\",\"\",'18-07-2019'!C282)","v":""},{"$f":"IF('18-07-2019'!D282=\"\",\"\",'18-07-2019'!D282)","v":""},{"$f":"IF('18-07-2019'!E282=\"\",\"\",'18-07-2019'!E282)","v":""},{"$f":"IF('18-07-2019'!F282=\"\",\"\",'18-07-2019'!F282)","v":""}]
[null,{"$f":"IF('18-07-2019'!B283=\"\",\"\",'18-07-2019'!B283)","v":""},{"$f":"IF('18-07-2019'!C283=\"\",\"\",'18-07-2019'!C283)","v":""},{"$f":"IF('18-07-2019'!D283=\"\",\"\",'18-07-2019'!D283)","v":""},{"$f":"IF('18-07-2019'!E283=\"\",\"\",'18-07-2019'!E283)","v":""},{"$f":"IF('18-07-2019'!F283=\"\",\"\",'18-07-2019'!F283)","v":""}]
[null,{"$f":"IF('18-07-2019'!B284=\"\",\"\",'18-07-2019'!B284)","v":""},{"$f":"IF('18-07-2019'!C284=\"\",\"\",'18-07-2019'!C284)","v":""},{"$f":"IF('18-07-2019'!D284=\"\",\"\",'18-07-2019'!D284)","v":""},{"$f":"IF('18-07-2019'!E284=\"\",\"\",'18-07-2019'!E284)","v":""},{"$f":"IF('18-07-2019'!F284=\"\",\"\",'18-07-2019'!F284)","v":""}]
[null,{"$f":"IF('18-07-2019'!B285=\"\",\"\",'18-07-2019'!B285)","v":""},{"$f":"IF('18-07-2019'!C285=\"\",\"\",'18-07-2019'!C285)","v":""},{"$f":"IF('18-07-2019'!D285=\"\",\"\",'18-07-2019'!D285)","v":""},{"$f":"IF('18-07-2019'!E285=\"\",\"\",'18-07-2019'!E285)","v":""},{"$f":"IF('18-07-2019'!F285=\"\",\"\",'18-07-2019'!F285)","v":""}]
[null,{"$f":"IF('18-07-2019'!B286=\"\",\"\",'18-07-2019'!B286)","v":""},{"$f":"IF('18-07-2019'!C286=\"\",\"\",'18-07-2019'!C286)","v":""},{"$f":"IF('18-07-2019'!D286=\"\",\"\",'18-07-2019'!D286)","v":""},{"$f":"IF('18-07-2019'!E286=\"\",\"\",'18-07-2019'!E286)","v":""},{"$f":"IF('18-07-2019'!F286=\"\",\"\",'18-07-2019'!F286)","v":""}]
[null,{"$f":"IF('18-07-2019'!B287=\"\",\"\",'18-07-2019'!B287)","v":""},{"$f":"IF('18-07-2019'!C287=\"\",\"\",'18-07-2019'!C287)","v":""},{"$f":"IF('18-07-2019'!D287=\"\",\"\",'18-07-2019'!D287)","v":""},{"$f":"IF('18-07-2019'!E287=\"\",\"\",'18-07-2019'!E287)","v":""},{"$f":"IF('18-07-2019'!F287=\"\",\"\",'18-07-2019'!F287)","v":""}]
[null,{"$f":"IF('18-07-2019'!B288=\"\",\"\",'18-07-2019'!B288)","v":""},{"$f":"IF('18-07-2019'!C288=\"\",\"\",'18-07-2019'!C288)","v":""},{"$f":"IF('18-07-2019'!D288=\"\",\"\",'18-07-2019'!D288)","v":""},{"$f":"IF('18-07-2019'!E288=\"\",\"\",'18-07-2019'!E288)","v":""},{"$f":"IF('18-07-2019'!F288=\"\",\"\",'18-07-2019'!F288)","v":""}]
[null,{"$f":"IF('18-07-2019'!B289=\"\",\"\",'18-07-2019'!B289)","v":""},{"$f":"IF('18-07-2019'!C289=\"\",\"\",'18-07-2019'!C289)","v":""},{"$f":"IF('18-07-2019'!D289=\"\",\"\",'18-07-2019'!D289)","v":""},{"$f":"IF('18-07-2019'!E289=\"\",\"\",'18-07-2019'!E289)","v":""},{"$f":"IF('18-07-2019'!F289=\"\",\"\",'18-07-2019'!F289)","v":""}]
[null,{"$f":"IF('18-07-2019'!B290=\"\",\"\",'18-07-2019'!B290)","v":""},{"$f":"IF('18-07-2019'!C290=\"\",\"\",'18-07-2019'!C290)","v":""},{"$f":"IF('18-07-2019'!D290=\"\",\"\",'18-07-2019'!D290)","v":""},{"$f":"IF('18-07-2019'!E290=\"\",\"\",'18-07-2019'!E290)","v":""},{"$f":"IF('18-07-2019'!F290=\"\",\"\",'18-07-2019'!F290)","v":""}]
[null,{"$f":"IF('18-07-2019'!B291=\"\",\"\",'18-07-2019'!B291)","v":""},{"$f":"IF('18-07-2019'!C291=\"\",\"\",'18-07-2019'!C291)","v":""},{"$f":"IF('18-07-2019'!D291=\"\",\"\",'18-07-2019'!D291)","v":""},{"$f":"IF('18-07-2019'!E291=\"\",\"\",'18-07-2019'!E291)","v":""},{"$f":"IF('18-07-2019'!F291=\"\",\"\",'18-07-2019'!F291)","v":""}]
[null,{"$f":"IF('18-07-2019'!B292=\"\",\"\",'18-07-2019'!B292)","v":""},{"$f":"IF('18-07-2019'!C292=\"\",\"\",'18-07-2019'!C292)","v":""},{"$f":"IF('18-07-2019'!D292=\"\",\"\",'18-07-2019'!D292)","v":""},{"$f":"IF('18-07-2019'!E292=\"\",\"\",'18-07-2019'!E292)","v":""},{"$f":"IF('18-07-2019'!F292=\"\",\"\",'18-07-2019'!F292)","v":""}]
[null,{"$f":"IF('18-07-2019'!B293=\"\",\"\",'18-07-2019'!B293)","v":""},{"$f":"IF('18-07-2019'!C293=\"\",\"\",'18-07-2019'!C293)","v":""},{"$f":"IF('18-07-2019'!D293=\"\",\"\",'18-07-2019'!D293)","v":""},{"$f":"IF('18-07-2019'!E293=\"\",\"\",'18-07-2019'!E293)","v":""},{"$f":"IF('18-07-2019'!F293=\"\",\"\",'18-07-2019'!F293)","v":""}]
[null,{"$f":"IF('18-07-2019'!B294=\"\",\"\",'18-07-2019'!B294)","v":""},{"$f":"IF('18-07-2019'!C294=\"\",\"\",'18-07-2019'!C294)","v":""},{"$f":"IF('18-07-2019'!D294=\"\",\"\",'18-07-2019'!D294)","v":""},{"$f":"IF('18-07-2019'!E294=\"\",\"\",'18-07-2019'!E294)","v":""},{"$f":"IF('18-07-2019'!F294=\"\",\"\",'18-07-2019'!F294)","v":""}]
[null,{"$f":"IF('18-07-2019'!B295=\"\",\"\",'18-07-2019'!B295)","v":""},{"$f":"IF('18-07-2019'!C295=\"\",\"\",'18-07-2019'!C295)","v":""},{"$f":"IF('18-07-2019'!D295=\"\",\"\",'18-07-2019'!D295)","v":""},{"$f":"IF('18-07-2019'!E295=\"\",\"\",'18-07-2019'!E295)","v":""},{"$f":"IF('18-07-2019'!F295=\"\",\"\",'18-07-2019'!F295)","v":""}]
[null,{"$f":"IF('18-07-2019'!B296=\"\",\"\",'18-07-2019'!B296)","v":""},{"$f":"IF('18-07-2019'!C296=\"\",\"\",'18-07-2019'!C296)","v":""},{"$f":"IF('18-07-2019'!D296=\"\",\"\",'18-07-2019'!D296)","v":""},{"$f":"IF('18-07-2019'!E296=\"\",\"\",'18-07-2019'!E296)","v":""},{"$f":"IF('18-07-2019'!F296=\"\",\"\",'18-07-2019'!F296)","v":""}]
[null,{"$f":"IF('18-07-2019'!B297=\"\",\"\",'18-07-2019'!B297)","v":""},{"$f":"IF('18-07-2019'!C297=\"\",\"\",'18-07-2019'!C297)","v":""},{"$f":"IF('18-07-2019'!D297=\"\",\"\",'18-07-2019'!D297)","v":""},{"$f":"IF('18-07-2019'!E297=\"\",\"\",'18-07-2019'!E297)","v":""},{"$f":"IF('18-07-2019'!F297=\"\",\"\",'18-07-2019'!F297)","v":""}]
[null,{"$f":"IF('18-07-2019'!B298=\"\",\"\",'18-07-2019'!B298)","v":""},{"$f":"IF('18-07-2019'!C298=\"\",\"\",'18-07-2019'!C298)","v":""},{"$f":"IF('18-07-2019'!D298=\"\",\"\",'18-07-2019'!D298)","v":""},{"$f":"IF('18-07-2019'!E298=\"\",\"\",'18-07-2019'!E298)","v":""},{"$f":"IF('18-07-2019'!F298=\"\",\"\",'18-07-2019'!F298)","v":""}]
[null,{"$f":"IF('18-07-2019'!B299=\"\",\"\",'18-07-2019'!B299)","v":""},{"$f":"IF('18-07-2019'!C299=\"\",\"\",'18-07-2019'!C299)","v":""},{"$f":"IF('18-07-2019'!D299=\"\",\"\",'18-07-2019'!D299)","v":""},{"$f":"IF('18-07-2019'!E299=\"\",\"\",'18-07-2019'!E299)","v":""},{"$f":"IF('18-07-2019'!F299=\"\",\"\",'18-07-2019'!F299)","v":""}]
[null,{"$f":"IF('18-07-2019'!B300=\"\",\"\",'18-07-2019'!B300)","v":""},{"$f":"IF('18-07-2019'!C300=\"\",\"\",'18-07-2019'!C300)","v":""},{"$f":"IF('18-07-2019'!D300=\"\",\"\",'18-07-2019'!D300)","v":""},{"$f":"IF('18-07-2019'!E300=\"\",\"\",'18-07-2019'!E300)","v":""},{"$f":"IF('18-07-2019'!F300=\"\",\"\",'18-07-2019'!F300)","v":""}]
[null,{"$f":"IF('18-07-2019'!B301=\"\",\"\",'18-07-2019'!B301)","v":""},{"$f":"IF('18-07-2019'!C301=\"\",\"\",'18-07-2019'!C301)","v":""},{"$f":"IF('18-07-2019'!D301=\"\",\"\",'18-07-2019'!D301)","v":""},{"$f":"IF('18-07-2019'!E301=\"\",\"\",'18-07-2019'!E301)","v":""},{"$f":"IF('18-07-2019'!F301=\"\",\"\",'18-07-2019'!F301)","v":""}]
[null,{"$f":"IF('18-07-2019'!B302=\"\",\"\",'18-07-2019'!B302)","v":""},{"$f":"IF('18-07-2019'!C302=\"\",\"\",'18-07-2019'!C302)","v":""},{"$f":"IF('18-07-2019'!D302=\"\",\"\",'18-07-2019'!D302)","v":""},{"$f":"IF('18-07-2019'!E302=\"\",\"\",'18-07-2019'!E302)","v":""},{"$f":"IF('18-07-2019'!F302=\"\",\"\",'18-07-2019'!F302)","v":""}]
[null,{"$f":"IF('18-07-2019'!B303=\"\",\"\",'18-07-2019'!B303)","v":""},{"$f":"IF('18-07-2019'!C303=\"\",\"\",'18-07-2019'!C303)","v":""},{"$f":"IF('18-07-2019'!D303=\"\",\"\",'18-07-2019'!D303)","v":""},{"$f":"IF('18-07-2019'!E303=\"\",\"\",'18-07-2019'!E303)","v":""},{"$f":"IF('18-07-2019'!F303=\"\",\"\",'18-07-2019'!F303)","v":""}]
[null,{"$f":"IF('18-07-2019'!B304=\"\",\"\",'18-07-2019'!B304)","v":""},{"$f":"IF('18-07-2019'!C304=\"\",\"\",'18-07-2019'!C304)","v":""},{"$f":"IF('18-07-2019'!D304=\"\",\"\",'18-07-2019'!D304)","v":""},{"$f":"IF('18-07-2019'!E304=\"\",\"\",'18-07-2019'!E304)","v":""},{"$f":"IF('18-07-2019'!F304=\"\",\"\",'18-07-2019'!F304)","v":""}]
[null,{"$f":"IF('18-07-2019'!B305=\"\",\"\",'18-07-2019'!B305)","v":""},{"$f":"IF('18-07-2019'!C305=\"\",\"\",'18-07-2019'!C305)","v":""},{"$f":"IF('18-07-2019'!D305=\"\",\"\",'18-07-2019'!D305)","v":""},{"$f":"IF('18-07-2019'!E305=\"\",\"\",'18-07-2019'!E305)","v":""},{"$f":"IF('18-07-2019'!F305=\"\",\"\",'18-07-2019'!F305)","v":""}]
[null,{"$f":"IF('18-07-2019'!B306=\"\",\"\",'18-07-2019'!B306)","v":""},{"$f":"IF('18-07-2019'!C306=\"\",\"\",'18-07-2019'!C306)","v":""},{"$f":"IF('18-07-2019'!D306=\"\",\"\",'18-07-2019'!D306)","v":""},{"$f":"IF('18-07-2019'!E306=\"\",\"\",'18-07-2019'!E306)","v":""},{"$f":"IF('18-07-2019'!F306=\"\",\"\",'18-07-2019'!F306)","v":""}]
[null,{"$f":"IF('18-07-2019'!B307=\"\",\"\",'18-07-2019'!B307)","v":""},{"$f":"IF('18-07-2019'!C307=\"\",\"\",'18-07-2019'!C307)","v":""},{"$f":"IF('18-07-2019'!D307=\"\",\"\",'18-07-2019'!D307)","v":""},{"$f":"IF('18-07-2019'!E307=\"\",\"\",'18-07-2019'!E307)","v":""},{"$f":"IF('18-07-2019'!F307=\"\",\"\",'18-07-2019'!F307)","v":""}]
[null,{"$f":"IF('18-07-2019'!B308=\"\",\"\",'18-07-2019'!B308)","v":""},{"$f":"IF('18-07-2019'!C308=\"\",\"\",'18-07-2019'!C308)","v":""},{"$f":"IF('18-07-2019'!D308=\"\",\"\",'18-07-2019'!D308)","v":""},{"$f":"IF('18-07-2019'!E308=\"\",\"\",'18-07-2019'!E308)","v":""},{"$f":"IF('18-07-2019'!F308=\"\",\"\",'18-07-2019'!F308)","v":""}]
[null,{"$f":"IF('18-07-2019'!B309=\"\",\"\",'18-07-2019'!B309)","v":""},{"$f":"IF('18-07-2019'!C309=\"\",\"\",'18-07-2019'!C309)","v":""},{"$f":"IF('18-07-2019'!D309=\"\",\"\",'18-07-2019'!D309)","v":""},{"$f":"IF('18-07-2019'!E309=\"\",\"\",'18-07-2019'!E309)","v":""},{"$f":"IF('18-07-2019'!F309=\"\",\"\",'18-07-2019'!F309)","v":""}]
[null,{"$f":"IF('18-07-2019'!B310=\"\",\"\",'18-07-2019'!B310)","v":""},{"$f":"IF('18-07-2019'!C310=\"\",\"\",'18-07-2019'!C310)","v":""},{"$f":"IF('18-07-2019'!D310=\"\",\"\",'18-07-2019'!D310)","v":""},{"$f":"IF('18-07-2019'!E310=\"\",\"\",'18-07-2019'!E310)","v":""},{"$f":"IF('18-07-2019'!F310=\"\",\"\",'18-07-2019'!F310)","v":""}]
[null,{"$f":"IF('18-07-2019'!B311=\"\",\"\",'18-07-2019'!B311)","v":""},{"$f":"IF('18-07-2019'!C311=\"\",\"\",'18-07-2019'!C311)","v":""},{"$f":"IF('18-07-2019'!D311=\"\",\"\",'18-07-2019'!D311)","v":""},{"$f":"IF('18-07-2019'!E311=\"\",\"\",'18-07-2019'!E311)","v":""},{"$f":"IF('18-07-2019'!F311=\"\",\"\",'18-07-2019'!F311)","v":""}]
[null,{"$f":"IF('18-07-2019'!B312=\"\",\"\",'18-07-2019'!B312)","v":""},{"$f":"IF('18-07-2019'!C312=\"\",\"\",'18-07-2019'!C312)","v":""},{"$f":"IF('18-07-2019'!D312=\"\",\"\",'18-07-2019'!D312)","v":""},{"$f":"IF('18-07-2019'!E312=\"\",\"\",'18-07-2019'!E312)","v":""},{"$f":"IF('18-07-2019'!F312=\"\",\"\",'18-07-2019'!F312)","v":""}]
[null,{"$f":"IF('18-07-2019'!B313=\"\",\"\",'18-07-2019'!B313)","v":""},{"$f":"IF('18-07-2019'!C313=\"\",\"\",'18-07-2019'!C313)","v":""},{"$f":"IF('18-07-2019'!D313=\"\",\"\",'18-07-2019'!D313)","v":""},{"$f":"IF('18-07-2019'!E313=\"\",\"\",'18-07-2019'!E313)","v":""},{"$f":"IF('18-07-2019'!F313=\"\",\"\",'18-07-2019'!F313)","v":""}]
[null,{"$f":"IF('18-07-2019'!B314=\"\",\"\",'18-07-2019'!B314)","v":""},{"$f":"IF('18-07-2019'!C314=\"\",\"\",'18-07-2019'!C314)","v":""},{"$f":"IF('18-07-2019'!D314=\"\",\"\",'18-07-2019'!D314)","v":""},{"$f":"IF('18-07-2019'!E314=\"\",\"\",'18-07-2019'!E314)","v":""},{"$f":"IF('18-07-2019'!F314=\"\",\"\",'18-07-2019'!F314)","v":""}]
[null,{"$f":"IF('18-07-2019'!B315=\"\",\"\",'18-07-2019'!B315)","v":""},{"$f":"IF('18-07-2019'!C315=\"\",\"\",'18-07-2019'!C315)","v":""},{"$f":"IF('18-07-2019'!D315=\"\",\"\",'18-07-2019'!D315)","v":""},{"$f":"IF('18-07-2019'!E315=\"\",\"\",'18-07-2019'!E315)","v":""},{"$f":"IF('18-07-2019'!F315=\"\",\"\",'18-07-2019'!F315)","v":""}]
[null,{"$f":"IF('18-07-2019'!B316=\"\",\"\",'18-07-2019'!B316)","v":""},{"$f":"IF('18-07-2019'!C316=\"\",\"\",'18-07-2019'!C316)","v":""},{"$f":"IF('18-07-2019'!D316=\"\",\"\",'18-07-2019'!D316)","v":""},{"$f":"IF('18-07-2019'!E316=\"\",\"\",'18-07-2019'!E316)","v":""},{"$f":"IF('18-07-2019'!F316=\"\",\"\",'18-07-2019'!F316)","v":""}]
[null,{"$f":"IF('18-07-2019'!B317=\"\",\"\",'18-07-2019'!B317)","v":""},{"$f":"IF('18-07-2019'!C317=\"\",\"\",'18-07-2019'!C317)","v":""},{"$f":"IF('18-07-2019'!D317=\"\",\"\",'18-07-2019'!D317)","v":""},{"$f":"IF('18-07-2019'!E317=\"\",\"\",'18-07-2019'!E317)","v":""},{"$f":"IF('18-07-2019'!F317=\"\",\"\",'18-07-2019'!F317)","v":""}]
[null,{"$f":"IF('18-07-2019'!B318=\"\",\"\",'18-07-2019'!B318)","v":""},{"$f":"IF('18-07-2019'!C318=\"\",\"\",'18-07-2019'!C318)","v":""},{"$f":"IF('18-07-2019'!D318=\"\",\"\",'18-07-2019'!D318)","v":""},{"$f":"IF('18-07-2019'!E318=\"\",\"\",'18-07-2019'!E318)","v":""},{"$f":"IF('18-07-2019'!F318=\"\",\"\",'18-07-2019'!F318)","v":""}]
[null,{"$f":"IF('18-07-2019'!B319=\"\",\"\",'18-07-2019'!B319)","v":""},{"$f":"IF('18-07-2019'!C319=\"\",\"\",'18-07-2019'!C319)","v":""},{"$f":"IF('18-07-2019'!D319=\"\",\"\",'18-07-2019'!D319)","v":""},{"$f":"IF('18-07-2019'!E319=\"\",\"\",'18-07-2019'!E319)","v":""},{"$f":"IF('18-07-2019'!F319=\"\",\"\",'18-07-2019'!F319)","v":""}]
[null,{"$f":"IF('18-07-2019'!B320=\"\",\"\",'18-07-2019'!B320)","v":""},{"$f":"IF('18-07-2019'!C320=\"\",\"\",'18-07-2019'!C320)","v":""},{"$f":"IF('18-07-2019'!D320=\"\",\"\",'18-07-2019'!D320)","v":""},{"$f":"IF('18-07-2019'!E320=\"\",\"\",'18-07-2019'!E320)","v":""},{"$f":"IF('18-07-2019'!F320=\"\",\"\",'18-07-2019'!F320)","v":""}]
[null,{"$f":"IF('18-07-2019'!B321=\"\",\"\",'18-07-2019'!B321)","v":""},{"$f":"IF('18-07-2019'!C321=\"\",\"\",'18-07-2019'!C321)","v":""},{"$f":"IF('18-07-2019'!D321=\"\",\"\",'18-07-2019'!D321)","v":""},{"$f":"IF('18-07-2019'!E321=\"\",\"\",'18-07-2019'!E321)","v":""},{"$f":"IF('18-07-2019'!F321=\"\",\"\",'18-07-2019'!F321)","v":""}]
[null,{"$f":"IF('18-07-2019'!B322=\"\",\"\",'18-07-2019'!B322)","v":""},{"$f":"IF('18-07-2019'!C322=\"\",\"\",'18-07-2019'!C322)","v":""},{"$f":"IF('18-07-2019'!D322=\"\",\"\",'18-07-2019'!D322)","v":""},{"$f":"IF('18-07-2019'!E322=\"\",\"\",'18-07-2019'!E322)","v":""},{"$f":"IF('18-07-2019'!F322=\"\",\"\",'18-07-2019'!F322)","v":""}]
[null,{"$f":"IF('18-07-2019'!B323=\"\",\"\",'18-07-2019'!B323)","v":""},{"$f":"IF('18-07-2019'!C323=\"\",\"\",'18-07-2019'!C323)","v":""},{"$f":"IF('18-07-2019'!D323=\"\",\"\",'18-07-2019'!D323)","v":""},{"$f":"IF('18-07-2019'!E323=\"\",\"\",'18-07-2019'!E323)","v":""},{"$f":"IF('18-07-2019'!F323=\"\",\"\",'18-07-2019'!F323)","v":""}]
[null,{"$f":"IF('18-07-2019'!B324=\"\",\"\",'18-07-2019'!B324)","v":""},{"$f":"IF('18-07-2019'!C324=\"\",\"\",'18-07-2019'!C324)","v":""},{"$f":"IF('18-07-2019'!D324=\"\",\"\",'18-07-2019'!D324)","v":""},{"$f":"IF('18-07-2019'!E324=\"\",\"\",'18-07-2019'!E324)","v":""},{"$f":"IF('18-07-2019'!F324=\"\",\"\",'18-07-2019'!F324)","v":""}]
[null,{"$f":"IF('18-07-2019'!B325=\"\",\"\",'18-07-2019'!B325)","v":""},{"$f":"IF('18-07-2019'!C325=\"\",\"\",'18-07-2019'!C325)","v":""},{"$f":"IF('18-07-2019'!D325=\"\",\"\",'18-07-2019'!D325)","v":""},{"$f":"IF('18-07-2019'!E325=\"\",\"\",'18-07-2019'!E325)","v":""},{"$f":"IF('18-07-2019'!F325=\"\",\"\",'18-07-2019'!F325)","v":""}]
[null,{"$f":"IF('18-07-2019'!B326=\"\",\"\",'18-07-2019'!B326)","v":""},{"$f":"IF('18-07-2019'!C326=\"\",\"\",'18-07-2019'!C326)","v":""},{"$f":"IF('18-07-2019'!D326=\"\",\"\",'18-07-2019'!D326)","v":""},{"$f":"IF('18-07-2019'!E326=\"\",\"\",'18-07-2019'!E326)","v":""},{"$f":"IF('18-07-2019'!F326=\"\",\"\",'18-07-2019'!F326)","v":""}]
[null,{"$f":"IF('18-07-2019'!B327=\"\",\"\",'18-07-2019'!B327)","v":""},{"$f":"IF('18-07-2019'!C327=\"\",\"\",'18-07-2019'!C327)","v":""},{"$f":"IF('18-07-2019'!D327=\"\",\"\",'18-07-2019'!D327)","v":""},{"$f":"IF('18-07-2019'!E327=\"\",\"\",'18-07-2019'!E327)","v":""},{"$f":"IF('18-07-2019'!F327=\"\",\"\",'18-07-2019'!F327)","v":""}]
[null,{"$f":"IF('18-07-2019'!B328=\"\",\"\",'18-07-2019'!B328)","v":""},{"$f":"IF('18-07-2019'!C328=\"\",\"\",'18-07-2019'!C328)","v":""},{"$f":"IF('18-07-2019'!D328=\"\",\"\",'18-07-2019'!D328)","v":""},{"$f":"IF('18-07-2019'!E328=\"\",\"\",'18-07-2019'!E328)","v":""},{"$f":"IF('18-07-2019'!F328=\"\",\"\",'18-07-2019'!F328)","v":""}]
[null,{"$f":"IF('18-07-2019'!B329=\"\",\"\",'18-07-2019'!B329)","v":""},{"$f":"IF('18-07-2019'!C329=\"\",\"\",'18-07-2019'!C329)","v":""},{"$f":"IF('18-07-2019'!D329=\"\",\"\",'18-07-2019'!D329)","v":""},{"$f":"IF('18-07-2019'!E329=\"\",\"\",'18-07-2019'!E329)","v":""},{"$f":"IF('18-07-2019'!F329=\"\",\"\",'18-07-2019'!F329)","v":""}]
[null,{"$f":"IF('18-07-2019'!B330=\"\",\"\",'18-07-2019'!B330)","v":""},{"$f":"IF('18-07-2019'!C330=\"\",\"\",'18-07-2019'!C330)","v":""},{"$f":"IF('18-07-2019'!D330=\"\",\"\",'18-07-2019'!D330)","v":""},{"$f":"IF('18-07-2019'!E330=\"\",\"\",'18-07-2019'!E330)","v":""},{"$f":"IF('18-07-2019'!F330=\"\",\"\",'18-07-2019'!F330)","v":""}]
[null,{"$f":"IF('18-07-2019'!B331=\"\",\"\",'18-07-2019'!B331)","v":""},{"$f":"IF('18-07-2019'!C331=\"\",\"\",'18-07-2019'!C331)","v":""},{"$f":"IF('18-07-2019'!D331=\"\",\"\",'18-07-2019'!D331)","v":""},{"$f":"IF('18-07-2019'!E331=\"\",\"\",'18-07-2019'!E331)","v":""},{"$f":"IF('18-07-2019'!F331=\"\",\"\",'18-07-2019'!F331)","v":""}]
[null,{"$f":"IF('18-07-2019'!B332=\"\",\"\",'18-07-2019'!B332)","v":""},{"$f":"IF('18-07-2019'!C332=\"\",\"\",'18-07-2019'!C332)","v":""},{"$f":"IF('18-07-2019'!D332=\"\",\"\",'18-07-2019'!D332)","v":""},{"$f":"IF('18-07-2019'!E332=\"\",\"\",'18-07-2019'!E332)","v":""},{"$f":"IF('18-07-2019'!F332=\"\",\"\",'18-07-2019'!F332)","v":""}]
[null,{"$f":"IF('18-07-2019'!B333=\"\",\"\",'18-07-2019'!B333)","v":""},{"$f":"IF('18-07-2019'!C333=\"\",\"\",'18-07-2019'!C333)","v":""},{"$f":"IF('18-07-2019'!D333=\"\",\"\",'18-07-2019'!D333)","v":""},{"$f":"IF('18-07-2019'!E333=\"\",\"\",'18-07-2019'!E333)","v":""},{"$f":"IF('18-07-2019'!F333=\"\",\"\",'18-07-2019'!F333)","v":""}]
[null,{"$f":"IF('18-07-2019'!B334=\"\",\"\",'18-07-2019'!B334)","v":""},{"$f":"IF('18-07-2019'!C334=\"\",\"\",'18-07-2019'!C334)","v":""},{"$f":"IF('18-07-2019'!D334=\"\",\"\",'18-07-2019'!D334)","v":""},{"$f":"IF('18-07-2019'!E334=\"\",\"\",'18-07-2019'!E334)","v":""},{"$f":"IF('18-07-2019'!F334=\"\",\"\",'18-07-2019'!F334)","v":""}]
[null,{"$f":"IF('18-07-2019'!B335=\"\",\"\",'18-07-2019'!B335)","v":""},{"$f":"IF('18-07-2019'!C335=\"\",\"\",'18-07-2019'!C335)","v":""},{"$f":"IF('18-07-2019'!D335=\"\",\"\",'18-07-2019'!D335)","v":""},{"$f":"IF('18-07-2019'!E335=\"\",\"\",'18-07-2019'!E335)","v":""},{"$f":"IF('18-07-2019'!F335=\"\",\"\",'18-07-2019'!F335)","v":""}]
[null,{"$f":"IF('18-07-2019'!B336=\"\",\"\",'18-07-2019'!B336)","v":""},{"$f":"IF('18-07-2019'!C336=\"\",\"\",'18-07-2019'!C336)","v":""},{"$f":"IF('18-07-2019'!D336=\"\",\"\",'18-07-2019'!D336)","v":""},{"$f":"IF('18-07-2019'!E336=\"\",\"\",'18-07-2019'!E336)","v":""},{"$f":"IF('18-07-2019'!F336=\"\",\"\",'18-07-2019'!F336)","v":""}]
[null,{"$f":"IF('18-07-2019'!B337=\"\",\"\",'18-07-2019'!B337)","v":""},{"$f":"IF('18-07-2019'!C337=\"\",\"\",'18-07-2019'!C337)","v":""},{"$f":"IF('18-07-2019'!D337=\"\",\"\",'18-07-2019'!D337)","v":""},{"$f":"IF('18-07-2019'!E337=\"\",\"\",'18-07-2019'!E337)","v":""},{"$f":"IF('18-07-2019'!F337=\"\",\"\",'18-07-2019'!F337)","v":""}]
[null,{"$f":"IF('18-07-2019'!B338=\"\",\"\",'18-07-2019'!B338)","v":""},{"$f":"IF('18-07-2019'!C338=\"\",\"\",'18-07-2019'!C338)","v":""},{"$f":"IF('18-07-2019'!D338=\"\",\"\",'18-07-2019'!D338)","v":""},{"$f":"IF('18-07-2019'!E338=\"\",\"\",'18-07-2019'!E338)","v":""},{"$f":"IF('18-07-2019'!F338=\"\",\"\",'18-07-2019'!F338)","v":""}]
[null,{"$f":"IF('18-07-2019'!B339=\"\",\"\",'18-07-2019'!B339)","v":""},{"$f":"IF('18-07-2019'!C339=\"\",\"\",'18-07-2019'!C339)","v":""},{"$f":"IF('18-07-2019'!D339=\"\",\"\",'18-07-2019'!D339)","v":""},{"$f":"IF('18-07-2019'!E339=\"\",\"\",'18-07-2019'!E339)","v":""},{"$f":"IF('18-07-2019'!F339=\"\",\"\",'18-07-2019'!F339)","v":""}]
[null,{"$f":"IF('18-07-2019'!B340=\"\",\"\",'18-07-2019'!B340)","v":""},{"$f":"IF('18-07-2019'!C340=\"\",\"\",'18-07-2019'!C340)","v":""},{"$f":"IF('18-07-2019'!D340=\"\",\"\",'18-07-2019'!D340)","v":""},{"$f":"IF('18-07-2019'!E340=\"\",\"\",'18-07-2019'!E340)","v":""},{"$f":"IF('18-07-2019'!F340=\"\",\"\",'18-07-2019'!F340)","v":""}]
[null,{"$f":"IF('18-07-2019'!B341=\"\",\"\",'18-07-2019'!B341)","v":""},{"$f":"IF('18-07-2019'!C341=\"\",\"\",'18-07-2019'!C341)","v":""},{"$f":"IF('18-07-2019'!D341=\"\",\"\",'18-07-2019'!D341)","v":""},{"$f":"IF('18-07-2019'!E341=\"\",\"\",'18-07-2019'!E341)","v":""},{"$f":"IF('18-07-2019'!F341=\"\",\"\",'18-07-2019'!F341)","v":""}]
[null,{"$f":"IF('18-07-2019'!B342=\"\",\"\",'18-07-2019'!B342)","v":""},{"$f":"IF('18-07-2019'!C342=\"\",\"\",'18-07-2019'!C342)","v":""},{"$f":"IF('18-07-2019'!D342=\"\",\"\",'18-07-2019'!D342)","v":""},{"$f":"IF('18-07-2019'!E342=\"\",\"\",'18-07-2019'!E342)","v":""},{"$f":"IF('18-07-2019'!F342=\"\",\"\",'18-07-2019'!F342)","v":""}]
[null,{"$f":"IF('18-07-2019'!B343=\"\",\"\",'18-07-2019'!B343)","v":""},{"$f":"IF('18-07-2019'!C343=\"\",\"\",'18-07-2019'!C343)","v":""},{"$f":"IF('18-07-2019'!D343=\"\",\"\",'18-07-2019'!D343)","v":""},{"$f":"IF('18-07-2019'!E343=\"\",\"\",'18-07-2019'!E343)","v":""},{"$f":"IF('18-07-2019'!F343=\"\",\"\",'18-07-2019'!F343)","v":""}]
[null,{"$f":"IF('18-07-2019'!B344=\"\",\"\",'18-07-2019'!B344)","v":""},{"$f":"IF('18-07-2019'!C344=\"\",\"\",'18-07-2019'!C344)","v":""},{"$f":"IF('18-07-2019'!D344=\"\",\"\",'18-07-2019'!D344)","v":""},{"$f":"IF('18-07-2019'!E344=\"\",\"\",'18-07-2019'!E344)","v":""},{"$f":"IF('18-07-2019'!F344=\"\",\"\",'18-07-2019'!F344)","v":""}]
[null,{"$f":"IF('18-07-2019'!B345=\"\",\"\",'18-07-2019'!B345)","v":""},{"$f":"IF('18-07-2019'!C345=\"\",\"\",'18-07-2019'!C345)","v":""},{"$f":"IF('18-07-2019'!D345=\"\",\"\",'18-07-2019'!D345)","v":""},{"$f":"IF('18-07-2019'!E345=\"\",\"\",'18-07-2019'!E345)","v":""},{"$f":"IF('18-07-2019'!F345=\"\",\"\",'18-07-2019'!F345)","v":""}]
[null,{"$f":"IF('18-07-2019'!B346=\"\",\"\",'18-07-2019'!B346)","v":""},{"$f":"IF('18-07-2019'!C346=\"\",\"\",'18-07-2019'!C346)","v":""},{"$f":"IF('18-07-2019'!D346=\"\",\"\",'18-07-2019'!D346)","v":""},{"$f":"IF('18-07-2019'!E346=\"\",\"\",'18-07-2019'!E346)","v":""},{"$f":"IF('18-07-2019'!F346=\"\",\"\",'18-07-2019'!F346)","v":""}]
[null,{"$f":"IF('18-07-2019'!B347=\"\",\"\",'18-07-2019'!B347)","v":""},{"$f":"IF('18-07-2019'!C347=\"\",\"\",'18-07-2019'!C347)","v":""},{"$f":"IF('18-07-2019'!D347=\"\",\"\",'18-07-2019'!D347)","v":""},{"$f":"IF('18-07-2019'!E347=\"\",\"\",'18-07-2019'!E347)","v":""},{"$f":"IF('18-07-2019'!F347=\"\",\"\",'18-07-2019'!F347)","v":""}]
[null,{"$f":"IF('18-07-2019'!B348=\"\",\"\",'18-07-2019'!B348)","v":""},{"$f":"IF('18-07-2019'!C348=\"\",\"\",'18-07-2019'!C348)","v":""},{"$f":"IF('18-07-2019'!D348=\"\",\"\",'18-07-2019'!D348)","v":""},{"$f":"IF('18-07-2019'!E348=\"\",\"\",'18-07-2019'!E348)","v":""},{"$f":"IF('18-07-2019'!F348=\"\",\"\",'18-07-2019'!F348)","v":""}]
[null,{"$f":"IF('18-07-2019'!B349=\"\",\"\",'18-07-2019'!B349)","v":""},{"$f":"IF('18-07-2019'!C349=\"\",\"\",'18-07-2019'!C349)","v":""},{"$f":"IF('18-07-2019'!D349=\"\",\"\",'18-07-2019'!D349)","v":""},{"$f":"IF('18-07-2019'!E349=\"\",\"\",'18-07-2019'!E349)","v":""},{"$f":"IF('18-07-2019'!F349=\"\",\"\",'18-07-2019'!F349)","v":""}]
[null,{"$f":"IF('18-07-2019'!B350=\"\",\"\",'18-07-2019'!B350)","v":""},{"$f":"IF('18-07-2019'!C350=\"\",\"\",'18-07-2019'!C350)","v":""},{"$f":"IF('18-07-2019'!D350=\"\",\"\",'18-07-2019'!D350)","v":""},{"$f":"IF('18-07-2019'!E350=\"\",\"\",'18-07-2019'!E350)","v":""},{"$f":"IF('18-07-2019'!F350=\"\",\"\",'18-07-2019'!F350)","v":""}]
[null,{"$f":"IF('18-07-2019'!B351=\"\",\"\",'18-07-2019'!B351)","v":""},{"$f":"IF('18-07-2019'!C351=\"\",\"\",'18-07-2019'!C351)","v":""},{"$f":"IF('18-07-2019'!D351=\"\",\"\",'18-07-2019'!D351)","v":""},{"$f":"IF('18-07-2019'!E351=\"\",\"\",'18-07-2019'!E351)","v":""},{"$f":"IF('18-07-2019'!F351=\"\",\"\",'18-07-2019'!F351)","v":""}]
[null,{"$f":"IF('18-07-2019'!B352=\"\",\"\",'18-07-2019'!B352)","v":""},{"$f":"IF('18-07-2019'!C352=\"\",\"\",'18-07-2019'!C352)","v":""},{"$f":"IF('18-07-2019'!D352=\"\",\"\",'18-07-2019'!D352)","v":""},{"$f":"IF('18-07-2019'!E352=\"\",\"\",'18-07-2019'!E352)","v":""},{"$f":"IF('18-07-2019'!F352=\"\",\"\",'18-07-2019'!F352)","v":""}]
[null,{"$f":"IF('18-07-2019'!B353=\"\",\"\",'18-07-2019'!B353)","v":""},{"$f":"IF('18-07-2019'!C353=\"\",\"\",'18-07-2019'!C353)","v":""},{"$f":"IF('18-07-2019'!D353=\"\",\"\",'18-07-2019'!D353)","v":""},{"$f":"IF('18-07-2019'!E353=\"\",\"\",'18-07-2019'!E353)","v":""},{"$f":"IF('18-07-2019'!F353=\"\",\"\",'18-07-2019'!F353)","v":""}]
[null,{"$f":"IF('18-07-2019'!B354=\"\",\"\",'18-07-2019'!B354)","v":""},{"$f":"IF('18-07-2019'!C354=\"\",\"\",'18-07-2019'!C354)","v":""},{"$f":"IF('18-07-2019'!D354=\"\",\"\",'18-07-2019'!D354)","v":""},{"$f":"IF('18-07-2019'!E354=\"\",\"\",'18-07-2019'!E354)","v":""},{"$f":"IF('18-07-2019'!F354=\"\",\"\",'18-07-2019'!F354)","v":""}]
[null,{"$f":"IF('18-07-2019'!B355=\"\",\"\",'18-07-2019'!B355)","v":""},{"$f":"IF('18-07-2019'!C355=\"\",\"\",'18-07-2019'!C355)","v":""},{"$f":"IF('18-07-2019'!D355=\"\",\"\",'18-07-2019'!D355)","v":""},{"$f":"IF('18-07-2019'!E355=\"\",\"\",'18-07-2019'!E355)","v":""},{"$f":"IF('18-07-2019'!F355=\"\",\"\",'18-07-2019'!F355)","v":""}]
[null,{"$f":"IF('18-07-2019'!B356=\"\",\"\",'18-07-2019'!B356)","v":""},{"$f":"IF('18-07-2019'!C356=\"\",\"\",'18-07-2019'!C356)","v":""},{"$f":"IF('18-07-2019'!D356=\"\",\"\",'18-07-2019'!D356)","v":""},{"$f":"IF('18-07-2019'!E356=\"\",\"\",'18-07-2019'!E356)","v":""},{"$f":"IF('18-07-2019'!F356=\"\",\"\",'18-07-2019'!F356)","v":""}]
[null,{"$f":"IF('18-07-2019'!B357=\"\",\"\",'18-07-2019'!B357)","v":""},{"$f":"IF('18-07-2019'!C357=\"\",\"\",'18-07-2019'!C357)","v":""},{"$f":"IF('18-07-2019'!D357=\"\",\"\",'18-07-2019'!D357)","v":""},{"$f":"IF('18-07-2019'!E357=\"\",\"\",'18-07-2019'!E357)","v":""},{"$f":"IF('18-07-2019'!F357=\"\",\"\",'18-07-2019'!F357)","v":""}]
[null,{"$f":"IF('18-07-2019'!B358=\"\",\"\",'18-07-2019'!B358)","v":""},{"$f":"IF('18-07-2019'!C358=\"\",\"\",'18-07-2019'!C358)","v":""},{"$f":"IF('18-07-2019'!D358=\"\",\"\",'18-07-2019'!D358)","v":""},{"$f":"IF('18-07-2019'!E358=\"\",\"\",'18-07-2019'!E358)","v":""},{"$f":"IF('18-07-2019'!F358=\"\",\"\",'18-07-2019'!F358)","v":""}]
[null,{"$f":"IF('18-07-2019'!B359=\"\",\"\",'18-07-2019'!B359)","v":""},{"$f":"IF('18-07-2019'!C359=\"\",\"\",'18-07-2019'!C359)","v":""},{"$f":"IF('18-07-2019'!D359=\"\",\"\",'18-07-2019'!D359)","v":""},{"$f":"IF('18-07-2019'!E359=\"\",\"\",'18-07-2019'!E359)","v":""},{"$f":"IF('18-07-2019'!F359=\"\",\"\",'18-07-2019'!F359)","v":""}]
[null,{"$f":"IF('18-07-2019'!B360=\"\",\"\",'18-07-2019'!B360)","v":""},{"$f":"IF('18-07-2019'!C360=\"\",\"\",'18-07-2019'!C360)","v":""},{"$f":"IF('18-07-2019'!D360=\"\",\"\",'18-07-2019'!D360)","v":""},{"$f":"IF('18-07-2019'!E360=\"\",\"\",'18-07-2019'!E360)","v":""},{"$f":"IF('18-07-2019'!F360=\"\",\"\",'18-07-2019'!F360)","v":""}]
[null,{"$f":"IF('18-07-2019'!B361=\"\",\"\",'18-07-2019'!B361)","v":""},{"$f":"IF('18-07-2019'!C361=\"\",\"\",'18-07-2019'!C361)","v":""},{"$f":"IF('18-07-2019'!D361=\"\",\"\",'18-07-2019'!D361)","v":""},{"$f":"IF('18-07-2019'!E361=\"\",\"\",'18-07-2019'!E361)","v":""},{"$f":"IF('18-07-2019'!F361=\"\",\"\",'18-07-2019'!F361)","v":""}]
[null,{"$f":"IF('18-07-2019'!B362=\"\",\"\",'18-07-2019'!B362)","v":""},{"$f":"IF('18-07-2019'!C362=\"\",\"\",'18-07-2019'!C362)","v":""},{"$f":"IF('18-07-2019'!D362=\"\",\"\",'18-07-2019'!D362)","v":""},{"$f":"IF('18-07-2019'!E362=\"\",\"\",'18-07-2019'!E362)","v":""},{"$f":"IF('18-07-2019'!F362=\"\",\"\",'18-07-2019'!F362)","v":""}]
[null,{"$f":"IF('18-07-2019'!B363=\"\",\"\",'18-07-2019'!B363)","v":""},{"$f":"IF('18-07-2019'!C363=\"\",\"\",'18-07-2019'!C363)","v":""},{"$f":"IF('18-07-2019'!D363=\"\",\"\",'18-07-2019'!D363)","v":""},{"$f":"IF('18-07-2019'!E363=\"\",\"\",'18-07-2019'!E363)","v":""},{"$f":"IF('18-07-2019'!F363=\"\",\"\",'18-07-2019'!F363)","v":""}]
[null,{"$f":"IF('18-07-2019'!B364=\"\",\"\",'18-07-2019'!B364)","v":""},{"$f":"IF('18-07-2019'!C364=\"\",\"\",'18-07-2019'!C364)","v":""},{"$f":"IF('18-07-2019'!D364=\"\",\"\",'18-07-2019'!D364)","v":""},{"$f":"IF('18-07-2019'!E364=\"\",\"\",'18-07-2019'!E364)","v":""},{"$f":"IF('18-07-2019'!F364=\"\",\"\",'18-07-2019'!F364)","v":""}]
[null,{"$f":"IF('18-07-2019'!B365=\"\",\"\",'18-07-2019'!B365)","v":""},{"$f":"IF('18-07-2019'!C365=\"\",\"\",'18-07-2019'!C365)","v":""},{"$f":"IF('18-07-2019'!D365=\"\",\"\",'18-07-2019'!D365)","v":""},{"$f":"IF('18-07-2019'!E365=\"\",\"\",'18-07-2019'!E365)","v":""},{"$f":"IF('18-07-2019'!F365=\"\",\"\",'18-07-2019'!F365)","v":""}]
[null,{"$f":"IF('18-07-2019'!B366=\"\",\"\",'18-07-2019'!B366)","v":""},{"$f":"IF('18-07-2019'!C366=\"\",\"\",'18-07-2019'!C366)","v":""},{"$f":"IF('18-07-2019'!D366=\"\",\"\",'18-07-2019'!D366)","v":""},{"$f":"IF('18-07-2019'!E366=\"\",\"\",'18-07-2019'!E366)","v":""},{"$f":"IF('18-07-2019'!F366=\"\",\"\",'18-07-2019'!F366)","v":""}]
[null,{"$f":"IF('18-07-2019'!B367=\"\",\"\",'18-07-2019'!B367)","v":""},{"$f":"IF('18-07-2019'!C367=\"\",\"\",'18-07-2019'!C367)","v":""},{"$f":"IF('18-07-2019'!D367=\"\",\"\",'18-07-2019'!D367)","v":""},{"$f":"IF('18-07-2019'!E367=\"\",\"\",'18-07-2019'!E367)","v":""},{"$f":"IF('18-07-2019'!F367=\"\",\"\",'18-07-2019'!F367)","v":""}]
[null,{"$f":"IF('18-07-2019'!B368=\"\",\"\",'18-07-2019'!B368)","v":""},{"$f":"IF('18-07-2019'!C368=\"\",\"\",'18-07-2019'!C368)","v":""},{"$f":"IF('18-07-2019'!D368=\"\",\"\",'18-07-2019'!D368)","v":""},{"$f":"IF('18-07-2019'!E368=\"\",\"\",'18-07-2019'!E368)","v":""},{"$f":"IF('18-07-2019'!F368=\"\",\"\",'18-07-2019'!F368)","v":""}]
[null,{"$f":"IF('18-07-2019'!B369=\"\",\"\",'18-07-2019'!B369)","v":""},{"$f":"IF('18-07-2019'!C369=\"\",\"\",'18-07-2019'!C369)","v":""},{"$f":"IF('18-07-2019'!D369=\"\",\"\",'18-07-2019'!D369)","v":""},{"$f":"IF('18-07-2019'!E369=\"\",\"\",'18-07-2019'!E369)","v":""},{"$f":"IF('18-07-2019'!F369=\"\",\"\",'18-07-2019'!F369)","v":""}]
[null,{"$f":"IF('18-07-2019'!B370=\"\",\"\",'18-07-2019'!B370)","v":""},{"$f":"IF('18-07-2019'!C370=\"\",\"\",'18-07-2019'!C370)","v":""},{"$f":"IF('18-07-2019'!D370=\"\",\"\",'18-07-2019'!D370)","v":""},{"$f":"IF('18-07-2019'!E370=\"\",\"\",'18-07-2019'!E370)","v":""},{"$f":"IF('18-07-2019'!F370=\"\",\"\",'18-07-2019'!F370)","v":""}]
[null,{"$f":"IF('18-07-2019'!B371=\"\",\"\",'18-07-2019'!B371)","v":""},{"$f":"IF('18-07-2019'!C371=\"\",\"\",'18-07-2019'!C371)","v":""},{"$f":"IF('18-07-2019'!D371=\"\",\"\",'18-07-2019'!D371)","v":""},{"$f":"IF('18-07-2019'!E371=\"\",\"\",'18-07-2019'!E371)","v":""},{"$f":"IF('18-07-2019'!F371=\"\",\"\",'18-07-2019'!F371)","v":""}]
[null,{"$f":"IF('18-07-2019'!B372=\"\",\"\",'18-07-2019'!B372)","v":""},{"$f":"IF('18-07-2019'!C372=\"\",\"\",'18-07-2019'!C372)","v":""},{"$f":"IF('18-07-2019'!D372=\"\",\"\",'18-07-2019'!D372)","v":""},{"$f":"IF('18-07-2019'!E372=\"\",\"\",'18-07-2019'!E372)","v":""},{"$f":"IF('18-07-2019'!F372=\"\",\"\",'18-07-2019'!F372)","v":""}]
[null,{"$f":"IF('18-07-2019'!B373=\"\",\"\",'18-07-2019'!B373)","v":""},{"$f":"IF('18-07-2019'!C373=\"\",\"\",'18-07-2019'!C373)","v":""},{"$f":"IF('18-07-2019'!D373=\"\",\"\",'18-07-2019'!D373)","v":""},{"$f":"IF('18-07-2019'!E373=\"\",\"\",'18-07-2019'!E373)","v":""},{"$f":"IF('18-07-2019'!F373=\"\",\"\",'18-07-2019'!F373)","v":""}]
[null,{"$f":"IF('18-07-2019'!B374=\"\",\"\",'18-07-2019'!B374)","v":""},{"$f":"IF('18-07-2019'!C374=\"\",\"\",'18-07-2019'!C374)","v":""},{"$f":"IF('18-07-2019'!D374=\"\",\"\",'18-07-2019'!D374)","v":""},{"$f":"IF('18-07-2019'!E374=\"\",\"\",'18-07-2019'!E374)","v":""},{"$f":"IF('18-07-2019'!F374=\"\",\"\",'18-07-2019'!F374)","v":""}]
[null,{"$f":"IF('18-07-2019'!B375=\"\",\"\",'18-07-2019'!B375)","v":""},{"$f":"IF('18-07-2019'!C375=\"\",\"\",'18-07-2019'!C375)","v":""},{"$f":"IF('18-07-2019'!D375=\"\",\"\",'18-07-2019'!D375)","v":""},{"$f":"IF('18-07-2019'!E375=\"\",\"\",'18-07-2019'!E375)","v":""},{"$f":"IF('18-07-2019'!F375=\"\",\"\",'18-07-2019'!F375)","v":""}]
[null,{"$f":"IF('18-07-2019'!B376=\"\",\"\",'18-07-2019'!B376)","v":""},{"$f":"IF('18-07-2019'!C376=\"\",\"\",'18-07-2019'!C376)","v":""},{"$f":"IF('18-07-2019'!D376=\"\",\"\",'18-07-2019'!D376)","v":""},{"$f":"IF('18-07-2019'!E376=\"\",\"\",'18-07-2019'!E376)","v":""},{"$f":"IF('18-07-2019'!F376=\"\",\"\",'18-07-2019'!F376)","v":""}]
[null,{"$f":"IF('18-07-2019'!B377=\"\",\"\",'18-07-2019'!B377)","v":""},{"$f":"IF('18-07-2019'!C377=\"\",\"\",'18-07-2019'!C377)","v":""},{"$f":"IF('18-07-2019'!D377=\"\",\"\",'18-07-2019'!D377)","v":""},{"$f":"IF('18-07-2019'!E377=\"\",\"\",'18-07-2019'!E377)","v":""},{"$f":"IF('18-07-2019'!F377=\"\",\"\",'18-07-2019'!F377)","v":""}]
[null,{"$f":"IF('18-07-2019'!B378=\"\",\"\",'18-07-2019'!B378)","v":""},{"$f":"IF('18-07-2019'!C378=\"\",\"\",'18-07-2019'!C378)","v":""},{"$f":"IF('18-07-2019'!D378=\"\",\"\",'18-07-2019'!D378)","v":""},{"$f":"IF('18-07-2019'!E378=\"\",\"\",'18-07-2019'!E378)","v":""},{"$f":"IF('18-07-2019'!F378=\"\",\"\",'18-07-2019'!F378)","v":""}]
[null,{"$f":"IF('18-07-2019'!B379=\"\",\"\",'18-07-2019'!B379)","v":""},{"$f":"IF('18-07-2019'!C379=\"\",\"\",'18-07-2019'!C379)","v":""},{"$f":"IF('18-07-2019'!D379=\"\",\"\",'18-07-2019'!D379)","v":""},{"$f":"IF('18-07-2019'!E379=\"\",\"\",'18-07-2019'!E379)","v":""},{"$f":"IF('18-07-2019'!F379=\"\",\"\",'18-07-2019'!F379)","v":""}]
[null,{"$f":"IF('18-07-2019'!B380=\"\",\"\",'18-07-2019'!B380)","v":""},{"$f":"IF('18-07-2019'!C380=\"\",\"\",'18-07-2019'!C380)","v":""},{"$f":"IF('18-07-2019'!D380=\"\",\"\",'18-07-2019'!D380)","v":""},{"$f":"IF('18-07-2019'!E380=\"\",\"\",'18-07-2019'!E380)","v":""},{"$f":"IF('18-07-2019'!F380=\"\",\"\",'18-07-2019'!F380)","v":""}]
[null,{"$f":"IF('18-07-2019'!B381=\"\",\"\",'18-07-2019'!B381)","v":""},{"$f":"IF('18-07-2019'!C381=\"\",\"\",'18-07-2019'!C381)","v":""},{"$f":"IF('18-07-2019'!D381=\"\",\"\",'18-07-2019'!D381)","v":""},{"$f":"IF('18-07-2019'!E381=\"\",\"\",'18-07-2019'!E381)","v":""},{"$f":"IF('18-07-2019'!F381=\"\",\"\",'18-07-2019'!F381)","v":""}]
[null,{"$f":"IF('18-07-2019'!B382=\"\",\"\",'18-07-2019'!B382)","v":""},{"$f":"IF('18-07-2019'!C382=\"\",\"\",'18-07-2019'!C382)","v":""},{"$f":"IF('18-07-2019'!D382=\"\",\"\",'18-07-2019'!D382)","v":""},{"$f":"IF('18-07-2019'!E382=\"\",\"\",'18-07-2019'!E382)","v":""},{"$f":"IF('18-07-2019'!F382=\"\",\"\",'18-07-2019'!F382)","v":""}]
[null,{"$f":"IF('18-07-2019'!B383=\"\",\"\",'18-07-2019'!B383)","v":""},{"$f":"IF('18-07-2019'!C383=\"\",\"\",'18-07-2019'!C383)","v":""},{"$f":"IF('18-07-2019'!D383=\"\",\"\",'18-07-2019'!D383)","v":""},{"$f":"IF('18-07-2019'!E383=\"\",\"\",'18-07-2019'!E383)","v":""},{"$f":"IF('18-07-2019'!F383=\"\",\"\",'18-07-2019'!F383)","v":""}]
[null,{"$f":"IF('18-07-2019'!B384=\"\",\"\",'18-07-2019'!B384)","v":""},{"$f":"IF('18-07-2019'!C384=\"\",\"\",'18-07-2019'!C384)","v":""},{"$f":"IF('18-07-2019'!D384=\"\",\"\",'18-07-2019'!D384)","v":""},{"$f":"IF('18-07-2019'!E384=\"\",\"\",'18-07-2019'!E384)","v":""},{"$f":"IF('18-07-2019'!F384=\"\",\"\",'18-07-2019'!F384)","v":""}]
[null,{"$f":"IF('18-07-2019'!B385=\"\",\"\",'18-07-2019'!B385)","v":""},{"$f":"IF('18-07-2019'!C385=\"\",\"\",'18-07-2019'!C385)","v":""},{"$f":"IF('18-07-2019'!D385=\"\",\"\",'18-07-2019'!D385)","v":""},{"$f":"IF('18-07-2019'!E385=\"\",\"\",'18-07-2019'!E385)","v":""},{"$f":"IF('18-07-2019'!F385=\"\",\"\",'18-07-2019'!F385)","v":""}]
[null,{"$f":"IF('18-07-2019'!B386=\"\",\"\",'18-07-2019'!B386)","v":""},{"$f":"IF('18-07-2019'!C386=\"\",\"\",'18-07-2019'!C386)","v":""},{"$f":"IF('18-07-2019'!D386=\"\",\"\",'18-07-2019'!D386)","v":""},{"$f":"IF('18-07-2019'!E386=\"\",\"\",'18-07-2019'!E386)","v":""},{"$f":"IF('18-07-2019'!F386=\"\",\"\",'18-07-2019'!F386)","v":""}]
[null,{"$f":"IF('18-07-2019'!B387=\"\",\"\",'18-07-2019'!B387)","v":""},{"$f":"IF('18-07-2019'!C387=\"\",\"\",'18-07-2019'!C387)","v":""},{"$f":"IF('18-07-2019'!D387=\"\",\"\",'18-07-2019'!D387)","v":""},{"$f":"IF('18-07-2019'!E387=\"\",\"\",'18-07-2019'!E387)","v":""},{"$f":"IF('18-07-2019'!F387=\"\",\"\",'18-07-2019'!F387)","v":""}]
[null,{"$f":"IF('18-07-2019'!B388=\"\",\"\",'18-07-2019'!B388)","v":""},{"$f":"IF('18-07-2019'!C388=\"\",\"\",'18-07-2019'!C388)","v":""},{"$f":"IF('18-07-2019'!D388=\"\",\"\",'18-07-2019'!D388)","v":""},{"$f":"IF('18-07-2019'!E388=\"\",\"\",'18-07-2019'!E388)","v":""},{"$f":"IF('18-07-2019'!F388=\"\",\"\",'18-07-2019'!F388)","v":""}]
[null,{"$f":"IF('18-07-2019'!B389=\"\",\"\",'18-07-2019'!B389)","v":""},{"$f":"IF('18-07-2019'!C389=\"\",\"\",'18-07-2019'!C389)","v":""},{"$f":"IF('18-07-2019'!D389=\"\",\"\",'18-07-2019'!D389)","v":""},{"$f":"IF('18-07-2019'!E389=\"\",\"\",'18-07-2019'!E389)","v":""},{"$f":"IF('18-07-2019'!F389=\"\",\"\",'18-07-2019'!F389)","v":""}]
[null,{"$f":"IF('18-07-2019'!B390=\"\",\"\",'18-07-2019'!B390)","v":""},{"$f":"IF('18-07-2019'!C390=\"\",\"\",'18-07-2019'!C390)","v":""},{"$f":"IF('18-07-2019'!D390=\"\",\"\",'18-07-2019'!D390)","v":""},{"$f":"IF('18-07-2019'!E390=\"\",\"\",'18-07-2019'!E390)","v":""},{"$f":"IF('18-07-2019'!F390=\"\",\"\",'18-07-2019'!F390)","v":""}]
[null,{"$f":"IF('18-07-2019'!B391=\"\",\"\",'18-07-2019'!B391)","v":""},{"$f":"IF('18-07-2019'!C391=\"\",\"\",'18-07-2019'!C391)","v":""},{"$f":"IF('18-07-2019'!D391=\"\",\"\",'18-07-2019'!D391)","v":""},{"$f":"IF('18-07-2019'!E391=\"\",\"\",'18-07-2019'!E391)","v":""},{"$f":"IF('18-07-2019'!F391=\"\",\"\",'18-07-2019'!F391)","v":""}]
[null,{"$f":"IF('18-07-2019'!B392=\"\",\"\",'18-07-2019'!B392)","v":""},{"$f":"IF('18-07-2019'!C392=\"\",\"\",'18-07-2019'!C392)","v":""},{"$f":"IF('18-07-2019'!D392=\"\",\"\",'18-07-2019'!D392)","v":""},{"$f":"IF('18-07-2019'!E392=\"\",\"\",'18-07-2019'!E392)","v":""},{"$f":"IF('18-07-2019'!F392=\"\",\"\",'18-07-2019'!F392)","v":""}]
[null,{"$f":"IF('18-07-2019'!B393=\"\",\"\",'18-07-2019'!B393)","v":""},{"$f":"IF('18-07-2019'!C393=\"\",\"\",'18-07-2019'!C393)","v":""},{"$f":"IF('18-07-2019'!D393=\"\",\"\",'18-07-2019'!D393)","v":""},{"$f":"IF('18-07-2019'!E393=\"\",\"\",'18-07-2019'!E393)","v":""},{"$f":"IF('18-07-2019'!F393=\"\",\"\",'18-07-2019'!F393)","v":""}]
[null,{"$f":"IF('18-07-2019'!B394=\"\",\"\",'18-07-2019'!B394)","v":""},{"$f":"IF('18-07-2019'!C394=\"\",\"\",'18-07-2019'!C394)","v":""},{"$f":"IF('18-07-2019'!D394=\"\",\"\",'18-07-2019'!D394)","v":""},{"$f":"IF('18-07-2019'!E394=\"\",\"\",'18-07-2019'!E394)","v":""},{"$f":"IF('18-07-2019'!F394=\"\",\"\",'18-07-2019'!F394)","v":""}]
[null,{"$f":"IF('18-07-2019'!B395=\"\",\"\",'18-07-2019'!B395)","v":""},{"$f":"IF('18-07-2019'!C395=\"\",\"\",'18-07-2019'!C395)","v":""},{"$f":"IF('18-07-2019'!D395=\"\",\"\",'18-07-2019'!D395)","v":""},{"$f":"IF('18-07-2019'!E395=\"\",\"\",'18-07-2019'!E395)","v":""},{"$f":"IF('18-07-2019'!F395=\"\",\"\",'18-07-2019'!F395)","v":""}]
[null,{"$f":"IF('18-07-2019'!B396=\"\",\"\",'18-07-2019'!B396)","v":""},{"$f":"IF('18-07-2019'!C396=\"\",\"\",'18-07-2019'!C396)","v":""},{"$f":"IF('18-07-2019'!D396=\"\",\"\",'18-07-2019'!D396)","v":""},{"$f":"IF('18-07-2019'!E396=\"\",\"\",'18-07-2019'!E396)","v":""},{"$f":"IF('18-07-2019'!F396=\"\",\"\",'18-07-2019'!F396)","v":""}]
[null,{"$f":"IF('18-07-2019'!B397=\"\",\"\",'18-07-2019'!B397)","v":""},{"$f":"IF('18-07-2019'!C397=\"\",\"\",'18-07-2019'!C397)","v":""},{"$f":"IF('18-07-2019'!D397=\"\",\"\",'18-07-2019'!D397)","v":""},{"$f":"IF('18-07-2019'!E397=\"\",\"\",'18-07-2019'!E397)","v":""},{"$f":"IF('18-07-2019'!F397=\"\",\"\",'18-07-2019'!F397)","v":""}]
[null,{"$f":"IF('18-07-2019'!B398=\"\",\"\",'18-07-2019'!B398)","v":""},{"$f":"IF('18-07-2019'!C398=\"\",\"\",'18-07-2019'!C398)","v":""},{"$f":"IF('18-07-2019'!D398=\"\",\"\",'18-07-2019'!D398)","v":""},{"$f":"IF('18-07-2019'!E398=\"\",\"\",'18-07-2019'!E398)","v":""},{"$f":"IF('18-07-2019'!F398=\"\",\"\",'18-07-2019'!F398)","v":""}]
[null,{"$f":"IF('18-07-2019'!B399=\"\",\"\",'18-07-2019'!B399)","v":""},{"$f":"IF('18-07-2019'!C399=\"\",\"\",'18-07-2019'!C399)","v":""},{"$f":"IF('18-07-2019'!D399=\"\",\"\",'18-07-2019'!D399)","v":""},{"$f":"IF('18-07-2019'!E399=\"\",\"\",'18-07-2019'!E399)","v":""},{"$f":"IF('18-07-2019'!F399=\"\",\"\",'18-07-2019'!F399)","v":""}]
[null,{"$f":"IF('18-07-2019'!B400=\"\",\"\",'18-07-2019'!B400)","v":""},{"$f":"IF('18-07-2019'!C400=\"\",\"\",'18-07-2019'!C400)","v":""},{"$f":"IF('18-07-2019'!D400=\"\",\"\",'18-07-2019'!D400)","v":""},{"$f":"IF('18-07-2019'!E400=\"\",\"\",'18-07-2019'!E400)","v":""},{"$f":"IF('18-07-2019'!F400=\"\",\"\",'18-07-2019'!F400)","v":""}]
[null,{"$f":"IF('18-07-2019'!B401=\"\",\"\",'18-07-2019'!B401)","v":""},{"$f":"IF('18-07-2019'!C401=\"\",\"\",'18-07-2019'!C401)","v":""},{"$f":"IF('18-07-2019'!D401=\"\",\"\",'18-07-2019'!D401)","v":""},{"$f":"IF('18-07-2019'!E401=\"\",\"\",'18-07-2019'!E401)","v":""},{"$f":"IF('18-07-2019'!F401=\"\",\"\",'18-07-2019'!F401)","v":""}]
[null,{"$f":"IF('18-07-2019'!B402=\"\",\"\",'18-07-2019'!B402)","v":""},{"$f":"IF('18-07-2019'!C402=\"\",\"\",'18-07-2019'!C402)","v":""},{"$f":"IF('18-07-2019'!D402=\"\",\"\",'18-07-2019'!D402)","v":""},{"$f":"IF('18-07-2019'!E402=\"\",\"\",'18-07-2019'!E402)","v":""},{"$f":"IF('18-07-2019'!F402=\"\",\"\",'18-07-2019'!F402)","v":""}]
[null,{"$f":"IF('18-07-2019'!B403=\"\",\"\",'18-07-2019'!B403)","v":""},{"$f":"IF('18-07-2019'!C403=\"\",\"\",'18-07-2019'!C403)","v":""},{"$f":"IF('18-07-2019'!D403=\"\",\"\",'18-07-2019'!D403)","v":""},{"$f":"IF('18-07-2019'!E403=\"\",\"\",'18-07-2019'!E403)","v":""},{"$f":"IF('18-07-2019'!F403=\"\",\"\",'18-07-2019'!F403)","v":""}]
[null,{"$f":"IF('18-07-2019'!B404=\"\",\"\",'18-07-2019'!B404)","v":""},{"$f":"IF('18-07-2019'!C404=\"\",\"\",'18-07-2019'!C404)","v":""},{"$f":"IF('18-07-2019'!D404=\"\",\"\",'18-07-2019'!D404)","v":""},{"$f":"IF('18-07-2019'!E404=\"\",\"\",'18-07-2019'!E404)","v":""},{"$f":"IF('18-07-2019'!F404=\"\",\"\",'18-07-2019'!F404)","v":""}]
[null,{"$f":"IF('18-07-2019'!B405=\"\",\"\",'18-07-2019'!B405)","v":""},{"$f":"IF('18-07-2019'!C405=\"\",\"\",'18-07-2019'!C405)","v":""},{"$f":"IF('18-07-2019'!D405=\"\",\"\",'18-07-2019'!D405)","v":""},{"$f":"IF('18-07-2019'!E405=\"\",\"\",'18-07-2019'!E405)","v":""},{"$f":"IF('18-07-2019'!F405=\"\",\"\",'18-07-2019'!F405)","v":""}]
[null,{"$f":"IF('18-07-2019'!B406=\"\",\"\",'18-07-2019'!B406)","v":""},{"$f":"IF('18-07-2019'!C406=\"\",\"\",'18-07-2019'!C406)","v":""},{"$f":"IF('18-07-2019'!D406=\"\",\"\",'18-07-2019'!D406)","v":""},{"$f":"IF('18-07-2019'!E406=\"\",\"\",'18-07-2019'!E406)","v":""},{"$f":"IF('18-07-2019'!F406=\"\",\"\",'18-07-2019'!F406)","v":""}]
[null,{"$f":"IF('18-07-2019'!B407=\"\",\"\",'18-07-2019'!B407)","v":""},{"$f":"IF('18-07-2019'!C407=\"\",\"\",'18-07-2019'!C407)","v":""},{"$f":"IF('18-07-2019'!D407=\"\",\"\",'18-07-2019'!D407)","v":""},{"$f":"IF('18-07-2019'!E407=\"\",\"\",'18-07-2019'!E407)","v":""},{"$f":"IF('18-07-2019'!F407=\"\",\"\",'18-07-2019'!F407)","v":""}]
[null,{"$f":"IF('18-07-2019'!B408=\"\",\"\",'18-07-2019'!B408)","v":""},{"$f":"IF('18-07-2019'!C408=\"\",\"\",'18-07-2019'!C408)","v":""},{"$f":"IF('18-07-2019'!D408=\"\",\"\",'18-07-2019'!D408)","v":""},{"$f":"IF('18-07-2019'!E408=\"\",\"\",'18-07-2019'!E408)","v":""},{"$f":"IF('18-07-2019'!F408=\"\",\"\",'18-07-2019'!F408)","v":""}]
[null,{"$f":"IF('18-07-2019'!B409=\"\",\"\",'18-07-2019'!B409)","v":""},{"$f":"IF('18-07-2019'!C409=\"\",\"\",'18-07-2019'!C409)","v":""},{"$f":"IF('18-07-2019'!D409=\"\",\"\",'18-07-2019'!D409)","v":""},{"$f":"IF('18-07-2019'!E409=\"\",\"\",'18-07-2019'!E409)","v":""},{"$f":"IF('18-07-2019'!F409=\"\",\"\",'18-07-2019'!F409)","v":""}]
[null,{"$f":"IF('18-07-2019'!B410=\"\",\"\",'18-07-2019'!B410)","v":""},{"$f":"IF('18-07-2019'!C410=\"\",\"\",'18-07-2019'!C410)","v":""},{"$f":"IF('18-07-2019'!D410=\"\",\"\",'18-07-2019'!D410)","v":""},{"$f":"IF('18-07-2019'!E410=\"\",\"\",'18-07-2019'!E410)","v":""},{"$f":"IF('18-07-2019'!F410=\"\",\"\",'18-07-2019'!F410)","v":""}]
[null,{"$f":"IF('18-07-2019'!B411=\"\",\"\",'18-07-2019'!B411)","v":""},{"$f":"IF('18-07-2019'!C411=\"\",\"\",'18-07-2019'!C411)","v":""},{"$f":"IF('18-07-2019'!D411=\"\",\"\",'18-07-2019'!D411)","v":""},{"$f":"IF('18-07-2019'!E411=\"\",\"\",'18-07-2019'!E411)","v":""},{"$f":"IF('18-07-2019'!F411=\"\",\"\",'18-07-2019'!F411)","v":""}]
[null,{"$f":"IF('18-07-2019'!B412=\"\",\"\",'18-07-2019'!B412)","v":""},{"$f":"IF('18-07-2019'!C412=\"\",\"\",'18-07-2019'!C412)","v":""},{"$f":"IF('18-07-2019'!D412=\"\",\"\",'18-07-2019'!D412)","v":""},{"$f":"IF('18-07-2019'!E412=\"\",\"\",'18-07-2019'!E412)","v":""},{"$f":"IF('18-07-2019'!F412=\"\",\"\",'18-07-2019'!F412)","v":""}]
[null,{"$f":"IF('18-07-2019'!B413=\"\",\"\",'18-07-2019'!B413)","v":""},{"$f":"IF('18-07-2019'!C413=\"\",\"\",'18-07-2019'!C413)","v":""},{"$f":"IF('18-07-2019'!D413=\"\",\"\",'18-07-2019'!D413)","v":""},{"$f":"IF('18-07-2019'!E413=\"\",\"\",'18-07-2019'!E413)","v":""},{"$f":"IF('18-07-2019'!F413=\"\",\"\",'18-07-2019'!F413)","v":""}]
[null,{"$f":"IF('18-07-2019'!B414=\"\",\"\",'18-07-2019'!B414)","v":""},{"$f":"IF('18-07-2019'!C414=\"\",\"\",'18-07-2019'!C414)","v":""},{"$f":"IF('18-07-2019'!D414=\"\",\"\",'18-07-2019'!D414)","v":""},{"$f":"IF('18-07-2019'!E414=\"\",\"\",'18-07-2019'!E414)","v":""},{"$f":"IF('18-07-2019'!F414=\"\",\"\",'18-07-2019'!F414)","v":""}]
[null,{"$f":"IF('18-07-2019'!B415=\"\",\"\",'18-07-2019'!B415)","v":""},{"$f":"IF('18-07-2019'!C415=\"\",\"\",'18-07-2019'!C415)","v":""},{"$f":"IF('18-07-2019'!D415=\"\",\"\",'18-07-2019'!D415)","v":""},{"$f":"IF('18-07-2019'!E415=\"\",\"\",'18-07-2019'!E415)","v":""},{"$f":"IF('18-07-2019'!F415=\"\",\"\",'18-07-2019'!F415)","v":""}]
[null,{"$f":"IF('18-07-2019'!B416=\"\",\"\",'18-07-2019'!B416)","v":""},{"$f":"IF('18-07-2019'!C416=\"\",\"\",'18-07-2019'!C416)","v":""},{"$f":"IF('18-07-2019'!D416=\"\",\"\",'18-07-2019'!D416)","v":""},{"$f":"IF('18-07-2019'!E416=\"\",\"\",'18-07-2019'!E416)","v":""},{"$f":"IF('18-07-2019'!F416=\"\",\"\",'18-07-2019'!F416)","v":""}]
[null,{"$f":"IF('18-07-2019'!B417=\"\",\"\",'18-07-2019'!B417)","v":""},{"$f":"IF('18-07-2019'!C417=\"\",\"\",'18-07-2019'!C417)","v":""},{"$f":"IF('18-07-2019'!D417=\"\",\"\",'18-07-2019'!D417)","v":""},{"$f":"IF('18-07-2019'!E417=\"\",\"\",'18-07-2019'!E417)","v":""},{"$f":"IF('18-07-2019'!F417=\"\",\"\",'18-07-2019'!F417)","v":""}]
[null,{"$f":"IF('18-07-2019'!B418=\"\",\"\",'18-07-2019'!B418)","v":""},{"$f":"IF('18-07-2019'!C418=\"\",\"\",'18-07-2019'!C418)","v":""},{"$f":"IF('18-07-2019'!D418=\"\",\"\",'18-07-2019'!D418)","v":""},{"$f":"IF('18-07-2019'!E418=\"\",\"\",'18-07-2019'!E418)","v":""},{"$f":"IF('18-07-2019'!F418=\"\",\"\",'18-07-2019'!F418)","v":""}]
[null,{"$f":"IF('18-07-2019'!B419=\"\",\"\",'18-07-2019'!B419)","v":""},{"$f":"IF('18-07-2019'!C419=\"\",\"\",'18-07-2019'!C419)","v":""},{"$f":"IF('18-07-2019'!D419=\"\",\"\",'18-07-2019'!D419)","v":""},{"$f":"IF('18-07-2019'!E419=\"\",\"\",'18-07-2019'!E419)","v":""},{"$f":"IF('18-07-2019'!F419=\"\",\"\",'18-07-2019'!F419)","v":""}]
[null,{"$f":"IF('18-07-2019'!B420=\"\",\"\",'18-07-2019'!B420)","v":""},{"$f":"IF('18-07-2019'!C420=\"\",\"\",'18-07-2019'!C420)","v":""},{"$f":"IF('18-07-2019'!D420=\"\",\"\",'18-07-2019'!D420)","v":""},{"$f":"IF('18-07-2019'!E420=\"\",\"\",'18-07-2019'!E420)","v":""},{"$f":"IF('18-07-2019'!F420=\"\",\"\",'18-07-2019'!F420)","v":""}]
[null,{"$f":"IF('18-07-2019'!B421=\"\",\"\",'18-07-2019'!B421)","v":""},{"$f":"IF('18-07-2019'!C421=\"\",\"\",'18-07-2019'!C421)","v":""},{"$f":"IF('18-07-2019'!D421=\"\",\"\",'18-07-2019'!D421)","v":""},{"$f":"IF('18-07-2019'!E421=\"\",\"\",'18-07-2019'!E421)","v":""},{"$f":"IF('18-07-2019'!F421=\"\",\"\",'18-07-2019'!F421)","v":""}]
[null,{"$f":"IF('18-07-2019'!B422=\"\",\"\",'18-07-2019'!B422)","v":""},{"$f":"IF('18-07-2019'!C422=\"\",\"\",'18-07-2019'!C422)","v":""},{"$f":"IF('18-07-2019'!D422=\"\",\"\",'18-07-2019'!D422)","v":""},{"$f":"IF('18-07-2019'!E422=\"\",\"\",'18-07-2019'!E422)","v":""},{"$f":"IF('18-07-2019'!F422=\"\",\"\",'18-07-2019'!F422)","v":""}]
[null,{"$f":"IF('18-07-2019'!B423=\"\",\"\",'18-07-2019'!B423)","v":""},{"$f":"IF('18-07-2019'!C423=\"\",\"\",'18-07-2019'!C423)","v":""},{"$f":"IF('18-07-2019'!D423=\"\",\"\",'18-07-2019'!D423)","v":""},{"$f":"IF('18-07-2019'!E423=\"\",\"\",'18-07-2019'!E423)","v":""},{"$f":"IF('18-07-2019'!F423=\"\",\"\",'18-07-2019'!F423)","v":""}]
[null,{"$f":"IF('18-07-2019'!B424=\"\",\"\",'18-07-2019'!B424)","v":""},{"$f":"IF('18-07-2019'!C424=\"\",\"\",'18-07-2019'!C424)","v":""},{"$f":"IF('18-07-2019'!D424=\"\",\"\",'18-07-2019'!D424)","v":""},{"$f":"IF('18-07-2019'!E424=\"\",\"\",'18-07-2019'!E424)","v":""},{"$f":"IF('18-07-2019'!F424=\"\",\"\",'18-07-2019'!F424)","v":""}]
[null,{"$f":"IF('18-07-2019'!B425=\"\",\"\",'18-07-2019'!B425)","v":""},{"$f":"IF('18-07-2019'!C425=\"\",\"\",'18-07-2019'!C425)","v":""},{"$f":"IF('18-07-2019'!D425=\"\",\"\",'18-07-2019'!D425)","v":""},{"$f":"IF('18-07-2019'!E425=\"\",\"\",'18-07-2019'!E425)","v":""},{"$f":"IF('18-07-2019'!F425=\"\",\"\",'18-07-2019'!F425)","v":""}]
[null,{"$f":"IF('18-07-2019'!B426=\"\",\"\",'18-07-2019'!B426)","v":""},{"$f":"IF('18-07-2019'!C426=\"\",\"\",'18-07-2019'!C426)","v":""},{"$f":"IF('18-07-2019'!D426=\"\",\"\",'18-07-2019'!D426)","v":""},{"$f":"IF('18-07-2019'!E426=\"\",\"\",'18-07-2019'!E426)","v":""},{"$f":"IF('18-07-2019'!F426=\"\",\"\",'18-07-2019'!F426)","v":""}]
[null,{"$f":"IF('18-07-2019'!B427=\"\",\"\",'18-07-2019'!B427)","v":""},{"$f":"IF('18-07-2019'!C427=\"\",\"\",'18-07-2019'!C427)","v":""},{"$f":"IF('18-07-2019'!D427=\"\",\"\",'18-07-2019'!D427)","v":""},{"$f":"IF('18-07-2019'!E427=\"\",\"\",'18-07-2019'!E427)","v":""},{"$f":"IF('18-07-2019'!F427=\"\",\"\",'18-07-2019'!F427)","v":""}]
[null,{"$f":"IF('18-07-2019'!B428=\"\",\"\",'18-07-2019'!B428)","v":""},{"$f":"IF('18-07-2019'!C428=\"\",\"\",'18-07-2019'!C428)","v":""},{"$f":"IF('18-07-2019'!D428=\"\",\"\",'18-07-2019'!D428)","v":""},{"$f":"IF('18-07-2019'!E428=\"\",\"\",'18-07-2019'!E428)","v":""},{"$f":"IF('18-07-2019'!F428=\"\",\"\",'18-07-2019'!F428)","v":""}]
[null,{"$f":"IF('18-07-2019'!B429=\"\",\"\",'18-07-2019'!B429)","v":""},{"$f":"IF('18-07-2019'!C429=\"\",\"\",'18-07-2019'!C429)","v":""},{"$f":"IF('18-07-2019'!D429=\"\",\"\",'18-07-2019'!D429)","v":""},{"$f":"IF('18-07-2019'!E429=\"\",\"\",'18-07-2019'!E429)","v":""},{"$f":"IF('18-07-2019'!F429=\"\",\"\",'18-07-2019'!F429)","v":""}]
[null,{"$f":"IF('18-07-2019'!B430=\"\",\"\",'18-07-2019'!B430)","v":""},{"$f":"IF('18-07-2019'!C430=\"\",\"\",'18-07-2019'!C430)","v":""},{"$f":"IF('18-07-2019'!D430=\"\",\"\",'18-07-2019'!D430)","v":""},{"$f":"IF('18-07-2019'!E430=\"\",\"\",'18-07-2019'!E430)","v":""},{"$f":"IF('18-07-2019'!F430=\"\",\"\",'18-07-2019'!F430)","v":""}]
[null,{"$f":"IF('18-07-2019'!B431=\"\",\"\",'18-07-2019'!B431)","v":""},{"$f":"IF('18-07-2019'!C431=\"\",\"\",'18-07-2019'!C431)","v":""},{"$f":"IF('18-07-2019'!D431=\"\",\"\",'18-07-2019'!D431)","v":""},{"$f":"IF('18-07-2019'!E431=\"\",\"\",'18-07-2019'!E431)","v":""},{"$f":"IF('18-07-2019'!F431=\"\",\"\",'18-07-2019'!F431)","v":""}]
[null,{"$f":"IF('18-07-2019'!B432=\"\",\"\",'18-07-2019'!B432)","v":""},{"$f":"IF('18-07-2019'!C432=\"\",\"\",'18-07-2019'!C432)","v":""},{"$f":"IF('18-07-2019'!D432=\"\",\"\",'18-07-2019'!D432)","v":""},{"$f":"IF('18-07-2019'!E432=\"\",\"\",'18-07-2019'!E432)","v":""},{"$f":"IF('18-07-2019'!F432=\"\",\"\",'18-07-2019'!F432)","v":""}]
[null,{"$f":"IF('18-07-2019'!B433=\"\",\"\",'18-07-2019'!B433)","v":""},{"$f":"IF('18-07-2019'!C433=\"\",\"\",'18-07-2019'!C433)","v":""},{"$f":"IF('18-07-2019'!D433=\"\",\"\",'18-07-2019'!D433)","v":""},{"$f":"IF('18-07-2019'!E433=\"\",\"\",'18-07-2019'!E433)","v":""},{"$f":"IF('18-07-2019'!F433=\"\",\"\",'18-07-2019'!F433)","v":""}]
[null,{"$f":"IF('18-07-2019'!B434=\"\",\"\",'18-07-2019'!B434)","v":""},{"$f":"IF('18-07-2019'!C434=\"\",\"\",'18-07-2019'!C434)","v":""},{"$f":"IF('18-07-2019'!D434=\"\",\"\",'18-07-2019'!D434)","v":""},{"$f":"IF('18-07-2019'!E434=\"\",\"\",'18-07-2019'!E434)","v":""},{"$f":"IF('18-07-2019'!F434=\"\",\"\",'18-07-2019'!F434)","v":""}]
[null,{"$f":"IF('18-07-2019'!B435=\"\",\"\",'18-07-2019'!B435)","v":""},{"$f":"IF('18-07-2019'!C435=\"\",\"\",'18-07-2019'!C435)","v":""},{"$f":"IF('18-07-2019'!D435=\"\",\"\",'18-07-2019'!D435)","v":""},{"$f":"IF('18-07-2019'!E435=\"\",\"\",'18-07-2019'!E435)","v":""},{"$f":"IF('18-07-2019'!F435=\"\",\"\",'18-07-2019'!F435)","v":""}]
[null,{"$f":"IF('18-07-2019'!B436=\"\",\"\",'18-07-2019'!B436)","v":""},{"$f":"IF('18-07-2019'!C436=\"\",\"\",'18-07-2019'!C436)","v":""},{"$f":"IF('18-07-2019'!D436=\"\",\"\",'18-07-2019'!D436)","v":""},{"$f":"IF('18-07-2019'!E436=\"\",\"\",'18-07-2019'!E436)","v":""},{"$f":"IF('18-07-2019'!F436=\"\",\"\",'18-07-2019'!F436)","v":""}]
[null,{"$f":"IF('18-07-2019'!B437=\"\",\"\",'18-07-2019'!B437)","v":""},{"$f":"IF('18-07-2019'!C437=\"\",\"\",'18-07-2019'!C437)","v":""},{"$f":"IF('18-07-2019'!D437=\"\",\"\",'18-07-2019'!D437)","v":""},{"$f":"IF('18-07-2019'!E437=\"\",\"\",'18-07-2019'!E437)","v":""},{"$f":"IF('18-07-2019'!F437=\"\",\"\",'18-07-2019'!F437)","v":""}]
[null,{"$f":"IF('18-07-2019'!B438=\"\",\"\",'18-07-2019'!B438)","v":""},{"$f":"IF('18-07-2019'!C438=\"\",\"\",'18-07-2019'!C438)","v":""},{"$f":"IF('18-07-2019'!D438=\"\",\"\",'18-07-2019'!D438)","v":""},{"$f":"IF('18-07-2019'!E438=\"\",\"\",'18-07-2019'!E438)","v":""},{"$f":"IF('18-07-2019'!F438=\"\",\"\",'18-07-2019'!F438)","v":""}]
[null,{"$f":"IF('18-07-2019'!B439=\"\",\"\",'18-07-2019'!B439)","v":""},{"$f":"IF('18-07-2019'!C439=\"\",\"\",'18-07-2019'!C439)","v":""},{"$f":"IF('18-07-2019'!D439=\"\",\"\",'18-07-2019'!D439)","v":""},{"$f":"IF('18-07-2019'!E439=\"\",\"\",'18-07-2019'!E439)","v":""},{"$f":"IF('18-07-2019'!F439=\"\",\"\",'18-07-2019'!F439)","v":""}]
[null,{"$f":"IF('18-07-2019'!B440=\"\",\"\",'18-07-2019'!B440)","v":""},{"$f":"IF('18-07-2019'!C440=\"\",\"\",'18-07-2019'!C440)","v":""},{"$f":"IF('18-07-2019'!D440=\"\",\"\",'18-07-2019'!D440)","v":""},{"$f":"IF('18-07-2019'!E440=\"\",\"\",'18-07-2019'!E440)","v":""},{"$f":"IF('18-07-2019'!F440=\"\",\"\",'18-07-2019'!F440)","v":""}]
[null,{"$f":"IF('18-07-2019'!B441=\"\",\"\",'18-07-2019'!B441)","v":""},{"$f":"IF('18-07-2019'!C441=\"\",\"\",'18-07-2019'!C441)","v":""},{"$f":"IF('18-07-2019'!D441=\"\",\"\",'18-07-2019'!D441)","v":""},{"$f":"IF('18-07-2019'!E441=\"\",\"\",'18-07-2019'!E441)","v":""},{"$f":"IF('18-07-2019'!F441=\"\",\"\",'18-07-2019'!F441)","v":""}]
[null,{"$f":"IF('18-07-2019'!B442=\"\",\"\",'18-07-2019'!B442)","v":""},{"$f":"IF('18-07-2019'!C442=\"\",\"\",'18-07-2019'!C442)","v":""},{"$f":"IF('18-07-2019'!D442=\"\",\"\",'18-07-2019'!D442)","v":""},{"$f":"IF('18-07-2019'!E442=\"\",\"\",'18-07-2019'!E442)","v":""},{"$f":"IF('18-07-2019'!F442=\"\",\"\",'18-07-2019'!F442)","v":""}]
[null,{"$f":"IF('18-07-2019'!B443=\"\",\"\",'18-07-2019'!B443)","v":""},{"$f":"IF('18-07-2019'!C443=\"\",\"\",'18-07-2019'!C443)","v":""},{"$f":"IF('18-07-2019'!D443=\"\",\"\",'18-07-2019'!D443)","v":""},{"$f":"IF('18-07-2019'!E443=\"\",\"\",'18-07-2019'!E443)","v":""},{"$f":"IF('18-07-2019'!F443=\"\",\"\",'18-07-2019'!F443)","v":""}]
[null,{"$f":"IF('18-07-2019'!B444=\"\",\"\",'18-07-2019'!B444)","v":""},{"$f":"IF('18-07-2019'!C444=\"\",\"\",'18-07-2019'!C444)","v":""},{"$f":"IF('18-07-2019'!D444=\"\",\"\",'18-07-2019'!D444)","v":""},{"$f":"IF('18-07-2019'!E444=\"\",\"\",'18-07-2019'!E444)","v":""},{"$f":"IF('18-07-2019'!F444=\"\",\"\",'18-07-2019'!F444)","v":""}]
[null,{"$f":"IF('18-07-2019'!B445=\"\",\"\",'18-07-2019'!B445)","v":""},{"$f":"IF('18-07-2019'!C445=\"\",\"\",'18-07-2019'!C445)","v":""},{"$f":"IF('18-07-2019'!D445=\"\",\"\",'18-07-2019'!D445)","v":""},{"$f":"IF('18-07-2019'!E445=\"\",\"\",'18-07-2019'!E445)","v":""},{"$f":"IF('18-07-2019'!F445=\"\",\"\",'18-07-2019'!F445)","v":""}]
[null,{"$f":"IF('18-07-2019'!B446=\"\",\"\",'18-07-2019'!B446)","v":""},{"$f":"IF('18-07-2019'!C446=\"\",\"\",'18-07-2019'!C446)","v":""},{"$f":"IF('18-07-2019'!D446=\"\",\"\",'18-07-2019'!D446)","v":""},{"$f":"IF('18-07-2019'!E446=\"\",\"\",'18-07-2019'!E446)","v":""},{"$f":"IF('18-07-2019'!F446=\"\",\"\",'18-07-2019'!F446)","v":""}]
[null,{"$f":"IF('18-07-2019'!B447=\"\",\"\",'18-07-2019'!B447)","v":""},{"$f":"IF('18-07-2019'!C447=\"\",\"\",'18-07-2019'!C447)","v":""},{"$f":"IF('18-07-2019'!D447=\"\",\"\",'18-07-2019'!D447)","v":""},{"$f":"IF('18-07-2019'!E447=\"\",\"\",'18-07-2019'!E447)","v":""},{"$f":"IF('18-07-2019'!F447=\"\",\"\",'18-07-2019'!F447)","v":""}]
[null,{"$f":"IF('18-07-2019'!B448=\"\",\"\",'18-07-2019'!B448)","v":""},{"$f":"IF('18-07-2019'!C448=\"\",\"\",'18-07-2019'!C448)","v":""},{"$f":"IF('18-07-2019'!D448=\"\",\"\",'18-07-2019'!D448)","v":""},{"$f":"IF('18-07-2019'!E448=\"\",\"\",'18-07-2019'!E448)","v":""},{"$f":"IF('18-07-2019'!F448=\"\",\"\",'18-07-2019'!F448)","v":""}]
[null,{"$f":"IF('18-07-2019'!B449=\"\",\"\",'18-07-2019'!B449)","v":""},{"$f":"IF('18-07-2019'!C449=\"\",\"\",'18-07-2019'!C449)","v":""},{"$f":"IF('18-07-2019'!D449=\"\",\"\",'18-07-2019'!D449)","v":""},{"$f":"IF('18-07-2019'!E449=\"\",\"\",'18-07-2019'!E449)","v":""},{"$f":"IF('18-07-2019'!F449=\"\",\"\",'18-07-2019'!F449)","v":""}]
[null,{"$f":"IF('18-07-2019'!B450=\"\",\"\",'18-07-2019'!B450)","v":""},{"$f":"IF('18-07-2019'!C450=\"\",\"\",'18-07-2019'!C450)","v":""},{"$f":"IF('18-07-2019'!D450=\"\",\"\",'18-07-2019'!D450)","v":""},{"$f":"IF('18-07-2019'!E450=\"\",\"\",'18-07-2019'!E450)","v":""},{"$f":"IF('18-07-2019'!F450=\"\",\"\",'18-07-2019'!F450)","v":""}]
[null,{"$f":"IF('18-07-2019'!B451=\"\",\"\",'18-07-2019'!B451)","v":""},{"$f":"IF('18-07-2019'!C451=\"\",\"\",'18-07-2019'!C451)","v":""},{"$f":"IF('18-07-2019'!D451=\"\",\"\",'18-07-2019'!D451)","v":""},{"$f":"IF('18-07-2019'!E451=\"\",\"\",'18-07-2019'!E451)","v":""},{"$f":"IF('18-07-2019'!F451=\"\",\"\",'18-07-2019'!F451)","v":""}]
[null,{"$f":"IF('18-07-2019'!B452=\"\",\"\",'18-07-2019'!B452)","v":""},{"$f":"IF('18-07-2019'!C452=\"\",\"\",'18-07-2019'!C452)","v":""},{"$f":"IF('18-07-2019'!D452=\"\",\"\",'18-07-2019'!D452)","v":""},{"$f":"IF('18-07-2019'!E452=\"\",\"\",'18-07-2019'!E452)","v":""},{"$f":"IF('18-07-2019'!F452=\"\",\"\",'18-07-2019'!F452)","v":""}]
[null,{"$f":"IF('18-07-2019'!B453=\"\",\"\",'18-07-2019'!B453)","v":""},{"$f":"IF('18-07-2019'!C453=\"\",\"\",'18-07-2019'!C453)","v":""},{"$f":"IF('18-07-2019'!D453=\"\",\"\",'18-07-2019'!D453)","v":""},{"$f":"IF('18-07-2019'!E453=\"\",\"\",'18-07-2019'!E453)","v":""},{"$f":"IF('18-07-2019'!F453=\"\",\"\",'18-07-2019'!F453)","v":""}]
[null,{"$f":"IF('18-07-2019'!B454=\"\",\"\",'18-07-2019'!B454)","v":""},{"$f":"IF('18-07-2019'!C454=\"\",\"\",'18-07-2019'!C454)","v":""},{"$f":"IF('18-07-2019'!D454=\"\",\"\",'18-07-2019'!D454)","v":""},{"$f":"IF('18-07-2019'!E454=\"\",\"\",'18-07-2019'!E454)","v":""},{"$f":"IF('18-07-2019'!F454=\"\",\"\",'18-07-2019'!F454)","v":""}]
[null,{"$f":"IF('18-07-2019'!B455=\"\",\"\",'18-07-2019'!B455)","v":""},{"$f":"IF('18-07-2019'!C455=\"\",\"\",'18-07-2019'!C455)","v":""},{"$f":"IF('18-07-2019'!D455=\"\",\"\",'18-07-2019'!D455)","v":""},{"$f":"IF('18-07-2019'!E455=\"\",\"\",'18-07-2019'!E455)","v":""},{"$f":"IF('18-07-2019'!F455=\"\",\"\",'18-07-2019'!F455)","v":""}]
[null,{"$f":"IF('18-07-2019'!B456=\"\",\"\",'18-07-2019'!B456)","v":""},{"$f":"IF('18-07-2019'!C456=\"\",\"\",'18-07-2019'!C456)","v":""},{"$f":"IF('18-07-2019'!D456=\"\",\"\",'18-07-2019'!D456)","v":""},{"$f":"IF('18-07-2019'!E456=\"\",\"\",'18-07-2019'!E456)","v":""},{"$f":"IF('18-07-2019'!F456=\"\",\"\",'18-07-2019'!F456)","v":""}]
[null,{"$f":"IF('18-07-2019'!B457=\"\",\"\",'18-07-2019'!B457)","v":""},{"$f":"IF('18-07-2019'!C457=\"\",\"\",'18-07-2019'!C457)","v":""},{"$f":"IF('18-07-2019'!D457=\"\",\"\",'18-07-2019'!D457)","v":""},{"$f":"IF('18-07-2019'!E457=\"\",\"\",'18-07-2019'!E457)","v":""},{"$f":"IF('18-07-2019'!F457=\"\",\"\",'18-07-2019'!F457)","v":""}]
[null,{"$f":"IF('18-07-2019'!B458=\"\",\"\",'18-07-2019'!B458)","v":""},{"$f":"IF('18-07-2019'!C458=\"\",\"\",'18-07-2019'!C458)","v":""},{"$f":"IF('18-07-2019'!D458=\"\",\"\",'18-07-2019'!D458)","v":""},{"$f":"IF('18-07-2019'!E458=\"\",\"\",'18-07-2019'!E458)","v":""},{"$f":"IF('18-07-2019'!F458=\"\",\"\",'18-07-2019'!F458)","v":""}]
[null,{"$f":"IF('18-07-2019'!B459=\"\",\"\",'18-07-2019'!B459)","v":""},{"$f":"IF('18-07-2019'!C459=\"\",\"\",'18-07-2019'!C459)","v":""},{"$f":"IF('18-07-2019'!D459=\"\",\"\",'18-07-2019'!D459)","v":""},{"$f":"IF('18-07-2019'!E459=\"\",\"\",'18-07-2019'!E459)","v":""},{"$f":"IF('18-07-2019'!F459=\"\",\"\",'18-07-2019'!F459)","v":""}]
[null,{"$f":"IF('18-07-2019'!B460=\"\",\"\",'18-07-2019'!B460)","v":""},{"$f":"IF('18-07-2019'!C460=\"\",\"\",'18-07-2019'!C460)","v":""},{"$f":"IF('18-07-2019'!D460=\"\",\"\",'18-07-2019'!D460)","v":""},{"$f":"IF('18-07-2019'!E460=\"\",\"\",'18-07-2019'!E460)","v":""},{"$f":"IF('18-07-2019'!F460=\"\",\"\",'18-07-2019'!F460)","v":""}]
[null,{"$f":"IF('18-07-2019'!B461=\"\",\"\",'18-07-2019'!B461)","v":""},{"$f":"IF('18-07-2019'!C461=\"\",\"\",'18-07-2019'!C461)","v":""},{"$f":"IF('18-07-2019'!D461=\"\",\"\",'18-07-2019'!D461)","v":""},{"$f":"IF('18-07-2019'!E461=\"\",\"\",'18-07-2019'!E461)","v":""},{"$f":"IF('18-07-2019'!F461=\"\",\"\",'18-07-2019'!F461)","v":""}]
[null,{"$f":"IF('18-07-2019'!B462=\"\",\"\",'18-07-2019'!B462)","v":""},{"$f":"IF('18-07-2019'!C462=\"\",\"\",'18-07-2019'!C462)","v":""},{"$f":"IF('18-07-2019'!D462=\"\",\"\",'18-07-2019'!D462)","v":""},{"$f":"IF('18-07-2019'!E462=\"\",\"\",'18-07-2019'!E462)","v":""},{"$f":"IF('18-07-2019'!F462=\"\",\"\",'18-07-2019'!F462)","v":""}]
[null,{"$f":"IF('18-07-2019'!B463=\"\",\"\",'18-07-2019'!B463)","v":""},{"$f":"IF('18-07-2019'!C463=\"\",\"\",'18-07-2019'!C463)","v":""},{"$f":"IF('18-07-2019'!D463=\"\",\"\",'18-07-2019'!D463)","v":""},{"$f":"IF('18-07-2019'!E463=\"\",\"\",'18-07-2019'!E463)","v":""},{"$f":"IF('18-07-2019'!F463=\"\",\"\",'18-07-2019'!F463)","v":""}]
[null,{"$f":"IF('18-07-2019'!B464=\"\",\"\",'18-07-2019'!B464)","v":""},{"$f":"IF('18-07-2019'!C464=\"\",\"\",'18-07-2019'!C464)","v":""},{"$f":"IF('18-07-2019'!D464=\"\",\"\",'18-07-2019'!D464)","v":""},{"$f":"IF('18-07-2019'!E464=\"\",\"\",'18-07-2019'!E464)","v":""},{"$f":"IF('18-07-2019'!F464=\"\",\"\",'18-07-2019'!F464)","v":""}]
[null,{"$f":"IF('18-07-2019'!B465=\"\",\"\",'18-07-2019'!B465)","v":""},{"$f":"IF('18-07-2019'!C465=\"\",\"\",'18-07-2019'!C465)","v":""},{"$f":"IF('18-07-2019'!D465=\"\",\"\",'18-07-2019'!D465)","v":""},{"$f":"IF('18-07-2019'!E465=\"\",\"\",'18-07-2019'!E465)","v":""},{"$f":"IF('18-07-2019'!F465=\"\",\"\",'18-07-2019'!F465)","v":""}]
[null,{"$f":"IF('18-07-2019'!B466=\"\",\"\",'18-07-2019'!B466)","v":""},{"$f":"IF('18-07-2019'!C466=\"\",\"\",'18-07-2019'!C466)","v":""},{"$f":"IF('18-07-2019'!D466=\"\",\"\",'18-07-2019'!D466)","v":""},{"$f":"IF('18-07-2019'!E466=\"\",\"\",'18-07-2019'!E466)","v":""},{"$f":"IF('18-07-2019'!F466=\"\",\"\",'18-07-2019'!F466)","v":""}]
[null,{"$f":"IF('18-07-2019'!B467=\"\",\"\",'18-07-2019'!B467)","v":""},{"$f":"IF('18-07-2019'!C467=\"\",\"\",'18-07-2019'!C467)","v":""},{"$f":"IF('18-07-2019'!D467=\"\",\"\",'18-07-2019'!D467)","v":""},{"$f":"IF('18-07-2019'!E467=\"\",\"\",'18-07-2019'!E467)","v":""},{"$f":"IF('18-07-2019'!F467=\"\",\"\",'18-07-2019'!F467)","v":""}]
[null,{"$f":"IF('18-07-2019'!B468=\"\",\"\",'18-07-2019'!B468)","v":""},{"$f":"IF('18-07-2019'!C468=\"\",\"\",'18-07-2019'!C468)","v":""},{"$f":"IF('18-07-2019'!D468=\"\",\"\",'18-07-2019'!D468)","v":""},{"$f":"IF('18-07-2019'!E468=\"\",\"\",'18-07-2019'!E468)","v":""},{"$f":"IF('18-07-2019'!F468=\"\",\"\",'18-07-2019'!F468)","v":""}]
[null,{"$f":"IF('18-07-2019'!B469=\"\",\"\",'18-07-2019'!B469)","v":""},{"$f":"IF('18-07-2019'!C469=\"\",\"\",'18-07-2019'!C469)","v":""},{"$f":"IF('18-07-2019'!D469=\"\",\"\",'18-07-2019'!D469)","v":""},{"$f":"IF('18-07-2019'!E469=\"\",\"\",'18-07-2019'!E469)","v":""},{"$f":"IF('18-07-2019'!F469=\"\",\"\",'18-07-2019'!F469)","v":""}]
[null,{"$f":"IF('18-07-2019'!B470=\"\",\"\",'18-07-2019'!B470)","v":""},{"$f":"IF('18-07-2019'!C470=\"\",\"\",'18-07-2019'!C470)","v":""},{"$f":"IF('18-07-2019'!D470=\"\",\"\",'18-07-2019'!D470)","v":""},{"$f":"IF('18-07-2019'!E470=\"\",\"\",'18-07-2019'!E470)","v":""},{"$f":"IF('18-07-2019'!F470=\"\",\"\",'18-07-2019'!F470)","v":""}]
[null,{"$f":"IF('18-07-2019'!B471=\"\",\"\",'18-07-2019'!B471)","v":""},{"$f":"IF('18-07-2019'!C471=\"\",\"\",'18-07-2019'!C471)","v":""},{"$f":"IF('18-07-2019'!D471=\"\",\"\",'18-07-2019'!D471)","v":""},{"$f":"IF('18-07-2019'!E471=\"\",\"\",'18-07-2019'!E471)","v":""},{"$f":"IF('18-07-2019'!F471=\"\",\"\",'18-07-2019'!F471)","v":""}]
[null,{"$f":"IF('18-07-2019'!B472=\"\",\"\",'18-07-2019'!B472)","v":""},{"$f":"IF('18-07-2019'!C472=\"\",\"\",'18-07-2019'!C472)","v":""},{"$f":"IF('18-07-2019'!D472=\"\",\"\",'18-07-2019'!D472)","v":""},{"$f":"IF('18-07-2019'!E472=\"\",\"\",'18-07-2019'!E472)","v":""},{"$f":"IF('18-07-2019'!F472=\"\",\"\",'18-07-2019'!F472)","v":""}]
[null,{"$f":"IF('18-07-2019'!B473=\"\",\"\",'18-07-2019'!B473)","v":""},{"$f":"IF('18-07-2019'!C473=\"\",\"\",'18-07-2019'!C473)","v":""},{"$f":"IF('18-07-2019'!D473=\"\",\"\",'18-07-2019'!D473)","v":""},{"$f":"IF('18-07-2019'!E473=\"\",\"\",'18-07-2019'!E473)","v":""},{"$f":"IF('18-07-2019'!F473=\"\",\"\",'18-07-2019'!F473)","v":""}]
[null,{"$f":"IF('18-07-2019'!B474=\"\",\"\",'18-07-2019'!B474)","v":""},{"$f":"IF('18-07-2019'!C474=\"\",\"\",'18-07-2019'!C474)","v":""},{"$f":"IF('18-07-2019'!D474=\"\",\"\",'18-07-2019'!D474)","v":""},{"$f":"IF('18-07-2019'!E474=\"\",\"\",'18-07-2019'!E474)","v":""},{"$f":"IF('18-07-2019'!F474=\"\",\"\",'18-07-2019'!F474)","v":""}]
[null,{"$f":"IF('18-07-2019'!B475=\"\",\"\",'18-07-2019'!B475)","v":""},{"$f":"IF('18-07-2019'!C475=\"\",\"\",'18-07-2019'!C475)","v":""},{"$f":"IF('18-07-2019'!D475=\"\",\"\",'18-07-2019'!D475)","v":""},{"$f":"IF('18-07-2019'!E475=\"\",\"\",'18-07-2019'!E475)","v":""},{"$f":"IF('18-07-2019'!F475=\"\",\"\",'18-07-2019'!F475)","v":""}]
[null,{"$f":"IF('18-07-2019'!B476=\"\",\"\",'18-07-2019'!B476)","v":""},{"$f":"IF('18-07-2019'!C476=\"\",\"\",'18-07-2019'!C476)","v":""},{"$f":"IF('18-07-2019'!D476=\"\",\"\",'18-07-2019'!D476)","v":""},{"$f":"IF('18-07-2019'!E476=\"\",\"\",'18-07-2019'!E476)","v":""},{"$f":"IF('18-07-2019'!F476=\"\",\"\",'18-07-2019'!F476)","v":""}]
[null,{"$f":"IF('18-07-2019'!B477=\"\",\"\",'18-07-2019'!B477)","v":""},{"$f":"IF('18-07-2019'!C477=\"\",\"\",'18-07-2019'!C477)","v":""},{"$f":"IF('18-07-2019'!D477=\"\",\"\",'18-07-2019'!D477)","v":""},{"$f":"IF('18-07-2019'!E477=\"\",\"\",'18-07-2019'!E477)","v":""},{"$f":"IF('18-07-2019'!F477=\"\",\"\",'18-07-2019'!F477)","v":""}]
[null,{"$f":"IF('18-07-2019'!B478=\"\",\"\",'18-07-2019'!B478)","v":""},{"$f":"IF('18-07-2019'!C478=\"\",\"\",'18-07-2019'!C478)","v":""},{"$f":"IF('18-07-2019'!D478=\"\",\"\",'18-07-2019'!D478)","v":""},{"$f":"IF('18-07-2019'!E478=\"\",\"\",'18-07-2019'!E478)","v":""},{"$f":"IF('18-07-2019'!F478=\"\",\"\",'18-07-2019'!F478)","v":""}]
[null,{"$f":"IF('18-07-2019'!B479=\"\",\"\",'18-07-2019'!B479)","v":""},{"$f":"IF('18-07-2019'!C479=\"\",\"\",'18-07-2019'!C479)","v":""},{"$f":"IF('18-07-2019'!D479=\"\",\"\",'18-07-2019'!D479)","v":""},{"$f":"IF('18-07-2019'!E479=\"\",\"\",'18-07-2019'!E479)","v":""},{"$f":"IF('18-07-2019'!F479=\"\",\"\",'18-07-2019'!F479)","v":""}]
[null,{"$f":"IF('18-07-2019'!B480=\"\",\"\",'18-07-2019'!B480)","v":""},{"$f":"IF('18-07-2019'!C480=\"\",\"\",'18-07-2019'!C480)","v":""},{"$f":"IF('18-07-2019'!D480=\"\",\"\",'18-07-2019'!D480)","v":""},{"$f":"IF('18-07-2019'!E480=\"\",\"\",'18-07-2019'!E480)","v":""},{"$f":"IF('18-07-2019'!F480=\"\",\"\",'18-07-2019'!F480)","v":""}]
[null,{"$f":"IF('18-07-2019'!B481=\"\",\"\",'18-07-2019'!B481)","v":""},{"$f":"IF('18-07-2019'!C481=\"\",\"\",'18-07-2019'!C481)","v":""},{"$f":"IF('18-07-2019'!D481=\"\",\"\",'18-07-2019'!D481)","v":""},{"$f":"IF('18-07-2019'!E481=\"\",\"\",'18-07-2019'!E481)","v":""},{"$f":"IF('18-07-2019'!F481=\"\",\"\",'18-07-2019'!F481)","v":""}]
[null,{"$f":"IF('18-07-2019'!B482=\"\",\"\",'18-07-2019'!B482)","v":""},{"$f":"IF('18-07-2019'!C482=\"\",\"\",'18-07-2019'!C482)","v":""},{"$f":"IF('18-07-2019'!D482=\"\",\"\",'18-07-2019'!D482)","v":""},{"$f":"IF('18-07-2019'!E482=\"\",\"\",'18-07-2019'!E482)","v":""},{"$f":"IF('18-07-2019'!F482=\"\",\"\",'18-07-2019'!F482)","v":""}]
[null,{"$f":"IF('18-07-2019'!B483=\"\",\"\",'18-07-2019'!B483)","v":""},{"$f":"IF('18-07-2019'!C483=\"\",\"\",'18-07-2019'!C483)","v":""},{"$f":"IF('18-07-2019'!D483=\"\",\"\",'18-07-2019'!D483)","v":""},{"$f":"IF('18-07-2019'!E483=\"\",\"\",'18-07-2019'!E483)","v":""},{"$f":"IF('18-07-2019'!F483=\"\",\"\",'18-07-2019'!F483)","v":""}]
[null,{"$f":"IF('18-07-2019'!B484=\"\",\"\",'18-07-2019'!B484)","v":""},{"$f":"IF('18-07-2019'!C484=\"\",\"\",'18-07-2019'!C484)","v":""},{"$f":"IF('18-07-2019'!D484=\"\",\"\",'18-07-2019'!D484)","v":""},{"$f":"IF('18-07-2019'!E484=\"\",\"\",'18-07-2019'!E484)","v":""},{"$f":"IF('18-07-2019'!F484=\"\",\"\",'18-07-2019'!F484)","v":""}]
[null,{"$f":"IF('18-07-2019'!B485=\"\",\"\",'18-07-2019'!B485)","v":""},{"$f":"IF('18-07-2019'!C485=\"\",\"\",'18-07-2019'!C485)","v":""},{"$f":"IF('18-07-2019'!D485=\"\",\"\",'18-07-2019'!D485)","v":""},{"$f":"IF('18-07-2019'!E485=\"\",\"\",'18-07-2019'!E485)","v":""},{"$f":"IF('18-07-2019'!F485=\"\",\"\",'18-07-2019'!F485)","v":""}]
[null,{"$f":"IF('18-07-2019'!B486=\"\",\"\",'18-07-2019'!B486)","v":""},{"$f":"IF('18-07-2019'!C486=\"\",\"\",'18-07-2019'!C486)","v":""},{"$f":"IF('18-07-2019'!D486=\"\",\"\",'18-07-2019'!D486)","v":""},{"$f":"IF('18-07-2019'!E486=\"\",\"\",'18-07-2019'!E486)","v":""},{"$f":"IF('18-07-2019'!F486=\"\",\"\",'18-07-2019'!F486)","v":""}]
[null,{"$f":"IF('18-07-2019'!B487=\"\",\"\",'18-07-2019'!B487)","v":""},{"$f":"IF('18-07-2019'!C487=\"\",\"\",'18-07-2019'!C487)","v":""},{"$f":"IF('18-07-2019'!D487=\"\",\"\",'18-07-2019'!D487)","v":""},{"$f":"IF('18-07-2019'!E487=\"\",\"\",'18-07-2019'!E487)","v":""},{"$f":"IF('18-07-2019'!F487=\"\",\"\",'18-07-2019'!F487)","v":""}]
[null,{"$f":"IF('18-07-2019'!B488=\"\",\"\",'18-07-2019'!B488)","v":""},{"$f":"IF('18-07-2019'!C488=\"\",\"\",'18-07-2019'!C488)","v":""},{"$f":"IF('18-07-2019'!D488=\"\",\"\",'18-07-2019'!D488)","v":""},{"$f":"IF('18-07-2019'!E488=\"\",\"\",'18-07-2019'!E488)","v":""},{"$f":"IF('18-07-2019'!F488=\"\",\"\",'18-07-2019'!F488)","v":""}]
[null,{"$f":"IF('18-07-2019'!B489=\"\",\"\",'18-07-2019'!B489)","v":""},{"$f":"IF('18-07-2019'!C489=\"\",\"\",'18-07-2019'!C489)","v":""},{"$f":"IF('18-07-2019'!D489=\"\",\"\",'18-07-2019'!D489)","v":""},{"$f":"IF('18-07-2019'!E489=\"\",\"\",'18-07-2019'!E489)","v":""},{"$f":"IF('18-07-2019'!F489=\"\",\"\",'18-07-2019'!F489)","v":""}]
[null,{"$f":"IF('18-07-2019'!B490=\"\",\"\",'18-07-2019'!B490)","v":""},{"$f":"IF('18-07-2019'!C490=\"\",\"\",'18-07-2019'!C490)","v":""},{"$f":"IF('18-07-2019'!D490=\"\",\"\",'18-07-2019'!D490)","v":""},{"$f":"IF('18-07-2019'!E490=\"\",\"\",'18-07-2019'!E490)","v":""},{"$f":"IF('18-07-2019'!F490=\"\",\"\",'18-07-2019'!F490)","v":""}]
[null,{"$f":"IF('18-07-2019'!B491=\"\",\"\",'18-07-2019'!B491)","v":""},{"$f":"IF('18-07-2019'!C491=\"\",\"\",'18-07-2019'!C491)","v":""},{"$f":"IF('18-07-2019'!D491=\"\",\"\",'18-07-2019'!D491)","v":""},{"$f":"IF('18-07-2019'!E491=\"\",\"\",'18-07-2019'!E491)","v":""},{"$f":"IF('18-07-2019'!F491=\"\",\"\",'18-07-2019'!F491)","v":""}]
[null,{"$f":"IF('18-07-2019'!B492=\"\",\"\",'18-07-2019'!B492)","v":""},{"$f":"IF('18-07-2019'!C492=\"\",\"\",'18-07-2019'!C492)","v":""},{"$f":"IF('18-07-2019'!D492=\"\",\"\",'18-07-2019'!D492)","v":""},{"$f":"IF('18-07-2019'!E492=\"\",\"\",'18-07-2019'!E492)","v":""},{"$f":"IF('18-07-2019'!F492=\"\",\"\",'18-07-2019'!F492)","v":""}]
[null,{"$f":"IF('18-07-2019'!B493=\"\",\"\",'18-07-2019'!B493)","v":""},{"$f":"IF('18-07-2019'!C493=\"\",\"\",'18-07-2019'!C493)","v":""},{"$f":"IF('18-07-2019'!D493=\"\",\"\",'18-07-2019'!D493)","v":""},{"$f":"IF('18-07-2019'!E493=\"\",\"\",'18-07-2019'!E493)","v":""},{"$f":"IF('18-07-2019'!F493=\"\",\"\",'18-07-2019'!F493)","v":""}]
[null,{"$f":"IF('18-07-2019'!B494=\"\",\"\",'18-07-2019'!B494)","v":""},{"$f":"IF('18-07-2019'!C494=\"\",\"\",'18-07-2019'!C494)","v":""},{"$f":"IF('18-07-2019'!D494=\"\",\"\",'18-07-2019'!D494)","v":""},{"$f":"IF('18-07-2019'!E494=\"\",\"\",'18-07-2019'!E494)","v":""},{"$f":"IF('18-07-2019'!F494=\"\",\"\",'18-07-2019'!F494)","v":""}]
[null,{"$f":"IF('18-07-2019'!B495=\"\",\"\",'18-07-2019'!B495)","v":""},{"$f":"IF('18-07-2019'!C495=\"\",\"\",'18-07-2019'!C495)","v":""},{"$f":"IF('18-07-2019'!D495=\"\",\"\",'18-07-2019'!D495)","v":""},{"$f":"IF('18-07-2019'!E495=\"\",\"\",'18-07-2019'!E495)","v":""},{"$f":"IF('18-07-2019'!F495=\"\",\"\",'18-07-2019'!F495)","v":""}]
[null,{"$f":"IF('18-07-2019'!B496=\"\",\"\",'18-07-2019'!B496)","v":""},{"$f":"IF('18-07-2019'!C496=\"\",\"\",'18-07-2019'!C496)","v":""},{"$f":"IF('18-07-2019'!D496=\"\",\"\",'18-07-2019'!D496)","v":""},{"$f":"IF('18-07-2019'!E496=\"\",\"\",'18-07-2019'!E496)","v":""},{"$f":"IF('18-07-2019'!F496=\"\",\"\",'18-07-2019'!F496)","v":""}]
[null,{"$f":"IF('18-07-2019'!B497=\"\",\"\",'18-07-2019'!B497)","v":""},{"$f":"IF('18-07-2019'!C497=\"\",\"\",'18-07-2019'!C497)","v":""},{"$f":"IF('18-07-2019'!D497=\"\",\"\",'18-07-2019'!D497)","v":""},{"$f":"IF('18-07-2019'!E497=\"\",\"\",'18-07-2019'!E497)","v":""},{"$f":"IF('18-07-2019'!F497=\"\",\"\",'18-07-2019'!F497)","v":""}]
[null,{"$f":"IF('18-07-2019'!B498=\"\",\"\",'18-07-2019'!B498)","v":""},{"$f":"IF('18-07-2019'!C498=\"\",\"\",'18-07-2019'!C498)","v":""},{"$f":"IF('18-07-2019'!D498=\"\",\"\",'18-07-2019'!D498)","v":""},{"$f":"IF('18-07-2019'!E498=\"\",\"\",'18-07-2019'!E498)","v":""},{"$f":"IF('18-07-2019'!F498=\"\",\"\",'18-07-2019'!F498)","v":""}]
[null,{"$f":"IF('18-07-2019'!B499=\"\",\"\",'18-07-2019'!B499)","v":""},{"$f":"IF('18-07-2019'!C499=\"\",\"\",'18-07-2019'!C499)","v":""},{"$f":"IF('18-07-2019'!D499=\"\",\"\",'18-07-2019'!D499)","v":""},{"$f":"IF('18-07-2019'!E499=\"\",\"\",'18-07-2019'!E499)","v":""},{"$f":"IF('18-07-2019'!F499=\"\",\"\",'18-07-2019'!F499)","v":""}]

{"sheet":"18-07-2019","index":1,"n_rows":500,"n_cols":32,"rows_kept":500,"cut":false,"hidden":false,"merged":[]}
["Official time","App. Date","Name","Surname","Pasaport No.","Date of birth","Note of status","Price $","Paid $","Route","Unpaid $","GT","Case of appl","T.Gov",null,null,null,"رجــــوع","رجــــوع","رجــــوع","رجــــوع","TOTAL"]
[1,"2019-04-24T15:00:35.577","KHAYRI ATEEYAH ALMAHDI","ALGHOUL","RGZ10H6R","1973-05-08","Done"," ",{"$f":"IF(J2<>\"\",\"\",H2)","v":""},"IHAB",{"$f":"IF(AND(I2=\"\",J2<>\"\"),H2,\"\")","v":" "},{"$f":"IF(M2=\"Extractor\",25, )","v":0},"Not extractor",{"$f":"IF(M2=\"Not Extractor\",62.5, )","v":62.5}]
[2,"2019-04-28T12:39:44.370","ALZUBAYR FARAJ HASAN","ALMUZOUGHI","LPC37G85","1993-11-21","Cancelled"," ",{"$f":"IF(J3<>\"\",\"\",H3)","v":""},"nisreen"," ",{"$f":"IF(M3=\"Extractor\",25, )","v":0},null,{"$f":"IF(M3=\"Not Extractor\",62.5, )","v":0},null,null,"DONE",null,null,null,null,"Total amount",null,"Net profit",null,"Route","Total Unpaid",null,null,{"$f":"Noblanks(J2:J499)","v":"IHAB"},"Note of status","Count of Mistake"]
[3,"2019-04-28T13:13:30.707","ZAKRIA","ALMOZGI","GL35GN54","1991-12-02","Done"," ","","IHAB"," ",0,null,0,null,null,"CANCELLED",null,null,null,null,{"$f":"SUM(H2:H69)","v":0},null,{"$f":"V4-X14","v":0},null,{"$f":"IF(ISERROR(INDEX($AD$3:$AD$70,MATCH(0,COUNTIF($Z$3:Z3,$AD$3:$AD$69),0))),\"\",INDEX($AD$3:$AD$69,MATCH(0,COUNTIF($Z$3:Z3,$AD$3:$AD$69),0)))","v":"IHAB"},{"$f":"IF(Z4<>\"\",SUMPRODUCT(--($J$2:$J$69=Z4),$K$2:$K$69),\"\")","v":0},null,null,{"$f":"Noblanks(AB6:AB499)","v":"IHAB"},"MISTAKE IN DOB",{"$f":"COUNTIF(G2:G70,\"Mistake\")","v":5}]
[4,"2019-04-29T13:36:16.330","OMAR","ELMOHASHSH","NCJRH93G","1990-09-28","Mistake",0,0,null,"",0,null,0,null,null,"REFUSED",null,null,null,null,null,null,null,null,{"$f":"IF(ISERROR(INDEX($AD$3:$AD$70,MATCH(0,COUNTIF($Z$3:Z4,$AD$3:$AD$69),0))),\"\",INDEX($AD$3:$AD$69,MATCH(0,COUNTIF($Z$3:Z4,$AD$3:$AD$69),0)))","v":"nisreen"},{"$f":"IF(Z5<>\"\",SUMPRODUCT(--($J$2:$J$69=Z5),$K$2:$K$69),\"\")","v":0},null,null,{"$f":"Noblanks(AB7:AB500)","v":"nisreen"}]
[5,"2019-04-29T13:42:27.433","HIND","OSMAN","C5NR6798","1994-05-01","Mistake",0,0,null,"",0,null,0,null,null,"MISTAKE",null,null,null,null,"Total Paid",null,"Difrent amount",null,{"$f":"IF(ISERROR(INDEX($AD$3:$AD$70,MATCH(0,COUNTIF($Z$3:Z5,$AD$3:$AD$69),0))),\"\",INDEX($AD$3:$AD$69,MATCH(0,COUNTIF($Z$3:Z5,$AD$3:$AD$69),0)))","v":"akram"},{"$f":"IF(Z6<>\"\",SUMPRODUCT(--($J$2:$J$69=Z6),$K$2:$K$69),\"\")","v":0},{"$f":"IF(K2=\"\",\"\",J2)","v":"IHAB"},null,{"$f":"Noblanks(AB8:AB501)","v":"IHAB"}]
[6,"2019-05-02T16:57:01.433","MOHAMED","ALBIJOU","RJH6LLCZ","1991-04-24"," "," "," ",null,"",0,null,0,null,null,"GREEN PASS.",null,null,null,null,{"$f":"SUM(I2:I67)","v":0},null,{"$f":"V4-(V7+V10)","v":0},null,{"$f":"IF(ISERROR(INDEX($AD$3:$AD$70,MATCH(0,COUNTIF($Z$3:Z6,$AD$3:$AD$69),0))),\"\",INDEX($AD$3:$AD$69,MATCH(0,COUNTIF($Z$3:Z6,$AD$3:$AD$69),0)))","v":"BINDARDAF"},{"$f":"IF(Z7<>\"\",SUMPRODUCT(--($J$2:$J$69=Z7),$K$2:$K$69),\"\")","v":0},"nisreen",null,{"$f":"Noblanks(AB9:AB502)","v":"akram"}]
[7,"2019-05-02T17:04:28.613","SANA","ELHASSI","HCJ6L6PK","1991-09-29","Done"," "," ",null,"",0,null,0,null,null,null,null,null,null,null,null,null,null,null,{"$f":"IF(ISERROR(INDEX($AD$3:$AD$70,MATCH(0,COUNTIF($Z$3:Z7,$AD$3:$AD$69),0))),\"\",INDEX($AD$3:$AD$69,MATCH(0,COUNTIF($Z$3:Z7,$AD$3:$AD$69),0)))","v":"SALAH SHABASH"},{"$f":"IF(Z8<>\"\",SUMPRODUCT(--($J$2:$J$69=Z8),$K$2:$K$69),\"\")","v":0},"IHAB",null,{"$f":"Noblanks(AB10:AB503)","v":"akram"}]
[8,"2019-05-08T12:55:30.870","AISHA","ALSAKLOUL","NPJ3YZH4","1979-05-25","Mistake",0,0,null,"",0,null,0,null,null,"official time",null,null,null,null,"Total UnPaid",null,"No. of applicants",null,{"$f":"IF(ISERROR(INDEX($AD$3:$AD$70,MATCH(0,COUNTIF($Z$3:Z8,$AD$3:$AD$69),0))),\"\",INDEX($AD$3:$AD$69,MATCH(0,COUNTIF($Z$3:Z8,$AD$3:$AD$69),0)))","v":"DR.ABDO"},{"$f":"IF(Z9<>\"\",SUMPRODUCT(--($J$2:$J$69=Z9),$K$2:$K$69),\"\")","v":0},"",null,{"$f":"Noblanks(AB11:AB504)","v":"akram"}]
[9,"2019-05-08T13:03:32.563","ESLAM","ALSAKLOUL","NPNKR1RZ","1990-01-15","Cancelled"," "," ",null,"",0,null,0,null,null,"official holiday",null,null,null,null,{"$f":"SUM(AA4:AA15)","v":0},null,{"$f":"COUNT(B:B)","v":76},null,{"$f":"IF(ISERROR(INDEX($AD$3:$AD$70,MATCH(0,COUNTIF($Z$3:Z9,$AD$3:$AD$69),0))),\"\",INDEX($AD$3:$AD$69,MATCH(0,COUNTIF($Z$3:Z9,$AD$3:$AD$69),0)))","v":"HAMZA"},{"$f":"IF(Z10<>\"\",SUMPRODUCT(--($J$2:$J$69=Z10),$K$2:$K$69),\"\")","v":0},"",null,{"$f":"Noblanks(AB12:AB505)","v":"akram"}]
[10,"2019-05-12T15:21:28.803","ESLAM","ALSAKLOUL","-NPNKR1RZ","1996-01-15","Green pass."," "," ",null,"",0,null,0,null,null,"other",null,null,null,null,null,null,null,null,{"$f":"IF(ISERROR(INDEX($AD$3:$AD$70,MATCH(0,COUNTIF($Z$3:Z10,$AD$3:$AD$69),0))),\"\",INDEX($AD$3:$AD$69,MATCH(0,COUNTIF($Z$3:Z10,$AD$3:$AD$69),0)))","v":"SHAHOMI"},{"$f":"IF(Z11<>\"\",SUMPRODUCT(--($J$2:$J$69=Z11),$K$2:$K$69),\"\")","v":0},"",null,{"$f":"Noblanks(AB13:AB506)","v":"akram"}]
[11,"2019-05-16T13:48:08.413","MUHANAD","ELBURKI","J7G3JY60","1984-01-21","Mistake",0,"","akram",0,0,null,0,null,null,null,null,null,null,null,"Total GT",null,null,null,{"$f":"IF(ISERROR(INDEX($AD$3:$AD$70,MATCH(0,COUNTIF($Z$3:Z11,$AD$3:$AD$69),0))),\"\",INDEX($AD$3:$AD$69,MATCH(0,COUNTIF($Z$3:Z11,$AD$3:$AD$69),0)))","v":"saleh"},{"$f":"IF(Z12<>\"\",SUMPRODUCT(--($J$2:$J$69=Z12),$K$2:$K$69),\"\")","v":0},"",null,{"$f":"Noblanks(AB14:AB507)","v":"akram"}]
[12,"2019-05-16T13:53:24.300","ENAS","IKJAM","R4HHCPY4","1985-02-06","Mistake",0,0,null,"",0,null,0,null,null,null,null,null,null,null,{"$f":"SUM(L2:L77)","v":0},null,"Cost amount",null,{"$f":"IF(ISERROR(INDEX($AD$3:$AD$70,MATCH(0,COUNTIF($Z$3:Z12,$AD$3:$AD$69),0))),\"\",INDEX($AD$3:$AD$69,MATCH(0,COUNTIF($Z$3:Z12,$AD$3:$AD$69),0)))","v":""},null,"",null,{"$f":"Noblanks(AB15:AB508)","v":"akram"}]
[13,"2019-05-19T13:26:46.853","LAILA","BEN ISMAIL","K2P1N4N8","1966-04-06"," "," "," ",null,"",0,null,0,null,null,null,null,null,null,null,null,null,{"$f":"V13+V16","v":0},null,{"$f":"IF(ISERROR(INDEX($AD$3:$AD$70,MATCH(0,COUNTIF($Z$3:Z13,$AD$3:$AD$69),0))),\"\",INDEX($AD$3:$AD$69,MATCH(0,COUNTIF($Z$3:Z13,$AD$3:$AD$69),0)))","v":""},null,"",null,{"$f":"Noblanks(AB16:AB509)","v":"akram"}]
[14,"2019-05-19T13:31:45.700","YASMIN","EL SAHLI","PCPY0PG9","2005-05-15"," "," "," ",null,"",0,null,0,null,null,null,null,null,null,null,"Total T.Gov",null,null,null,{"$f":"IF(ISERROR(INDEX($AD$3:$AD$70,MATCH(0,COUNTIF($Z$3:Z14,$AD$3:$AD$69),0))),\"\",INDEX($AD$3:$AD$69,MATCH(0,COUNTIF($Z$3:Z14,$AD$3:$AD$69),0)))","v":""},null,"",null,{"$f":"Noblanks(AB17:AB510)","v":"BINDARDAF"}]
[15,"2019-05-19T13:35:47.647","YOMNA","EL SAHLI","PCR55NJP","2002-02-27"," "," "," ",null,"",0,null,0,null,null,null,null,null,null,null,{"$f":"SUM(N5:N80)","v":0},null,null,null,{"$f":"IF(ISERROR(INDEX($AD$3:$AD$70,MATCH(0,COUNTIF($Z$3:Z15,$AD$3:$AD$69),0))),\"\",INDEX($AD$3:$AD$69,MATCH(0,COUNTIF($Z$3:Z15,$AD$3:$AD$69),0)))","v":""},null,"akram",{"$f":"Noblanks(AE13:AE15)","v":""},{"$f":"Noblanks(AB18:AB511)","v":"BINDARDAF"}]
[16,"2019-05-21T16:16:50.417","ALSADEG","AGILA","P81G5CK1","1978-01-05"," "," "," ",null,{"$f":"IF(AND(I17=\"\",J17<>\"\"),H17,\"\")","v":""},0,null,0,null,null,null,null,null,null,null,null,null,null,null,{"$f":"IF(ISERROR(INDEX($AD$3:$AD$70,MATCH(0,COUNTIF($Z$3:Z16,$AD$3:$AD$69),0))),\"\",INDEX($AD$3:$AD$69,MATCH(0,COUNTIF($Z$3:Z16,$AD$3:$AD$69),0)))","v":""},null,"",{"$f":"Noblanks(AE14:AE16)","v":""},{"$f":"Noblanks(AB19:AB512)","v":"BINDARDAF"}]
[17,"2019-05-22T13:16:38.180","KHOLUD","KRAIM","F9K1J6G5","1983-08-06"," "," ","","BINDARDAF"," ",0,null,0,null,null,null,null,null,null,null,null,null,null,null,{"$f":"IF(ISERROR(INDEX($AD$3:$AD$70,MATCH(0,COUNTIF($Z$3:Z17,$AD$3:$AD$69),0))),\"\",INDEX($AD$3:$AD$69,MATCH(0,COUNTIF($Z$3:Z17,$AD$3:$AD$69),0)))","v":""},null,"",null,{"$f":"Noblanks(AB20:AB513)","v":"BINDARDAF"}]
[18,"2019-05-23T12:28:57.527","RAMADHAN","GARGOM","000C6236LL1","1977-04-21"," "," ","","SALAH SHABASH"," ",0,null,0,null,null,null,null,null,null,null,null,null,null,null,{"$f":"IF(ISERROR(INDEX($AD$3:$AD$70,MATCH(0,COUNTIF($Z$3:Z18,$AD$3:$AD$69),0))),\"\",INDEX($AD$3:$AD$69,MATCH(0,COUNTIF($Z$3:Z18,$AD$3:$AD$69),0)))","v":""},null,"",null,{"$f":"Noblanks(AB21:AB514)","v":"BINDARDAF"}]
[19,"2019-05-28T17:03:35.457","ABTISAM  ","HOUSSEIN","HZLY9H3G","1983-10-01"," "," "," ",null,"",0,null,0,null,null,null,null,null,null,null,null,null,null,null,{"$f":"IF(ISERROR(INDEX($AD$3:$AD$70,MATCH(0,COUNTIF($Z$3:Z19,$AD$3:$AD$69),0))),\"\",INDEX($AD$3:$AD$69,MATCH(0,COUNTIF($Z$3:Z19,$AD$3:$AD$69),0)))","v":""},null,"",null,{"$f":"Noblanks(AB22:AB515)","v":"BINDARDAF"}]
[20,"2019-05-29T18:56:52.767","ABOBAKER ","ALSHADLI","NGR095HY","1985-04-08"," "," "," ",null,"",0,null,0,null,null,null,null,null,null,null,"Done",null,null,null,{"$f":"IF(ISERROR(INDEX($AD$3:$AD$70,MATCH(0,COUNTIF($Z$3:Z20,$AD$3:$AD$69),0))),\"\",INDEX($AD$3:$AD$69,MATCH(0,COUNTIF($Z$3:Z20,$AD$3:$AD$69),0)))","v":""},null,"",null,{"$f":"Noblanks(AB23:AB516)","v":"SALAH SHABASH"}]
[21,"2019-06-09T12:00:50.073","ADEL","ALABYADH","RG2KYP15","1976-02-20"," "," "," ",null,"",0,null,0,null,null,null,null,null,null,null,"Cancelled",null,null,null,{"$f":"IF(ISERROR(INDEX($AD$3:$AD$70,MATCH(0,COUNTIF($Z$3:Z21,$AD$3:$AD$69),0))),\"\",INDEX($AD$3:$AD$69,MATCH(0,COUNTIF($Z$3:Z21,$AD$3:$AD$69),0)))","v":""},null,"BINDARDAF",null,{"$f":"Noblanks(AB24:AB517)","v":"IHAB"},null,{"$f":"IFERROR(INDEX($J$2:$J$499,SMALL(IF($J$2:$J$499<>\"\",ROW($J$1:$J$499)-ROW($J$2)+1,\"\"),ROWS($AF$21:AF22))),\"\")","v":""}]
[22,"2019-06-09T13:19:06.617","MOHAMED","ALBIJOU","+RJH6LLCZ","1991-04-24"," "," "," ",null,"",0,null,0,null,null,null,null,null,null,null,"Refused",null,null,null,"Total",{"$f":"SUM(AA4:AA22)","v":0},"SALAH SHABASH",null,{"$f":"Noblanks(AB25:AB518)","v":"IHAB"},null,{"$f":"IFERROR(INDEX($J$2:$J$499,SMALL(IF($J$2:$J$499<>\"\",ROW($J$1:$J$499)-ROW($J$2)+1,\"\"),ROWS($AF$21:AF23))),\"\")","v":""}]
[23,"2019-06-09T13:42:41.223","ALMAHDI","ALBAHLOUL","P28YYP83","1981-10-06"," "," "," ",null,"",0,null,0,null,null,null,null,null,null,null,"Green pass.",null,null,null,null,null,"",null,{"$f":"Noblanks(AB26:AB519)","v":"IHAB"},null,{"$f":"IFERROR(INDEX($J$2:$J$499,SMALL(IF($J$2:$J$499<>\"\",ROW($J$1:$J$499)-ROW($J$2)+1,\"\"),ROWS($AF$21:AF24))),\"\")","v":""}]
[24,"2019-06-09T15:32:46.743","KHADIJA","AGILA","HN058N7F","1995-05-05"," "," "," ",null,"",0,null,0,null,null,null,null,null,null,null,"Mistake",null,null,null,null,null,"",null,{"$f":"Noblanks(AB27:AB520)","v":"IHAB"},null,{"$f":"IFERROR(INDEX($J$2:$J$499,SMALL(IF($J$2:$J$499<>\"\",ROW($J$1:$J$499)-ROW($J$2)+1,\"\"),ROWS($AF$21:AF25))),\"\")","v":""}]
[25,"2019-06-10T13:58:24.787","MUNIR","ELAGOURI","FPFGG8YP","1975-03-01"," "," "," ",null,"",0,null,0,null,null,null,null,null,null,null,null,null,null,null,null,null,"",null,{"$f":"Noblanks(AB28:AB521)","v":"IHAB"}]
[26,"2019-06-10T14:15:21.727","ABDULBASIT","ALTAHIR","LCLRC5F0","1971-10-12"," "," "," ",null,"",0,null,0,null,null,null,null,null,null,null,null,null,null,null,null,null,"",null,{"$f":"Noblanks(AB29:AB522)","v":"IHAB"}]
[27,"2019-06-10T14:32:41.430","OMAR","ALTAHIR","HP52ZG24","1975-04-01"," "," "," ",null,"",0,null,0,null,null,null,null,null,null,null,null,null,null,null,null,null,"",null,{"$f":"Noblanks(AB30:AB523)","v":"IHAB"}]
[28,"2019-06-10T16:05:09.850","OSAMA","BELGASEM","QY84LPJY","1976-10-04"," "," "," ",null,"",0,null,0,null,null,null,null,null,null,null,null,null,null,null,null,null,"",null,{"$f":"Noblanks(AB31:AB524)","v":"IHAB"}]
[29,"2019-06-10T16:08:07.367","NESRIN","MOHAMED","GY8Y7L1N","1982-06-10"," "," "," ",null,"",0,null,0,null,null,null,null,null,null,null,null,null,null,null,null,null,"",null,{"$f":"Noblanks(AB32:AB525)","v":"IHAB"}]
[30,"2019-06-10T16:45:00.743","OMAR","ELHMRRI","HYY6NGL2","1990-11-22"," "," "," ",null,"",0,null,0,null,null,null,null,null,null,null,null,null,null,null,null,null,"",null,{"$f":"Noblanks(AB33:AB526)","v":"IHAB"}]
[31,"2019-06-10T16:50:13.033","GHALIYAH","ALHAMRI","CKN315PH","1987-06-03"," "," "," ",null,"",0,null,0,null,null,null,null,null,null,null,null,null,null,null,null,null,"",null,{"$f":"Noblanks(AB34:AB527)","v":"IHAB"}]
[32,"2019-06-11T12:02:25.957","BRAA","ELMANGOSH","+C0881J9P","1994-02-06"," "," ","","IHAB"," ",0,null,0,null,null,null,null,null,null,null,null,null,null,null,null,null,"",null,{"$f":"Noblanks(AB35:AB528)","v":"IHAB"}]
[33,"2019-06-11T12:06:47.277","ZAINAB","ELSADEG","L0KPKR13","1955-12-25"," "," ","","IHAB"," ",0,null,0,null,null,null,null,null,null,null,null,null,null,null,null,null,"",null,{"$f":"Noblanks(AB36:AB529)","v":"IHAB"}]
[34,"2019-06-11T12:24:45.843","ASEIDA","AHNESH","JZ3PC669","1994-08-02"," "," "," ",null,"",0,null,0,null,null,null,null,null,null,null,null,null,null,null,null,null,"",null,{"$f":"Noblanks(AB37:AB530)","v":"IHAB"}]
[35,"2019-06-11T14:08:21.950","NASSER","BENHALLOUM","CGJJFN87","1959-01-01"," "," ","","DR.ABDO"," ",0,null,0,null,null,null,null,null,null,null,null,null,null,null,null,null,"",null,{"$f":"Noblanks(AB38:AB531)","v":"IHAB"}]
[36,"2019-06-11T14:12:07.113","ABDULLAH","BINHALLOUM","HRC82HFJ","1990-08-19"," "," ","","DR.ABDO"," ",0,null,0,null,null,null,null,null,null,null,null,null,null,null,null,null,"IHAB",null,{"$f":"Noblanks(AB39:AB532)","v":"DR.ABDO"}]
[37,"2019-06-12T13:06:19.563","ALAADIN","ALSHARKSI","LL2JC154","1968-09-04"," "," ","","IHAB"," ",0,null,0,null,null,null,null,null,null,null,null,null,null,null,null,null,{"$f":"IF(K34=\"\",\"\",J34)","v":"IHAB"},null,{"$f":"Noblanks(AB40:AB533)","v":"DR.ABDO"}]
[38,"2019-06-12T13:11:53.757","AHLAM","ABDALLAH","LL00C60N","1974-06-08"," "," ","","IHAB"," ",0,null,0,null,null,null,null,null,null,null,null,null,null,null,null,null,"",null,{"$f":"Noblanks(AB41:AB534)","v":"DR.ABDO"}]
[39,"2019-06-12T13:15:23.813","ALAA","ALSHARKASI","L22L1RCP","2007-05-14"," "," ","","IHAB"," ",0,null,0,null,null,null,null,null,null,null,null,null,null,null,null,null,"DR.ABDO",null,{"$f":"Noblanks(AB42:AB535)","v":"IHAB"}]
[40,"2019-06-13T15:33:52.910","OMAR","ELHMRRI","+HYY6NGL2","1990-11-22"," "," "," ",null,"",0,null,0,null,null,null,null,null,null,null,null,null,null,null,null,null,"DR.ABDO",null,{"$f":"Noblanks(AB43:AB536)","v":"IHAB"}]
[41,"2019-06-13T15:39:21.060","LAYLAY","BOUSHEEHAH","HYZG20YC","1966-01-01"," "," "," ",null,"",0,null,0,null,null,null,null,null,null,null,null,null,null,null,null,null,"IHAB",null,{"$f":"Noblanks(AB44:AB537)","v":"IHAB"}]
[42,"2019-06-17T12:12:51.307","SALAH EDDIN","SHAHOMI","GY1JRP7P","1976-05-25"," "," "," ",null,"",0,null,0,null,null,null,null,null,null,null,null,null,null,null,null,null,"IHAB",null,{"$f":"Noblanks(AB45:AB538)","v":"HAMZA"}]
[43,"2019-06-17T12:17:44.810","MARWA","ASHTITI","GY42C07F","1990-09-24"," "," "," ",null,"",0,null,0,null,null,null,null,null,null,null,null,null,null,null,null,null,"IHAB",null,{"$f":"Noblanks(AB46:AB539)","v":"HAMZA"}]
[44,"2019-06-17T12:51:47.780","ZAHRAH","BOURAWI","P7RLF9J0","1965-08-28"," "," "," ",null,"",0,null,0,null,null,null,null,null,null,null,null,null,null,null,null,null,"",null,{"$f":"Noblanks(AB47:AB540)","v":"HAMZA"}]
[45,"2019-06-17T12:56:59.610","ABDELRAHIM","ALSHATEETI","GR3P9FZK","1992-01-04"," "," "," ",null,"",0,null,0,null,null,null,null,null,null,null,null,null,null,null,null,null,"",null,{"$f":"Noblanks(AB48:AB541)","v":"HAMZA"}]
[46,"2019-06-17T13:02:00.187","AHMED","ALSHATEETI","FRF2YK0C","1995-10-06"," "," "," ",null,"",0,null,0,null,null,null,null,null,null,null,null,null,null,null,null,null,"",null,{"$f":"Noblanks(AB49:AB542)","v":"HAMZA"}]
[47,"2019-06-18T12:24:59.867","IBRAHIM","ELGAHANI","H07H239J","1984-01-11"," "," ","","HAMZA"," ",0,null,0,null,null,null,null,null,null,null,null,null,null,null,null,null,"",null,{"$f":"Noblanks(AB50:AB543)","v":"HAMZA"}]
[48,"2019-06-18T12:28:44.510","NADAY","ALARJ","CFJ2L289","1996-12-26"," "," ","","HAMZA"," ",0,null,0,null,null,null,null,null,null,null,null,null,null,null,null,null,"",null,{"$f":"Noblanks(AB51:AB544)","v":"HAMZA"}]
[49,"2019-06-18T17:22:15.387","OMAR","ALBISHARI","LN0G4RC3","1984-03-12"," "," "," ",null,"",0,null,0,null,null,null,null,null,null,null,null,null,null,null,null,null,"",null,{"$f":"Noblanks(AB52:AB545)","v":"HAMZA"}]
[50,"2019-06-18T17:54:11.480","SHIMA","ALBASHARI","HF7F2F8N","1990-01-21"," "," "," ",null,"",0,null,0,null,null,null,null,null,null,null,null,null,null,null,null,null,"",null,{"$f":"Noblanks(AB53:AB546)","v":"HAMZA"}]
[51,"2019-06-20T11:42:46.477","MARWA","ELMAHDI","CK5R6GCC","1996-02-13"," "," "," ",null,"",0,null,0,null,null,null,null,null,null,null,null,null,null,null,null,null,"HAMZA",null,{"$f":"Noblanks(AB54:AB547)","v":"SHAHOMI"}]
[52,"2019-06-20T12:12:00.130","BALGEIS","BADI","GN575LJ5","1963-01-01"," "," "," ",null,"",0,null,0,null,null,null,null,null,null,null,null,null,null,null,null,null,"HAMZA",null,{"$f":"Noblanks(AB55:AB548)","v":"SHAHOMI"}]
[53,"2019-06-20T12:18:10.100","MIRA","GLESSA","GN3FZG0P","2006-07-31"," "," "," ",null,"",0,null,0,null,null,null,null,null,null,null,null,null,null,null,null,null,"",null,{"$f":"Noblanks(AB56:AB549)","v":"SHAHOMI"}]
[54,"2019-06-20T12:27:13.480","HANI","GLESSA","GN755ZZJ","2004-01-20"," "," "," ",null,"",0,null,0,null,null,null,null,null,null,null,null,null,null,null,null,null,"",null,{"$f":"Noblanks(AB57:AB550)","v":"SHAHOMI"}]
[55,"2019-06-20T14:38:24.320","YAHIA","ELFALLAH","JKP7CGP2","1970-01-01"," "," "," ",null,"",0,null,0,null,null,null,null,null,null,null,null,null,null,null,null,null,"",null,{"$f":"Noblanks(AB58:AB551)","v":"SHAHOMI"}]
[56,"2019-06-20T14:43:13.117","ABTESAM","BADER","C9127619","1971-02-06"," "," "," ",null,"",0,null,0,null,null,null,null,null,null,null,null,null,null,null,null,null,"",null,{"$f":"Noblanks(AB59:AB552)","v":"SHAHOMI"}]
[57,"2019-06-20T14:46:41.963","NOOR","ALFALLAH","C8RRLPH0","2002-09-04"," "," "," ",null,"",0,null,0,null,null,null,null,null,null,null,null,null,null,null,null,null,"",null,{"$f":"Noblanks(AB60:AB553)","v":"SHAHOMI"}]
[58,"2019-06-20T14:53:30.030","ISLAM","ALFALLAH","C8LCJ63Y","2004-01-11"," "," "," ",null,"",0,null,0,null,null,null,null,null,null,null,null,null,null,null,null,null,"",null,{"$f":"Noblanks(AB61:AB554)","v":"SHAHOMI"}]
[59,"2019-06-20T16:10:06.907","AHMED","BEDA","H9941GK0","1979-10-06"," "," ","","SHAHOMI"," ",0,null,0,null,null,null,null,null,null,null,null,null,null,null,null,null,"",null,{"$f":"Noblanks(AB62:AB555)","v":"SHAHOMI"}]
[60,"2019-06-20T16:26:14.793","ESRAA","GINI","H973R816","1989-03-22"," "," ","","SHAHOMI"," ",0,null,0,null,null,null,null,null,null,null,null,null,null,null,null,null,"",null,{"$f":"Noblanks(AB63:AB556)","v":"SHAHOMI"}]
[61,"2019-06-20T18:11:23.413","ABDELJAUL","ELAYTIE","FRNFL9ZK","1959-08-28"," "," ","","nisreen"," ",0,null,0,null,null,null,null,null,null,null,null,null,null,null,null,null,"",null,{"$f":"Noblanks(AB64:AB557)","v":"SHAHOMI"}]
[62,"2019-06-20T18:14:02.773","SALMA","ELZEWI","FRYCP0P3","1958-01-01"," "," ","","saleh"," ",0,null,0,null,null,null,null,null,null,null,null,null,null,null,null,null,"",null,{"$f":"Noblanks(AB65:AB558)","v":"SHAHOMI"}]
[63,"2019-06-20T18:17:26.260","MARWA","ELSAYTIE","FRN4NYCF","1991-02-12"," "," "," ",null,{"$f":"IF(AND(I64=\"\",J64<>\"\"),H64,\"\")","v":""},0,null,0,null,null,null,null,null,null,null,null,null,null,null,null,null,"SHAHOMI",null,{"$f":"Noblanks(AB66:AB559)","v":"nisreen"}]
[64,"2019-06-20T18:23:05.277","ALI","ALSAEITI","GG019KY0","1996-12-22"," "," "," ",null,{"$f":"IF(AND(I65=\"\",J65<>\"\"),H65,\"\")","v":""},0,null,0,null,null,null,null,null,null,null,null,null,null,null,null,null,"SHAHOMI",null,{"$f":"Noblanks(AB67:AB560)","v":"saleh"}]
[65,"2019-06-20T19:09:13.237","KHADEEJAH","ALZAWI","F1KY0LK0","1966-11-21"," "," "," ",null,"",0,null,0,null,null,null,null,null,null,null,null,null,null,null,null,null,"nisreen",null,{"$f":"Noblanks(AB68:AB561)","v":""}]
[66,"2019-06-20T19:17:53.300","AIDAH","BEIDA","G15PZZ2F","1973-10-25"," "," ",{"$f":"IF(J67<>\"\",\"\",H67)","v":" "},null,"",{"$f":"IF(M67=\"Extractor\",25, )","v":0},null,{"$f":"IF(M67=\"Not Extractor\",62.5, )","v":0},null,null,null,null,null,null,null,null,null,null,null,null,null,"saleh",null,{"$f":"Noblanks(AB69:AB562)","v":""}]
[67,"2019-06-20T19:26:33.365","KHADEEJAH","ALZAWI","F1KY0LK1","1980-09-28"," "," "," ",null,"",0,null,0,null,null,null,null,null,null,null,null,null,null,null,null,null,"",null,{"$f":"Noblanks(AB70:AB563)","v":""}]
[68,"2019-06-20T19:35:13.430","AIDAH","BEIDA","G15PZZ2F","1987-09-02"," "," "," ",null,"",0,null,0,null,null,null,null,null,null,null,null,null,null,null,null,null,"",null,{"$f":"Noblanks(AB71:AB564)","v":""}]
[69,"2019-06-20T19:43:53.495","KHADEEJAH","ALZAWI","F1KY0LK2","1994-08-06"," "," "," ",null,"",0,null,0,null,null,null,null,null,null,null,null,null,null,null,null,null,{"$f":"IF(K66=\"\",\"\",J66)","v":""},null,{"$f":"Noblanks(AB72:AB565)","v":""}]
[70,"2019-06-20T19:52:33.560","AIDAH","BEIDA","G15PZZ2F","2001-07-10"," "," "," ",null,"",0,null,0,null,null,null,null,null,null,null,null,null,null,null,null,null,{"$f":"IF(K67=\"\",\"\",J67)","v":""},null,{"$f":"Noblanks(AB73:AB566)","v":""}]
[71,"2019-06-20T20:01:13.625","KHADEEJAH","ALZAWI","F1KY0LK3","2008-06-13"," "," "," ",null,"",0,null,0,null,null,null,null,null,null,null,null,null,null,null,null,null,"",null,{"$f":"Noblanks(AB74:AB567)","v":""}]
[72,"2019-06-20T20:09:53.690","AIDAH","BEIDA","G15PZZ2F","2015-05-18"," "," "," ",null,"",0,null,0,null,null,null,null,null,null,null,null,null,null,null,null,null,"",null,{"$f":"Noblanks(AB75:AB568)","v":""}]
[73,"2019-06-20T20:18:33.755","KHADEEJAH","ALZAWI","F1KY0LK4","2022-04-21"," "," "," ",null,"",0,null,0,null,null,null,null,null,null,null,null,null,null,null,null,null,"",null,{"$f":"Noblanks(AB76:AB569)","v":""}]
[74,"2019-06-20T20:27:13.820","AIDAH","BEIDA","G15PZZ2F","2029-03-25"," "," "," ",null,"",0,null,0,null,null,null,null,null,null,null,null,null,null,null,null,null,"",null,{"$f":"Noblanks(AB77:AB570)","v":""}]
[75,"2019-06-20T20:35:53.885","KHADEEJAH","ALZAWI","F1KY0LK5","2036-02-27"," "," "," ",null,"",0,null,0,null,null,null,null,null,null,null,null,null,null,null,null,null,"",null,{"$f":"Noblanks(AB78:AB571)","v":""}]
[76,"2019-06-20T20:44:33.950","AIDAH","BEIDA","G15PZZ2F","2043-01-31"," "," "," ",null,"",0,null,0,null,null,null,null,null,null,null,null,null,null,null,null,null,"",null,{"$f":"Noblanks(AB79:AB572)","v":""}]
[null,null,null,null,null,null," "," ",null,null,null,null,null,null,null,null,null,null,null,null,null,null,null,null,null,null,null,"",null,{"$f":"Noblanks(AB80:AB573)","v":""}]
[null,null,null,null,null,null," "," ",null,null,null,null,null,null,null,null,null,null,null,null,null,null,null,null,null,null,null,"",null,{"$f":"Noblanks(AB81:AB574)","v":""}]
[null,null,null,null,null,null," "," ",null,null,null,null,null,null,null,null,null,null,null,null,null,null,null,null,null,null,null,"",null,{"$f":"Noblanks(AB82:AB575)","v":""}]
[null,null,null,null,null,null," "," ",null,null,null,null,null,null,null,null,null,null,null,null,null,null,null,null,null,null,null,"",null,{"$f":"Noblanks(AB83:AB576)","v":""}]
[null,null,null,null,null,null," "," ",null,null,null,null,null,null,null,null,null,null,null,null,null,null,null,null,null,null,null,"",null,{"$f":"Noblanks(AB84:AB577)","v":""}]
[null,null,null,null,null,null," "," ",null,null,null,null,null,null,null,null,null,null,null,null,null,null,null,null,null,null,null,"",null,{"$f":"Noblanks(AB85:AB578)","v":""}]
[null,null,null,null,null,null," "," ",null,null,null,null,null,null,null,null,null,null,null,null,null,null,null,null,null,null,null,"",null,{"$f":"Noblanks(AB86:AB579)","v":""}]
[null,null,null,null,null,null," "," ",null,null,null,null,null,null,null,null,null,null,null,null,null,null,null,null,null,null,null,"",null,{"$f":"Noblanks(AB87:AB580)","v":""}]
[null,null,null,null,null,null," "," ",null,null,null,null,null,null,null,null,null,null,null,null,null,null,null,null,null,null,null,"",null,{"$f":"Noblanks(AB88:AB581)","v":""}]
[null,null,null,null,null,null," "," ",null,null,null,null,null,null,null,null,null,null,null,null,null,null,null,null,null,null,null,"",null,{"$f":"Noblanks(J86:J583)","v":""}]
[null,null,null,null,null,null," "," ",null,null,null,null,null,null,null,null,null,null,null,null,null,null,null,null,null,null,null,"",null,{"$f":"Noblanks(J87:J584)","v":""}]
[null,null,null,null,null,null," "," ",null,null,null,null,null,null,null,null,null,null,null,null,null,null,null,null,null,null,null,"",null,{"$f":"Noblanks(J88:J585)","v":""}]
[null,null,null,null,null,null," "," ",null,null,null,null,null,null,null,null,null,null,null,null,null,null,null,null,null,null,null,"",null,{"$f":"Noblanks(J89:J586)","v":""}]
[null,null,null,null,null,null," "," ",null,null,null,null,null,null,null,null,null,null,null,null,null,null,null,null,null,null,null,"",null,{"$f":"Noblanks(J90:J587)","v":""}]
[null,null,null,null,null,null," "," ",null,null,null,null,null,null,null,null,null,null,null,null,null,null,null,null,null,null,null,"",null,{"$f":"Noblanks(J91:J588)","v":""}]
[null,null,null,null,null,null," "," ",null,null,null,null,null,null,null,null,null,null,null,null,null,null,null,null,null,null,null,"",null,{"$f":"Noblanks(J92:J589)","v":""}]
[null,null,null,null,null,null," "," ",null,null,null,null,null,null,null,null,null,null,null,null,null,null,null,null,null,null,null,"",null,{"$f":"Noblanks(J93:J590)","v":""}]
[null,null,null,null,null,null," "," ",null,null,null,null,null,null,null,null,null,null,null,null,null,null,null,null,null,null,null,"",null,{"$f":"Noblanks(J94:J591)","v":""}]
[null,null,null,null,null,null," "," ",null,null,null,null,null,null,null,null,null,null,null,null,null,null,null,null,null,null,null,"",null,{"$f":"Noblanks(J95:J592)","v":""}]
[null,null,null,null,null,null," "," ",null,null,null,null,null,null,null,null,null,null,null,null,null,null,null,null,null,null,null,"",null,{"$f":"Noblanks(J96:J593)","v":""}]
[null,null,null,null,null,null," "," ",null,null,null,null,null,null,null,null,null,null,null,null,null,null,null,null,null,null,null,"",null,{"$f":"Noblanks(J97:J594)","v":""}]
[null,null,null,null,null,null," "," ",null,null,null,null,null,null,null,null,null,null,null,null,null,null,null,null,null,null,null,"",null,{"$f":"Noblanks(J98:J595)","v":""}]
[null,null,null,null,null,null," "," ",null,null,null,null,null,null,null,null,null,null,null,null,null,null,null,null,null,null,null,"",null,{"$f":"Noblanks(J99:J596)","v":""}]
[null,null,null,null,null,null," ",null,null,null,null,null,null,null,null,null,null,null,null,null,null,null,null,null,null,null,null,"",null,{"$f":"Noblanks(J100:J597)","v":""}]
[null,null,null,null,null,null," ",null,null,null,null,null,null,null,null,null,null,null,null,null,null,null,null,null,null,null,null,"",null,{"$f":"Noblanks(J101:J598)","v":""}]
[null,null,null,null,null,null," ",null,null,null,null,null,null,null,null,null,null,null,null,null,null,null,null,null,null,null,null,null,null,{"$f":"Noblanks(J102:J599)","v":""}]
[null,null,null,null,null,null," ",null,null,null,null,null,null,null,null,null,null,null,null,null,null,null,null,null,null,null,null,null,null,{"$f":"Noblanks(J103:J600)","v":""}]
[null,null,null,null,null,null," ",null,null,null,null,null,null,null,null,null,null,null,null,null,null,null,null,null,null,null,null,null,null,{"$f":"Noblanks(J104:J601)","v":""}]
[null,null,null,null,null,null," ",null,null,null,null,null,null,null,null,null,null,null,null,null,null,null,null,null,null,null,null,null,null,{"$f":"Noblanks(J105:J602)","v":""}]
[null,null,null,null,null,null," ",null,null,null,null,null,null,null,null,null,null,null,null,null,null,null,null,null,null,null,null,null,null,{"$f":"Noblanks(J106:J603)","v":""}]
[null,null,null,null,null,null," ",null,null,null,null,null,null,null,null,null,null,null,null,null,null,null,null,null,null,null,null,null,null,{"$f":"Noblanks(J107:J604)","v":""}]
[null,null,null,null,null,null," ",null,null,null,null,null,null,null,null,null,null,null,null,null,null,null,null,null,null,null,null,null,null,{"$f":"Noblanks(J108:J605)","v":""}]
[null,null,null,null,null,null," ",null,null,null,null,null,null,null,null,null,null,null,null,null,null,null,null,null,null,null,null,null,null,{"$f":"Noblanks(J109:J606)","v":""}]
[null,null,null,null,null,null," ",null,null,null,null,null,null,null,null,null,null,null,null,null,null,null,null,null,null,null,null,null,null,{"$f":"Noblanks(J110:J607)","v":""}]
[null,null,null,null,null,null," ",null,null,null,null,null,null,null,null,null,null,null,null,null,null,null,null,null,null,null,null,null,null,{"$f":"Noblanks(J111:J608)","v":""}]
[null,null,null,null,null,null," ",null,null,null,null,null,null,null,null,null,null,null,null,null,null,null,null,null,null,null,null,null,null,{"$f":"Noblanks(J112:J609)","v":""}]
[null,null,null,null,null,null," ",null,null,null,null,null,null,null,null,null,null,null,null,null,null,null,null,null,null,null,null,null,null,{"$f":"Noblanks(J113:J610)","v":""}]
[null,null,null,null,null,null," ",null,null,null,null,null,null,null,null,null,null,null,null,null,null,null,null,null,null,null,null,null,null,{"$f":"Noblanks(J114:J611)","v":""}]
[null,null,null,null,null,null," ",null,null,null,null,null,null,null,null,null,null,null,null,null,null,null,null,null,null,null,null,null,null,{"$f":"Noblanks(J115:J612)","v":""}]
[null,null,null,null,null,null," ",null,null,null,null,null,null,null,null,null,null,null,null,null,null,null,null,null,null,null,null,null,null,{"$f":"Noblanks(J116:J613)","v":""}]
[null,null,null,null,null,null," ",null,null,null,null,null,null,null,null,null,null,null,null,null,null,null,null,null,null,null,null,null,null,{"$f":"Noblanks(J117:J614)","v":""}]
[null,null,null,null,null,null," ",null,null,null,null,null,null,null,null,null,null,null,null,null,null,null,null,null,null,null,null,null,null,{"$f":"Noblanks(J118:J615)","v":""}]
[null,null,null,null,null,null," ",null,null,null,null,null,null,null,null,null,null,null,null,null,null,null,null,null,null,null,null,null,null,{"$f":"Noblanks(J119:J616)","v":""}]
[null,null,null,null,null,null," ",null,null,null,null,null,null,null,null,null,null,null,null,null,null,null,null,null,null,null,null,null,null,{"$f":"Noblanks(J120:J617)","v":""}]
[null,null,null,null,null,null," ",null,null,null,null,null,null,null,null,null,null,null,null,null,null,null,null,null,null,null,null,null,null,{"$f":"Noblanks(J121:J618)","v":""}]
[null,null,null,null,null,null," ",null,null,null,null,null,null,null,null,null,null,null,null,null,null,null,null,null,null,null,null,null,null,{"$f":"Noblanks(J122:J619)","v":""}]
[null,null,null,null,null,null," ",null,null,null,null,null,null,null,null,null,null,null,null,null,null,null,null,null,null,null,null,null,null,{"$f":"Noblanks(J123:J620)","v":""}]
[null,null,null,null,null,null," ",null,null,null,null,null,null,null,null,null,null,null,null,null,null,null,null,null,null,null,null,null,null,{"$f":"Noblanks(J124:J621)","v":""}]
[null,null,null,null,null,null," ",null,null,null,null,null,null,null,null,null,null,null,null,null,null,null,null,null,null,null,null,null,null,{"$f":"Noblanks(J125:J622)","v":""}]
[null,null,null,null,null,null," ",null,null,null,null,null,null,null,null,null,null,null,null,null,null,null,null,null,null,null,null,null,null,{"$f":"Noblanks(J126:J623)","v":""}]
[null,null,null,null,null,null," ",null,null,null,null,null,null,null,null,null,null,null,null,null,null,null,null,null,null,null,null,null,null,{"$f":"Noblanks(J127:J624)","v":""}]
[null,null,null,null,null,null," ",null,null,null,null,null,null,null,null,null,null,null,null,null,null,null,null,null,null,null,null,null,null,{"$f":"Noblanks(J128:J625)","v":""}]
[null,null,null,null,null,null," ",null,null,null,null,null,null,null,null,null,null,null,null,null,null,null,null,null,null,null,null,null,null,{"$f":"Noblanks(J129:J626)","v":""}]
[null,null,null,null,null,null," ",null,null,null,null,null,null,null,null,null,null,null,null,null,null,null,null,null,null,null,null,null,null,{"$f":"Noblanks(J130:J627)","v":""}]
[null,null,null,null,null,null," ",null,null,null,null,null,null,null,null,null,null,null,null,null,null,null,null,null,null,null,null,null,null,{"$f":"Noblanks(J131:J628)","v":""}]
[null,null,null,null,null,null," ",null,null,null,null,null,null,null,null,null,null,null,null,null,null,null,null,null,null,null,null,null,null,{"$f":"Noblanks(J132:J629)","v":""}]
[null,null,null,null,null,null," ",null,null,null,null,null,null,null,null,null,null,null,null,null,null,null,null,null,null,null,null,null,null,{"$f":"Noblanks(J133:J630)","v":""}]
[null,null,null,null,null,null," ",null,null,null,null,null,null,null,null,null,null,null,null,null,null,null,null,null,null,null,null,null,null,{"$f":"Noblanks(J134:J631)","v":""}]
[null,null,null,null,null,null," ",null,null,null,null,null,null,null,null,null,null,null,null,null,null,null,null,null,null,null,null,null,null,{"$f":"Noblanks(J135:J632)","v":""}]
[null,null,null,null,null,null," ",null,null,null,null,null,null,null,null,null,null,null,null,null,null,null,null,null,null,null,null,null,null,{"$f":"Noblanks(J136:J633)","v":""}]
[null,null,null,null,null,null," ",null,null,null,null,null,null,null,null,null,null,null,null,null,null,null,null,null,null,null,null,null,null,{"$f":"Noblanks(J137:J634)","v":""}]
[null,null,null,null,null,null," ",null,null,null,null,null,null,null,null,null,null,null,null,null,null,null,null,null,null,null,null,null,null,{"$f":"Noblanks(J138:J635)","v":""}]
[null,null,null,null,null,null," ",null,null,null,null,null,null,null,null,null,null,null,null,null,null,null,null,null,null,null,null,null,null,{"$f":"Noblanks(J139:J636)","v":""}]
[null,null,null,null,null,null," ",null,null,null,null,null,null,null,null,null,null,null,null,null,null,null,null,null,null,null,null,null,null,{"$f":"Noblanks(J140:J637)","v":""}]
[null,null,null,null,null,null," ",null,null,null,null,null,null,null,null,null,null,null,null,null,null,null,null,null,null,null,null,null,null,{"$f":"Noblanks(J141:J638)","v":""}]
[null,null,null,null,null,null," ",null,null,null,null,null,null,null,null,null,null,null,null,null,null,null,null,null,null,null,null,null,null,{"$f":"Noblanks(J142:J639)","v":""}]
[null,null,null,null,null,null," ",null,null,null,null,null,null,null,null,null,null,null,null,null,null,null,null,null,null,null,null,null,null,{"$f":"Noblanks(J143:J640)","v":""}]
[null,null,null,null,null,null," ",null,null,null,null,null,null,null,null,null,null,null,null,null,null,null,null,null,null,null,null,null,null,{"$f":"Noblanks(J144:J641)","v":""}]
[null,null,null,null,null,null," ",null,null,null,null,null,null,null,null,null,null,null,null,null,null,null,null,null,null,null,null,null,null,{"$f":"Noblanks(J145:J642)","v":""}]
[null,null,null,null,null,null," ",null,null,null,null,null,null,null,null,null,null,null,null,null,null,null,null,null,null,null,null,null,null,{"$f":"Noblanks(J146:J643)","v":""}]
[null,null,null,null,null,null," ",null,null,null,null,null,null,null,null,null,null,null,null,null,null,null,null,null,null,null,null,null,null,{"$f":"Noblanks(J147:J644)","v":""}]
[null,null,null,null,null,null," ",null,null,null,null,null,null,null,null,null,null,null,null,null,null,null,null,null,null,null,null,null,null,{"$f":"Noblanks(J148:J645)","v":""}]
[null,null,null,null,null,null," ",null,null,null,null,null,null,null,null,null,null,null,null,null,null,null,null,null,null,null,null,null,null,{"$f":"Noblanks(J149:J646)","v":""}]
[null,null,null,null,null,null," ",null,null,null,null,null,null,null,null,null,null,null,null,null,null,null,null,null,null,null,null,null,null,{"$f":"Noblanks(J150:J647)","v":""}]
[null,null,null,null,null,null," ",null,null,null,null,null,null,null,null,null,null,null,null,null,null,null,null,null,null,null,null,null,null,{"$f":"Noblanks(J151:J648)","v":""}]
[null,null,null,null,null,null," ",null,null,null,null,null,null,null,null,null,null,null,null,null,null,null,null,null,null,null,null,null,null,{"$f":"Noblanks(J152:J649)","v":""}]
[null,null,null,null,null,null," ",null,null,null,null,null,null,null,null,null,null,null,null,null,null,null,null,null,null,null,null,null,null,{"$f":"Noblanks(J153:J650)","v":""}]
[null,null,null,null,null,null," ",null,null,null,null,null,null,null,null,null,null,null,null,null,null,null,null,null,null,null,null,null,null,{"$f":"Noblanks(J154:J651)","v":""}]
[null,null,null,null,null,null," ",null,null,null,null,null,null,null,null,null,null,null,null,null,null,null,null,null,null,null,null,null,null,{"$f":"Noblanks(J155:J652)","v":""}]
[null,null,null,null,null,null," ",null,null,null,null,null,null,null,null,null,null,null,null,null,null,null,null,null,null,null,null,null,null,{"$f":"Noblanks(J156:J653)","v":""}]
[null,null,null,null,null,null," ",null,null,null,null,null,null,null,null,null,null,null,null,null,null,null,null,null,null,null,null,null,null,{"$f":"Noblanks(J157:J654)","v":""}]
[null,null,null,null,null,null," ",null,null,null,null,null,null,null,null,null,null,null,null,null,null,null,null,null,null,null,null,null,null,{"$f":"Noblanks(J158:J655)","v":""}]
[null,null,null,null,null,null," ",null,null,null,null,null,null,null,null,null,null,null,null,null,null,null,null,null,null,null,null,null,null,{"$f":"Noblanks(J159:J656)","v":""}]
[null,null,null,null,null,null," ",null,null,null,null,null,null,null,null,null,null,null,null,null,null,null,null,null,null,null,null,null,null,{"$f":"Noblanks(J160:J657)","v":""}]
[null,null,null,null,null,null," ",null,null,null,null,null,null,null,null,null,null,null,null,null,null,null,null,null,null,null,null,null,null,{"$f":"Noblanks(J161:J658)","v":""}]
[null,null,null,null,null,null," ",null,null,null,null,null,null,null,null,null,null,null,null,null,null,null,null,null,null,null,null,null,null,{"$f":"Noblanks(J162:J659)","v":""}]
[null,null,null,null,null,null," ",null,null,null,null,null,null,null,null,null,null,null,null,null,null,null,null,null,null,null,null,null,null,{"$f":"Noblanks(J163:J660)","v":""}]
[null,null,null,null,null,null," ",null,null,null,null,null,null,null,null,null,null,null,null,null,null,null,null,null,null,null,null,null,null,{"$f":"Noblanks(J164:J661)","v":""}]
[null,null,null,null,null,null," ",null,null,null,null,null,null,null,null,null,null,null,null,null,null,null,null,null,null,null,null,null,null,{"$f":"Noblanks(J165:J662)","v":""}]
[null,null,null,null,null,null," ",null,null,null,null,null,null,null,null,null,null,null,null,null,null,null,null,null,null,null,null,null,null,{"$f":"Noblanks(J166:J663)","v":""}]
[null,null,null,null,null,null," ",null,null,null,null,null,null,null,null,null,null,null,null,null,null,null,null,null,null,null,null,null,null,{"$f":"Noblanks(J167:J664)","v":""}]
[null,null,null,null,null,null," ",null,null,null,null,null,null,null,null,null,null,null,null,null,null,null,null,null,null,null,null,null,null,{"$f":"Noblanks(J168:J665)","v":""}]
[null,null,null,null,null,null," ",null,null,null,null,null,null,null,null,null,null,null,null,null,null,null,null,null,null,null,null,null,null,{"$f":"Noblanks(J169:J666)","v":""}]
[null,null,null,null,null,null," ",null,null,null,null,null,null,null,null,null,null,null,null,null,null,null,null,null,null,null,null,null,null,{"$f":"Noblanks(J170:J667)","v":""}]
[null,null,null,null,null,null," ",null,null,null,null,null,null,null,null,null,null,null,null,null,null,null,null,null,null,null,null,null,null,{"$f":"Noblanks(J171:J668)","v":""}]
[null,null,null,null,null,null," ",null,null,null,null,null,null,null,null,null,null,null,null,null,null,null,null,null,null,null,null,null,null,{"$f":"Noblanks(J172:J669)","v":""}]
[null,null,null,null,null,null," ",null,null,null,null,null,null,null,null,null,null,null,null,null,null,null,null,null,null,null,null,null,null,{"$f":"Noblanks(J173:J670)","v":""}]
[null,null,null,null,null,null," ",null,null,null,null,null,null,null,null,null,null,null,null,null,null,null,null,null,null,null,null,null,null,{"$f":"Noblanks(J174:J671)","v":""}]
[null,null,null,null,null,null," ",null,null,null,null,null,null,null,null,null,null,null,null,null,null,null,null,null,null,null,null,null,null,{"$f":"Noblanks(J175:J672)","v":""}]
[null,null,null,null,null,null," ",null,null,null,null,null,null,null,null,null,null,null,null,null,null,null,null,null,null,null,null,null,null,{"$f":"Noblanks(J176:J673)","v":""}]
[null,null,null,null,null,null," ",null,null,null,null,null,null,null,null,null,null,null,null,null,null,null,null,null,null,null,null,null,null,{"$f":"Noblanks(J177:J674)","v":""}]
[null,null,null,null,null,null," ",null,null,null,null,null,null,null,null,null,null,null,null,null,null,null,null,null,null,null,null,null,null,{"$f":"Noblanks(J178:J675)","v":""}]
[null,null,null,null,null,null," ",null,null,null,null,null,null,null,null,null,null,null,null,null,null,null,null,null,null,null,null,null,null,{"$f":"Noblanks(J179:J676)","v":""}]
[null,null,null,null,null,null," ",null,null,null,null,null,null,null,null,null,null,null,null,null,null,null,null,null,null,null,null,null,null,{"$f":"Noblanks(J180:J677)","v":""}]
[null,null,null,null,null,null," ",null,null,null,null,null,null,null,null,null,null,null,null,null,null,null,null,null,null,null,null,null,null,{"$f":"Noblanks(J181:J678)","v":""}]
[null,null,null,null,null,null," ",null,null,null,null,null,null,null,null,null,null,null,null,null,null,null,null,null,null,null,null,null,null,{"$f":"Noblanks(J182:J679)","v":""}]
[null,null,null,null,null,null," ",null,null,null,null,null,null,null,null,null,null,null,null,null,null,null,null,null,null,null,null,null,null,{"$f":"Noblanks(J183:J680)","v":""}]
[null,null,null,null,null,null," ",null,null,null,null,null,null,null,null,null,null,null,null,null,null,null,null,null,null,null,null,null,null,{"$f":"Noblanks(J184:J681)","v":""}]
[null,null,null,null,null,null," ",null,null,null,null,null,null,null,null,null,null,null,null,null,null,null,null,null,null,null,null,null,null,{"$f":"Noblanks(J185:J682)","v":""}]
[null,null,null,null,null,null," ",null,null,null,null,null,null,null,null,null,null,null,null,null,null,null,null,null,null,null,null,null,null,{"$f":"Noblanks(J186:J683)","v":""}]
[null,null,null,null,null,null," ",null,null,null,null,null,null,null,null,null,null,null,null,null,null,null,null,null,null,null,null,null,null,{"$f":"Noblanks(J187:J684)","v":""}]
[null,null,null,null,null,null," ",null,null,null,null,null,null,null,null,null,null,null,null,null,null,null,null,null,null,null,null,null,null,{"$f":"Noblanks(J188:J685)","v":""}]
[null,null,null,null,null,null," ",null,null,null,null,null,null,null,null,null,null,null,null,null,null,null,null,null,null,null,null,null,null,{"$f":"Noblanks(J189:J686)","v":""}]
[null,null,null,null,null,null," ",null,null,null,null,null,null,null,null,null,null,null,null,null,null,null,null,null,null,null,null,null,null,{"$f":"Noblanks(J190:J687)","v":""}]
[null,null,null,null,null,null," ",null,null,null,null,null,null,null,null,null,null,null,null,null,null,null,null,null,null,null,null,null,null,{"$f":"Noblanks(J191:J688)","v":""}]
[null,null,null,null,null,null," ",null,null,null,null,null,null,null,null,null,null,null,null,null,null,null,null,null,null,null,null,null,null,{"$f":"Noblanks(J192:J689)","v":""}]
[null,null,null,null,null,null," ",null,null,null,null,null,null,null,null,null,null,null,null,null,null,null,null,null,null,null,null,null,null,{"$f":"Noblanks(J193:J690)","v":""}]
[null,null,null,null,null,null," ",null,null,null,null,null,null,null,null,null,null,null,null,null,null,null,null,null,null,null,null,null,null,{"$f":"Noblanks(J194:J691)","v":""}]
[null,null,null,null,null,null," ",null,null,null,null,null,null,null,null,null,null,null,null,null,null,null,null,null,null,null,null,null,null,{"$f":"Noblanks(J195:J692)","v":""}]
[null,null,null,null,null,null," ",null,null,null,null,null,null,null,null,null,null,null,null,null,null,null,null,null,null,null,null,null,null,{"$f":"Noblanks(J196:J693)","v":""}]
[null,null,null,null,null,null," ",null,null,null,null,null,null,null,null,null,null,null,null,null,null,null,null,null,null,null,null,null,null,{"$f":"Noblanks(J197:J694)","v":""}]
[null,null,null,null,null,null," "]
[null,null,null,null,null,null," "]
[null,null,null,null,null,null," "]
[null,null,null,null,null,null," "]
[null,null,null,null,null,null," "]
[null,null,null,null,null,null," "]
[null,null,null,null,null,null," "]
[null,null,null,null,null,null," "]
[null,null,null,null,null,null," "]
[null,null,null,null,null,null," "]
[null,null,null,null,null,null," "]
[null,null,null,null,null,null," "]
[null,null,null,null,null,null," "]
[null,null,null,null,null,null," "]
[null,null,null,null,null,null," "]
[null,null,null,null,null,null," "]
[null,null,null,null,null,null," "]
[null,null,null,null,null,null," "]
[null,null,null,null,null,null," "]
[null,null,null,null,null,null," "]
[null,null,null,null,null,null," "]
[null,null,null,null,null,null," "]
[null,null,null,null,null,null," "]
[null,null,null,null,null,null," "]
[null,null,null,null,null,null," "]
[null,null,null,null,null,null," "]
[null,null,null,null,null,null," "]
[null,null,null,null,null,null," "]
[null,null,null,null,null,null," "]
[null,null,null,null,null,null," "]
[null,null,null,null,null,null," "]
[null,null,null,null,null,null," "]
[null,null,null,null,null,null," "]
[null,null,null,null,null,null," "]
[null,null,null,null,null,null," "]
[null,null,null,null,null,null," "]
[null,null,null,null,null,null," "]
[null,null,null,null,null,null," "]
[null,null,null,null,null,null," "]
[null,null,null,null,null,null," "]
[null,null,null,null,null,null," "]
[null,null,null,null,null,null," "]
[null,null,null,null,null,null," "]
[null,null,null,null,null,null," "]
[null,null,null,null,null,null," "]
[null,null,null,null,null,null," "]
[null,null,null,null,null,null," "]
[null,null,null,null,null,null," "]
[null,null,null,null,null,null," "]
[null,null,null,null,null,null," "]
[null,null,null,null,null,null," "]
[null,null,null,null,null,null," "]
[null,null,null,null,null,null," "]
[null,null,null,null,null,null," "]
[null,null,null,null,null,null," "]
[null,null,null,null,null,null," "]
[null,null,null,null,null,null," "]
[null,null,null,null,null,null," "]
[null,null,null,null,null,null," "]
[null,null,null,null,null,null," "]
[null,null,null,null,null,null," "]
[null,null,null,null,null,null," "]
[null,null,null,null,null,null," "]
[null,null,null,null,null,null," "]
[null,null,null,null,null,null," "]
[null,null,null,null,null,null," "]
[null,null,null,null,null,null," "]
[null,null,null,null,null,null," "]
[null,null,null,null,null,null," "]
[null,null,null,null,null,null," "]
[null,null,null,null,null,null," "]
[null,null,null,null,null,null," "]
[null,null,null,null,null,null," "]
[null,null,null,null,null,null," "]
[null,null,null,null,null,null," "]
[null,null,null,null,null,null," "]
[null,null,null,null,null,null," "]
[null,null,null,null,null,null," "]
[null,null,null,null,null,null," "]
[null,null,null,null,null,null," "]
[null,null,null,null,null,null," "]
[null,null,null,null,null,null," "]
[null,null,null,null,null,null," "]
[null,null,null,null,null,null," "]
[null,null,null,null,null,null," "]
[null,null,null,null,null,null," "]
[null,null,null,null,null,null," "]
[null,null,null,null,null,null," "]
[null,null,null,null,null,null," "]
[null,null,null,null,null,null," "]
[null,null,null,null,null,null," "]
[null,null,null,null,null,null," "]
[null,null,null,null,null,null," "]
[null,null,null,null,null,null," "]
[null,null,null,null,null,null," "]
[null,null,null,null,null,null," "]
[null,null,null,null,null,null," "]
[null,null,null,null,null,null," "]
[null,null,null,null,null,null," "]
[null,null,null,null,null,null," "]
[null,null,null,null,null,null," "]
[null,null,null,null,null,null," "]
[null,null,null,null,null,null," "]
[null,null,null,null,null,null," "]
[null,null,null,null,null,null," "]
[null,null,null,null,null,null," "]
[null,null,null,null,null,null," "]
[null,null,null,null,null,null," "]
[null,null,null,null,null,null," "]
[null,null,null,null,null,null," "]
[null,null,null,null,null,null," "]
[null,null,null,null,null,null," "]
[null,null,null,null,null,null," "]
[null,null,null,null,null,null," "]
[null,null,null,null,null,null," "]
[null,null,null,null,null,null," "]
[null,null,null,null,null,null," "]
[null,null,null,null,null,null," "]
[null,null,null,null,null,null," "]
[null,null,null,null,null,null," "]
[null,null,null,null,null,null," "]
[null,null,null,null,null,null," "]
[null,null,null,null,null,null," "]
[null,null,null,null,null,null," "]
[null,null,null,null,null,null," "]
[null,null,null,null,null,null," "]
[null,null,null,null,null,null," "]
[null,null,null,null,null,null," "]
[null,null,null,null,null,null," "]
[null,null,null,null,null,null," "]
[null,null,null,null,null,null," "]
[null,null,null,null,null,null," "]
[null,null,null,null,null,null," "]
[null,null,null,null,null,null," "]
[null,null,null,null,null,null," "]
[null,null,null,null,null,null," "]
[null,null,null,null,null,null," "]
[null,null,null,null,null,null," "]
[null,null,null,null,null,null," "]
[null,null,null,null,null,null," "]
[null,null,null,null,null,null," "]
[null,null,null,null,null,null," "]
[null,null,null,null,null,null," "]
[null,null,null,null,null,null," "]
[null,null,null,null,null,null," "]
[null,null,null,null,null,null," "]
[null,null,null,null,null,null," "]
[null,null,null,null,null,null," "]
[null,null,null,null,null,null," "]
[null,null,null,null,null,null," "]
[null,null,null,null,null,null," "]
[null,null,null,null,null,null," "]
[null,null,null,null,null,null," "]
[null,null,null,null,null,null," "]
[null,null,null,null,null,null," "]
[null,null,null,null,null,null," "]
[null,null,null,null,null,null," "]
[null,null,null,null,null,null," "]
[null,null,null,null,null,null," "]
[null,null,null,null,null,null," "]
[null,null,null,null,null,null," "]
[null,null,null,null,null,null," "]
[null,null,null,null,null,null," "]
[null,null,null,null,null,null," "]
[null,null,null,null,null,null," "]
[null,null,null,null,null,null," "]
[null,null,null,null,null,null," "]
[null,null,null,null,null,null," "]
[null,null,null,null,null,null," "]
[null,null,null,null,null,null," "]
[null,null,null,null,null,null," "]
[null,null,null,null,null,null," "]
[null,null,null,null,null,null," "]
[null,null,null,null,null,null," "]
[null,null,null,null,null,null," "]
[null,null,null,null,null,null," "]
[null,null,null,null,null,null," "]
[null,null,null,null,null,null," "]
[null,null,null,null,null,null," "]
[null,null,null,null,null,null," "]
[null,null,null,null,null,null," "]
[null,null,null,null,null,null," "]
[null,null,null,null,null,null," "]
[null,null,null,null,null,null," "]
[null,null,null,null,null,null," "]
[null,null,null,null,null,null," "]
[null,null,null,null,null,null," "]
[null,null,null,null,null,null," "]
[null,null,null,null,null,null," "]
[null,null,null,null,null,null," "]
[null,null,null,null,null,null," "]
[null,null,null,null,null,null," "]
[null,null,null,null,null,null," "]
[null,null,null,null,null,null," "]
[null,null,null,null,null,null," "]
[null,null,null,null,null,null," "]
[null,null,null,null,null,null," "]
[null,null,null,null,null,null," "]
[null,null,null,null,null,null," "]
[null,null,null,null,null,null," "]
[null,null,null,null,null,null," "]
[null,null,null,null,null,null," "]
[null,null,null,null,null,null," "]
[null,null,null,null,null,null," "]
[null,null,null,null,null,null," "]
[null,null,null,null,null,null," "]
[null,null,null,null,null,null," "]
[null,null,null,null,null,null," "]
[null,null,null,null,null,null," "]
[null,null,null,null,null,null," "]
[null,null,null,null,null,null," "]
[null,null,null,null,null,null," "]
[null,null,null,null,null,null," "]
[null,null,null,null,null,null," "]
[null,null,null,null,null,null," "]
[null,null,null,null,null,null," "]
[null,null,null,null,null,null," "]
[null,null,null,null,null,null," "]
[null,null,null,null,null,null," "]
[null,null,null,null,null,null," "]
[null,null,null,null,null,null," "]
[null,null,null,null,null,null," "]
[null,null,null,null,null,null," "]
[null,null,null,null,null,null," "]
[null,null,null,null,null,null," "]
[null,null,null,null,null,null," "]
[null,null,null,null,null,null," "]
[null,null,null,null,null,null," "]
[null,null,null,null,null,null," "]
[null,null,null,null,null,null," "]
[null,null,null,null,null,null," "]
[null,null,null,null,null,null," "]
[null,null,null,null,null,null," "]
[null,null,null,null,null,null," "]
[null,null,null,null,null,null," "]
[null,null,null,null,null,null," "]
[null,null,null,null,null,null," "]
[null,null,null,null,null,null," "]
[null,null,null,null,null,null," "]
[null,null,null,null,null,null," "]
[null,null,null,null,null,null," "]
[null,null,null,null,null,null," "]
[null,null,null,null,null,null," "]
[null,null,null,null,null,null," "]
[null,null,null,null,null,null," "]
[null,null,null,null,null,null," "]
[null,null,null,null,null,null," "]
[null,null,null,null,null,null," "]
[null,null,null,null,null,null," "]
[null,null,null,null,null,null," "]
[null,null,null,null,null,null," "]
[null,null,null,null,null,null," "]
[null,null,null,null,null,null," "]
[null,null,null,null,null,null," "]
[null,null,null,null,null,null," "]
[null,null,null,null,null,null," "]
[null,null,null,null,null,null," "]
[null,null,null,null,null,null," "]
[null,null,null,null,null,null," "]
[null,null,null,null,null,null," "]
[null,null,null,null,null,null," "]
[null,null,null,null,null,null," "]
[null,null,null,null,null,null," "]
[null,null,null,null,null,null," "]
[null,null,null,null,null,null," "]
[null,null,null,null,null,null," "]
[null,null,null,null,null,null," "]
[null,null,null,null,null,null," "]
[null,null,null,null,null,null," "]
[null,null,null,null,null,null," "]
[null,null,null,null,null,null," "]
[null,null,null,null,null,null," "]
[null,null,null,null,null,null," "]
[null,null,null,null,null,null," "]
[null,null,null,null,null,null," "]
[null,null,null,null,null,null," "]
[null,null,null,null,null,null," "]
[null,null,null,null,null,null," "]
[null,null,null,null,null,null," "]
[null,null,null,null,null,null," "]
[null,null,null,null,null,null," "]
[null,null,null,null,null,null," "]
[null,null,null,null,null,null," "]
[null,null,null,null,null,null," "]
[null,null,null,null,null,null," "]
[null,null,null,null,null,null," "]
[null,null,null,null,null,null," "]
[null,null,null,null,null,null," "]
[null,null,null,null,null,null," "]
[null,null,null,null,null,null," "]
[null,null,null,null,null,null," "]
[null,null,null,null,null,null," "]
[null,null,null,null,null,null," "]
[null,null,null,null,null,null," "]
[null,null,null,null,null,null," "]
[null,null,null,null,null,null," "]
[null,null,null,null,null,null," "]
[null,null,null,null,null,null," "]
[null,null,null,null,null,null," "]
[null,null,null,null,null,null," "]
[null,null,null,null,null,null," "]
[null,null,null,null,null,null," "]

{"sheet":"20-07-2019","index":2,"n_rows":500,"n_cols":31,"rows_kept":500,"cut":false,"hidden":false,"merged":[]}
["Official time","App. Date","Name","Surname","Pasaport No.","Date of birth","Note of status","Price $","Paid $","Route","Unpaid $","GT","T.Gov",null,null,null,"رجــــوع","رجــــوع","رجــــوع","رجــــوع","TOTAL"]
[1,"2019-04-24T15:00:35.577","KHAYRI ATEEYAH ALMAHDI","ALGHOUL","RGZ10H6R","1973-05-08","Done"," ","","IHAB"," ",25,62.5]
[2,"2019-04-28T12:39:44.370","ALZUBAYR FARAJ HASAN","ALMUZOUGHI","LPC37G85","1993-11-21","Cancelled"," ","","nisreen"," ",25,62.5,null,null,"DONE",null,null,null,null,"Total amount",null,"Net profit",null,"Route","Total Unpaid",null,null,"IHAB","Note of status","Count of Mistake"]
[3,"2019-04-28T13:13:30.707","ZAKRIA","ALMOZGI","GL35GN54","1991-12-02","Done"," ","","IHAB"," ",25,62.5,null,null,"CANCELLED",null,null,null,null,0,null,-6462.5,null,"IHAB",0,null,null,"IHAB","MISTAKE IN DOB",4]
[4,"2019-04-29T13:36:16.330","OMAR","ELMOHASHSH","NCJRH93G","1990-09-28","Mistake",0,0,null,"",25,62.5,null,null,"REFUSED",null,null,null,null,null,null,null,null,"nisreen",0,null,null,"nisreen"]
[5,"2019-04-29T13:42:27.433","HIND","OSMAN","C5NR6798","1994-05-01","Mistake",0,0,null,"",25,62.5,null,null,"MISTAKE",null,null,null,null,"Total Paid",null,"Difrent amount",null,"akram",0,"IHAB",null,"IHAB"]
[6,"2019-05-02T16:57:01.433","MOHAMED","ALBIJOU","RJH6LLCZ","1991-04-24"," "," "," ",null,"",25,62.5,null,null,"GREEN PASS.",null,null,null,null,0,null,0,null,"BINDARDAF",0,"nisreen",null,"akram"]
[7,"2019-05-02T17:04:28.613","SANA","ELHASSI","HCJ6L6PK","1991-09-29","Done"," "," ",null,"",25,62.5,null,null,null,null,null,null,null,null,null,null,null,"SALAH SHABASH",0,"IHAB",null,"akram"]
[8,"2019-05-08T12:55:30.870","AISHA","ALSAKLOUL","NPJ3YZH4","1979-05-25","Mistake",0,0,null,"",25,62.5,null,null,"official time",null,null,null,null,"Total UnPaid",null,"No. of applicants",null,"DR.ABDO",0,"",null,"akram"]
[9,"2019-05-08T13:03:32.563","ESLAM","ALSAKLOUL","NPNKR1RZ","1990-01-15","Cancelled"," "," ",null,"",25,62.5,null,null,"official holiday",null,null,null,null,0,null,76,null,"HAMZA",0,"",null,"akram"]
[10,"2019-05-12T15:21:28.803","ESLAM","ALSAKLOUL","-NPNKR1RZ","1996-01-15","Green pass."," "," ",null,"",25,62.5,null,null,"other",null,null,null,null,null,null,null,null,"SHAHOMI",0,"",null,"akram"]
[11,"2019-05-16T13:48:08.413","MUHANAD","ELBURKI","J7G3JY60","1984-01-21","Mistake",0,"","akram"," ",25,62.5,null,null,null,null,null,null,null,"Total GT",null,null,null,"saleh",0,"",null,"akram"]
[12,"2019-05-16T13:53:24.300","ENAS","IKJAM","R4HHCPY4","1985-02-06","Mistake",0," ",null,"",25,62.5,null,null,null,null,null,null,null,1900,null,"Cost amount",null,"",null,"",null,"akram"]
[13,"2019-05-19T13:26:46.853","LAILA","BEN ISMAIL","K2P1N4N8","1966-04-06"," "," "," ",null,"",25,62.5,null,null,null,null,null,null,null,null,null,6462.5,null,"",null,"",null,"akram"]
[14,"2019-05-19T13:31:45.700","YASMIN","EL SAHLI","PCPY0PG9","2005-05-15"," "," "," ",null,"",25,62.5,null,null,null,null,null,null,null,"Total T.Gov",null,null,null,"",null,"",null,"BINDARDAF"]
[15,"2019-05-19T13:35:47.647","YOMNA","EL SAHLI","PCR55NJP","2002-02-27"," "," "," ",null,"",25,62.5,null,null,null,null,null,null,null,4562.5,null,null,null,"",null,"akram","","BINDARDAF"]
[16,"2019-05-21T16:16:50.417","ALSADEG","AGILA","P81G5CK1","1978-01-05"," "," "," ",null,"",25,62.5,null,null,null,null,null,null,null,null,null,null,null,"",null,"","","BINDARDAF"]
[17,"2019-05-22T13:16:38.180","KHOLUD","KRAIM","F9K1J6G5","1983-08-06"," "," ","","BINDARDAF"," ",25,62.5,null,null,null,null,null,null,null,null,null,null,null,"",null,"",null,"BINDARDAF"]
[18,"2019-05-23T12:28:57.527","RAMADHAN","GARGOM","000C6236LL1","1977-04-21"," "," ","","SALAH SHABASH"," ",25,62.5,null,null,null,null,null,null,null,null,null,null,null,"",null,"",null,"BINDARDAF"]
[19,"2019-05-28T17:03:35.457","ABTISAM  ","HOUSSEIN","HZLY9H3G","1983-10-01"," "," "," ",null,"",25,62.5,null,null,null,null,null,null,null,null,null,null,null,"",null,"",null,"BINDARDAF"]
[20,"2019-05-29T18:56:52.767","ABOBAKER ","ALSHADLI","NGR095HY","1985-04-08"," "," "," ",null,"",25,62.5,null,null,null,null,null,null,null,"Done",null,null,null,"",null,"",null,"SALAH SHABASH"]
[21,"2019-06-09T12:00:50.073","ADEL","ALABYADH","RG2KYP15","1976-02-20"," "," "," ",null,"",25,62.5,null,null,null,null,null,null,null,"Cancelled",null,null,null,"",null,"BINDARDAF",null,"IHAB",null,""]
[22,"2019-06-09T13:19:06.617","MOHAMED","ALBIJOU","+RJH6LLCZ","1991-04-24"," "," "," ",null,"",25,62.5,null,null,null,null,null,null,null,"Refused",null,null,null,"Total",0,"SALAH SHABASH",null,"IHAB",null,""]
[23,"2019-06-09T13:42:41.223","ALMAHDI","ALBAHLOUL","P28YYP83","1981-10-06"," "," "," ",null,"",25,62.5,null,null,null,null,null,null,null,"Green pass.",null,null,null,null,null,"",null,"IHAB",null,""]
[24,"2019-06-09T15:32:46.743","KHADIJA","AGILA","HN058N7F","1995-05-05"," "," "," ",null,"",25,62.5,null,null,null,null,null,null,null,"Mistake",null,null,null,null,null,"",null,"IHAB",null,""]
[25,"2019-06-10T13:58:24.787","MUNIR","ELAGOURI","FPFGG8YP","1975-03-01"," "," "," ",null,"",25,62.5,null,null,null,null,null,null,null,null,null,null,null,null,null,"",null,"IHAB"]
[26,"2019-06-10T14:15:21.727","ABDULBASIT","ALTAHIR","LCLRC5F0","1971-10-12"," "," "," ",null,"",25,62.5,null,null,null,null,null,null,null,null,null,null,null,null,null,"",null,"IHAB"]
[27,"2019-06-10T14:32:41.430","OMAR","ALTAHIR","HP52ZG24","1975-04-01"," "," "," ",null,"",25,62.5,null,null,null,null,null,null,null,null,null,null,null,null,null,"",null,"IHAB"]
[28,"2019-06-10T16:05:09.850","OSAMA","BELGASEM","QY84LPJY","1976-10-04"," "," "," ",null,"",25,62.5,null,null,null,null,null,null,null,null,null,null,null,null,null,"",null,"IHAB"]
[29,"2019-06-10T16:08:07.367","NESRIN","MOHAMED","GY8Y7L1N","1982-06-10"," "," "," ",null,"",25,62.5,null,null,null,null,null,null,null,null,null,null,null,null,null,"",null,"IHAB"]
[30,"2019-06-10T16:45:00.743","OMAR","ELHMRRI","HYY6NGL2","1990-11-22"," "," "," ",null,"",25,62.5,null,null,null,null,null,null,null,null,null,null,null,null,null,"",null,"IHAB"]
[31,"2019-06-10T16:50:13.033","GHALIYAH","ALHAMRI","CKN315PH","1987-06-03"," "," "," ",null,"",25,62.5,null,null,null,null,null,null,null,null,null,null,null,null,null,"",null,"IHAB"]
[32,"2019-06-11T12:02:25.957","BRAA","ELMANGOSH","+C0881J9P","1994-02-06"," "," ","","IHAB"," ",25,62.5,null,null,null,null,null,null,null,null,null,null,null,null,null,"",null,"IHAB"]
[33,"2019-06-11T12:06:47.277","ZAINAB","ELSADEG","L0KPKR13","1955-12-25"," "," ","","IHAB"," ",25,62.5,null,null,null,null,null,null,null,null,null,null,null,null,null,"",null,"IHAB"]
[34,"2019-06-11T12:24:45.843","ASEIDA","AHNESH","JZ3PC669","1994-08-02"," "," "," ",null,"",25,62.5,null,null,null,null,null,null,null,null,null,null,null,null,null,"",null,"IHAB"]
[35,"2019-06-11T14:08:21.950","NASSER","BENHALLOUM","CGJJFN87","1959-01-01"," "," ","","DR.ABDO"," ",25,62.5,null,null,null,null,null,null,null,null,null,null,null,null,null,"",null,"IHAB"]
[36,"2019-06-11T14:12:07.113","ABDULLAH","BINHALLOUM","HRC82HFJ","1990-08-19"," "," ","","DR.ABDO"," ",25,62.5,null,null,null,null,null,null,null,null,null,null,null,null,null,"IHAB",null,"DR.ABDO"]
[37,"2019-06-12T13:06:19.563","ALAADIN","ALSHARKSI","LL2JC154","1968-09-04"," "," ","","IHAB"," ",25,62.5,null,null,null,null,null,null,null,null,null,null,null,null,null,"IHAB",null,"DR.ABDO"]
[38,"2019-06-12T13:11:53.757","AHLAM","ABDALLAH","LL00C60N","1974-06-08"," "," ","","IHAB"," ",25,62.5,null,null,null,null,null,null,null,null,null,null,null,null,null,"",null,"DR.ABDO"]
[39,"2019-06-12T13:15:23.813","ALAA","ALSHARKASI","L22L1RCP","2007-05-14"," "," ","","IHAB"," ",25,62.5,null,null,null,null,null,null,null,null,null,null,null,null,null,"DR.ABDO",null,"IHAB"]
[40,"2019-06-13T15:33:52.910","OMAR","ELHMRRI","+HYY6NGL2","1990-11-22"," "," "," ",null,"",25,62.5,null,null,null,null,null,null,null,null,null,null,null,null,null,"DR.ABDO",null,"IHAB"]
[41,"2019-06-13T15:39:21.060","LAYLAY","BOUSHEEHAH","HYZG20YC","1966-01-01"," "," "," ",null,"",25,62.5,null,null,null,null,null,null,null,null,null,null,null,null,null,"IHAB",null,"IHAB"]
[42,"2019-06-17T12:12:51.307","SALAH EDDIN","SHAHOMI","GY1JRP7P","1976-05-25"," "," "," ",null,"",25,62.5,null,null,null,null,null,null,null,null,null,null,null,null,null,"IHAB",null,"HAMZA"]
[43,"2019-06-17T12:17:44.810","MARWA","ASHTITI","GY42C07F","1990-09-24"," "," "," ",null,"",25,62.5,null,null,null,null,null,null,null,null,null,null,null,null,null,"IHAB",null,"HAMZA"]
[44,"2019-06-17T12:51:47.780","ZAHRAH","BOURAWI","P7RLF9J0","1965-08-28"," "," "," ",null,"",25,62.5,null,null,null,null,null,null,null,null,null,null,null,null,null,"",null,"HAMZA"]
[45,"2019-06-17T12:56:59.610","ABDELRAHIM","ALSHATEETI","GR3P9FZK","1992-01-04"," "," "," ",null,"",25,62.5,null,null,null,null,null,null,null,null,null,null,null,null,null,"",null,"HAMZA"]
[46,"2019-06-17T13:02:00.187","AHMED","ALSHATEETI","FRF2YK0C","1995-10-06"," "," "," ",null,"",25,62.5,null,null,null,null,null,null,null,null,null,null,null,null,null,"",null,"HAMZA"]
[47,"2019-06-18T12:24:59.867","IBRAHIM","ELGAHANI","H07H239J","1984-01-11"," "," ","","HAMZA"," ",25,62.5,null,null,null,null,null,null,null,null,null,null,null,null,null,"",null,"HAMZA"]
[48,"2019-06-18T12:28:44.510","NADAY","ALARJ","CFJ2L289","1996-12-26"," "," ","","HAMZA"," ",25,62.5,null,null,null,null,null,null,null,null,null,null,null,null,null,"",null,"HAMZA"]
[49,"2019-06-18T17:22:15.387","OMAR","ALBISHARI","LN0G4RC3","1984-03-12"," "," "," ",null,"",25,62.5,null,null,null,null,null,null,null,null,null,null,null,null,null,"",null,"HAMZA"]
[50,"2019-06-18T17:54:11.480","SHIMA","ALBASHARI","HF7F2F8N","1990-01-21"," "," "," ",null,"",25,62.5,null,null,null,null,null,null,null,null,null,null,null,null,null,"",null,"HAMZA"]
[51,"2019-06-20T11:42:46.477","MARWA","ELMAHDI","CK5R6GCC","1996-02-13"," "," "," ",null,"",25,62.5,null,null,null,null,null,null,null,null,null,null,null,null,null,"HAMZA",null,"SHAHOMI"]
[52,"2019-06-20T12:12:00.130","BALGEIS","BADI","GN575LJ5","1963-01-01"," "," "," ",null,"",25,62.5,null,null,null,null,null,null,null,null,null,null,null,null,null,"HAMZA",null,"SHAHOMI"]
[53,"2019-06-20T12:18:10.100","MIRA","GLESSA","GN3FZG0P","2006-07-31"," "," "," ",null,"",25,62.5,null,null,null,null,null,null,null,null,null,null,null,null,null,"",null,"SHAHOMI"]
[54,"2019-06-20T12:27:13.480","HANI","GLESSA","GN755ZZJ","2004-01-20"," "," "," ",null,"",25,62.5,null,null,null,null,null,null,null,null,null,null,null,null,null,"",null,"SHAHOMI"]
[55,"2019-06-20T14:38:24.320","YAHIA","ELFALLAH","JKP7CGP2","1970-01-01"," "," "," ",null,"",25,62.5,null,null,null,null,null,null,null,null,null,null,null,null,null,"",null,"SHAHOMI"]
[56,"2019-06-20T14:43:13.117","ABTESAM","BADER","C9127619","1971-02-06"," "," "," ",null,"",25,62.5,null,null,null,null,null,null,null,null,null,null,null,null,null,"",null,"SHAHOMI"]
[57,"2019-06-20T14:46:41.963","NOOR","ALFALLAH","C8RRLPH0","2002-09-04"," "," "," ",null,"",25,62.5,null,null,null,null,null,null,null,null,null,null,null,null,null,"",null,"SHAHOMI"]
[58,"2019-06-20T14:53:30.030","ISLAM","ALFALLAH","C8LCJ63Y","2004-01-11"," "," "," ",null,"",25,62.5,null,null,null,null,null,null,null,null,null,null,null,null,null,"",null,"SHAHOMI"]
[59,"2019-06-20T16:10:06.907","AHMED","BEDA","H9941GK0","1979-10-06"," "," ","","SHAHOMI"," ",25,62.5,null,null,null,null,null,null,null,null,null,null,null,null,null,"",null,"SHAHOMI"]
[60,"2019-06-20T16:26:14.793","ESRAA","GINI","H973R816","1989-03-22"," "," ","","SHAHOMI"," ",25,62.5,null,null,null,null,null,null,null,null,null,null,null,null,null,"",null,"SHAHOMI"]
[61,"2019-06-20T18:11:23.413","ABDELJAUL","ELAYTIE","FRNFL9ZK","1959-08-28"," "," ","","nisreen"," ",25,62.5,null,null,null,null,null,null,null,null,null,null,null,null,null,"",null,"SHAHOMI"]
[62,"2019-06-20T18:14:02.773","SALMA","ELZEWI","FRYCP0P3","1958-01-01"," "," ","","saleh"," ",25,62.5,null,null,null,null,null,null,null,null,null,null,null,null,null,"",null,"SHAHOMI"]
[63,"2019-06-20T18:17:26.260","MARWA","ELSAYTIE","FRN4NYCF","1991-02-12"," "," "," ",null,"",25,62.5,null,null,null,null,null,null,null,null,null,null,null,null,null,"SHAHOMI",null,"nisreen"]
[64,"2019-06-20T18:23:05.277","ALI","ALSAEITI","GG019KY0","1996-12-22"," "," "," ",null,"",25,62.5,null,null,null,null,null,null,null,null,null,null,null,null,null,"SHAHOMI",null,"saleh"]
[65,"2019-06-20T19:09:13.237","KHADEEJAH","ALZAWI","F1KY0LK0","1966-11-21"," "," "," ",null,"",25,62.5,null,null,null,null,null,null,null,null,null,null,null,null,null,"nisreen",null,""]
[66,"2019-06-20T19:17:53.300","AIDAH","BEIDA","G15PZZ2F","1973-10-25"," "," "," ",null,"",25,62.5,null,null,null,null,null,null,null,null,null,null,null,null,null,"saleh",null,""]
[67,"2019-06-20T19:26:33.365","KHADEEJAH","ALZAWI","F1KY0LK1","1980-09-28"," "," "," ",null,"",25,62.5,null,null,null,null,null,null,null,null,null,null,null,null,null,"",null,""]
[68,"2019-06-20T19:35:13.430","AIDAH","BEIDA","G15PZZ2F","1987-09-02"," "," "," ",null,"",25,62.5,null,null,null,null,null,null,null,null,null,null,null,null,null,"",null,""]
[69,"2019-06-20T19:43:53.495","KHADEEJAH","ALZAWI","F1KY0LK2","1994-08-06"," "," "," ",null,"",25,62.5,null,null,null,null,null,null,null,null,null,null,null,null,null,"",null,""]
[70,"2019-06-20T19:52:33.560","AIDAH","BEIDA","G15PZZ2F","2001-07-10"," "," "," ",null,"",25,62.5,null,null,null,null,null,null,null,null,null,null,null,null,null,"",null,""]
[71,"2019-06-20T20:01:13.625","KHADEEJAH","ALZAWI","F1KY0LK3","2008-06-13"," "," "," ",null,"",25,62.5,null,null,null,null,null,null,null,null,null,null,null,null,null,"",null,""]
[72,"2019-06-20T20:09:53.690","AIDAH","BEIDA","G15PZZ2F","2015-05-18"," "," "," ",null,"",25,62.5,null,null,null,null,null,null,null,null,null,null,null,null,null,"",null,""]
[73,"2019-06-20T20:18:33.755","KHADEEJAH","ALZAWI","F1KY0LK4","2022-04-21"," "," "," ",null,"",25,62.5,null,null,null,null,null,null,null,null,null,null,null,null,null,"",null,""]
[74,"2019-06-20T20:27:13.820","AIDAH","BEIDA","G15PZZ2F","2029-03-25"," "," "," ",null,"",25,62.5,null,null,null,null,null,null,null,null,null,null,null,null,null,"",null,""]
[75,"2019-06-20T20:35:53.885","KHADEEJAH","ALZAWI","F1KY0LK5","2036-02-27"," "," "," ",null,"",25,62.5,null,null,null,null,null,null,null,null,null,null,null,null,null,"",null,""]
[76,"2019-06-20T20:44:33.950","AIDAH","BEIDA","G15PZZ2F","2043-01-31"," "," "," ",null,"",25,62.5,null,null,null,null,null,null,null,null,null,null,null,null,null,"",null,""]
[null,null,null,null,null,null," "," ",null,null,null,null,null,null,null,null,null,null,null,null,null,null,null,null,null,null,"",null,""]
[null,null,null,null,null,null," "," ",null,null,null,null,null,null,null,null,null,null,null,null,null,null,null,null,null,null,"",null,""]
[null,null,null,null,null,null," "," ",null,null,null,null,null,null,null,null,null,null,null,null,null,null,null,null,null,null,"",null,""]
[null,null,null,null,null,null," "," ",null,null,null,null,null,null,null,null,null,null,null,null,null,null,null,null,null,null,"",null,""]
[null,null,null,null,null,null," "," ",null,null,null,null,null,null,null,null,null,null,null,null,null,null,null,null,null,null,"",null,""]
[null,null,null,null,null,null," "," ",null,null,null,null,null,null,null,null,null,null,null,null,null,null,null,null,null,null,"",null,""]
[null,null,null,null,null,null," "," ",null,null,null,null,null,null,null,null,null,null,null,null,null,null,null,null,null,null,"",null,""]
[null,null,null,null,null,null," "," ",null,null,null,null,null,null,null,null,null,null,null,null,null,null,null,null,null,null,"",null,""]
[null,null,null,null,null,null," "," ",null,null,null,null,null,null,null,null,null,null,null,null,null,null,null,null,null,null,"",null,""]
[null,null,null,null,null,null," "," ",null,null,null,null,null,null,null,null,null,null,null,null,null,null,null,null,null,null,"",null,""]
[null,null,null,null,null,null," "," ",null,null,null,null,null,null,null,null,null,null,null,null,null,null,null,null,null,null,"",null,""]
[null,null,null,null,null,null," "," ",null,null,null,null,null,null,null,null,null,null,null,null,null,null,null,null,null,null,"",null,""]
[null,null,null,null,null,null," "," ",null,null,null,null,null,null,null,null,null,null,null,null,null,null,null,null,null,null,"",null,""]
[null,null,null,null,null,null," "," ",null,null,null,null,null,null,null,null,null,null,null,null,null,null,null,null,null,null,"",null,""]
[null,null,null,null,null,null," "," ",null,null,null,null,null,null,null,null,null,null,null,null,null,null,null,null,null,null,"",null,""]
[null,null,null,null,null,null," "," ",null,null,null,null,null,null,null,null,null,null,null,null,null,null,null,null,null,null,"",null,""]
[null,null,null,null,null,null," "," ",null,null,null,null,null,null,null,null,null,null,null,null,null,null,null,null,null,null,"",null,""]
[null,null,null,null,null,null," "," ",null,null,null,null,null,null,null,null,null,null,null,null,null,null,null,null,null,null,"",null,""]
[null,null,null,null,null,null," "," ",null,null,null,null,null,null,null,null,null,null,null,null,null,null,null,null,null,null,"",null,""]
[null,null,null,null,null,null," "," ",null,null,null,null,null,null,null,null,null,null,null,null,null,null,null,null,null,null,"",null,""]
[null,null,null,null,null,null," "," ",null,null,null,null,null,null,null,null,null,null,null,null,null,null,null,null,null,null,"",null,""]
[null,null,null,null,null,null," "," ",null,null,null,null,null,null,null,null,null,null,null,null,null,null,null,null,null,null,"",null,""]
[null,null,null,null,null,null," "," ",null,null,null,null,null,null,null,null,null,null,null,null,null,null,null,null,null,null,"",null,""]
[null,null,null,null,null,null," ",null,null,null,null,null,null,null,null,null,null,null,null,null,null,null,null,null,null,null,"",null,""]
[null,null,null,null,null,null," ",null,null,null,null,null,null,null,null,null,null,null,null,null,null,null,null,null,null,null,"",null,""]
[null,null,null,null,null,null," ",null,null,null,null,null,null,null,null,null,null,null,null,null,null,null,null,null,null,null,null,null,""]
[null,null,null,null,null,null," ",null,null,null,null,null,null,null,null,null,null,null,null,null,null,null,null,null,null,null,null,null,""]
[null,null,null,null,null,null," ",null,null,null,null,null,null,null,null,null,null,null,null,null,null,null,null,null,null,null,null,null,""]
[null,null,null,null,null,null," ",null,null,null,null,null,null,null,null,null,null,null,null,null,null,null,null,null,null,null,null,null,""]
[null,null,null,null,null,null," ",null,null,null,null,null,null,null,null,null,null,null,null,null,null,null,null,null,null,null,null,null,""]
[null,null,null,null,null,null," ",null,null,null,null,null,null,null,null,null,null,null,null,null,null,null,null,null,null,null,null,null,""]
[null,null,null,null,null,null," ",null,null,null,null,null,null,null,null,null,null,null,null,null,null,null,null,null,null,null,null,null,""]
[null,null,null,null,null,null," ",null,null,null,null,null,null,null,null,null,null,null,null,null,null,null,null,null,null,null,null,null,""]
[null,null,null,null,null,null," ",null,null,null,null,null,null,null,null,null,null,null,null,null,null,null,null,null,null,null,null,null,""]
[null,null,null,null,null,null," ",null,null,null,null,null,null,null,null,null,null,null,null,null,null,null,null,null,null,null,null,null,""]
[null,null,null,null,null,null," ",null,null,null,null,null,null,null,null,null,null,null,null,null,null,null,null,null,null,null,null,null,""]
[null,null,null,null,null,null," ",null,null,null,null,null,null,null,null,null,null,null,null,null,null,null,null,null,null,null,null,null,""]
[null,null,null,null,null,null," ",null,null,null,null,null,null,null,null,null,null,null,null,null,null,null,null,null,null,null,null,null,""]
[null,null,null,null,null,null," ",null,null,null,null,null,null,null,null,null,null,null,null,null,null,null,null,null,null,null,null,null,""]
[null,null,null,null,null,null," ",null,null,null,null,null,null,null,null,null,null,null,null,null,null,null,null,null,null,null,null,null,""]
[null,null,null,null,null,null," ",null,null,null,null,null,null,null,null,null,null,null,null,null,null,null,null,null,null,null,null,null,""]
[null,null,null,null,null,null," ",null,null,null,null,null,null,null,null,null,null,null,null,null,null,null,null,null,null,null,null,null,""]
[null,null,null,null,null,null," ",null,null,null,null,null,null,null,null,null,null,null,null,null,null,null,null,null,null,null,null,null,""]
[null,null,null,null,null,null," ",null,null,null,null,null,null,null,null,null,null,null,null,null,null,null,null,null,null,null,null,null,""]
[null,null,null,null,null,null," ",null,null,null,null,null,null,null,null,null,null,null,null,null,null,null,null,null,null,null,null,null,""]
[null,null,null,null,null,null," ",null,null,null,null,null,null,null,null,null,null,null,null,null,null,null,null,null,null,null,null,null,""]
[null,null,null,null,null,null," ",null,null,null,null,null,null,null,null,null,null,null,null,null,null,null,null,null,null,null,null,null,""]
[null,null,null,null,null,null," ",null,null,null,null,null,null,null,null,null,null,null,null,null,null,null,null,null,null,null,null,null,""]
[null,null,null,null,null,null," ",null,null,null,null,null,null,null,null,null,null,null,null,null,null,null,null,null,null,null,null,null,""]
[null,null,null,null,null,null," ",null,null,null,null,null,null,null,null,null,null,null,null,null,null,null,null,null,null,null,null,null,""]
[null,null,null,null,null,null," ",null,null,null,null,null,null,null,null,null,null,null,null,null,null,null,null,null,null,null,null,null,""]
[null,null,null,null,null,null," ",null,null,null,null,null,null,null,null,null,null,null,null,null,null,null,null,null,null,null,null,null,""]
[null,null,null,null,null,null," ",null,null,null,null,null,null,null,null,null,null,null,null,null,null,null,null,null,null,null,null,null,""]
[null,null,null,null,null,null," ",null,null,null,null,null,null,null,null,null,null,null,null,null,null,null,null,null,null,null,null,null,""]
[null,null,null,null,null,null," ",null,null,null,null,null,null,null,null,null,null,null,null,null,null,null,null,null,null,null,null,null,""]
[null,null,null,null,null,null," ",null,null,null,null,null,null,null,null,null,null,null,null,null,null,null,null,null,null,null,null,null,""]
[null,null,null,null,null,null," ",null,null,null,null,null,null,null,null,null,null,null,null,null,null,null,null,null,null,null,null,null,""]
[null,null,null,null,null,null," ",null,null,null,null,null,null,null,null,null,null,null,null,null,null,null,null,null,null,null,null,null,""]
[null,null,null,null,null,null," ",null,null,null,null,null,null,null,null,null,null,null,null,null,null,null,null,null,null,null,null,null,""]
[null,null,null,null,null,null," ",null,null,null,null,null,null,null,null,null,null,null,null,null,null,null,null,null,null,null,null,null,""]
[null,null,null,null,null,null," ",null,null,null,null,null,null,null,null,null,null,null,null,null,null,null,null,null,null,null,null,null,""]
[null,null,null,null,null,null," ",null,null,null,null,null,null,null,null,null,null,null,null,null,null,null,null,null,null,null,null,null,""]
[null,null,null,null,null,null," ",null,null,null,null,null,null,null,null,null,null,null,null,null,null,null,null,null,null,null,null,null,""]
[null,null,null,null,null,null," ",null,null,null,null,null,null,null,null,null,null,null,null,null,null,null,null,null,null,null,null,null,""]
[null,null,null,null,null,null," ",null,null,null,null,null,null,null,null,null,null,null,null,null,null,null,null,null,null,null,null,null,""]
[null,null,null,null,null,null," ",null,null,null,null,null,null,null,null,null,null,null,null,null,null,null,null,null,null,null,null,null,""]
[null,null,null,null,null,null," ",null,null,null,null,null,null,null,null,null,null,null,null,null,null,null,null,null,null,null,null,null,""]
[null,null,null,null,null,null," ",null,null,null,null,null,null,null,null,null,null,null,null,null,null,null,null,null,null,null,null,null,""]
[null,null,null,null,null,null," ",null,null,null,null,null,null,null,null,null,null,null,null,null,null,null,null,null,null,null,null,null,""]
[null,null,null,null,null,null," ",null,null,null,null,null,null,null,null,null,null,null,null,null,null,null,null,null,null,null,null,null,""]
[null,null,null,null,null,null," ",null,null,null,null,null,null,null,null,null,null,null,null,null,null,null,null,null,null,null,null,null,""]
[null,null,null,null,null,null," ",null,null,null,null,null,null,null,null,null,null,null,null,null,null,null,null,null,null,null,null,null,""]
[null,null,null,null,null,null," ",null,null,null,null,null,null,null,null,null,null,null,null,null,null,null,null,null,null,null,null,null,""]
[null,null,null,null,null,null," ",null,null,null,null,null,null,null,null,null,null,null,null,null,null,null,null,null,null,null,null,null,""]
[null,null,null,null,null,null," ",null,null,null,null,null,null,null,null,null,null,null,null,null,null,null,null,null,null,null,null,null,""]
[null,null,null,null,null,null," ",null,null,null,null,null,null,null,null,null,null,null,null,null,null,null,null,null,null,null,null,null,""]
[null,null,null,null,null,null," ",null,null,null,null,null,null,null,null,null,null,null,null,null,null,null,null,null,null,null,null,null,""]
[null,null,null,null,null,null," ",null,null,null,null,null,null,null,null,null,null,null,null,null,null,null,null,null,null,null,null,null,""]
[null,null,null,null,null,null," ",null,null,null,null,null,null,null,null,null,null,null,null,null,null,null,null,null,null,null,null,null,""]
[null,null,null,null,null,null," ",null,null,null,null,null,null,null,null,null,null,null,null,null,null,null,null,null,null,null,null,null,""]
[null,null,null,null,null,null," ",null,null,null,null,null,null,null,null,null,null,null,null,null,null,null,null,null,null,null,null,null,""]
[null,null,null,null,null,null," ",null,null,null,null,null,null,null,null,null,null,null,null,null,null,null,null,null,null,null,null,null,""]
[null,null,null,null,null,null," ",null,null,null,null,null,null,null,null,null,null,null,null,null,null,null,null,null,null,null,null,null,""]
[null,null,null,null,null,null," ",null,null,null,null,null,null,null,null,null,null,null,null,null,null,null,null,null,null,null,null,null,""]
[null,null,null,null,null,null," ",null,null,null,null,null,null,null,null,null,null,null,null,null,null,null,null,null,null,null,null,null,""]
[null,null,null,null,null,null," ",null,null,null,null,null,null,null,null,null,null,null,null,null,null,null,null,null,null,null,null,null,""]
[null,null,null,null,null,null," ",null,null,null,null,null,null,null,null,null,null,null,null,null,null,null,null,null,null,null,null,null,""]
[null,null,null,null,null,null," ",null,null,null,null,null,null,null,null,null,null,null,null,null,null,null,null,null,null,null,null,null,""]
[null,null,null,null,null,null," ",null,null,null,null,null,null,null,null,null,null,null,null,null,null,null,null,null,null,null,null,null,""]
[null,null,null,null,null,null," ",null,null,null,null,null,null,null,null,null,null,null,null,null,null,null,null,null,null,null,null,null,""]
[null,null,null,null,null,null," ",null,null,null,null,null,null,null,null,null,null,null,null,null,null,null,null,null,null,null,null,null,""]
[null,null,null,null,null,null," ",null,null,null,null,null,null,null,null,null,null,null,null,null,null,null,null,null,null,null,null,null,""]
[null,null,null,null,null,null," ",null,null,null,null,null,null,null,null,null,null,null,null,null,null,null,null,null,null,null,null,null,""]
[null,null,null,null,null,null," ",null,null,null,null,null,null,null,null,null,null,null,null,null,null,null,null,null,null,null,null,null,""]
[null,null,null,null,null,null," ",null,null,null,null,null,null,null,null,null,null,null,null,null,null,null,null,null,null,null,null,null,""]
[null,null,null,null,null,null," ",null,null,null,null,null,null,null,null,null,null,null,null,null,null,null,null,null,null,null,null,null,""]
[null,null,null,null,null,null," ",null,null,null,null,null,null,null,null,null,null,null,null,null,null,null,null,null,null,null,null,null,""]
[null,null,null,null,null,null," ",null,null,null,null,null,null,null,null,null,null,null,null,null,null,null,null,null,null,null,null,null,""]
[null,null,null,null,null,null," ",null,null,null,null,null,null,null,null,null,null,null,null,null,null,null,null,null,null,null,null,null,""]
[null,null,null,null,null,null," ",null,null,null,null,null,null,null,null,null,null,null,null,null,null,null,null,null,null,null,null,null,""]
[null,null,null,null,null,null," ",null,null,null,null,null,null,null,null,null,null,null,null,null,null,null,null,null,null,null,null,null,""]
[null,null,null,null,null,null," ",null,null,null,null,null,null,null,null,null,null,null,null,null,null,null,null,null,null,null,null,null,""]
[null,null,null,null,null,null," ",null,null,null,null,null,null,null,null,null,null,null,null,null,null,null,null,null,null,null,null,null,""]
[null,null,null,null,null,null," ",null,null,null,null,null,null,null,null,null,null,null,null,null,null,null,null,null,null,null,null,null,""]
[null,null,null,null,null,null," ",null,null,null,null,null,null,null,null,null,null,null,null,null,null,null,null,null,null,null,null,null,""]
[null,null,null,null,null,null," ",null,null,null,null,null,null,null,null,null,null,null,null,null,null,null,null,null,null,null,null,null,""]
[null,null,null,null,null,null," ",null,null,null,null,null,null,null,null,null,null,null,null,null,null,null,null,null,null,null,null,null,""]
[null,null,null,null,null,null," ",null,null,null,null,null,null,null,null,null,null,null,null,null,null,null,null,null,null,null,null,null,""]
[null,null,null,null,null,null," ",null,null,null,null,null,null,null,null,null,null,null,null,null,null,null,null,null,null,null,null,null,""]
[null,null,null,null,null,null," ",null,null,null,null,null,null,null,null,null,null,null,null,null,null,null,null,null,null,null,null,null,""]
[null,null,null,null,null,null," ",null,null,null,null,null,null,null,null,null,null,null,null,null,null,null,null,null,null,null,null,null,""]
[null,null,null,null,null,null," ",null,null,null,null,null,null,null,null,null,null,null,null,null,null,null,null,null,null,null,null,null,""]
[null,null,null,null,null,null," ",null,null,null,null,null,null,null,null,null,null,null,null,null,null,null,null,null,null,null,null,null,""]
[null,null,null,null,null,null," ",null,null,null,null,null,null,null,null,null,null,null,null,null,null,null,null,null,null,null,null,null,""]
[null,null,null,null,null,null," ",null,null,null,null,null,null,null,null,null,null,null,null,null,null,null,null,null,null,null,null,null,""]
[null,null,null,null,null,null," ",null,null,null,null,null,null,null,null,null,null,null,null,null,null,null,null,null,null,null,null,null,""]
[null,null,null,null,null,null," ",null,null,null,null,null,null,null,null,null,null,null,null,null,null,null,null,null,null,null,null,null,""]
[null,null,null,null,null,null," ",null,null,null,null,null,null,null,null,null,null,null,null,null,null,null,null,null,null,null,null,null,""]
[null,null,null,null,null,null," ",null,null,null,null,null,null,null,null,null,null,null,null,null,null,null,null,null,null,null,null,null,""]
[null,null,null,null,null,null," ",null,null,null,null,null,null,null,null,null,null,null,null,null,null,null,null,null,null,null,null,null,""]
[null,null,null,null,null,null," ",null,null,null,null,null,null,null,null,null,null,null,null,null,null,null,null,null,null,null,null,null,""]
[null,null,null,null,null,null," "]
[null,null,null,null,null,null," "]
[null,null,null,null,null,null," "]
[null,null,null,null,null,null," "]
[null,null,null,null,null,null," "]
[null,null,null,null,null,null," "]
[null,null,null,null,null,null," "]
[null,null,null,null,null,null," "]
[null,null,null,null,null,null," "]
[null,null,null,null,null,null," "]
[null,null,null,null,null,null," "]
[null,null,null,null,null,null," "]
[null,null,null,null,null,null," "]
[null,null,null,null,null,null," "]
[null,null,null,null,null,null," "]
[null,null,null,null,null,null," "]
[null,null,null,null,null,null," "]
[null,null,null,null,null,null," "]
[null,null,null,null,null,null," "]
[null,null,null,null,null,null," "]
[null,null,null,null,null,null," "]
[null,null,null,null,null,null," "]
[null,null,null,null,null,null," "]
[null,null,null,null,null,null," "]
[null,null,null,null,null,null," "]
[null,null,null,null,null,null," "]
[null,null,null,null,null,null," "]
[null,null,null,null,null,null," "]
[null,null,null,null,null,null," "]
[null,null,null,null,null,null," "]
[null,null,null,null,null,null," "]
[null,null,null,null,null,null," "]
[null,null,null,null,null,null," "]
[null,null,null,null,null,null," "]
[null,null,null,null,null,null," "]
[null,null,null,null,null,null," "]
[null,null,null,null,null,null," "]
[null,null,null,null,null,null," "]
[null,null,null,null,null,null," "]
[null,null,null,null,null,null," "]
[null,null,null,null,null,null," "]
[null,null,null,null,null,null," "]
[null,null,null,null,null,null," "]
[null,null,null,null,null,null," "]
[null,null,null,null,null,null," "]
[null,null,null,null,null,null," "]
[null,null,null,null,null,null," "]
[null,null,null,null,null,null," "]
[null,null,null,null,null,null," "]
[null,null,null,null,null,null," "]
[null,null,null,null,null,null," "]
[null,null,null,null,null,null," "]
[null,null,null,null,null,null," "]
[null,null,null,null,null,null," "]
[null,null,null,null,null,null," "]
[null,null,null,null,null,null," "]
[null,null,null,null,null,null," "]
[null,null,null,null,null,null," "]
[null,null,null,null,null,null," "]
[null,null,null,null,null,null," "]
[null,null,null,null,null,null," "]
[null,null,null,null,null,null," "]
[null,null,null,null,null,null," "]
[null,null,null,null,null,null," "]
[null,null,null,null,null,null," "]
[null,null,null,null,null,null," "]
[null,null,null,null,null,null," "]
[null,null,null,null,null,null," "]
[null,null,null,null,null,null," "]
[null,null,null,null,null,null," "]
[null,null,null,null,null,null," "]
[null,null,null,null,null,null," "]
[null,null,null,null,null,null," "]
[null,null,null,null,null,null," "]
[null,null,null,null,null,null," "]
[null,null,null,null,null,null," "]
[null,null,null,null,null,null," "]
[null,null,null,null,null,null," "]
[null,null,null,null,null,null," "]
[null,null,null,null,null,null," "]
[null,null,null,null,null,null," "]
[null,null,null,null,null,null," "]
[null,null,null,null,null,null," "]
[null,null,null,null,null,null," "]
[null,null,null,null,null,null," "]
[null,null,null,null,null,null," "]
[null,null,null,null,null,null," "]
[null,null,null,null,null,null," "]
[null,null,null,null,null,null," "]
[null,null,null,null,null,null," "]
[null,null,null,null,null,null," "]
[null,null,null,null,null,null," "]
[null,null,null,null,null,null," "]
[null,null,null,null,null,null," "]
[null,null,null,null,null,null," "]
[null,null,null,null,null,null," "]
[null,null,null,null,null,null," "]
[null,null,null,null,null,null," "]
[null,null,null,null,null,null," "]
[null,null,null,null,null,null," "]
[null,null,null,null,null,null," "]
[null,null,null,null,null,null," "]
[null,null,null,null,null,null," "]
[null,null,null,null,null,null," "]
[null,null,null,null,null,null," "]
[null,null,null,null,null,null," "]
[null,null,null,null,null,null," "]
[null,null,null,null,null,null," "]
[null,null,null,null,null,null," "]
[null,null,null,null,null,null," "]
[null,null,null,null,null,null," "]
[null,null,null,null,null,null," "]
[null,null,null,null,null,null," "]
[null,null,null,null,null,null," "]
[null,null,null,null,null,null," "]
[null,null,null,null,null,null," "]
[null,null,null,null,null,null," "]
[null,null,null,null,null,null," "]
[null,null,null,null,null,null," "]
[null,null,null,null,null,null," "]
[null,null,null,null,null,null," "]
[null,null,null,null,null,null," "]
[null,null,null,null,null,null," "]
[null,null,null,null,null,null," "]
[null,null,null,null,null,null," "]
[null,null,null,null,null,null," "]
[null,null,null,null,null,null," "]
[null,null,null,null,null,null," "]
[null,null,null,null,null,null," "]
[null,null,null,null,null,null," "]
[null,null,null,null,null,null," "]
[null,null,null,null,null,null," "]
[null,null,null,null,null,null," "]
[null,null,null,null,null,null," "]
[null,null,null,null,null,null," "]
[null,null,null,null,null,null," "]
[null,null,null,null,null,null," "]
[null,null,null,null,null,null," "]
[null,null,null,null,null,null," "]
[null,null,null,null,null,null," "]
[null,null,null,null,null,null," "]
[null,null,null,null,null,null," "]
[null,null,null,null,null,null," "]
[null,null,null,null,null,null," "]
[null,null,null,null,null,null," "]
[null,null,null,null,null,null," "]
[null,null,null,null,null,null," "]
[null,null,null,null,null,null," "]
[null,null,null,null,null,null," "]
[null,null,null,null,null,null," "]
[null,null,null,null,null,null," "]
[null,null,null,null,null,null," "]
[null,null,null,null,null,null," "]
[null,null,null,null,null,null," "]
[null,null,null,null,null,null," "]
[null,null,null,null,null,null," "]
[null,null,null,null,null,null," "]
[null,null,null,null,null,null," "]
[null,null,null,null,null,null," "]
[null,null,null,null,null,null," "]
[null,null,null,null,null,null," "]
[null,null,null,null,null,null," "]
[null,null,null,null,null,null," "]
[null,null,null,null,null,null," "]
[null,null,null,null,null,null," "]
[null,null,null,null,null,null," "]
[null,null,null,null,null,null," "]
[null,null,null,null,null,null," "]
[null,null,null,null,null,null," "]
[null,null,null,null,null,null," "]
[null,null,null,null,null,null," "]
[null,null,null,null,null,null," "]
[null,null,null,null,null,null," "]
[null,null,null,null,null,null," "]
[null,null,null,null,null,null," "]
[null,null,null,null,null,null," "]
[null,null,null,null,null,null," "]
[null,null,null,null,null,null," "]
[null,null,null,null,null,null," "]
[null,null,null,null,null,null," "]
[null,null,null,null,null,null," "]
[null,null,null,null,null,null," "]
[null,null,null,null,null,null," "]
[null,null,null,null,null,null," "]
[null,null,null,null,null,null," "]
[null,null,null,null,null,null," "]
[null,null,null,null,null,null," "]
[null,null,null,null,null,null," "]
[null,null,null,null,null,null," "]
[null,null,null,null,null,null," "]
[null,null,null,null,null,null," "]
[null,null,null,null,null,null," "]
[null,null,null,null,null,null," "]
[null,null,null,null,null,null," "]
[null,null,null,null,null,null," "]
[null,null,null,null,null,null," "]
[null,null,null,null,null,null," "]
[null,null,null,null,null,null," "]
[null,null,null,null,null,null," "]
[null,null,null,null,null,null," "]
[null,null,null,null,null,null," "]
[null,null,null,null,null,null," "]
[null,null,null,null,null,null," "]
[null,null,null,null,null,null," "]
[null,null,null,null,null,null," "]
[null,null,null,null,null,null," "]
[null,null,null,null,null,null," "]
[null,null,null,null,null,null," "]
[null,null,null,null,null,null," "]
[null,null,null,null,null,null," "]
[null,null,null,null,null,null," "]
[null,null,null,null,null,null," "]
[null,null,null,null,null,null," "]
[null,null,null,null,null,null," "]
[null,null,null,null,null,null," "]
[null,null,null,null,null,null," "]
[null,null,null,null,null,null," "]
[null,null,null,null,null,null," "]
[null,null,null,null,null,null," "]
[null,null,null,null,null,null," "]
[null,null,null,null,null,null," "]
[null,null,null,null,null,null," "]
[null,null,null,null,null,null," "]
[null,null,null,null,null,null," "]
[null,null,null,null,null,null," "]
[null,null,null,null,null,null," "]
[null,null,null,null,null,null," "]
[null,null,null,null,null,null," "]
[null,null,null,null,null,null," "]
[null,null,null,null,null,null," "]
[null,null,null,null,null,null," "]
[null,null,null,null,null,null," "]
[null,null,null,null,null,null," "]
[null,null,null,null,null,null," "]
[null,null,null,null,null,null," "]
[null,null,null,null,null,null," "]
[null,null,null,null,null,null," "]
[null,null,null,null,null,null," "]
[null,null,null,null,null,null," "]
[null,null,null,null,null,null," "]
[null,null,null,null,null,null," "]
[null,null,null,null,null,null," "]
[null,null,null,null,null,null," "]
[null,null,null,null,null,null," "]
[null,null,null,null,null,null," "]
[null,null,null,null,null,null," "]
[null,null,null,null,null,null," "]
[null,null,null,null,null,null," "]
[null,null,null,null,null,null," "]
[null,null,null,null,null,null," "]
[null,null,null,null,null,null," "]
[null,null,null,null,null,null," "]
[null,null,null,null,null,null," "]
[null,null,null,null,null,null," "]
[null,null,null,null,null,null," "]
[null,null,null,null,null,null," "]
[null,null,null,null,null,null," "]
[null,null,null,null,null,null," "]
[null,null,null,null,null,null," "]
[null,null,null,null,null,null," "]
[null,null,null,null,null,null," "]
[null,null,null,null,null,null," "]
[null,null,null,null,null,null," "]
[null,null,null,null,null,null," "]
[null,null,null,null,null,null," "]
[null,null,null,null,null,null," "]
[null,null,null,null,null,null," "]
[null,null,null,null,null,null," "]
[null,null,null,null,null,null," "]
[null,null,null,null,null,null," "]
[null,null,null,null,null,null," "]
[null,null,null,null,null,null," "]
[null,null,null,null,null,null," "]
[null,null,null,null,null,null," "]
[null,null,null,null,null,null," "]
[null,null,null,null,null,null," "]
[null,null,null,null,null,null," "]
[null,null,null,null,null,null," "]
[null,null,null,null,null,null," "]
[null,null,null,null,null,null," "]
[null,null,null,null,null,null," "]
[null,null,null,null,null,null," "]
[null,null,null,null,null,null," "]
[null,null,null,null,null,null," "]
[null,null,null,null,null,null," "]
[null,null,null,null,null,null," "]
[null,null,null,null,null,null," "]
[null,null,null,null,null,null," "]
[null,null,null,null,null,null," "]
[null,null,null,null,null,null," "]
[null,null,null,null,null,null," "]
[null,null,null,null,null,null," "]
[null,null,null,null,null,null," "]
[null,null,null,null,null,null," "]
[null,null,null,null,null,null," "]
[null,null,null,null,null,null," "]
[null,null,null,null,null,null," "]
[null,null,null,null,null,null," "]
[null,null,null,null,null,null," "]
[null,null,null,null,null,null," "]
[null,null,null,null,null,null," "]
[null,null,null,null,null,null," "]