{"text_format":"1","workbook":"xlsx","n_sheets":2,"sheets":["اسماء العام الدراسى 2019-2020","بيان قيد"],"not_rendered":{"charts":0,"images":3,"macros":1,"external_links":0,"defined_names":4,"comments":0,"pivot_tables":0},"unopened":[],"bounds":{"document_bytes":16777216,"sheet_cells":100000,"rows_first":2000,"rows_last":500,"rows_between":2000,"halvings":0,"cell_chars":16384,"cell_head_chars":4096},"cells_cut":0,"cells_raw":0,"read":"whole","date_system":"1900"}

{"sheet":"اسماء العام الدراسى 2019-2020","index":0,"n_rows":2667,"n_cols":19,"rows_kept":2667,"cut":false,"hidden":false,"merged":[]}
[null," ","اسم التلميذ",null,"الصف","الفصل","النوع","حالة القيد","الديانة   *","كود الديانة","اسم الام","م  *","صف- فصل- نوع   *","صف- فصل- نوع ديانة *","الصف *",{"$f":"COLUMN()","v":16}]
[1,{"$f":"IF(C2=\"\",\"\",COUNTA($C$2:C2))","v":1},"ابراهيم محمد حسين القرشى ",1,1,"2",1,null,{"$f":"IF(C2=\"\",\"\",IF(J2=1,\"\",\"م\"))","v":""},1,null,{"$f":"B2","v":1},{"$f":"CONCATENATE(G2,F2,E2)","v":"121"},{"$f":"CONCATENATE(J2,G2,F2,E2)","v":"1121"},{"$f":"E2","v":1},{"$f":"IF(O2=1,\" الاول الابتدائى\",IF(O2=2,\" الثانى الابتدائى\",IF(O2=3,\"الثالث الابتدائى\",IF(O2=4,\" الرابع الابتدائى\",IF(O2=5,\" الخامس الابتدائى\",IF(O2=6,\" السادس الابتدائى\",IF(O2=7,\" الاول الاعدادى\",IF(O2=8,\" الثانى الاعدادى\",IF(O2=9,\" الثالث الاعدادى\",IF(O2=10,\" الاول الثانوى\",IF(O2=11,\" الثانى الثانوى\",IF(O2=12,\" الثالث الثانوى\",IF(O2=13,\" الاول حضانة  KG1\",IF(O2=14,\" الثانى حضانة KG2\",\"\"))))))))))))))","v":" الاول الابتدائى"},{"$f":"IF(G2=1,\"ولد\",\"بنت\")","v":"ولد"},{"$f":"IF(AND(G2=1,J2=1),\"مسلم\",IF(AND(G2=2,J2=1),\"مسلمة\",IF(AND(G2=1,J2=2),\"مسيحى\",IF(AND(G2=2,J2=2),\"مسيحية\",\"\"))))","v":"مسلم"}]
[2,{"$f":"IF(C3=\"\",\"\",COUNTA($C$2:C3))","v":2},"ابراهيم محمد فوزى محمد فنون",2,1,"5",1,null,"",1,null,2,"151","1151",1," الاول الابتدائى","ولد","مسلم"]
[3,{"$f":"IF(C4=\"\",\"\",COUNTA($C2:C$4))","v":3},"احمد جلال عزت عبد الجليل العطفاوى ",3,1,"1",1,null,"",1,null,3,"111","1111",1," الاول الابتدائى","ولد","مسلم","2014-10-12"]
[4,{"$f":"IF(C5=\"\",\"\",COUNTA($C$2:C5))","v":4},"احمد خالد إبراهيم السيد شرف ",4,1,"6",1,null,"",1,null,4,"161","1161",1," الاول الابتدائى","ولد","مسلم"]
[5,{"$f":"IF(C6=\"\",\"\",COUNTA($C$2:C6))","v":5},"احمد عادل محمد عاطف عبد المقصود السملاوى",5,1,"2",1,null,"",1,null,5,"121","1121",1," الاول الابتدائى","ولد","مسلم"]
[6,{"$f":"IF(C7=\"\",\"\",COUNTA($C$2:C7))","v":6},"احمد عمرو احمد عبد العزيز الرملاوى ",6,1,"2",1,null,"",1,null,6,"121","1121",1," الاول الابتدائى","ولد","مسلم"]
[7,{"$f":"IF(C8=\"\",\"\",COUNTA($C$2:C8))","v":7},"احمد عمرو حسنى حماد ",7,1,"5",1,null,"",1,null,7,"151","1151",1," الاول الابتدائى","ولد","مسلم"]
[8,{"$f":"IF(C9=\"\",\"\",COUNTA($C$2:C9))","v":8},"احمد محمد إبراهيم البرماوى",8,1,"3",1,null,"",1,null,8,"131","1131",1," الاول الابتدائى","ولد","مسلم"]
[9,{"$f":"IF(C10=\"\",\"\",COUNTA($C$2:C10))","v":9},"احمد محمد سامى محمد غبارة ",9,1,"4",1,null,"",1,null,9,"141","1141",1," الاول الابتدائى","ولد","مسلم"]
[10,{"$f":"IF(C11=\"\",\"\",COUNTA($C$2:C11))","v":10},"احمد محمد نبيل طه الشقرى",10,1,"3",1,null,"",1,null,10,"131","1131",1," الاول الابتدائى","ولد","مسلم"]
[11,{"$f":"IF(C12=\"\",\"\",COUNTA($C$2:C12))","v":11},"احمد ياسر احمد عبد الرحيم الشاعر ",11,1,"6",1,null,"",1,null,11,"161","1161",1," الاول الابتدائى","ولد","مسلم"]
[12,{"$f":"IF(C13=\"\",\"\",COUNTA($C$2:C13))","v":12},"ادم ابراهيم محمد احمد كريم ",12,1,"1",1,null,"",1,null,12,"111","1111",1," الاول الابتدائى","ولد","مسلم","2014-12-02"]
[13,{"$f":"IF(C14=\"\",\"\",COUNTA($C$2:C14))","v":13},"ادم احمد حمدي السيد فرج ",13,1,"2",1,null,"",1,null,13,"121","1121",1," الاول الابتدائى","ولد","مسلم"]
[14,{"$f":"IF(C15=\"\",\"\",COUNTA($C$2:C15))","v":14},"ادم احمد سامى احمد مختار ",14,1,"6",1,null,"",1,null,14,"161","1161",1," الاول الابتدائى","ولد","مسلم"]
[15,{"$f":"IF(C16=\"\",\"\",COUNTA($C$2:C16))","v":15},"ادم اسامه احمد فؤاد السيد الشعراوى",15,1,"5",1,null,"",1,null,15,"151","1151",1," الاول الابتدائى","ولد","مسلم"]
[16,{"$f":"IF(C17=\"\",\"\",COUNTA($C$2:C17))","v":16},"ادم تامر رمضان عبد الحميد جاد حسن",16,1,"1",1,null,"",1,null,16,"111","1111",1," الاول الابتدائى","ولد","مسلم"]
[17,{"$f":"IF(C18=\"\",\"\",COUNTA($C$2:C18))","v":17},"ادم عماد الدين محمد فياض",17,1,"4",1,null,"",1,null,17,"141","1141",1," الاول الابتدائى","ولد","مسلم"]
[18,{"$f":"IF(C19=\"\",\"\",COUNTA($C$2:C19))","v":18},"ادم محمد محمود عبد المجيد حسين ",18,1,"2",1,null,"",1,null,18,"121","1121",1," الاول الابتدائى","ولد","مسلم"]
[19,{"$f":"IF(C20=\"\",\"\",COUNTA($C$2:C20))","v":19},"ادم مصطفى كامل احمد خليفه ",19,1,"1",1,null,"",1,null,19,"111","1111",1," الاول الابتدائى","ولد","مسلم"]
[20,{"$f":"IF(C21=\"\",\"\",COUNTA($C$2:C21))","v":20},"ادهم عمرو محمد محمد عطيه",20,1,"1",1,null,"",1,null,20,"111","1111",1," الاول الابتدائى","ولد","مسلم"]
[21,{"$f":"IF(C22=\"\",\"\",COUNTA($C$2:C22))","v":21},"ارسانى ماجد مكرم جرجس ",21,1,"2",1,null,"م",2,null,21,"121","2121",1," الاول الابتدائى","ولد","مسيحى"]
[22,{"$f":"IF(C23=\"\",\"\",COUNTA($C$2:C23))","v":22},"اسامه احمد اسامه عبد الله عامر ",22,1,"6",1,null,"",1,null,22,"161","1161",1," الاول الابتدائى","ولد","مسلم"]
[23,{"$f":"IF(C24=\"\",\"\",COUNTA($C$2:C24))","v":23},"اسر احمد محمد يوسف الشيخ ",23,1,"5",1,null,"",1,null,23,"151","1151",1," الاول الابتدائى","ولد","مسلم"]
[24,{"$f":"IF(C25=\"\",\"\",COUNTA($C$2:C25))","v":24},"اسر محمد السيد صابر",24,1,"6",1,null,"",1,null,24,"161","1161",1," الاول الابتدائى","ولد","مسلم"]
[25,{"$f":"IF(C26=\"\",\"\",COUNTA($C$2:C26))","v":25},"اسر محمد القطب حماد ",25,1,"5",1,null,"",1,null,25,"151","1151",1," الاول الابتدائى","ولد","مسلم"]
[26,{"$f":"IF(C27=\"\",\"\",COUNTA($C$2:C27))","v":26},"افرام نزيه فهيم عطيه سليمان ",26,1,"3",1,null,"م",2,null,26,"131","2131",1," الاول الابتدائى","ولد","مسيحى"]
[27,{"$f":"IF(C28=\"\",\"\",COUNTA($C$2:C28))","v":27},"اندرو صفوت عبد السيد يوسف ",27,1,"5",1,null,"م",2,null,27,"151","2151",1," الاول الابتدائى","ولد","مسيحى"]
[28,{"$f":"IF(C29=\"\",\"\",COUNTA($C$2:C29))","v":28},"اياد احمد صالح كمال الفخرانى ",28,1,"4",1,null,"",1,null,28,"141","1141",1," الاول الابتدائى","ولد","مسلم"]
[29,{"$f":"IF(C30=\"\",\"\",COUNTA($C$2:C30))","v":29},"اياد احمد عصام الدين الميهى ",29,1,"3",1,null,"",1,null,29,"131","1131",1," الاول الابتدائى","ولد","مسلم"]
[30,{"$f":"IF(C31=\"\",\"\",COUNTA($C$2:C31))","v":30},"اياد ايمن شكرى المكاوى",30,1,"3",1,null,"",1,null,30,"131","1131",1," الاول الابتدائى","ولد","مسلم"]
[31,{"$f":"IF(C32=\"\",\"\",COUNTA($C$2:C32))","v":31},"باسل خالد عبد الوهاب خليل حماد",31,1,"4",1,null,"",1,null,31,"141","1141",1," الاول الابتدائى","ولد","مسلم"]
[32,{"$f":"IF(C33=\"\",\"\",COUNTA($C$2:C33))","v":32},"بافلى فادى فايز ميخائيل ",32,1,"4",1,null,"م",2,null,32,"141","2141",1," الاول الابتدائى","ولد","مسيحى"]
[33,{"$f":"IF(C34=\"\",\"\",COUNTA($C$2:C34))","v":33},"بافلي بيشوي سامي جرجس",33,1,"2",1,null,"م",2,null,33,"121","2121",1," الاول الابتدائى","ولد","مسيحى"]
[34,{"$f":"IF(C35=\"\",\"\",COUNTA($C$2:C35))","v":34},"تميم احمد ممدوح ابو اليزيد النشرتى ",34,1,"3",1,null,"",1,null,34,"131","1131",1," الاول الابتدائى","ولد","مسلم"]
[35,{"$f":"IF(C36=\"\",\"\",COUNTA($C$2:C36))","v":35},"توماس فادى فوزى فهمى رزق",35,1,"6",1,null,"م",2,null,35,"161","2161",1," الاول الابتدائى","ولد","مسيحى"]
[36,{"$f":"IF(C37=\"\",\"\",COUNTA($C$2:C37))","v":36},"جورج رفيق اداورد حنا فرج الله",36,1,"2",1,null,"م",2,null,36,"121","2121",1," الاول الابتدائى","ولد","مسيحى"]
[37,{"$f":"IF(C38=\"\",\"\",COUNTA($C$2:C38))","v":37},"جون مينا جبران ميخائيل جبران",37,1,"2",1,null,"م",2,null,37,"121","2121",1," الاول الابتدائى","ولد","مسيحى"]
[38,{"$f":"IF(C39=\"\",\"\",COUNTA($C$2:C39))","v":38},"حامد ابراهيم حامد حامد السيد جبر",38,1,"5",1,null,"",1,null,38,"151","1151",1," الاول الابتدائى","ولد","مسلم"]
[39,{"$f":"IF(C40=\"\",\"\",COUNTA($C$2:C40))","v":39},"حسن محمد ابراهيم احمد ",39,1,"1",1,null,"",1,null,39,"111","1111",1," الاول الابتدائى","ولد","مسلم"]
[40,{"$f":"IF(C41=\"\",\"\",COUNTA($C$2:C41))","v":40},"حسين محمود محمد حسين محمود ",40,1,"5",1,null,"",1,null,40,"151","1151",1," الاول الابتدائى","ولد","مسلم"]
[41,{"$f":"IF(C42=\"\",\"\",COUNTA($C$2:C42))","v":41},"حمزة على احمد عبد الفتاح",41,1,"3",1,null,"",1,null,41,"131","1131",1," الاول الابتدائى","ولد","مسلم"]
[42,{"$f":"IF(C43=\"\",\"\",COUNTA($C$2:C43))","v":42},"ديماس مجدى عطيه ابراهيم غبريال ",42,1,"3",1,null,"م",2,null,42,"131","2131",1," الاول الابتدائى","ولد","مسيحى"]
[43,{"$f":"IF(C44=\"\",\"\",COUNTA($C$2:C44))","v":43},"سليم محمد فوزى على عبد الله ",43,1,"6",1,null,"",1,null,43,"161","1161",1," الاول الابتدائى","ولد","مسلم"]
[44,{"$f":"IF(C45=\"\",\"\",COUNTA($C$2:C45))","v":44},"سيف الاسلام مجدي حسن احمد حسن عباس",44,1,"2",1,null,"",1,null,44,"121","1121",1," الاول الابتدائى","ولد","مسلم"]
[45,{"$f":"IF(C46=\"\",\"\",COUNTA($C$2:C46))","v":45},"شادى شريف احمد حامد حجازى ",45,1,"1",1,null,"",1,null,45,"111","1111",1," الاول الابتدائى","ولد","مسلم"]
[46,{"$f":"IF(C47=\"\",\"\",COUNTA($C$2:C47))","v":46},"شادى عادل فاروق صليب اسعد",46,1,"4",1,null,"م",2,null,46,"141","2141",1," الاول الابتدائى","ولد","مسيحى"]
[47,{"$f":"IF(C48=\"\",\"\",COUNTA($C$2:C48))","v":47},"شنودة مينا عادل لويس طنيوس",47,1,"1",1,null,"م",2,null,47,"111","2111",1," الاول الابتدائى","ولد","مسيحى"]
[48,{"$f":"IF(C49=\"\",\"\",COUNTA($C$2:C49))","v":48},"عبد الرحمن شريف محمد شحاته ",48,1,"3",1,null,"",1,null,48,"131","1131",1," الاول الابتدائى","ولد","مسلم"]
[49,{"$f":"IF(C50=\"\",\"\",COUNTA($C$2:C50))","v":49},"عبد الرحمن محمد ابو العنين عبد الرحمن ",49,1,"3",1,null,"",1,null,49,"131","1131",1," الاول الابتدائى","ولد","مسلم"]
[50,{"$f":"IF(C51=\"\",\"\",COUNTA($C$2:C51))","v":50},"عبد الرحمن محمود جلال بسيونى البرماوى",50,1,"1",1,null,"",1,null,50,"111","1111",1," الاول الابتدائى","ولد","مسلم"]
[51,{"$f":"IF(C52=\"\",\"\",COUNTA($C$2:C52))","v":51},"عبد الله محمد عبد السميع غنيم الشاذلى",51,1,"6",1,null,"",1,null,51,"161","1161",1," الاول الابتدائى","ولد","مسلم"]
[52,{"$f":"IF(C53=\"\",\"\",COUNTA($C$2:C53))","v":52},"على اسامه احمد محمد بيومى ",52,1,"6",1,null,"",1,null,52,"161","1161",1," الاول الابتدائى","ولد","مسلم"]
[53,{"$f":"IF(C54=\"\",\"\",COUNTA($C$2:C54))","v":53},"عمر اكرم مصطفى عبد القادر ابو سالم ",53,1,"5",1,null,"",1,null,53,"151","1151",1," الاول الابتدائى","ولد","مسلم"]
[54,{"$f":"IF(C55=\"\",\"\",COUNTA($C$2:C55))","v":54},"عمر ايمن ايوب راغب المغربى ",54,1,"6",1,null,"",1,null,54,"161","1161",1," الاول الابتدائى","ولد","مسلم"]
[55,{"$f":"IF(C56=\"\",\"\",COUNTA($C$2:C56))","v":55},"عمر تامر محمود البرى ",55,1,"1",1,null,"",1,null,55,"111","1111",1," الاول الابتدائى","ولد","مسلم"]
[56,{"$f":"IF(C57=\"\",\"\",COUNTA($C$2:C57))","v":56},"عمر على مصطفى على الجندى ",56,1,"6",1,null,"",1,null,56,"161","1161",1," الاول الابتدائى","ولد","مسلم"]
[57,{"$f":"IF(C58=\"\",\"\",COUNTA($C$2:C58))","v":57},"عمر محمد السنوسى زيدان الدسوقى ",57,1,"5",1,null,"",1,null,57,"151","1151",1," الاول الابتدائى","ولد","مسلم"]
[58,{"$f":"IF(C59=\"\",\"\",COUNTA($C$2:C59))","v":58},"عمر محمد عبد الوهاب عبد الرحمن المغازى ",58,1,"4",1,null,"",1,null,58,"141","1141",1," الاول الابتدائى","ولد","مسلم"]
[59,{"$f":"IF(C60=\"\",\"\",COUNTA($C$2:C60))","v":59},"عمر محمد مطاوع محمد احمد مطاوع ",59,1,"1",1,null,"",1,null,59,"111","1111",1," الاول الابتدائى","ولد","مسلم"]
[60,{"$f":"IF(C61=\"\",\"\",COUNTA($C$2:C61))","v":60},"عمر هشام على السيد النجار ",60,1,"3",1,null,"",1,null,60,"131","1131",1," الاول الابتدائى","ولد","مسلم"]
[61,{"$f":"IF(C62=\"\",\"\",COUNTA($C$2:C62))","v":61},"عمر هيثم مرسى حامد مرسى الاروش ",61,1,"6",1,null,"",1,null,61,"161","1161",1," الاول الابتدائى","ولد","مسلم"]
[62,{"$f":"IF(C63=\"\",\"\",COUNTA($C$2:C63))","v":62},"فارس عمر فوزى محمد طه بسيونى",62,1,"2",1,null,"",1,null,62,"121","1121",1," الاول الابتدائى","ولد","مسلم"]
[63,{"$f":"IF(C64=\"\",\"\",COUNTA($C$2:C64))","v":63},"فريد وائل لطفى سلامه ",63,1,"4",1,null,"",1,null,63,"141","1141",1," الاول الابتدائى","ولد","مسلم"]
[64,{"$f":"IF(C65=\"\",\"\",COUNTA($C$2:C65))","v":64},"فلوباتير بولس فتحى حمايه ",64,1,"3",1,null,"م",2,null,64,"131","2131",1," الاول الابتدائى","ولد","مسيحى"]
[65,{"$f":"IF(C66=\"\",\"\",COUNTA($C$2:C66))","v":65},"كاراس ملاك مجدى جرجس",65,1,"3",1,null,{"$f":"IF(C66=\"\",\"\",IF(J66=1,\"\",\"م\"))","v":"م"},2,null,{"$f":"B66","v":65},{"$f":"CONCATENATE(G66,F66,E66)","v":"131"},{"$f":"CONCATENATE(J66,G66,F66,E66)","v":"2131"},{"$f":"E66","v":1},{"$f":"IF(O66=1,\" الاول الابتدائى\",IF(O66=2,\" الثانى الابتدائى\",IF(O66=3,\"الثالث الابتدائى\",IF(O66=4,\" الرابع الابتدائى\",IF(O66=5,\" الخامس الابتدائى\",IF(O66=6,\" السادس الابتدائى\",IF(O66=7,\" الاول الاعدادى\",IF(O66=8,\" الثانى الاعدادى\",IF(O66=9,\" الثالث الاعدادى\",IF(O66=10,\" الاول الثانوى\",IF(O66=11,\" الثانى الثانوى\",IF(O66=12,\" الثالث الثانوى\",IF(O66=13,\" الاول حضانة  KG1\",IF(O66=14,\" الثانى حضانة KG2\",\"\"))))))))))))))","v":" الاول الابتدائى"},{"$f":"IF(G66=1,\"ولد\",\"بنت\")","v":"ولد"},{"$f":"IF(AND(G66=1,J66=1),\"مسلم\",IF(AND(G66=2,J66=1),\"مسلمة\",IF(AND(G66=1,J66=2),\"مسيحى\",IF(AND(G66=2,J66=2),\"مسيحية\",\"\"))))","v":"مسيحى"}]
[66,{"$f":"IF(C67=\"\",\"\",COUNTA($C$2:C67))","v":66},"كاراس هانى مجدى ميخائيل ",66,1,"2",1,null,"م",2,null,66,"121","2121",1," الاول الابتدائى","ولد","مسيحى"]
[67,{"$f":"IF(C68=\"\",\"\",COUNTA($C$2:C68))","v":67},"كريم عطيه محمد عطيه ابو طيره ",67,1,"5",1,null,"",1,null,67,"151","1151",1," الاول الابتدائى","ولد","مسلم"]
[68,{"$f":"IF(C69=\"\",\"\",COUNTA($C$2:C69))","v":68},"كريم محمد إبراهيم عبد الله يونس",68,1,"2",1,null,"",1,null,68,"121","1121",1," الاول الابتدائى","ولد","مسلم"]
[69,{"$f":"IF(C70=\"\",\"\",COUNTA($C$2:C70))","v":69},"كيرلس جورج حليم عازر قزمان",69,1,"6",1,null,"م",2,null,69,"161","2161",1," الاول الابتدائى","ولد","مسيحى"]
[70,{"$f":"IF(C71=\"\",\"\",COUNTA($C$2:C71))","v":70},"كيرلس عماد حمدى روفائيل برسوم ",70,1,"1",1,null,"م",2,null,70,"111","2111",1," الاول الابتدائى","ولد","مسيحى"]
[71,{"$f":"IF(C72=\"\",\"\",COUNTA($C$2:C72))","v":71},"كيرلس مايكل عبد الله راغب ",71,1,"4",1,null,"م",2,null,71,"141","2141",1," الاول الابتدائى","ولد","مسيحى"]
[72,{"$f":"IF(C73=\"\",\"\",COUNTA($C$2:C73))","v":72},"كيفن عماد كامل جبران عبد الملك ",72,1,"4",1,null,"م",2,null,72,"141","2141",1," الاول الابتدائى","ولد","مسيحى"]
[73,{"$f":"IF(C74=\"\",\"\",COUNTA($C$2:C74))","v":73},"ماثيو مينا سامى رياض ",73,1,"5",1,null,"م",2,null,73,"151","2151",1," الاول الابتدائى","ولد","مسيحى"]
[74,{"$f":"IF(C75=\"\",\"\",COUNTA($C$2:C75))","v":74},"مارسلينو مينا صفوت سلامه ابراهيم",74,1,"5",1,null,"م",2,null,74,"151","2151",1," الاول الابتدائى","ولد","مسيحى"]
[75,{"$f":"IF(C76=\"\",\"\",COUNTA($C$2:C76))","v":75},"مارك سامح شاكر رجائى حنا ",75,1,"4",1,null,"م",2,null,75,"141","2141",1," الاول الابتدائى","ولد","مسيحى"]
[76,{"$f":"IF(C77=\"\",\"\",COUNTA($C$2:C77))","v":76},"ماريو ماهر نبيه جرجس ",76,1,"4",1,null,"م",2,null,76,"141","2141",1," الاول الابتدائى","ولد","مسيحى"]
[77,{"$f":"IF(C78=\"\",\"\",COUNTA($C$2:C78))","v":77},"مازن وليد محمد فتحى توفيق",77,1,"1",1,null,"",1,null,77,"111","1111",1," الاول الابتدائى","ولد","مسلم"]
[78,{"$f":"IF(C79=\"\",\"\",COUNTA($C$2:C79))","v":78},"مالك حسن عبد الناصر امين الطيبى",78,1,"2",1,null,"",1,null,78,"121","1121",1," الاول الابتدائى","ولد","مسلم"]
[79,{"$f":"IF(C80=\"\",\"\",COUNTA($C$2:C80))","v":79},"محمد احمد عبد الفتاح تركى ",79,1,"1",1,null,"",1,null,79,"111","1111",1," الاول الابتدائى","ولد","مسلم"]
[80,{"$f":"IF(C81=\"\",\"\",COUNTA($C$2:C81))","v":80},"محمد احمد محمد عبد الخالق محمد ",80,1,"5",1,null,"",1,null,80,"151","1151",1," الاول الابتدائى","ولد","مسلم"]
[81,{"$f":"IF(C82=\"\",\"\",COUNTA($C$2:C82))","v":81},"محمد احمد محمد عبد القادر سالم ",81,1,"5",1,null,"",1,null,81,"151","1151",1," الاول الابتدائى","ولد","مسلم"]
[82,{"$f":"IF(C83=\"\",\"\",COUNTA($C$2:C83))","v":82},"محمد اسلام محمد عبد الرازق عبد الحليم",82,1,"4",1,null,"",1,null,82,"141","1141",1," الاول الابتدائى","ولد","مسلم"]
[83,{"$f":"IF(C84=\"\",\"\",COUNTA($C$2:C84))","v":83},"محمد اشرف زكريا زهران ",83,1,"6",1,null,"",1,null,83,"161","1161",1," الاول الابتدائى","ولد","مسلم"]
[84,{"$f":"IF(C85=\"\",\"\",COUNTA($C$2:C85))","v":84},"محمد حاتم محمود الهمشرى ",84,1,"5",1,null,"",1,null,84,"151","1151",1," الاول الابتدائى","ولد","مسلم"]
[85,{"$f":"IF(C86=\"\",\"\",COUNTA($C$2:C86))","v":85},"محمد رامى إبراهيم سعيد الحصرى ",85,1,"3",1,null,"",1,null,85,"131","1131",1," الاول الابتدائى","ولد","مسلم"]
[86,{"$f":"IF(C87=\"\",\"\",COUNTA($C$2:C87))","v":86},"محمد هيثم محمد حسب خلف الله ",86,1,"1",1,null,"",1,null,86,"111","1111",1," الاول الابتدائى","ولد","مسلم"]
[87,{"$f":"IF(C88=\"\",\"\",COUNTA($C$2:C88))","v":87},"محمود اشرف محمود رضا عبد السلام زهانه ",87,1,"5",1,null,"",1,null,87,"151","1151",1," الاول الابتدائى","ولد","مسلم"]
[88,{"$f":"IF(C89=\"\",\"\",COUNTA($C$2:C89))","v":88},"محمود ايمن ايوب راغب المغربى ",88,1,"6",1,null,"",1,null,88,"161","1161",1," الاول الابتدائى","ولد","مسلم"]
[89,{"$f":"IF(C90=\"\",\"\",COUNTA($C$2:C90))","v":89},"محمود عمرو محمد الشبينى ",89,1,"6",1,null,"",1,null,89,"161","1161",1," الاول الابتدائى","ولد","مسلم"]
[90,{"$f":"IF(C91=\"\",\"\",COUNTA($C$2:C91))","v":90},"مصطفى محمد مصطفى حامد مرسى ",90,1,"3",1,null,"",1,null,90,"131","1131",1," الاول الابتدائى","ولد","مسلم"]
[91,{"$f":"IF(C92=\"\",\"\",COUNTA($C$2:C92))","v":91},"مصطفى مسعد محمد محمد نصر",91,1,"1",1,null,"",1,null,91,"111","1111",1," الاول الابتدائى","ولد","مسلم"]
[92,{"$f":"IF(C93=\"\",\"\",COUNTA($C$2:C93))","v":92},"معاذ شريف احمد حامد حجازى",92,1,"1",1,null,"",1,null,92,"111","1111",1," الاول الابتدائى","ولد","مسلم"]
[93,{"$f":"IF(C94=\"\",\"\",COUNTA($C$2:C94))","v":93},"معاذ مصطفى السيد البهى الشوبرى",93,1,"6",1,null,"",1,null,93,"161","1161",1," الاول الابتدائى","ولد","مسلم"]
[94,{"$f":"IF(C95=\"\",\"\",COUNTA($C$2:C95))","v":94},"مهاد محمد إبراهيم عكاشه ",94,1,"6",1,null,"",1,null,94,"161","1161",1," الاول الابتدائى","ولد","مسلم"]
[95,{"$f":"IF(C96=\"\",\"\",COUNTA($C$2:C96))","v":95},"نادر محمد عبد الحميد المصرى ",95,1,"4",1,null,"",1,null,95,"141","1141",1," الاول الابتدائى","ولد","مسلم"]
[96,{"$f":"IF(C97=\"\",\"\",COUNTA($C$2:C97))","v":96},"نديم كمال محمد جمال الشافعى ",96,1,"2",1,null,"",1,null,96,"121","1121",1," الاول الابتدائى","ولد","مسلم"]
[97,{"$f":"IF(C98=\"\",\"\",COUNTA($C$2:C98))","v":97},"هاشم احمد هاشم فتوح بكر ",97,1,"2",1,null,"",1,null,97,"121","1121",1," الاول الابتدائى","ولد","مسلم"]
[98,{"$f":"IF(C99=\"\",\"\",COUNTA($C$2:C99))","v":98},"ياسين احمد صبحى احمد عبد اللطيف ",98,1,"3",1,null,"",1,null,98,"131","1131",1," الاول الابتدائى","ولد","مسلم"]
[99,{"$f":"IF(C100=\"\",\"\",COUNTA($C$2:C100))","v":99},"ياسين اسلام محمد عاطف جعيصه ",99,1,"4",1,null,"",1,null,99,"141","1141",1," الاول الابتدائى","ولد","مسلم"]
[100,{"$f":"IF(C101=\"\",\"\",COUNTA($C$2:C101))","v":100},"ياسين ايمن محمد هلال ",100,1,"2",1,null,"",1,null,100,"121","1121",1," الاول الابتدائى","ولد","مسلم"]
[101,{"$f":"IF(C102=\"\",\"\",COUNTA($C$2:C102))","v":101},"ياسين ايهاب احمد حسن",101,1,"2",1,null,"",1,null,101,"121","1121",1," الاول الابتدائى","ولد","مسلم"]
[102,{"$f":"IF(C103=\"\",\"\",COUNTA($C$2:C103))","v":102},"ياسين طارق محمد السيد ",102,1,"1",1,null,"",1,null,102,"111","1111",1," الاول الابتدائى","ولد","مسلم"]
[103,{"$f":"IF(C104=\"\",\"\",COUNTA($C$2:C104))","v":103},"ياسين علاء شكرى النجار ",103,1,"4",1,null,"",1,null,103,"141","1141",1," الاول الابتدائى","ولد","مسلم"]
[104,{"$f":"IF(C105=\"\",\"\",COUNTA($C$2:C105))","v":104},"ياسين محمد سمير محمد",104,1,"5",1,null,"",1,null,104,"151","1151",1," الاول الابتدائى","ولد","مسلم"]
[105,{"$f":"IF(C106=\"\",\"\",COUNTA($C$2:C106))","v":105},"ياسين محمد عاطف محمد  ابو شادى ",105,1,"1",1,null,"",1,null,105,"111","1111",1," الاول الابتدائى","ولد","مسلم"]
[106,{"$f":"IF(C107=\"\",\"\",COUNTA($C$2:C107))","v":106},"ياسين محمود محمد محمود خليل ",106,1,"3",1,null,"",1,null,106,"131","1131",1," الاول الابتدائى","ولد","مسلم"]
[107,{"$f":"IF(C108=\"\",\"\",COUNTA($C$2:C108))","v":107},"ياسين وائل موسى عبد المعطى واصل ",107,1,"5",1,null,"",1,null,107,"151","1151",1," الاول الابتدائى","ولد","مسلم"]
[108,{"$f":"IF(C109=\"\",\"\",COUNTA($C$2:C109))","v":108},"ياسين وليد احمد محمد اسماعيل موسى ",108,1,"1",1,null,"",1,null,108,"111","1111",1," الاول الابتدائى","ولد","مسلم"]
[109,{"$f":"IF(C110=\"\",\"\",COUNTA($C$2:C110))","v":109},"يحيى ياسر محمد حسنين الشلبى ",109,1,"5",1,null,"",1,null,109,"151","1151",1," الاول الابتدائى","ولد","مسلم"]
[110,{"$f":"IF(C111=\"\",\"\",COUNTA($C$2:C111))","v":110},"يزن محمد عبد الحميد عبد اللطيف عبد البارى",110,1,"1",1,null,"",1,null,110,"111","1111",1," الاول الابتدائى","ولد","مسلم"]
[111,{"$f":"IF(C112=\"\",\"\",COUNTA($C$2:C112))","v":111},"يوسف احمد السيد عبد العال برغوت",111,1,"3",1,null,"",1,null,111,"131","1131",1," الاول الابتدائى","ولد","مسلم"]
[112,{"$f":"IF(C113=\"\",\"\",COUNTA($C$2:C113))","v":112},"يوسف ماجد رضا جرجس ",112,1,"1",1,null,"م",2,null,112,"111","2111",1," الاول الابتدائى","ولد","مسيحى"]
[113,{"$f":"IF(C114=\"\",\"\",COUNTA($C$2:C114))","v":113},"يوسف محمد ابراهيم عمر خضر ",113,1,"1",1,null,"",1,null,113,"111","1111",1," الاول الابتدائى","ولد","مسلم"]
[114,{"$f":"IF(C115=\"\",\"\",COUNTA($C$2:C115))","v":114},"يوسف محمد عباس محمد حموده ",114,1,"5",1,null,"",1,null,114,"151","1151",1," الاول الابتدائى","ولد","مسلم"]
[115,{"$f":"IF(C116=\"\",\"\",COUNTA($C$2:C116))","v":115},"يوسف محمد فاروق زكى سعفان ",115,1,"3",1,null,"",1,null,115,"131","1131",1," الاول الابتدائى","ولد","مسلم"]
[116,{"$f":"IF(C117=\"\",\"\",COUNTA($C$2:C117))","v":116},"يوسف محمد موسى السباعى موسى",116,1,"3",1,null,"",1,null,116,"131","1131",1," الاول الابتدائى","ولد","مسلم"]
[117,{"$f":"IF(C118=\"\",\"\",COUNTA($C$2:C118))","v":117},"يوسف محمد يوسف العوانى ",117,1,"2",1,null,"",1,null,117,"121","1121",1," الاول الابتدائى","ولد","مسلم"]
[118,{"$f":"IF(C119=\"\",\"\",COUNTA($C$2:C119))","v":118},"يوسف وائل جلال حميده حسن الصفطى",118,1,"4",1,null,"",1,null,118,"141","1141",1," الاول الابتدائى","ولد","مسلم"]
[119,{"$f":"IF(C120=\"\",\"\",COUNTA($C$2:C120))","v":119},"ابرار محمد احمد محمد الفخرانى ",119,1,"6",2,null,"",1,null,119,"261","1261",1," الاول الابتدائى","بنت","مسلمة"]
{"$rows_left_out":2548}
{"sheet":"بيان قيد","index":1,"n_rows":10,"n_cols":14,"rows_kept":10,"cut":false,"hidden":false,"merged":[[10,1,10,2],[10,4,10,5],[5,6,5,11],[6,6,6,11],[7,6,7,11],[8,6,9,11],[9,1,9,2],[4,0,4,1],[4,2,4,5],[5,1,5,5],[6,1,6,5],[7,0,7,5],[8,0,8,5],[9,4,9,5],[0,0,0,1],[1,0,1,1],[2,0,2,1],[3,6,3,11],[4,6,4,11],[3,0,3,5]]}
["ادارة شرق طنطا ",null,null,null,null,null,null,null,null,"2019 /  2020 م",null,null,null,"بحث"]
["سنودس النيل الانجيلى",null,null,null,null,null,null,null,{"$f":"IFERROR(INDEX('اسماء العام الدراسى 2019-2020'!$A:$A,MATCH(J2,'اسماء العام الدراسى 2019-2020'!$C:$C,0)),\"\")","v":1794},"سمير سامح سمير فوزى",null,{"$f":"IF(J2=\"\",\"\",VLOOKUP(I2,'اسماء العام الدراسى 2019-2020'!A2:S2667,7,1))","v":1}]
["مدارس السلام الخاصة للغات بطنطا"]
["بيان قيد",null,null,null,null,null,"لعمل بيان القيد "]
["بالبحث فى سجلات المدرسة  عام",null,{"$f":"J1","v":"2019 /  2020 م"},null,null,null,"اذهب الى صفحة الاسماء وعلم على عامود الاسم كاملا"]
[{"$f":"IF(L2=\"\",\"\",IF(L2=1,\"وجد ان الطالب\",\"وجد ان الطالبة\"))","v":"وجد ان الطالب"},{"$f":"IF(I2=\"\",\"\",VLOOKUP(I2,'اسماء العام الدراسى 2019-2020'!A2:R2667,3,1))","v":"سمير سامح سمير فوزى"},null,null,null,null," ابحث عن الاسم المراد عمل الشهادة له"]
[{"$f":"IF(L2=\"\",\"\",IF(L2=1,\"مقيد بالصف\",\"مقيدة بالصف\"))","v":"مقيد بالصف"},{"$f":"IF(I2=\"\",\"\",VLOOKUP(I2,'اسماء العام الدراسى 2019-2020'!A2:R2667,16,1))","v":" الثالث الاعدادى"},null,null,null,null,"عند ظهور الاسم فى البحث  انسخ الاسم من الخلية التى فى العمود C"]
["هذا للعلم وعمل اللازم وشكرا  ..",null,null,null,null,null,"الصق الاسم فى الخلية J2 ببيان القيد يظهر البيان بعد ظهور رقم مسلسل الطالب فى I2"]
["وتفضلوا بقبول فائق الاحترام ",null,null,null,null,null,"لتغير العام الدراسى غير من الخلية J1 مع العلم بأن هذا البيان خاص بالعام الدراسى 2019 / 2020"]
["المختص","رئيس الوحده",null,"ناظر المدرسة","مدير المدرسة "]