{"text_format":"1","workbook":"xlsx","n_sheets":3,"sheets":["form","Search","Roster"],"not_rendered":{"charts":0,"images":2,"macros":1,"external_links":0,"defined_names":13,"comments":0,"pivot_tables":0},"unopened":[],"bounds":{"document_bytes":16777216,"sheet_cells":100000,"rows_first":2000,"rows_last":500,"rows_between":2000,"halvings":0,"cell_chars":16384,"cell_head_chars":4096},"cells_cut":0,"cells_raw":0,"read":"whole","date_system":"1900"}

{"sheet":"form","index":0,"n_rows":303,"n_cols":8,"rows_kept":303,"cut":false,"hidden":false,"merged":[]}
[null,null,null,"FROM",null,"TO"]
[]
[]
["S #","PRN","NAME","FROM DATE OF",null,"TO DATE",null,"TTL DAYS"]
[]
[]
[]
[{"$f":"IF($B8<>\"\",ROW()-4,\"\")","v":""}]
[""]
[""]
[""]
[""]
[""]
[""]
[""]
[""]
[""]
[""]
[""]
[""]
[""]
[""]
[""]
[""]
[""]
[""]
[""]
[""]
[""]
[""]
[""]
[""]
[""]
[""]
[""]
[""]
[""]
[""]
[""]
[""]
[""]
[""]
[""]
[""]
[""]
[""]
[""]
[""]
[""]
[""]
[""]
[""]
[""]
[""]
[""]
[""]
[""]
[""]
[""]
[""]
[""]
[""]
[""]
[""]
[""]
[""]
[""]
[""]
[""]
[""]
[""]
[{"$f":"IF($B72<>\"\",ROW()-4,\"\")","v":""}]
[""]
[""]
[""]
[""]
[""]
[""]
[""]
[""]
[""]
[""]
[""]
[""]
[""]
[""]
[""]
[""]
[""]
[""]
[""]
[""]
[""]
[""]
[""]
[""]
[""]
[""]
[""]
[""]
[""]
[""]
[""]
[""]
[""]
[""]
[""]
[""]
[""]
[""]
[""]
[""]
[""]
[""]
[""]
[""]
[""]
[""]
[""]
[""]
[""]
[""]
[""]
[""]
[""]
[""]
[""]
[""]
[""]
[""]
[""]
[""]
[""]
[""]
[""]
[{"$f":"IF($B136<>\"\",ROW()-4,\"\")","v":""}]
[""]
[""]
[""]
[""]
[""]
[""]
[""]
[""]
[""]
[""]
[""]
[""]
[""]
[""]
[""]
[""]
[""]
[""]
[""]
[""]
[""]
[""]
[""]
[""]
[""]
[""]
[""]
[""]
[""]
[""]
[""]
[""]
[""]
[""]
[""]
[""]
[""]
[""]
[""]
[""]
[""]
[""]
[""]
[""]
[""]
[""]
[""]
[""]
[""]
[""]
[""]
[""]
[""]
[""]
[""]
[""]
[""]
[""]
[""]
[""]
[""]
[""]
[""]
[{"$f":"IF($B200<>\"\",ROW()-4,\"\")","v":""}]
[""]
[""]
[""]
[""]
[""]
[""]
[""]
[""]
[""]
[""]
[""]
[""]
[""]
[""]
[""]
[""]
[""]
[""]
[""]
[""]
[""]
[""]
[""]
[""]
[""]
[""]
[""]
[""]
[""]
[""]
[""]
[""]
[""]
[""]
[""]
[""]
[""]
[""]
[""]
[""]
[""]
[""]
[""]
[""]
[""]
[""]
[""]
[""]
[""]
[""]
[""]
[""]
[""]
[""]
[""]
[""]
[""]
[""]
[""]
[""]
[""]
[""]
[""]
[{"$f":"IF($B264<>\"\",ROW()-4,\"\")","v":""}]
[""]
[""]
[""]
[""]
[""]
[""]
[""]
[""]
[""]
[""]
[""]
[""]
[""]
[""]
[""]
[""]
[""]
[""]
[""]
[""]
[""]
[""]
[""]
[""]
[""]
[""]
[""]
[""]
[""]
[""]
[""]
[""]
[""]
[""]
[""]
[""]
[""]
[""]
[""]

{"sheet":"Search","index":1,"n_rows":157,"n_cols":231,"rows_kept":157,"cut":false,"hidden":false,"merged":[[11,12,11,18],[11,19,11,49],[17,1,17,3],[18,3,20,3]]}
[null,"PRN",null,{"$f":"MATCH($C$1,Roster!$B$1:$B$1008,0)","v":{"$error":"#N/A"}}]
[]
[]
[]
[{"$f":"IFERROR(INDEX(Roster!$A$5:$BLL$999,MATCH($C$1,Roster!$B$5:$B$999,0),COLUMN()),\"NILL\")","v":"NILL"},{"$f":"IFERROR(INDEX(Roster!$A$5:$BLL$999,MATCH($C$1,Roster!$B$5:$B$999,0),COLUMN()),\"NILL\")","v":"NILL"},{"$f":"IFERROR(INDEX(Roster!$A$5:$BLL$999,MATCH($C$1,Roster!$B$5:$B$999,0),COLUMN()),\"NILL\")","v":"NILL"},{"$f":"IFERROR(INDEX(Roster!$A$5:$BLL$999,MATCH($C$1,Roster!$B$5:$B$999,0),COLUMN()),\"NILL\")","v":"NILL"},{"$f":"IFERROR(INDEX(Roster!$A$5:$BLL$999,MATCH($C$1,Roster!$B$5:$B$999,0),COLUMN()),\"NILL\")","v":"NILL"},{"$f":"IFERROR(INDEX(Roster!$A$5:$BLL$999,MATCH($C$1,Roster!$B$5:$B$999,0),COLUMN()),\"NILL\")","v":"NILL"},{"$f":"IFERROR(INDEX(Roster!$A$5:$BLL$999,MATCH($C$1,Roster!$B$5:$B$999,0),COLUMN()),\"NILL\")","v":"NILL"},{"$f":"IFERROR(INDEX(Roster!$A$5:$BLL$999,MATCH($C$1,Roster!$B$5:$B$999,0),COLUMN()),\"NILL\")","v":"NILL"},{"$f":"IFERROR(INDEX(Roster!$A$5:$BLL$999,MATCH($C$1,Roster!$B$5:$B$999,0),COLUMN()),\"NILL\")","v":"NILL"},{"$f":"IFERROR(INDEX(Roster!$A$5:$BLL$999,MATCH($C$1,Roster!$B$5:$B$999,0),COLUMN()),\"NILL\")","v":"NILL"},{"$f":"IFERROR(INDEX(Roster!$A$5:$BLL$999,MATCH($C$1,Roster!$B$5:$B$999,0),COLUMN()),\"NILL\")","v":"NILL"},{"$f":"IFERROR(INDEX(Roster!$A$5:$BLL$999,MATCH($C$1,Roster!$B$5:$B$999,0),COLUMN()),\"NILL\")","v":"NILL"},{"$f":"IFERROR(INDEX(Roster!$A$5:$BLL$999,MATCH($C$1,Roster!$B$5:$B$999,0),COLUMN()),\"NILL\")","v":"NILL"},{"$f":"IFERROR(INDEX(Roster!$A$5:$BLL$999,MATCH($C$1,Roster!$B$5:$B$999,0),COLUMN()),\"NILL\")","v":"NILL"},{"$f":"IFERROR(INDEX(Roster!$A$5:$BLL$999,MATCH($C$1,Roster!$B$5:$B$999,0),COLUMN()),\"NILL\")","v":"NILL"},{"$f":"IFERROR(INDEX(Roster!$A$5:$BLL$999,MATCH($C$1,Roster!$B$5:$B$999,0),COLUMN()),\"NILL\")","v":"NILL"},{"$f":"IFERROR(INDEX(Roster!$A$5:$BLL$999,MATCH($C$1,Roster!$B$5:$B$999,0),COLUMN()),\"NILL\")","v":"NILL"},{"$f":"IFERROR(INDEX(Roster!$A$5:$BLL$999,MATCH($C$1,Roster!$B$5:$B$999,0),COLUMN()),\"NILL\")","v":"NILL"},{"$f":"IFERROR(INDEX(Roster!$A$5:$BLL$999,MATCH($C$1,Roster!$B$5:$B$999,0),COLUMN()),\"NILL\")","v":"NILL"},{"$f":"IFERROR(INDEX(Roster!$A$5:$BLL$999,MATCH($C$1,Roster!$B$5:$B$999,0),COLUMN()),\"NILL\")","v":"NILL"},{"$f":"IFERROR(INDEX(Roster!$A$5:$BLL$999,MATCH($C$1,Roster!$B$5:$B$999,0),COLUMN()),\"NILL\")","v":"NILL"},{"$f":"IFERROR(INDEX(Roster!$A$5:$BLL$999,MATCH($C$1,Roster!$B$5:$B$999,0),COLUMN()),\"NILL\")","v":"NILL"},{"$f":"IFERROR(INDEX(Roster!$A$5:$BLL$999,MATCH($C$1,Roster!$B$5:$B$999,0),COLUMN()),\"NILL\")","v":"NILL"},{"$f":"IFERROR(INDEX(Roster!$A$5:$BLL$999,MATCH($C$1,Roster!$B$5:$B$999,0),COLUMN()),\"NILL\")","v":"NILL"},{"$f":"IFERROR(INDEX(Roster!$A$5:$BLL$999,MATCH($C$1,Roster!$B$5:$B$999,0),COLUMN()),\"NILL\")","v":"NILL"},{"$f":"IFERROR(INDEX(Roster!$A$5:$BLL$999,MATCH($C$1,Roster!$B$5:$B$999,0),COLUMN()),\"NILL\")","v":"NILL"},{"$f":"IFERROR(INDEX(Roster!$A$5:$BLL$999,MATCH($C$1,Roster!$B$5:$B$999,0),COLUMN()),\"NILL\")","v":"NILL"},{"$f":"IFERROR(INDEX(Roster!$A$5:$BLL$999,MATCH($C$1,Roster!$B$5:$B$999,0),COLUMN()),\"NILL\")","v":"NILL"},{"$f":"IFERROR(INDEX(Roster!$A$5:$BLL$999,MATCH($C$1,Roster!$B$5:$B$999,0),COLUMN()),\"NILL\")","v":"NILL"},{"$f":"IFERROR(INDEX(Roster!$A$5:$BLL$999,MATCH($C$1,Roster!$B$5:$B$999,0),COLUMN()),\"NILL\")","v":"NILL"},{"$f":"IFERROR(INDEX(Roster!$A$5:$BLL$999,MATCH($C$1,Roster!$B$5:$B$999,0),COLUMN()),\"NILL\")","v":"NILL"},{"$f":"IFERROR(INDEX(Roster!$A$5:$BLL$999,MATCH($C$1,Roster!$B$5:$B$999,0),COLUMN()),\"NILL\")","v":"NILL"},{"$f":"IFERROR(INDEX(Roster!$A$5:$BLL$999,MATCH($C$1,Roster!$B$5:$B$999,0),COLUMN()),\"NILL\")","v":"NILL"},{"$f":"IFERROR(INDEX(Roster!$A$5:$BLL$999,MATCH($C$1,Roster!$B$5:$B$999,0),COLUMN()),\"NILL\")","v":"NILL"},{"$f":"IFERROR(INDEX(Roster!$A$5:$BLL$999,MATCH($C$1,Roster!$B$5:$B$999,0),COLUMN()),\"NILL\")","v":"NILL"},{"$f":"IFERROR(INDEX(Roster!$A$5:$BLL$999,MATCH($C$1,Roster!$B$5:$B$999,0),COLUMN()),\"NILL\")","v":"NILL"},{"$f":"IFERROR(INDEX(Roster!$A$5:$BLL$999,MATCH($C$1,Roster!$B$5:$B$999,0),COLUMN()),\"NILL\")","v":"NILL"},{"$f":"IFERROR(INDEX(Roster!$A$5:$BLL$999,MATCH($C$1,Roster!$B$5:$B$999,0),COLUMN()),\"NILL\")","v":"NILL"},{"$f":"IFERROR(INDEX(Roster!$A$5:$BLL$999,MATCH($C$1,Roster!$B$5:$B$999,0),COLUMN()),\"NILL\")","v":"NILL"},{"$f":"IFERROR(INDEX(Roster!$A$5:$BLL$999,MATCH($C$1,Roster!$B$5:$B$999,0),COLUMN()),\"NILL\")","v":"NILL"},{"$f":"IFERROR(INDEX(Roster!$A$5:$BLL$999,MATCH($C$1,Roster!$B$5:$B$999,0),COLUMN()),\"NILL\")","v":"NILL"},{"$f":"IFERROR(INDEX(Roster!$A$5:$BLL$999,MATCH($C$1,Roster!$B$5:$B$999,0),COLUMN()),\"NILL\")","v":"NILL"},{"$f":"IFERROR(INDEX(Roster!$A$5:$BLL$999,MATCH($C$1,Roster!$B$5:$B$999,0),COLUMN()),\"NILL\")","v":"NILL"},{"$f":"IFERROR(INDEX(Roster!$A$5:$BLL$999,MATCH($C$1,Roster!$B$5:$B$999,0),COLUMN()),\"NILL\")","v":"NILL"},{"$f":"IFERROR(INDEX(Roster!$A$5:$BLL$999,MATCH($C$1,Roster!$B$5:$B$999,0),COLUMN()),\"NILL\")","v":"NILL"},{"$f":"IFERROR(INDEX(Roster!$A$5:$BLL$999,MATCH($C$1,Roster!$B$5:$B$999,0),COLUMN()),\"NILL\")","v":"NILL"},{"$f":"IFERROR(INDEX(Roster!$A$5:$BLL$999,MATCH($C$1,Roster!$B$5:$B$999,0),COLUMN()),\"NILL\")","v":"NILL"},{"$f":"IFERROR(INDEX(Roster!$A$5:$BLL$999,MATCH($C$1,Roster!$B$5:$B$999,0),COLUMN()),\"NILL\")","v":"NILL"},{"$f":"IFERROR(INDEX(Roster!$A$5:$BLL$999,MATCH($C$1,Roster!$B$5:$B$999,0),COLUMN()),\"NILL\")","v":"NILL"},{"$f":"IFERROR(INDEX(Roster!$A$5:$BLL$999,MATCH($C$1,Roster!$B$5:$B$999,0),COLUMN()),\"NILL\")","v":"NILL"},{"$f":"IFERROR(INDEX(Roster!$A$5:$BLL$999,MATCH($C$1,Roster!$B$5:$B$999,0),COLUMN()),\"NILL\")","v":"NILL"},{"$f":"IFERROR(INDEX(Roster!$A$5:$BLL$999,MATCH($C$1,Roster!$B$5:$B$999,0),COLUMN()),\"NILL\")","v":"NILL"},{"$f":"IFERROR(INDEX(Roster!$A$5:$BLL$999,MATCH($C$1,Roster!$B$5:$B$999,0),COLUMN()),\"NILL\")","v":"NILL"},{"$f":"IFERROR(INDEX(Roster!$A$5:$BLL$999,MATCH($C$1,Roster!$B$5:$B$999,0),COLUMN()),\"NILL\")","v":"NILL"},{"$f":"IFERROR(INDEX(Roster!$A$5:$BLL$999,MATCH($C$1,Roster!$B$5:$B$999,0),COLUMN()),\"NILL\")","v":"NILL"},{"$f":"IFERROR(INDEX(Roster!$A$5:$BLL$999,MATCH($C$1,Roster!$B$5:$B$999,0),COLUMN()),\"NILL\")","v":"NILL"},{"$f":"IFERROR(INDEX(Roster!$A$5:$BLL$999,MATCH($C$1,Roster!$B$5:$B$999,0),COLUMN()),\"NILL\")","v":"NILL"},{"$f":"IFERROR(INDEX(Roster!$A$5:$BLL$999,MATCH($C$1,Roster!$B$5:$B$999,0),COLUMN()),\"NILL\")","v":"NILL"},{"$f":"IFERROR(INDEX(Roster!$A$5:$BLL$999,MATCH($C$1,Roster!$B$5:$B$999,0),COLUMN()),\"NILL\")","v":"NILL"},{"$f":"IFERROR(INDEX(Roster!$A$5:$BLL$999,MATCH($C$1,Roster!$B$5:$B$999,0),COLUMN()),\"NILL\")","v":"NILL"},{"$f":"IFERROR(INDEX(Roster!$A$5:$BLL$999,MATCH($C$1,Roster!$B$5:$B$999,0),COLUMN()),\"NILL\")","v":"NILL"},{"$f":"IFERROR(INDEX(Roster!$A$5:$BLL$999,MATCH($C$1,Roster!$B$5:$B$999,0),COLUMN()),\"NILL\")","v":"NILL"},{"$f":"IFERROR(INDEX(Roster!$A$5:$BLL$999,MATCH($C$1,Roster!$B$5:$B$999,0),COLUMN()),\"NILL\")","v":"NILL"},{"$f":"IFERROR(INDEX(Roster!$A$5:$BLL$999,MATCH($C$1,Roster!$B$5:$B$999,0),COLUMN()),\"NILL\")","v":"NILL"},{"$f":"IFERROR(INDEX(Roster!$A$5:$BLL$999,MATCH($C$1,Roster!$B$5:$B$999,0),COLUMN()),\"NILL\")","v":"NILL"},{"$f":"IFERROR(INDEX(Roster!$A$5:$BLL$999,MATCH($C$1,Roster!$B$5:$B$999,0),COLUMN()),\"NILL\")","v":"NILL"},{"$f":"IFERROR(INDEX(Roster!$A$5:$BLL$999,MATCH($C$1,Roster!$B$5:$B$999,0),COLUMN()),\"NILL\")","v":"NILL"},{"$f":"IFERROR(INDEX(Roster!$A$5:$BLL$999,MATCH($C$1,Roster!$B$5:$B$999,0),COLUMN()),\"NILL\")","v":"NILL"},{"$f":"IFERROR(INDEX(Roster!$A$5:$BLL$999,MATCH($C$1,Roster!$B$5:$B$999,0),COLUMN()),\"NILL\")","v":"NILL"},{"$f":"IFERROR(INDEX(Roster!$A$5:$BLL$999,MATCH($C$1,Roster!$B$5:$B$999,0),COLUMN()),\"NILL\")","v":"NILL"},{"$f":"IFERROR(INDEX(Roster!$A$5:$BLL$999,MATCH($C$1,Roster!$B$5:$B$999,0),COLUMN()),\"NILL\")","v":"NILL"},{"$f":"IFERROR(INDEX(Roster!$A$5:$BLL$999,MATCH($C$1,Roster!$B$5:$B$999,0),COLUMN()),\"NILL\")","v":"NILL"},{"$f":"IFERROR(INDEX(Roster!$A$5:$BLL$999,MATCH($C$1,Roster!$B$5:$B$999,0),COLUMN()),\"NILL\")","v":"NILL"},{"$f":"IFERROR(INDEX(Roster!$A$5:$BLL$999,MATCH($C$1,Roster!$B$5:$B$999,0),COLUMN()),\"NILL\")","v":"NILL"},{"$f":"IFERROR(INDEX(Roster!$A$5:$BLL$999,MATCH($C$1,Roster!$B$5:$B$999,0),COLUMN()),\"NILL\")","v":"NILL"},{"$f":"IFERROR(INDEX(Roster!$A$5:$BLL$999,MATCH($C$1,Roster!$B$5:$B$999,0),COLUMN()),\"NILL\")","v":"NILL"},{"$f":"IFERROR(INDEX(Roster!$A$5:$BLL$999,MATCH($C$1,Roster!$B$5:$B$999,0),COLUMN()),\"NILL\")","v":"NILL"},{"$f":"IFERROR(INDEX(Roster!$A$5:$BLL$999,MATCH($C$1,Roster!$B$5:$B$999,0),COLUMN()),\"NILL\")","v":"NILL"},{"$f":"IFERROR(INDEX(Roster!$A$5:$BLL$999,MATCH($C$1,Roster!$B$5:$B$999,0),COLUMN()),\"NILL\")","v":"NILL"},{"$f":"IFERROR(INDEX(Roster!$A$5:$BLL$999,MATCH($C$1,Roster!$B$5:$B$999,0),COLUMN()),\"NILL\")","v":"NILL"},{"$f":"IFERROR(INDEX(Roster!$A$5:$BLL$999,MATCH($C$1,Roster!$B$5:$B$999,0),COLUMN()),\"NILL\")","v":"NILL"},{"$f":"IFERROR(INDEX(Roster!$A$5:$BLL$999,MATCH($C$1,Roster!$B$5:$B$999,0),COLUMN()),\"NILL\")","v":"NILL"},{"$f":"IFERROR(INDEX(Roster!$A$5:$BLL$999,MATCH($C$1,Roster!$B$5:$B$999,0),COLUMN()),\"NILL\")","v":"NILL"},{"$f":"IFERROR(INDEX(Roster!$A$5:$BLL$999,MATCH($C$1,Roster!$B$5:$B$999,0),COLUMN()),\"NILL\")","v":"NILL"},{"$f":"IFERROR(INDEX(Roster!$A$5:$BLL$999,MATCH($C$1,Roster!$B$5:$B$999,0),COLUMN()),\"NILL\")","v":"NILL"},{"$f":"IFERROR(INDEX(Roster!$A$5:$BLL$999,MATCH($C$1,Roster!$B$5:$B$999,0),COLUMN()),\"NILL\")","v":"NILL"},{"$f":"IFERROR(INDEX(Roster!$A$5:$BLL$999,MATCH($C$1,Roster!$B$5:$B$999,0),COLUMN()),\"NILL\")","v":"NILL"},{"$f":"IFERROR(INDEX(Roster!$A$5:$BLL$999,MATCH($C$1,Roster!$B$5:$B$999,0),COLUMN()),\"NILL\")","v":"NILL"},{"$f":"IFERROR(INDEX(Roster!$A$5:$BLL$999,MATCH($C$1,Roster!$B$5:$B$999,0),COLUMN()),\"NILL\")","v":"NILL"},{"$f":"IFERROR(INDEX(Roster!$A$5:$BLL$999,MATCH($C$1,Roster!$B$5:$B$999,0),COLUMN()),\"NILL\")","v":"NILL"},{"$f":"IFERROR(INDEX(Roster!$A$5:$BLL$999,MATCH($C$1,Roster!$B$5:$B$999,0),COLUMN()),\"NILL\")","v":"NILL"},{"$f":"IFERROR(INDEX(Roster!$A$5:$BLL$999,MATCH($C$1,Roster!$B$5:$B$999,0),COLUMN()),\"NILL\")","v":"NILL"},{"$f":"IFERROR(INDEX(Roster!$A$5:$BLL$999,MATCH($C$1,Roster!$B$5:$B$999,0),COLUMN()),\"NILL\")","v":"NILL"},{"$f":"IFERROR(INDEX(Roster!$A$5:$BLL$999,MATCH($C$1,Roster!$B$5:$B$999,0),COLUMN()),\"NILL\")","v":"NILL"},{"$f":"IFERROR(INDEX(Roster!$A$5:$BLL$999,MATCH($C$1,Roster!$B$5:$B$999,0),COLUMN()),\"NILL\")","v":"NILL"},{"$f":"IFERROR(INDEX(Roster!$A$5:$BLL$999,MATCH($C$1,Roster!$B$5:$B$999,0),COLUMN()),\"NILL\")","v":"NILL"},{"$f":"IFERROR(INDEX(Roster!$A$5:$BLL$999,MATCH($C$1,Roster!$B$5:$B$999,0),COLUMN()),\"NILL\")","v":"NILL"},{"$f":"IFERROR(INDEX(Roster!$A$5:$BLL$999,MATCH($C$1,Roster!$B$5:$B$999,0),COLUMN()),\"NILL\")","v":"NILL"},{"$f":"IFERROR(INDEX(Roster!$A$5:$BLL$999,MATCH($C$1,Roster!$B$5:$B$999,0),COLUMN()),\"NILL\")","v":"NILL"},{"$f":"IFERROR(INDEX(Roster!$A$5:$BLL$999,MATCH($C$1,Roster!$B$5:$B$999,0),COLUMN()),\"NILL\")","v":"NILL"},{"$f":"IFERROR(INDEX(Roster!$A$5:$BLL$999,MATCH($C$1,Roster!$B$5:$B$999,0),COLUMN()),\"NILL\")","v":"NILL"},{"$f":"IFERROR(INDEX(Roster!$A$5:$BLL$999,MATCH($C$1,Roster!$B$5:$B$999,0),COLUMN()),\"NILL\")","v":"NILL"},{"$f":"IFERROR(INDEX(Roster!$A$5:$BLL$999,MATCH($C$1,Roster!$B$5:$B$999,0),COLUMN()),\"NILL\")","v":"NILL"},{"$f":"IFERROR(INDEX(Roster!$A$5:$BLL$999,MATCH($C$1,Roster!$B$5:$B$999,0),COLUMN()),\"NILL\")","v":"NILL"},{"$f":"IFERROR(INDEX(Roster!$A$5:$BLL$999,MATCH($C$1,Roster!$B$5:$B$999,0),COLUMN()),\"NILL\")","v":"NILL"},{"$f":"IFERROR(INDEX(Roster!$A$5:$BLL$999,MATCH($C$1,Roster!$B$5:$B$999,0),COLUMN()),\"NILL\")","v":"NILL"},{"$f":"IFERROR(INDEX(Roster!$A$5:$BLL$999,MATCH($C$1,Roster!$B$5:$B$999,0),COLUMN()),\"NILL\")","v":"NILL"},{"$f":"IFERROR(INDEX(Roster!$A$5:$BLL$999,MATCH($C$1,Roster!$B$5:$B$999,0),COLUMN()),\"NILL\")","v":"NILL"},{"$f":"IFERROR(INDEX(Roster!$A$5:$BLL$999,MATCH($C$1,Roster!$B$5:$B$999,0),COLUMN()),\"NILL\")","v":"NILL"},{"$f":"IFERROR(INDEX(Roster!$A$5:$BLL$999,MATCH($C$1,Roster!$B$5:$B$999,0),COLUMN()),\"NILL\")","v":"NILL"},{"$f":"IFERROR(INDEX(Roster!$A$5:$BLL$999,MATCH($C$1,Roster!$B$5:$B$999,0),COLUMN()),\"NILL\")","v":"NILL"},{"$f":"IFERROR(INDEX(Roster!$A$5:$BLL$999,MATCH($C$1,Roster!$B$5:$B$999,0),COLUMN()),\"NILL\")","v":"NILL"},{"$f":"IFERROR(INDEX(Roster!$A$5:$BLL$999,MATCH($C$1,Roster!$B$5:$B$999,0),COLUMN()),\"NILL\")","v":"NILL"},{"$f":"IFERROR(INDEX(Roster!$A$5:$BLL$999,MATCH($C$1,Roster!$B$5:$B$999,0),COLUMN()),\"NILL\")","v":"NILL"},{"$f":"IFERROR(INDEX(Roster!$A$5:$BLL$999,MATCH($C$1,Roster!$B$5:$B$999,0),COLUMN()),\"NILL\")","v":"NILL"},{"$f":"IFERROR(INDEX(Roster!$A$5:$BLL$999,MATCH($C$1,Roster!$B$5:$B$999,0),COLUMN()),\"NILL\")","v":"NILL"},{"$f":"IFERROR(INDEX(Roster!$A$5:$BLL$999,MATCH($C$1,Roster!$B$5:$B$999,0),COLUMN()),\"NILL\")","v":"NILL"},{"$f":"IFERROR(INDEX(Roster!$A$5:$BLL$999,MATCH($C$1,Roster!$B$5:$B$999,0),COLUMN()),\"NILL\")","v":"NILL"},{"$f":"IFERROR(INDEX(Roster!$A$5:$BLL$999,MATCH($C$1,Roster!$B$5:$B$999,0),COLUMN()),\"NILL\")","v":"NILL"},{"$f":"IFERROR(INDEX(Roster!$A$5:$BLL$999,MATCH($C$1,Roster!$B$5:$B$999,0),COLUMN()),\"NILL\")","v":"NILL"},{"$f":"IFERROR(INDEX(Roster!$A$5:$BLL$999,MATCH($C$1,Roster!$B$5:$B$999,0),COLUMN()),\"NILL\")","v":"NILL"},{"$f":"IFERROR(INDEX(Roster!$A$5:$BLL$999,MATCH($C$1,Roster!$B$5:$B$999,0),COLUMN()),\"NILL\")","v":"NILL"},{"$f":"IFERROR(INDEX(Roster!$A$5:$BLL$999,MATCH($C$1,Roster!$B$5:$B$999,0),COLUMN()),\"NILL\")","v":"NILL"},{"$f":"IFERROR(INDEX(Roster!$A$5:$BLL$999,MATCH($C$1,Roster!$B$5:$B$999,0),COLUMN()),\"NILL\")","v":"NILL"},{"$f":"IFERROR(INDEX(Roster!$A$5:$BLL$999,MATCH($C$1,Roster!$B$5:$B$999,0),COLUMN()),\"NILL\")","v":"NILL"},{"$f":"IFERROR(INDEX(Roster!$A$5:$BLL$999,MATCH($C$1,Roster!$B$5:$B$999,0),COLUMN()),\"NILL\")","v":"NILL"},{"$f":"IFERROR(INDEX(Roster!$A$5:$BLL$999,MATCH($C$1,Roster!$B$5:$B$999,0),COLUMN()),\"NILL\")","v":"NILL"},{"$f":"IFERROR(INDEX(Roster!$A$5:$BLL$999,MATCH($C$1,Roster!$B$5:$B$999,0),COLUMN()),\"NILL\")","v":"NILL"},{"$f":"IFERROR(INDEX(Roster!$A$5:$BLL$999,MATCH($C$1,Roster!$B$5:$B$999,0),COLUMN()),\"NILL\")","v":"NILL"},{"$f":"IFERROR(INDEX(Roster!$A$5:$BLL$999,MATCH($C$1,Roster!$B$5:$B$999,0),COLUMN()),\"NILL\")","v":"NILL"},{"$f":"IFERROR(INDEX(Roster!$A$5:$BLL$999,MATCH($C$1,Roster!$B$5:$B$999,0),COLUMN()),\"NILL\")","v":"NILL"},{"$f":"IFERROR(INDEX(Roster!$A$5:$BLL$999,MATCH($C$1,Roster!$B$5:$B$999,0),COLUMN()),\"NILL\")","v":"NILL"},{"$f":"IFERROR(INDEX(Roster!$A$5:$BLL$999,MATCH($C$1,Roster!$B$5:$B$999,0),COLUMN()),\"NILL\")","v":"NILL"},{"$f":"IFERROR(INDEX(Roster!$A$5:$BLL$999,MATCH($C$1,Roster!$B$5:$B$999,0),COLUMN()),\"NILL\")","v":"NILL"},{"$f":"IFERROR(INDEX(Roster!$A$5:$BLL$999,MATCH($C$1,Roster!$B$5:$B$999,0),COLUMN()),\"NILL\")","v":"NILL"},{"$f":"IFERROR(INDEX(Roster!$A$5:$BLL$999,MATCH($C$1,Roster!$B$5:$B$999,0),COLUMN()),\"NILL\")","v":"NILL"},{"$f":"IFERROR(INDEX(Roster!$A$5:$BLL$999,MATCH($C$1,Roster!$B$5:$B$999,0),COLUMN()),\"NILL\")","v":"NILL"},{"$f":"IFERROR(INDEX(Roster!$A$5:$BLL$999,MATCH($C$1,Roster!$B$5:$B$999,0),COLUMN()),\"NILL\")","v":"NILL"},{"$f":"IFERROR(INDEX(Roster!$A$5:$BLL$999,MATCH($C$1,Roster!$B$5:$B$999,0),COLUMN()),\"NILL\")","v":"NILL"},{"$f":"IFERROR(INDEX(Roster!$A$5:$BLL$999,MATCH($C$1,Roster!$B$5:$B$999,0),COLUMN()),\"NILL\")","v":"NILL"},{"$f":"IFERROR(INDEX(Roster!$A$5:$BLL$999,MATCH($C$1,Roster!$B$5:$B$999,0),COLUMN()),\"NILL\")","v":"NILL"},{"$f":"IFERROR(INDEX(Roster!$A$5:$BLL$999,MATCH($C$1,Roster!$B$5:$B$999,0),COLUMN()),\"NILL\")","v":"NILL"},{"$f":"IFERROR(INDEX(Roster!$A$5:$BLL$999,MATCH($C$1,Roster!$B$5:$B$999,0),COLUMN()),\"NILL\")","v":"NILL"},{"$f":"IFERROR(INDEX(Roster!$A$5:$BLL$999,MATCH($C$1,Roster!$B$5:$B$999,0),COLUMN()),\"NILL\")","v":"NILL"},{"$f":"IFERROR(INDEX(Roster!$A$5:$BLL$999,MATCH($C$1,Roster!$B$5:$B$999,0),COLUMN()),\"NILL\")","v":"NILL"},{"$f":"IFERROR(INDEX(Roster!$A$5:$BLL$999,MATCH($C$1,Roster!$B$5:$B$999,0),COLUMN()),\"NILL\")","v":"NILL"},{"$f":"IFERROR(INDEX(Roster!$A$5:$BLL$999,MATCH($C$1,Roster!$B$5:$B$999,0),COLUMN()),\"NILL\")","v":"NILL"},{"$f":"IFERROR(INDEX(Roster!$A$5:$BLL$999,MATCH($C$1,Roster!$B$5:$B$999,0),COLUMN()),\"NILL\")","v":"NILL"},{"$f":"IFERROR(INDEX(Roster!$A$5:$BLL$999,MATCH($C$1,Roster!$B$5:$B$999,0),COLUMN()),\"NILL\")","v":"NILL"},{"$f":"IFERROR(INDEX(Roster!$A$5:$BLL$999,MATCH($C$1,Roster!$B$5:$B$999,0),COLUMN()),\"NILL\")","v":"NILL"},{"$f":"IFERROR(INDEX(Roster!$A$5:$BLL$999,MATCH($C$1,Roster!$B$5:$B$999,0),COLUMN()),\"NILL\")","v":"NILL"},{"$f":"IFERROR(INDEX(Roster!$A$5:$BLL$999,MATCH($C$1,Roster!$B$5:$B$999,0),COLUMN()),\"NILL\")","v":"NILL"},{"$f":"IFERROR(INDEX(Roster!$A$5:$BLL$999,MATCH($C$1,Roster!$B$5:$B$999,0),COLUMN()),\"NILL\")","v":"NILL"},{"$f":"IFERROR(INDEX(Roster!$A$5:$BLL$999,MATCH($C$1,Roster!$B$5:$B$999,0),COLUMN()),\"NILL\")","v":"NILL"},{"$f":"IFERROR(INDEX(Roster!$A$5:$BLL$999,MATCH($C$1,Roster!$B$5:$B$999,0),COLUMN()),\"NILL\")","v":"NILL"},{"$f":"IFERROR(INDEX(Roster!$A$5:$BLL$999,MATCH($C$1,Roster!$B$5:$B$999,0),COLUMN()),\"NILL\")","v":"NILL"},{"$f":"IFERROR(INDEX(Roster!$A$5:$BLL$999,MATCH($C$1,Roster!$B$5:$B$999,0),COLUMN()),\"NILL\")","v":"NILL"},{"$f":"IFERROR(INDEX(Roster!$A$5:$BLL$999,MATCH($C$1,Roster!$B$5:$B$999,0),COLUMN()),\"NILL\")","v":"NILL"},{"$f":"IFERROR(INDEX(Roster!$A$5:$BLL$999,MATCH($C$1,Roster!$B$5:$B$999,0),COLUMN()),\"NILL\")","v":"NILL"},{"$f":"IFERROR(INDEX(Roster!$A$5:$BLL$999,MATCH($C$1,Roster!$B$5:$B$999,0),COLUMN()),\"NILL\")","v":"NILL"},{"$f":"IFERROR(INDEX(Roster!$A$5:$BLL$999,MATCH($C$1,Roster!$B$5:$B$999,0),COLUMN()),\"NILL\")","v":"NILL"},{"$f":"IFERROR(INDEX(Roster!$A$5:$BLL$999,MATCH($C$1,Roster!$B$5:$B$999,0),COLUMN()),\"NILL\")","v":"NILL"},{"$f":"IFERROR(INDEX(Roster!$A$5:$BLL$999,MATCH($C$1,Roster!$B$5:$B$999,0),COLUMN()),\"NILL\")","v":"NILL"},{"$f":"IFERROR(INDEX(Roster!$A$5:$BLL$999,MATCH($C$1,Roster!$B$5:$B$999,0),COLUMN()),\"NILL\")","v":"NILL"},{"$f":"IFERROR(INDEX(Roster!$A$5:$BLL$999,MATCH($C$1,Roster!$B$5:$B$999,0),COLUMN()),\"NILL\")","v":"NILL"},{"$f":"IFERROR(INDEX(Roster!$A$5:$BLL$999,MATCH($C$1,Roster!$B$5:$B$999,0),COLUMN()),\"NILL\")","v":"NILL"},{"$f":"IFERROR(INDEX(Roster!$A$5:$BLL$999,MATCH($C$1,Roster!$B$5:$B$999,0),COLUMN()),\"NILL\")","v":"NILL"},{"$f":"IFERROR(INDEX(Roster!$A$5:$BLL$999,MATCH($C$1,Roster!$B$5:$B$999,0),COLUMN()),\"NILL\")","v":"NILL"},{"$f":"IFERROR(INDEX(Roster!$A$5:$BLL$999,MATCH($C$1,Roster!$B$5:$B$999,0),COLUMN()),\"NILL\")","v":"NILL"},{"$f":"IFERROR(INDEX(Roster!$A$5:$BLL$999,MATCH($C$1,Roster!$B$5:$B$999,0),COLUMN()),\"NILL\")","v":"NILL"},{"$f":"IFERROR(INDEX(Roster!$A$5:$BLL$999,MATCH($C$1,Roster!$B$5:$B$999,0),COLUMN()),\"NILL\")","v":"NILL"},{"$f":"IFERROR(INDEX(Roster!$A$5:$BLL$999,MATCH($C$1,Roster!$B$5:$B$999,0),COLUMN()),\"NILL\")","v":"NILL"},{"$f":"IFERROR(INDEX(Roster!$A$5:$BLL$999,MATCH($C$1,Roster!$B$5:$B$999,0),COLUMN()),\"NILL\")","v":"NILL"},{"$f":"IFERROR(INDEX(Roster!$A$5:$BLL$999,MATCH($C$1,Roster!$B$5:$B$999,0),COLUMN()),\"NILL\")","v":"NILL"},{"$f":"IFERROR(INDEX(Roster!$A$5:$BLL$999,MATCH($C$1,Roster!$B$5:$B$999,0),COLUMN()),\"NILL\")","v":"NILL"},{"$f":"IFERROR(INDEX(Roster!$A$5:$BLL$999,MATCH($C$1,Roster!$B$5:$B$999,0),COLUMN()),\"NILL\")","v":"NILL"},{"$f":"IFERROR(INDEX(Roster!$A$5:$BLL$999,MATCH($C$1,Roster!$B$5:$B$999,0),COLUMN()),\"NILL\")","v":"NILL"},{"$f":"IFERROR(INDEX(Roster!$A$5:$BLL$999,MATCH($C$1,Roster!$B$5:$B$999,0),COLUMN()),\"NILL\")","v":"NILL"},{"$f":"IFERROR(INDEX(Roster!$A$5:$BLL$999,MATCH($C$1,Roster!$B$5:$B$999,0),COLUMN()),\"NILL\")","v":"NILL"},{"$f":"IFERROR(INDEX(Roster!$A$5:$BLL$999,MATCH($C$1,Roster!$B$5:$B$999,0),COLUMN()),\"NILL\")","v":"NILL"},{"$f":"IFERROR(INDEX(Roster!$A$5:$BLL$999,MATCH($C$1,Roster!$B$5:$B$999,0),COLUMN()),\"NILL\")","v":"NILL"},{"$f":"IFERROR(INDEX(Roster!$A$5:$BLL$999,MATCH($C$1,Roster!$B$5:$B$999,0),COLUMN()),\"NILL\")","v":"NILL"},{"$f":"IFERROR(INDEX(Roster!$A$5:$BLL$999,MATCH($C$1,Roster!$B$5:$B$999,0),COLUMN()),\"NILL\")","v":"NILL"},{"$f":"IFERROR(INDEX(Roster!$A$5:$BLL$999,MATCH($C$1,Roster!$B$5:$B$999,0),COLUMN()),\"NILL\")","v":"NILL"},{"$f":"IFERROR(INDEX(Roster!$A$5:$BLL$999,MATCH($C$1,Roster!$B$5:$B$999,0),COLUMN()),\"NILL\")","v":"NILL"},{"$f":"IFERROR(INDEX(Roster!$A$5:$BLL$999,MATCH($C$1,Roster!$B$5:$B$999,0),COLUMN()),\"NILL\")","v":"NILL"},{"$f":"IFERROR(INDEX(Roster!$A$5:$BLL$999,MATCH($C$1,Roster!$B$5:$B$999,0),COLUMN()),\"NILL\")","v":"NILL"},{"$f":"IFERROR(INDEX(Roster!$A$5:$BLL$999,MATCH($C$1,Roster!$B$5:$B$999,0),COLUMN()),\"NILL\")","v":"NILL"},{"$f":"IFERROR(INDEX(Roster!$A$5:$BLL$999,MATCH($C$1,Roster!$B$5:$B$999,0),COLUMN()),\"NILL\")","v":"NILL"},{"$f":"IFERROR(INDEX(Roster!$A$5:$BLL$999,MATCH($C$1,Roster!$B$5:$B$999,0),COLUMN()),\"NILL\")","v":"NILL"},{"$f":"IFERROR(INDEX(Roster!$A$5:$BLL$999,MATCH($C$1,Roster!$B$5:$B$999,0),COLUMN()),\"NILL\")","v":"NILL"},{"$f":"IFERROR(INDEX(Roster!$A$5:$BLL$999,MATCH($C$1,Roster!$B$5:$B$999,0),COLUMN()),\"NILL\")","v":"NILL"},{"$f":"IFERROR(INDEX(Roster!$A$5:$BLL$999,MATCH($C$1,Roster!$B$5:$B$999,0),COLUMN()),\"NILL\")","v":"NILL"},{"$f":"IFERROR(INDEX(Roster!$A$5:$BLL$999,MATCH($C$1,Roster!$B$5:$B$999,0),COLUMN()),\"NILL\")","v":"NILL"},{"$f":"IFERROR(INDEX(Roster!$A$5:$BLL$999,MATCH($C$1,Roster!$B$5:$B$999,0),COLUMN()),\"NILL\")","v":"NILL"},{"$f":"IFERROR(INDEX(Roster!$A$5:$BLL$999,MATCH($C$1,Roster!$B$5:$B$999,0),COLUMN()),\"NILL\")","v":"NILL"},{"$f":"IFERROR(INDEX(Roster!$A$5:$BLL$999,MATCH($C$1,Roster!$B$5:$B$999,0),COLUMN()),\"NILL\")","v":"NILL"},{"$f":"IFERROR(INDEX(Roster!$A$5:$BLL$999,MATCH($C$1,Roster!$B$5:$B$999,0),COLUMN()),\"NILL\")","v":"NILL"},{"$f":"IFERROR(INDEX(Roster!$A$5:$BLL$999,MATCH($C$1,Roster!$B$5:$B$999,0),COLUMN()),\"NILL\")","v":"NILL"},{"$f":"IFERROR(INDEX(Roster!$A$5:$BLL$999,MATCH($C$1,Roster!$B$5:$B$999,0),COLUMN()),\"NILL\")","v":"NILL"},{"$f":"IFERROR(INDEX(Roster!$A$5:$BLL$999,MATCH($C$1,Roster!$B$5:$B$999,0),COLUMN()),\"NILL\")","v":"NILL"},{"$f":"IFERROR(INDEX(Roster!$A$5:$BLL$999,MATCH($C$1,Roster!$B$5:$B$999,0),COLUMN()),\"NILL\")","v":"NILL"},{"$f":"IFERROR(INDEX(Roster!$A$5:$BLL$999,MATCH($C$1,Roster!$B$5:$B$999,0),COLUMN()),\"NILL\")","v":"NILL"},{"$f":"IFERROR(INDEX(Roster!$A$5:$BLL$999,MATCH($C$1,Roster!$B$5:$B$999,0),COLUMN()),\"NILL\")","v":"NILL"},{"$f":"IFERROR(INDEX(Roster!$A$5:$BLL$999,MATCH($C$1,Roster!$B$5:$B$999,0),COLUMN()),\"NILL\")","v":"NILL"},{"$f":"IFERROR(INDEX(Roster!$A$5:$BLL$999,MATCH($C$1,Roster!$B$5:$B$999,0),COLUMN()),\"NILL\")","v":"NILL"},{"$f":"IFERROR(INDEX(Roster!$A$5:$BLL$999,MATCH($C$1,Roster!$B$5:$B$999,0),COLUMN()),\"NILL\")","v":"NILL"},{"$f":"IFERROR(INDEX(Roster!$A$5:$BLL$999,MATCH($C$1,Roster!$B$5:$B$999,0),COLUMN()),\"NILL\")","v":"NILL"},{"$f":"IFERROR(INDEX(Roster!$A$5:$BLL$999,MATCH($C$1,Roster!$B$5:$B$999,0),COLUMN()),\"NILL\")","v":"NILL"},{"$f":"IFERROR(INDEX(Roster!$A$5:$BLL$999,MATCH($C$1,Roster!$B$5:$B$999,0),COLUMN()),\"NILL\")","v":"NILL"},{"$f":"IFERROR(INDEX(Roster!$A$5:$BLL$999,MATCH($C$1,Roster!$B$5:$B$999,0),COLUMN()),\"NILL\")","v":"NILL"},{"$f":"IFERROR(INDEX(Roster!$A$5:$BLL$999,MATCH($C$1,Roster!$B$5:$B$999,0),COLUMN()),\"NILL\")","v":"NILL"},{"$f":"IFERROR(INDEX(Roster!$A$5:$BLL$999,MATCH($C$1,Roster!$B$5:$B$999,0),COLUMN()),\"NILL\")","v":"NILL"},{"$f":"IFERROR(INDEX(Roster!$A$5:$BLL$999,MATCH($C$1,Roster!$B$5:$B$999,0),COLUMN()),\"NILL\")","v":"NILL"},{"$f":"IFERROR(INDEX(Roster!$A$5:$BLL$999,MATCH($C$1,Roster!$B$5:$B$999,0),COLUMN()),\"NILL\")","v":"NILL"},{"$f":"IFERROR(INDEX(Roster!$A$5:$BLL$999,MATCH($C$1,Roster!$B$5:$B$999,0),COLUMN()),\"NILL\")","v":"NILL"},{"$f":"IFERROR(INDEX(Roster!$A$5:$BLL$999,MATCH($C$1,Roster!$B$5:$B$999,0),COLUMN()),\"NILL\")","v":"NILL"},{"$f":"IFERROR(INDEX(Roster!$A$5:$BLL$999,MATCH($C$1,Roster!$B$5:$B$999,0),COLUMN()),\"NILL\")","v":"NILL"},{"$f":"IFERROR(INDEX(Roster!$A$5:$BLL$999,MATCH($C$1,Roster!$B$5:$B$999,0),COLUMN()),\"NILL\")","v":"NILL"},{"$f":"IFERROR(INDEX(Roster!$A$5:$BLL$999,MATCH($C$1,Roster!$B$5:$B$999,0),COLUMN()),\"NILL\")","v":"NILL"},{"$f":"IFERROR(INDEX(Roster!$A$5:$BLL$999,MATCH($C$1,Roster!$B$5:$B$999,0),COLUMN()),\"NILL\")","v":"NILL"},{"$f":"IFERROR(INDEX(Roster!$A$5:$BLL$999,MATCH($C$1,Roster!$B$5:$B$999,0),COLUMN()),\"NILL\")","v":"NILL"},{"$f":"IFERROR(INDEX(Roster!$A$5:$BLL$999,MATCH($C$1,Roster!$B$5:$B$999,0),COLUMN()),\"NILL\")","v":"NILL"},{"$f":"IFERROR(INDEX(Roster!$A$5:$BLL$999,MATCH($C$1,Roster!$B$5:$B$999,0),COLUMN()),\"NILL\")","v":"NILL"},{"$f":"IFERROR(INDEX(Roster!$A$5:$BLL$999,MATCH($C$1,Roster!$B$5:$B$999,0),COLUMN()),\"NILL\")","v":"NILL"},{"$f":"IFERROR(INDEX(Roster!$A$5:$BLL$999,MATCH($C$1,Roster!$B$5:$B$999,0),COLUMN()),\"NILL\")","v":"NILL"},{"$f":"IFERROR(INDEX(Roster!$A$5:$BLL$999,MATCH($C$1,Roster!$B$5:$B$999,0),COLUMN()),\"NILL\")","v":"NILL"},{"$f":"IFERROR(INDEX(Roster!$A$5:$BLL$999,MATCH($C$1,Roster!$B$5:$B$999,0),COLUMN()),\"NILL\")","v":"NILL"},{"$f":"IFERROR(INDEX(Roster!$A$5:$BLL$999,MATCH($C$1,Roster!$B$5:$B$999,0),COLUMN()),\"NILL\")","v":"NILL"},{"$f":"IFERROR(INDEX(Roster!$A$5:$BLL$999,MATCH($C$1,Roster!$B$5:$B$999,0),COLUMN()),\"NILL\")","v":"NILL"},{"$f":"IFERROR(INDEX(Roster!$A$5:$BLL$999,MATCH($C$1,Roster!$B$5:$B$999,0),COLUMN()),\"NILL\")","v":"NILL"}]
["S #","PRN","NAME","POSITION\nHAJJ-PHASE-I","MESTRO","ALTEA","SABER","SITA","TROY","MACS","PC","PHS",43640,43641,43642,43643,43644,43645,43646,43647,43648,43649,43650,43651,43652,43653,43654,43655,43656,43657,43658,43659,43660,43661,43662,43663,43664,43665,43666,43667,43668,43669,43670,43671,43672,43673,43674,43675,43676,43677]
[null,null,null,null,null,null,null,null,null,null,null,null,{"$f":"M$6","v":43640},{"$f":"N$6","v":43641},43642,43643,43644,43645,43646,43647,43648,43649,43650,43651,43652,43653,43654,43655,43656,43657,43658,43659,43660,43661,43662,43663,43664,43665,43666,43667,43668,43669,43670,43671,43672,43673,43674,43675,43676,43677]
[null,null,null,null,null,null,null,null,null,null,null,null,{"$f":"M$7","v":43640},{"$f":"N$7","v":43641},43642,43643,43644,43645,43646,43647,43648,43649,43650,43651,43652,43653,43654,43655,43656,43657,43658,43659,43660,43661,43662,43663,43664,43665,43666,43667,43668,43669,43670,43671,43672,43673,43674,43675,43676,43677]
[]
[]
[]
[null,null,null,null,null,null,null,null,null,null,null,null,"2019-06-01",null,null,null,null,null,null,"2019-07-01"]
["S #","PRN","NAME","POSITION\nHAJJ\nPHASE-I","MESTRO","ALTEA","SABER","SITA","TROY","MACS","PC","PHS","2019-06-24","2019-06-25","2019-06-26","2019-06-27","2019-06-28","2019-06-29","2019-06-30","2019-07-01","2019-07-02","2019-07-03","2019-07-04","2019-07-05","2019-07-06","2019-07-07","2019-07-08","2019-07-09","2019-07-10","2019-07-11","2019-07-12","2019-07-13","2019-07-14","2019-07-15","2019-07-16","2019-07-17","2019-07-18","2019-07-19","2019-07-20","2019-07-21","2019-07-22","2019-07-23","2019-07-24","2019-07-25","2019-07-26","2019-07-27","2019-07-28","2019-07-29","2019-07-30","2019-07-31"]
[null,null,null,null,null,null,null,null,null,null,null,null,{"$f":"M$6","v":"2019-06-24"},{"$f":"N$6","v":"2019-06-25"},"2019-06-26","2019-06-27","2019-06-28","2019-06-29","2019-06-30","2019-07-01","2019-07-02","2019-07-03","2019-07-04","2019-07-05","2019-07-06","2019-07-07","2019-07-08","2019-07-09","2019-07-10","2019-07-11","2019-07-12","2019-07-13","2019-07-14","2019-07-15","2019-07-16","2019-07-17","2019-07-18","2019-07-19","2019-07-20","2019-07-21","2019-07-22","2019-07-23","2019-07-24","2019-07-25","2019-07-26","2019-07-27","2019-07-28","2019-07-29","2019-07-30","2019-07-31"]
[]
[]
[]
[]
[null,"M",{"$f":"COUNTIF($T$16:$BLK$16,$B19)","v":0},{"$f":"SUM($C$19:$C$21)","v":0}]
[null,"A",{"$f":"COUNTIF($T$16:$BLK$16,$B20)","v":0}]
[null,"H",{"$f":"COUNTIF($T$16:$BLK$16,$B21)","v":0}]
[]
[null,"REST DAY",{"$f":"COUNTIFS($T$16:$BLK$16,\"R\")","v":0},{"$f":"SUM($C$23)","v":0}]
[null,"VACATION",{"$f":"COUNTIFS($T$16:$BLK$16,\"VAC\")","v":0},{"$f":"SUM($C$24)","v":0}]
[null,"ABSENT",{"$f":"COUNTIFS($T$16:$BLK$16,\"U\")","v":0}]
[null,"SICK",{"$f":"COUNTIFS($T$16:$BLK$16,\"SICK\")","v":0}]
[null,null,null,{"$f":"SUM($D$19:$D$23)","v":0}]
[]
[]
[]
[]
[]
[]
[]
[]
[]
[]
[]
[]
[]
[]
[]
[]
[]
[]
[]
[]
[]
[]
[]
[]
[]
[]
[]
[]
[]
[]
[]
[]
[]
[]
[]
[]
[]
[]
[]
[]
[]
[]
[]
[]
[]
[]
[]
[]
[]
[]
[]
[]
[]
[]
[]
[]
[]
[]
[]
[]
[]
[]
[]
[]
[]
[]
[]
[]
[]
[]
[]
[]
[]
[]
[]
[]
[]
[]
[]
[]
[]
[]
[]
[]
[]
[]
[]
[]
[]
[]
[]
[]
[]
[]
[]
[]
[]
[]
[]
[]
[]
[]
[]
[]
[]
[]
[]
[]
[]
[]
[]
[]
[]
[]
[]
[]
[]
[]
[]
[]
[]
[]
[]
[]
[]
[]
[]
[]
[]
[10,15011678,"ADNAN ABDULRAZAG ALHAZMI","TOC",0,"X",0,0,0,0,"X",0,"VAC","VAC","VAC","VAC","VAC","VAC","VAC","VAC","VAC","VAC","VAC","VAC","VAC","VAC","EXR","EXR","R","R","M","M","M","M","M","EXR","R","R","H","H","H","H","H","H","R","R","A","A","A","A","A","A","R","R","M","M","M","M","M","M","R","R","H","H","H",0,0,0,0,0,0,0,0,0,0,0,0,0,0,0,0,0,0,0,0,0,0,0,0,0,0,0,0,0,0,0,0,0,0,0,0,0,0,0,0,0,0,0,0,0,0,0,0,0,0,0,0,0,0,0,0,0,0,0,0,0,0,0,0,0,0,0,0,0,0,0,0,0,0,0,0,0,0,0,0,0,0,0,0,0,0,0,0,0,0,0,0,0,0,0,0,0,0,0,0,0,0,0,0,0,0,0,0,0,0,0,0,0,0,0,0,0,0,0,0,0,0,0,0,0,0,0,0,0,0,0,0,0,0,0,0,0,0,0,0,0,0,0,0,0,0,0,0,0,0,0,0,0,0,0,0,0,0]

{"sheet":"Roster","index":2,"n_rows":218,"n_cols":232,"rows_kept":218,"cut":false,"hidden":false,"merged":[[0,113,0,143],[0,144,0,173],[0,174,0,204],[0,12,0,18],[0,19,0,49],[0,51,0,81],[0,83,0,112]]}
[null,null,null,null,null,null,null,null,null,null,null,null,"2019-06-01",null,null,null,null,null,null,"2019-07-01",null,null,null,null,null,null,null,null,null,null,null,null,null,null,null,null,null,null,null,null,null,null,null,null,null,null,null,null,null,null,"R","2019-08-01",null,null,null,null,null,null,null,null,null,null,null,null,null,null,null,null,null,null,null,null,null,null,null,null,null,null,null,null,null,null,"R","2019-09-01",null,null,null,null,null,null,null,null,null,null,null,null,null,null,null,null,null,null,null,null,null,null,null,null,null,null,null,null,null,"2019-10-01",null,null,null,null,null,null,null,null,null,null,null,null,null,null,null,null,null,null,null,null,null,null,null,null,null,null,null,null,null,null,"2019-11-01",null,null,null,null,null,null,null,null,null,null,null,null,null,null,null,null,null,null,null,null,null,null,null,null,null,null,null,null,null,"2019-12-01"]
["S #","PRN","NAME","POSITION\nHAJJ-PHASE-I",null,null,null,null,null,null,null,null,"2019-06-24","2019-06-25","2019-06-26","2019-06-27","2019-06-28","2019-06-29","2019-06-30","2019-07-01","2019-07-02","2019-07-03","2019-07-04","2019-07-05","2019-07-06","2019-07-07","2019-07-08","2019-07-09","2019-07-10","2019-07-11","2019-07-12","2019-07-13","2019-07-14","2019-07-15","2019-07-16","2019-07-17","2019-07-18","2019-07-19","2019-07-20","2019-07-21","2019-07-22","2019-07-23","2019-07-24","2019-07-25","2019-07-26","2019-07-27","2019-07-28","2019-07-29","2019-07-30","2019-07-31",null,"2019-08-01","2019-08-02","2019-08-03","2019-08-04","2019-08-05","2019-08-06","2019-08-07","2019-08-08","2019-08-09","2019-08-10","2019-08-11","2019-08-12","2019-08-13","2019-08-14","2019-08-15","2019-08-16","2019-08-17","2019-08-18","2019-08-19","2019-08-20","2019-08-21","2019-08-22","2019-08-23","2019-08-24","2019-08-25","2019-08-26","2019-08-27","2019-08-28","2019-08-29","2019-08-30","2019-08-31",null,"2019-09-01","2019-09-02","2019-09-03","2019-09-04","2019-09-05","2019-09-06","2019-09-07","2019-09-08","2019-09-09","2019-09-10","2019-09-11","2019-09-12","2019-09-13","2019-09-14","2019-09-15","2019-09-16","2019-09-17","2019-09-18","2019-09-19","2019-09-20","2019-09-21","2019-09-22","2019-09-23","2019-09-24","2019-09-25","2019-09-26","2019-09-27","2019-09-28","2019-09-29","2019-09-30","2019-10-01","2019-10-02","2019-10-03","2019-10-04","2019-10-05","2019-10-06","2019-10-07","2019-10-08","2019-10-09","2019-10-10","2019-10-11","2019-10-12","2019-10-13","2019-10-14","2019-10-15","2019-10-16","2019-10-17","2019-10-18","2019-10-19","2019-10-20","2019-10-21","2019-10-22","2019-10-23","2019-10-24","2019-10-25","2019-10-26","2019-10-27","2019-10-28","2019-10-29","2019-10-30","2019-10-31","2019-11-01","2019-11-02","2019-11-03","2019-11-04","2019-11-05","2019-11-06","2019-11-07","2019-11-08","2019-11-09","2019-11-10","2019-11-11","2019-11-12","2019-11-13","2019-11-14","2019-11-15","2019-11-16","2019-11-17","2019-11-18","2019-11-19","2019-11-20","2019-11-21","2019-11-22","2019-11-23","2019-11-24","2019-11-25","2019-11-26","2019-11-27","2019-11-28","2019-11-29","2019-11-30","2019-12-01","2019-12-02","2019-12-03","2019-12-04","2019-12-05","2019-12-06","2019-12-07","2019-12-08","2019-12-09","2019-12-10","2019-12-11","2019-12-12","2019-12-13","2019-12-14","2019-12-15","2019-12-16","2019-12-17","2019-12-18","2019-12-19","2019-12-20","2019-12-21","2019-12-22","2019-12-23","2019-12-24","2019-12-25","2019-12-26","2019-12-27","2019-12-28","2019-12-29","2019-12-30","2019-12-31"]
[null,null,null,null,null,null,null,null,null,null,null,null,{"$f":"M$2","v":"2019-06-24"},{"$f":"N$2","v":"2019-06-25"},"2019-06-26","2019-06-27","2019-06-28","2019-06-29","2019-06-30","2019-07-01","2019-07-02","2019-07-03","2019-07-04","2019-07-05","2019-07-06","2019-07-07","2019-07-08","2019-07-09","2019-07-10","2019-07-11","2019-07-12","2019-07-13","2019-07-14","2019-07-15","2019-07-16","2019-07-17","2019-07-18","2019-07-19","2019-07-20","2019-07-21","2019-07-22","2019-07-23","2019-07-24","2019-07-25","2019-07-26","2019-07-27","2019-07-28","2019-07-29","2019-07-30","2019-07-31",null,"2019-08-01","2019-08-02","2019-08-03","2019-08-04","2019-08-05","2019-08-06","2019-08-07","2019-08-08","2019-08-09","2019-08-10","2019-08-11","2019-08-12","2019-08-13","2019-08-14","2019-08-15","2019-08-16","2019-08-17","2019-08-18","2019-08-19","2019-08-20","2019-08-21","2019-08-22","2019-08-23","2019-08-24","2019-08-25","2019-08-26",{"$f":"BZ$2","v":"2019-08-27"},"2019-08-28","2019-08-29","2019-08-30","2019-08-31",null,"2019-09-01","2019-09-02","2019-09-03","2019-09-04","2019-09-05","2019-09-06","2019-09-07","2019-09-08","2019-09-09","2019-09-10","2019-09-11","2019-09-12","2019-09-13","2019-09-14","2019-09-15","2019-09-16","2019-09-17","2019-09-18","2019-09-19","2019-09-20","2019-09-21","2019-09-22","2019-09-23","2019-09-24","2019-09-25","2019-09-26","2019-09-27","2019-09-28","2019-09-29","2019-09-30","2019-10-01","2019-10-02","2019-10-03","2019-10-04","2019-10-05","2019-10-06","2019-10-07","2019-10-08","2019-10-09","2019-10-10","2019-10-11","2019-10-12","2019-10-13","2019-10-14","2019-10-15","2019-10-16","2019-10-17","2019-10-18","2019-10-19","2019-10-20","2019-10-21","2019-10-22","2019-10-23","2019-10-24","2019-10-25","2019-10-26","2019-10-27","2019-10-28",{"$f":"EL$2","v":"2019-10-29"},"2019-10-30","2019-10-31","2019-11-01","2019-11-02","2019-11-03","2019-11-04","2019-11-05","2019-11-06","2019-11-07","2019-11-08","2019-11-09","2019-11-10","2019-11-11","2019-11-12","2019-11-13","2019-11-14","2019-11-15","2019-11-16","2019-11-17","2019-11-18","2019-11-19","2019-11-20","2019-11-21","2019-11-22","2019-11-23","2019-11-24","2019-11-25","2019-11-26","2019-11-27","2019-11-28","2019-11-29","2019-11-30","2019-12-01","2019-12-02","2019-12-03","2019-12-04","2019-12-05","2019-12-06","2019-12-07","2019-12-08","2019-12-09","2019-12-10","2019-12-11","2019-12-12","2019-12-13","2019-12-14","2019-12-15","2019-12-16","2019-12-17","2019-12-18","2019-12-19","2019-12-20","2019-12-21","2019-12-22","2019-12-23","2019-12-24","2019-12-25","2019-12-26","2019-12-27","2019-12-28","2019-12-29","2019-12-30","2019-12-31"]
[null,null,null,null,null,null,null,null,null,null,null,null,{"$f":"M$3","v":"2019-06-24"},{"$f":"N$3","v":"2019-06-25"},"2019-06-26","2019-06-27","2019-06-28","2019-06-29","2019-06-30","2019-07-01","2019-07-02","2019-07-03","2019-07-04","2019-07-05","2019-07-06","2019-07-07","2019-07-08","2019-07-09","2019-07-10","2019-07-11","2019-07-12","2019-07-13","2019-07-14","2019-07-15","2019-07-16","2019-07-17","2019-07-18","2019-07-19","2019-07-20","2019-07-21","2019-07-22","2019-07-23","2019-07-24","2019-07-25","2019-07-26","2019-07-27","2019-07-28","2019-07-29","2019-07-30","2019-07-31",null,"2019-08-01","2019-08-02","2019-08-03","2019-08-04","2019-08-05","2019-08-06","2019-08-07","2019-08-08","2019-08-09","2019-08-10","2019-08-11","2019-08-12","2019-08-13","2019-08-14","2019-08-15","2019-08-16","2019-08-17","2019-08-18","2019-08-19","2019-08-20","2019-08-21","2019-08-22","2019-08-23","2019-08-24","2019-08-25","2019-08-26","2019-08-27",{"$f":"CA$3","v":"2019-08-28"},"2019-08-29","2019-08-30","2019-08-31",null,"2019-09-01","2019-09-02","2019-09-03","2019-09-04","2019-09-05","2019-09-06","2019-09-07","2019-09-08","2019-09-09","2019-09-10","2019-09-11","2019-09-12","2019-09-13","2019-09-14","2019-09-15","2019-09-16","2019-09-17","2019-09-18","2019-09-19","2019-09-20","2019-09-21","2019-09-22","2019-09-23","2019-09-24","2019-09-25","2019-09-26","2019-09-27","2019-09-28","2019-09-29","2019-09-30","2019-10-01","2019-10-02","2019-10-03","2019-10-04","2019-10-05","2019-10-06","2019-10-07","2019-10-08","2019-10-09","2019-10-10","2019-10-11","2019-10-12","2019-10-13","2019-10-14","2019-10-15","2019-10-16","2019-10-17","2019-10-18","2019-10-19","2019-10-20","2019-10-21","2019-10-22","2019-10-23","2019-10-24","2019-10-25","2019-10-26","2019-10-27","2019-10-28","2019-10-29","2019-10-30",{"$f":"EN$3","v":"2019-10-31"},"2019-11-01","2019-11-02","2019-11-03","2019-11-04","2019-11-05","2019-11-06","2019-11-07","2019-11-08","2019-11-09","2019-11-10","2019-11-11","2019-11-12","2019-11-13","2019-11-14","2019-11-15","2019-11-16","2019-11-17","2019-11-18","2019-11-19","2019-11-20","2019-11-21","2019-11-22","2019-11-23","2019-11-24","2019-11-25","2019-11-26","2019-11-27","2019-11-28","2019-11-29","2019-11-30","2019-12-01","2019-12-02","2019-12-03","2019-12-04","2019-12-05","2019-12-06","2019-12-07","2019-12-08","2019-12-09","2019-12-10","2019-12-11","2019-12-12","2019-12-13","2019-12-14","2019-12-15","2019-12-16","2019-12-17","2019-12-18","2019-12-19","2019-12-20","2019-12-21","2019-12-22","2019-12-23","2019-12-24","2019-12-25","2019-12-26","2019-12-27","2019-12-28","2019-12-29","2019-12-30","2019-12-31"]
[1,10001,"سالم",null,null,null,null,null,null,null,null,null,"R","R","R","A","R","R","M","M","M","M","M","M","R","R","EXR","H","H","H","H","H","R","R","A","A","A","A","A","A","R","R","EXR","M","M","M","M","M","R","R",{"$f":"COUNTIF($T5:$AX5,$AY$1)","v":8},"H","H","H","H","H","H","R","R","A","A","A","A","A","R","R","H",0,0,0,0,0,0,0,0,0,0,0,0,0,0,0,0,0,0,0,0,0,0,0,0,0,0,0,0,0,0,0,0,0,0,0,0,0,0,0,0,0,0,0,0,0,0,0,0,0,0,0,0,0,0,0,0,0,0,0,0,0,0,0,0,0,0,0,0,0,0,0,0,0,0,0,0,0,0,0,0,0,0,0,0,0,0,0,0,0,0,0,0,0,0,0,0,0,0,0,0,0,0,0,0,0,0,0,0,0,0,0,0,0,0,0,0,0,0,0,0,0,0,0,0,0,0,0,0,0,0,0,0,0,0,0,0,0,0,0,0,0,0,0,0,0,0,0,0,0,0,0,0,0,0,0,0,0,0]
[{"$f":"A5+1","v":2},10002,"عفيفي",null,null,null,null,null,null,null,null,null,"R","R","R","A","R","R","M","M","M","M","M","M","R","R","H","EXR","H","H","H","H","R","R","A","EXR","A","A","A","A","R","R","M","M","M","M","M","M","R","R",{"$f":"COUNTIF($T6:$AX6,$AY$1)","v":8},"H","H","H","H","H","H","R","R","A","A","A","A","A","R","R",null,null,null,null,null,null,null,null,null,null,null,null,null,null,null,null,{"$f":"COUNTIF(AZ6:$CD6,$AY$1)","v":4}]
[{"$f":"A6+1","v":3},10003,"محمود",null,null,null,null,null,null,null,null,null,"R","R","R","VAC","VAC","VAC","VAC","VAC","VAC","VAC","VAC","VAC","R","R","EXR","H","H","H","H","H","R","R","A","A","EXR","A","A","A","R","R","M","M","M","M","M","M","R","R",8,"H","H","H","H","H","H","R","R","A","A","A","A","A","R","R",null,null,null,null,null,null,null,null,null,null,null,null,null,null,null,null,{"$f":"COUNTIF(AZ7:$CD7,$AY$1)","v":4}]
[4,10004,"جمال",null,null,null,null,null,null,null,null,null,"R","R","R","A","R","R","VAC","VAC","VAC","VAC","VAC","VAC","R","R","H","H","H","EXR","H","H","R","R","A","A","A","EXR","A","A","R","R","M","M","M","M","M","M","R","R",8,"H","H","H","H","H","H","R","R","A","A","A","A","A","R","R",null,null,null,null,null,null,null,null,null,null,null,null,null,null,null,null,{"$f":"COUNTIF(AZ8:$CD8,$AY$1)","v":4}]
[5,10005,"خالد",null,null,null,null,null,null,null,null,null,"R","R","R","A","R","R","M","M","M","M","M","M","R","R","H","H","H","H","EXR","H","R","R","A","A","A","A","EXR","A","R","R","M","M","M","M","M","M","R","R",8,"H","H","H","H","H","H","R","R","A","A","A","A","A","R","R",null,null,null,null,null,null,null,null,null,null,null,null,null,null,null,null,{"$f":"COUNTIF(AZ9:$CD9,$AY$1)","v":4}]
[6,10006,"مصعب",null,null,null,null,null,null,null,null,null,"R","R","R","VAC","VAC","VAC","VAC","VAC","VAC","VAC","VAC","VAC","R","R","H","H","H","H","H","EXR","R","R","A","A","A","EXR","A","A","R","R","M","M","M","M","M","M","R","R",8,"H","H","H","H","H","H","R","R","A","A","A","A","A","R","R",null,null,null,null,null,null,null,null,null,null,null,null,null,null,null,null,{"$f":"COUNTIF(AZ10:$CD10,$AY$1)","v":4}]
[7,10007,"سالم",null,null,null,null,null,null,null,null,null,"R","R","R","VAC","VAC","VAC","VAC","VAC","M","M","M","M","R","R","H","H","H","H","EXR","H","R","R","A","A","A","A","A","EXR","R","R","M","M","M","M","M","M","R","R",8,"H","H","H","H","H","H","R","R","A","A","A","A","A","R","R",null,null,null,null,null,null,null,null,null,null,null,null,null,null,null,null,{"$f":"COUNTIF(AZ11:$CD11,$AY$1)","v":4}]
[8,10008,"عفيفي",null,null,null,null,null,null,null,null,null,"R","R","R","VAC","VAC","VAC","VAC","VAC","VAC","VAC","VAC","VAC","R","R","H","EXR","H","H","H","H","R","R","EXR","A","A","A","A","A","R","R","M","M","M","M","M","M","R","R",8,"H","H","H","H","H","H","R","R","A","A","A","A","A","R","R",null,null,null,null,null,null,null,null,null,null,null,null,null,null,null,null,{"$f":"COUNTIF(AZ12:$CD12,$AY$1)","v":4}]
[9,10009,"محمود",null,null,null,null,null,null,null,null,null,"R","R","R","A","R","R","VAC","VAC","VAC","VAC","VAC","VAC","VAC","VAC","VAC","VAC","VAC","VAC","VAC","VAC","VAC","VAC","VAC","VAC","VAC","VAC","VAC","VAC","VAC","VAC","VAC","VAC","VAC","VAC","VAC","VAC","R","R",2,"H","H","H","H","H","H","R","R","A","A","A","A","A","R","R",null,null,null,null,null,null,null,null,null,null,null,null,null,null,null,null,{"$f":"COUNTIF(AZ13:$CD13,$AY$1)","v":4}]
[10,10010,"جمال",null,null,null,null,null,null,null,null,null,"R","R","R","VAC","VAC","VAC","VAC","VAC","VAC","VAC","M","M","R","R","H","H","H","H","H","H","R","R","A","A","A","A","A","A","R","R","M","M","M","M","EXR","EXR","R","R",8,"H","H","H","H","H","H","R","R","A","A","A","A","A","R","R",0,0,0,0,0,0,0,0,0,0,0,0,0,0,0,0,4,0,0,0,0,0,0,0,0,0,0,0,0,0,0,0,0,0,0,0,0,0,0,0,0,0,0,0,0,0,0,0,0,0,0,0,0,0,0,0,0,0,0,0,0,0,0,0,0,0,0,0,0,0,0,0,0,0,0,0,0,0,0,0,0,0,0,0,0,0,0,0,0,0,0,0,0,0,0,0,0,0,0,0,0,0,0,0,0,0,0,0,0,0,0,0,0,0,0,0,0,0,0,0,0,0,0,0,0,0,0,0,0,0,0,0,0,0,0,0,0,0,0,0,0,0,0,0,0,0,0,0,0,0,0,0,0,0,0,0,0,0,0,0,0,0,0,0,0]
[11,10011,"خالد",null,null,null,null,null,null,null,null,null,"R","R","R","VAC","R","R","VAC","VAC","VAC","VAC","VAC","VAC","R","R","H","H","H","H","EXR","H","R","R","A","A","A","A","A","EXR","R","R","M","M","M","M","M","M","R","R",8,"H","H","H","H","H","H","R","R","A","A","A","A","A","R","R",null,null,null,null,null,null,null,null,null,null,null,null,null,null,null,null,{"$f":"COUNTIF(AZ15:$CD15,$AY$1)","v":4}]
[12,10012,"مصعب",null,null,null,null,null,null,null,null,null,"R","R","R","VAC","VAC","VAC","VAC","VAC","VAC","VAC","VAC","VAC","R","R","H","H","EXR","H","H","H","R","R","A","A","A","A","A","A","R","R","M","M","EXR","M","M","M","R","R",8,"H","H","H","H","H","H","R","R","A","A","A","A","A","R","R",null,null,null,null,null,null,null,null,null,null,null,null,null,null,null,null,{"$f":"COUNTIF(AZ16:$CD16,$AY$1)","v":4}]
[13,10013,"سالم",null,null,null,null,null,null,null,null,null,"R","R","R","A","R","R","VAC","VAC","VAC","VAC","M","M","R","R","H","EXR","H","H","H","H","R","R","A","A","A","A","A","A","R","R","M","M","M","EXR","M","M","R","R",8,"H","H","H","H","H","H","R","R","A","A","A","A","A","R","R",null,null,null,null,null,null,null,null,null,null,null,null,null,null,null,null,{"$f":"COUNTIF(AZ17:$CD17,$AY$1)","v":4}]
[14,10014,"عفيفي",null,null,null,null,null,null,null,null,null,"R","R","R","A","R","R","VAC","VAC","VAC","VAC","VAC","VAC","R","R","EXR","H","H","H","H","H","R","R","A","A","A","A","A","A","R","R","M","M","M","M","EXR","M","R","R",8,"H","H","H","H","H","H","R","R","A","A","A","A","A","R","R",null,null,null,null,null,null,null,null,null,null,null,null,null,null,null,null,{"$f":"COUNTIF(AZ18:$CD18,$AY$1)","v":4}]
[15,10015,"محمود",null,null,null,null,null,null,null,null,null,"R","R","R","A","R","R","VAC","VAC","VAC","VAC","VAC","VAC","R","R","H","EXR","H","H","H","H","R","R","A","A","A","A","A","A","R","R","M","M","M","M","M","EXR","R","R",8,"H","H","H","H","H","H","R","R","A","A","A","A","A","R","R",null,null,null,null,null,null,null,null,null,null,null,null,null,null,null,null,{"$f":"COUNTIF(AZ19:$CD19,$AY$1)","v":4}]
[16,10016,"جمال",null,null,null,null,null,null,null,null,null,"R","R","R","A","R","R","VAC","VAC","VAC","VAC","VAC","VAC","R","R","H","H","EXR","H","H","H","R","R","A","A","A","A","A","A","R","R","M","M","M","M","EXR","M","R","R",8,"H","H","H","H","H","H","R","R","A","A","A","A","A","R","R",null,null,null,null,null,null,null,null,null,null,null,null,null,null,null,null,{"$f":"COUNTIF(AZ20:$CD20,$AY$1)","v":4}]
[17,10017,"خالد",null,null,null,null,null,null,null,null,null,"R","R","R","VAC","VAC","VAC","VAC","VAC","VAC","VAC","VAC","VAC","VAC","VAC","VAC","VAC","VAC","VAC","VAC","VAC","VAC","VAC","VAC","VAC","VAC","VAC","VAC","VAC","R","R","M","M","M","EXR","M","M","R","R",4,"H","H","H","H","H","H","R","R","A","A","A","A","A","R","R",null,null,null,null,null,null,null,null,null,null,null,null,null,null,null,null,{"$f":"COUNTIF(AZ21:$CD21,$AY$1)","v":4}]
[18,10018,"مصعب",null,null,null,null,null,null,null,null,null,"R","R","R","VAC","VAC","VAC","VAC","VAC","VAC","VAC","VAC","VAC","R","R","H","H","H","H","EXR","H","R","R","A","A","A","A","A","A","R","R","M","M","EXR","M","M","M","R","R",8,"H","H","H","H","H","H","R","R","A","A","A","A","A","R","R",null,null,null,null,null,null,null,null,null,null,null,null,null,null,null,null,{"$f":"COUNTIF(AZ22:$CD22,$AY$1)","v":4}]
[19,10019,"سالم",null,null,null,null,null,null,null,null,null,"R","R","R","VAC","VAC","VAC","VAC","VAC","VAC","VAC","VAC","VAC","R","R","H","H","H","H","H","EXR","R","R","A","A","A","A","A","A","R","R","M","EXR","M","M","M","M","R","R",8,"H","H","H","H","H","H","R","R","A","A","A","A","A","R","R",null,null,null,null,null,null,null,null,null,null,null,null,null,null,null,null,{"$f":"COUNTIF(AZ23:$CD23,$AY$1)","v":4}]
[20,10020,"عفيفي",null,null,null,null,null,null,null,null,null,"R","R","R","A","R","R","M","M","M","M","M","M","R","R","H","H","H","EXR","H","H","R","R","A","A","A","A","A","EXR","R","R","M","M","M","M","M","M","R","R",8,"H","H","H","H","H","H","R","R","A","A","A","A","A","R","R",null,null,null,null,null,null,null,null,null,null,null,null,null,null,null,null,{"$f":"COUNTIF(AZ24:$CD24,$AY$1)","v":4}]
[21,10021,"محمود",null,null,null,null,null,null,null,null,null,"R","R","R","VAC","VAC","VAC","VAC","VAC","VAC","VAC","VAC","VAC","VAC","VAC","VAC","VAC","VAC","VAC","VAC","VAC","R","R","EXR","A","A","A","A","A","R","R","M","M","M","M","M","M","R","R",6,"H","H","H","H","H","H","R","R","A","A","A","A","A","R","R",null,null,null,null,null,null,null,null,null,null,null,null,null,null,null,null,{"$f":"COUNTIF(AZ25:$CD25,$AY$1)","v":4}]
[22,10022,"جمال",null,null,null,null,null,null,null,null,null,"R","R","R","A","R","R","VAC","VAC","VAC","VAC","VAC","VAC","R","R","H","EXR","H","H","H","H","R","R","A","A","A","EXR","A","A","R","R","M","M","M","M","M","M","R","R",8,"H","H","H","H","H","H","R","R","A","A","A","A","A","R","R",null,null,null,null,null,null,null,null,null,null,null,null,null,null,null,null,{"$f":"COUNTIF(AZ26:$CD26,$AY$1)","v":4}]
[23,10023,"خالد",null,null,null,null,null,null,null,null,null,"R","R","R","A","R","R","M","M","M","M","M","M","R","R","EXR","H","H","H","H","H","R","R","A","A","EXR","A","A","A","R","R","M","M","M","M","M","M","R","R",8,"H","H","H","H","H","H","R","R","A","A","A","A","A","R","R",null,null,null,null,null,null,null,null,null,null,null,null,null,null,null,null,{"$f":"COUNTIF(AZ27:$CD27,$AY$1)","v":4}]
[24,10024,"مصعب",null,null,null,null,null,null,null,null,null,"R","R","R","A","R","R","M","M","M","M","M","M","R","R","H","EXR","H","H","H","H","R","R","A","EXR","A","A","A","A","R","R","M","M","M","M","M","M","R","R",8,"H","H","H","H","H","H","R","R","A","A","A","A","A","R","R",null,null,null,null,null,null,null,null,null,null,null,null,null,null,null,null,{"$f":"COUNTIF(AZ28:$CD28,$AY$1)","v":4}]
[25,10025,"سالم",null,null,null,null,null,null,null,null,null,"R","R","R","A","R","R","VAC","VAC","VAC","VAC","VAC","VAC","R","R","H","H","EXR","H","H","H","R","R","EXR","A","A","A","A","A","R","R","M","M","M","M","M","M","R","R",8,"H","H","H","H","H","H","R","R","A","A","A","A","A","R","R",null,null,null,null,null,null,null,null,null,null,null,null,null,null,null,null,{"$f":"COUNTIF(AZ29:$CD29,$AY$1)","v":4}]
[26,10026,"عفيفي",null,null,null,null,null,null,null,null,null,"VAC","VAC","VAC","VAC","VAC","VAC","VAC","VAC","VAC","VAC","M","M","R","R","H","H","H","EXR","H","H","R","R","A","EXR","A","A","A","A","R","R","M","M","M","M","M","M","R","R",8,"H","H","H","H","H","H","R","R","A","A","A","A","A","R","R",null,null,null,null,null,null,null,null,null,null,null,null,null,null,null,null,{"$f":"COUNTIF(AZ30:$CD30,$AY$1)","v":4}]
[27,10027,"محمود",null,null,null,null,null,null,null,null,null,"R","R","R","A","R","R","M","M","M","M","M","M","R","R","H","H","H","H","EXR","H","R","R","VAC","VAC","VAC","VAC","VAC","VAC","VAC","VAC","VAC","VAC","VAC","VAC","VAC","VAC","R","R",6,"H","H","H","H","H","H","R","R","A","A","A","A","A","R","R",null,null,null,null,null,null,null,null,null,null,null,null,null,null,null,null,{"$f":"COUNTIF(AZ31:$CD31,$AY$1)","v":4}]
[28,10028,"جمال",null,null,null,null,null,null,null,null,null,"R","R","R","VAC","VAC","VAC","VAC","VAC","VAC","VAC","VAC","VAC","R","R","H","H","H","H","H","EXR","R","R","A","A","A","EXR","A","A","R","R","M","M","M","M","M","M","R","R",8,"H","H","H","H","H","H","R","R","A","A","A","A","A","R","R",null,null,null,null,null,null,null,null,null,null,null,null,null,null,null,null,{"$f":"COUNTIF(AZ32:$CD32,$AY$1)","v":4}]
[29,10029,"خالد",null,null,null,null,null,null,null,null,null,"R","R","R","A","R","R","M","M","M","M","M","M","R","R","H","H","H","H","EXR","H","R","R","A","A","A","A","EXR","A","R","R","M","M","M","M","M","M","R","R",8,"H","H","H","H","H","H","R","R","A","A","A","A","A","R","R",null,null,null,null,null,null,null,null,null,null,null,null,null,null,null,null,{"$f":"COUNTIF(AZ33:$CD33,$AY$1)","v":4}]
[30,10030,"مصعب",null,null,null,null,null,null,null,null,null,"R","R","R","A","R","R","VAC","VAC","VAC","VAC","VAC","VAC","R","R","H","H","H","EXR","H","H","R","R","A","A","A","A","A","EXR","R","R","M","M","M","M","M","M","R","R",8,"H","H","H","H","H","H","R","R","A","A","A","A","A","R","R",null,null,null,null,null,null,null,null,null,null,null,null,null,null,null,null,{"$f":"COUNTIF(AZ34:$CD34,$AY$1)","v":4}]
[31,10031,"سالم",null,null,null,null,null,null,null,null,null,"R","R","R","A","R","R","VAC","VAC","VAC","VAC","VAC","VAC","R","R","H","H","EXR","H","H","H","R","R","A","A","A","A","A","A","R","R","EXR","M","M","M","M","M","R","R",8,"H","H","H","H","H","H","R","R","A","A","A","A","A","R","R",null,null,null,null,null,null,null,null,null,null,null,null,null,null,null,null,{"$f":"COUNTIF(AZ35:$CD35,$AY$1)","v":4}]
[32,10032,"عفيفي",null,null,null,null,null,null,null,null,null,"R","R","R","A","R","R","VAC","VAC","VAC","VAC","VAC","VAC","R","R","H","EXR","H","H","H","H","R","R","A","A","A","A","A","A","R","R","M","EXR","M","M","M","M","R","R",8,"H","H","H","H","H","H","R","R","A","A","A","A","A","R","R",null,null,null,null,null,null,null,null,null,null,null,null,null,null,null,null,{"$f":"COUNTIF(AZ36:$CD36,$AY$1)","v":4}]
[33,10033,"محمود",null,null,null,null,null,null,null,null,null,"R","R","R","A","R","R","VAC","VAC","VAC","VAC","M","M","R","R","H","EXR","H","H","H","H","R","R","A","A","A","A","A","A","R","R","M","M","M","EXR","M","M","R","R",8,"H","H","H","H","H","H","R","R","A","A","A","A","A","R","R",null,null,null,null,null,null,null,null,null,null,null,null,null,null,null,null,{"$f":"COUNTIF(AZ37:$CD37,$AY$1)","v":4}]
[34,10034,"جمال",null,null,null,null,null,null,null,null,null,"R","R","R","A","R","R","VAC","VAC","VAC","VAC","M","M","R","R","H","H","EXR","H","H","H","R","R","A","A","A","A","A","A","R","R","M","M","M","M","EXR","M","R","R",8,"H","H","H","H","H","H","R","R","A","A","A","A","A","R","R",null,null,null,null,null,null,null,null,null,null,null,null,null,null,null,null,{"$f":"COUNTIF(AZ38:$CD38,$AY$1)","v":4}]
[35,10035,"خالد",null,null,null,null,null,null,null,null,null,"R","R","R","VAC","R","R","VAC","VAC","VAC","VAC","VAC","VAC","R","R","H","H","H","EXR","H","H","R","R","A","A","A","A","A","A","R","R","M","M","M","M","M","EXR","R","R",8,"H","H","H","H","H","H","R","R","A","A","A","A","A","R","R",null,null,null,null,null,null,null,null,null,null,null,null,null,null,null,null,{"$f":"COUNTIF(AZ39:$CD39,$AY$1)","v":4}]
[36,10036,"مصعب",null,null,null,null,null,null,null,null,null,"R","R","R","A","R","R","VAC","VAC","VAC","VAC","M","M","R","R","H","H","H","H","EXR","H","R","R","A","A","A","A","A","A","R","R","M","M","M","M","EXR","M","R","R",8,"H","H","H","H","H","H","R","R","A","A","A","A","A","R","R",null,null,null,null,null,null,null,null,null,null,null,null,null,null,null,null,{"$f":"COUNTIF(AZ40:$CD40,$AY$1)","v":4}]
[37,10037,"سالم",null,null,null,null,null,null,null,null,null,"R","R","R","A","R","R","VAC","VAC","VAC","VAC","VAC","VAC","R","R","H","H","H","H","H","EXR","R","R","A","A","A","A","A","A","R","R","M","M","M","EXR","M","M","R","R",8,"H","H","H","H","H","H","R","R","A","A","A","A","A","R","R",null,null,null,null,null,null,null,null,null,null,null,null,null,null,null,null,{"$f":"COUNTIF(AZ41:$CD41,$AY$1)","v":4}]
[38,10038,"عفيفي",null,null,null,null,null,null,null,null,null,"R","R","R","VAC","VAC","VAC","VAC","VAC","VAC","VAC","VAC","VAC","VAC","VAC","VAC","VAC","VAC","H","EXR","H","R","R","A","A","A","A","A","A","R","R","M","M","EXR","M","M","M","R","R",6,"H","H","H","H","H","H","R","R","A","A","A","A","A","R","R",null,null,null,null,null,null,null,null,null,null,null,null,null,null,null,null,{"$f":"COUNTIF(AZ42:$CD42,$AY$1)","v":4}]
[39,10039,"محمود",null,null,null,null,null,null,null,null,null,"R","R","R","A","R","R","VAC","VAC","VAC","VAC","VAC","VAC","R","R","H","H","H","EXR","H","H","R","R","A","A","A","A","A","A","R","R","M","EXR","M","M","M","M","R","R",8,"H","H","H","H","H","H","R","R","A","A","A","A","A","R","R",null,null,null,null,null,null,null,null,null,null,null,null,null,null,null,null,{"$f":"COUNTIF(AZ43:$CD43,$AY$1)","v":4}]
[40,10040,"جمال",null,null,null,null,null,null,null,null,null,"R","R","R","A","R","R","VAC","VAC","VAC","VAC","VAC","VAC","R","R","H","EXR","H","H","H","H","R","R","A","A","A","A","A","EXR","R","R","M","M","M","M","M","M","R","R",8,"H","H","H","H","H","H","R","R","A","A","A","A","A","R","R",null,null,null,null,null,null,null,null,null,null,null,null,null,null,null,null,{"$f":"COUNTIF(AZ44:$CD44,$AY$1)","v":4}]
[41,10041,"خالد",null,null,null,null,null,null,null,null,null,"VAC","VAC","VAC","VAC","VAC","VAC","VAC","VAC","VAC","VAC","VAC","VAC","VAC","VAC","VAC","H","H","H","H","H","R","R","A","A","A","A","EXR","A","R","R","M","M","M","M","M","M","R","R",6,"H","H","H","H","H","H","R","R","A","A","A","A","A","R","R",null,null,null,null,null,null,null,null,null,null,null,null,null,null,null,null,{"$f":"COUNTIF(AZ45:$CD45,$AY$1)","v":4}]
[42,10042,"مصعب",null,null,null,null,null,null,null,null,null,"R","R","R","A","R","R","VAC","VAC","VAC","VAC","VAC","VAC","R","R","H","EXR","H","H","H","H","R","R","A","A","A","EXR","A","A","R","R","M","M","M","M","M","M","R","R",8,"H","H","H","H","H","H","R","R","A","A","A","A","A","R","R",null,null,null,null,null,null,null,null,null,null,null,null,null,null,null,null,{"$f":"COUNTIF(AZ46:$CD46,$AY$1)","v":4}]
[43,10043,"سالم",null,null,null,null,null,null,null,null,null,"R","R","R","A","R","R","VAC","VAC","VAC","VAC","VAC","VAC","R","R","H","H","EXR","H","H","H","R","R","A","A","EXR","A","A","A","R","R","M","M","M","M","M","M","R","R",8,"H","H","H","H","H","H","R","R","A","A","A","A","A","R","R",null,null,null,null,null,null,null,null,null,null,null,null,null,null,null,null,{"$f":"COUNTIF(AZ47:$CD47,$AY$1)","v":4}]
[44,10044,"عفيفي",null,null,null,null,null,null,null,null,null,"R","R","R","VAC","VAC","VAC","VAC","VAC","VAC","VAC","M","M","R","R","H","H","H","EXR","H","H","R","R","A","EXR","A","A","A","A","R","R","M","M","M","M","M","M","R","R",8,"H","H","H","H","H","H","R","R","A","A","A","A","A","R","R",null,null,null,null,null,null,null,null,null,null,null,null,null,null,null,null,{"$f":"COUNTIF(AZ48:$CD48,$AY$1)","v":4}]
[45,10045,"محمود",null,null,null,null,null,null,null,null,null,"R","R","R","A","R","R","VAC","VAC","VAC","VAC","VAC","VAC","R","R","H","H","H","H","EXR","H","R","R","EXR","A","A","A","A","A","R","R","M","M","M","M","M","M","R","R",8,"H","H","H","H","H","H","R","R","A","A","A","A","A","R","R",null,null,null,null,null,null,null,null,null,null,null,null,null,null,null,null,{"$f":"COUNTIF(AZ49:$CD49,$AY$1)","v":4}]
[46,10046,"جمال",null,null,null,null,null,null,null,null,null,"R","R","R","VAC","VAC","VAC","VAC","VAC","VAC","VAC","VAC","VAC","R","R","H","H","H","H","H","EXR","R","R","A","EXR","A","A","A","A","R","R","M","M","M","M","M","M","R","R",8,"H","H","H","H","H","H","R","R","A","A","A","A","A","R","R",null,null,null,null,null,null,null,null,null,null,null,null,null,null,null,null,{"$f":"COUNTIF(AZ50:$CD50,$AY$1)","v":4}]
[47,10047,"خالد",null,null,null,null,null,null,null,null,null,"R","R","R","A","R","R","VAC","VAC","VAC","VAC","VAC","VAC","R","R","H","H","H","H","EXR","H","R","R","A","A","EXR","A","A","A","R","R","M","M","M","M","M","M","R","R",8,"H","H","H","H","H","H","R","R","A","A","A","A","A","R","R",null,null,null,null,null,null,null,null,null,null,null,null,null,null,null,null,{"$f":"COUNTIF(AZ51:$CD51,$AY$1)","v":4}]
[48,10048,"مصعب",null,null,null,null,null,null,null,null,null,"R","R","R","A","R","R","VAC","VAC","VAC","VAC","VAC","VAC","R","R","H","H","EXR","H","H","H","R","R","A","A","A","A","EXR","A","R","R","M","M","M","M","M","M","R","R",8,"H","H","H","H","H","H","R","R","A","A","A","A","A","R","R",null,null,null,null,null,null,null,null,null,null,null,null,null,null,null,null,{"$f":"COUNTIF(AZ52:$CD52,$AY$1)","v":4}]
[]
[1,10049,"سالم",null,0,0,0,0,0,0,0,0,"R","R","R","M","M","M","R","R","H","H","H","H","H","H","R","EXR","A","A","A","A","A","A","R","R","M","M","M","M","EXR","M","R","R","H","H","H","EXR","H","H",7,"R","R","A","A","A","A","A","A","R","R","M","M","M","M","M","M",null,null,null,null,null,null,null,null,null,null,null,null,null,null,null,4,0,0,0,0,0,0,0,0,0,0,0,0,0,0,0,0,0,0,0,0,0,0,0,0,0,0,0,0,0,0,0,0,0,0,0,0,0,0,0,0,0,0,0,0,0,0,0,0,0,0,0,0,0,0,0,0,0,0,0,0,0,0,0,0,0,0,0,0,0,0,0,0,0,0,0,0,0,0,0,0,0,0,0,0,0,0,0,0,0,0,0,0,0,0,0,0,0,0,0,0,0,0,0,0,0,0,0,0,0,0,0,0,0,0,0,0,0,0,0,0,0,0,0,0,0,0,0,0,0,0,0,0,0,0,0,0,0,0,0,0,0]
[{"$f":"A54+1","v":2},10050,"عفيفي",null,null,null,null,null,null,null,null,null,"R","R","R","M","M","M","R","R","H","H","H","H","H","H","R","R","A","EXR","A","A","A","A","R","R","M","M","M","M","M","EXR","R","R","H","H","H","H","EXR","H",{"$f":"COUNTIF($T55:$AX55,$AY$1)","v":7},"R","R","A","A","A","A","A","A","R","R","M","M","M","M","M","M",null,null,null,null,null,null,null,null,null,null,null,null,null,null,null,{"$f":"COUNTIF(AZ55:$CD55,$AY$1)","v":4}]
[{"$f":"A55+1","v":3},10051,"محمود",null,null,null,null,null,null,null,null,null,"R","R","R","VAC","VAC","VAC","VAC","VAC","VAC","VAC","VAC","VAC","VAC","VAC","R","R","A","A","EXR","A","A","A","R","R","M","M","M","M","EXR","M","R","R","H","H","H","H","H","EXR",6,"R","R","A","A","A","A","A","A","R","R","M","M","M","M","M","M",null,null,null,null,null,null,null,null,null,null,null,null,null,null,null,{"$f":"COUNTIF(AZ56:$CD56,$AY$1)","v":4}]
[4,10052,"جمال",null,null,null,null,null,null,null,null,null,"R","R","R","VAC","VAC","VAC","R","R","H","H","H","H","H","H","R","R","VAC","VAC","VAC","VAC","VAC","VAC","R","R","M","M","M","EXR","M","M","R","R","H","H","H","H","EXR","H",7,"R","R","A","A","A","A","A","A","R","R","M","M","M","M","M","M",null,null,null,null,null,null,null,null,null,null,null,null,null,null,null,{"$f":"COUNTIF(AZ57:$CD57,$AY$1)","v":4}]
[5,10053,"خالد",null,null,null,null,null,null,null,null,null,"R","R","R","VAC","VAC","VAC","VAC","VAC","VAC","VAC","VAC","VAC","VAC","VAC","VAC","VAC","VAC","VAC","VAC","VAC","VAC","A","R","R","M","M","EXR","M","M","M","R","R","H","H","H","EXR","H","H",4,"R","R","A","A","A","A","A","A","R","R","M","M","M","M","M","M",null,null,null,null,null,null,null,null,null,null,null,null,null,null,null,{"$f":"COUNTIF(AZ58:$CD58,$AY$1)","v":4}]
[6,10054,"مصعب",null,null,null,null,null,null,null,null,null,"R","R","R","VAC","VAC","VAC","VAC","VAC","VAC","VAC","VAC","VAC","VAC","VAC","R","R","A","A","A","A","A","EXR","R","R","M","EXR","M","M","M","M","R","R","H","H","EXR","H","H","H",6,"R","R","A","A","A","A","A","A","R","R","M","M","M","M","M","M",null,null,null,null,null,null,null,null,null,null,null,null,null,null,null,{"$f":"COUNTIF(AZ59:$CD59,$AY$1)","v":4}]
[7,10055,"سالم",null,null,null,null,null,null,null,null,null,"R","R","R","VAC","VAC","VAC","VAC","VAC","VAC","VAC","VAC","VAC","VAC","H","R","R","A","A","A","A","EXR","A","R","R","EXR","VAC","VAC","VAC","VAC","VAC","VAC","VAC","VAC","VAC","VAC","VAC","VAC","VAC",4,"R","R","A","A","A","A","A","A","R","R","M","M","M","M","M","M",null,null,null,null,null,null,null,null,null,null,null,null,null,null,null,{"$f":"COUNTIF(AZ60:$CD60,$AY$1)","v":4}]
[8,10056,"عفيفي",null,null,null,null,null,null,null,null,null,"R","R","R","VAC","VAC","VAC","VAC","VAC","VAC","VAC","VAC","VAC","VAC","VAC","R","R","A","A","A","EXR","A","A","R","R","M","EXR","M","M","M","M","R","R","EXR","H","H","H","H","H",6,"R","R","A","A","A","A","A","A","R","R","M","M","M","M","M","M",null,null,null,null,null,null,null,null,null,null,null,null,null,null,null,{"$f":"COUNTIF(AZ61:$CD61,$AY$1)","v":4}]
[9,10057,"محمود",null,0,0,0,0,0,0,0,0,"R","R","R","M","M","M","R","R","H","H","H","H","H","H","R","R","A","A","A","EXR","A","EXR","R","R","M","M","M","M","M","M","R","R","EXR","H","H","H","H","H",10,"R","R","A","A","A","A","A","A","R","R","M","M","M","M","M","M"]
[10,10058,"جمال",null,null,null,null,null,null,null,null,null,"R","R","R","VAC","VAC","VAC","VAC","VAC","VAC","VAC","VAC","VAC","VAC","VAC","VAC","VAC","VAC","VAC","EXR","A","A","A","R","R","M","M","EXR","M","M","M","R","R","H","EXR","H","H","H","H",{"$f":"COUNTIF($T63:$AX63,$AY$1)","v":4},"R","R","A","A","A","A","A","A","R","R","M","M","M","M","M","M",null,null,null,null,null,null,null,null,null,null,null,null,null,null,null,{"$f":"COUNTIF(AZ63:$CD63,$AY$1)","v":4}]
[11,10059,"خالد",null,null,null,null,null,null,null,null,null,"R","R","R","VAC","VAC","VAC","R","R","H","H","H","H","H","H","R","R","A","EXR","A","A","A","A","R","R","M","M","M","EXR","M","M","R","R","H","H","EXR","H","H","H",7,"R","R","A","A","A","A","A","A","R","R","M","M","M","M","M","M",null,null,null,null,null,null,null,null,null,null,null,null,null,null,null,{"$f":"COUNTIF(AZ64:$CD64,$AY$1)","v":4}]
[12,10060,"مصعب",null,null,null,null,null,null,null,null,null,"R","R","R","VAC","VAC","VAC","VAC","VAC","R","R","A","A","A","A","A","A","EXR","EXR","A","A","A","A","R","R","EXR","M","M","M","M","M","R","R","EXR","H","H","H","H","H",6,"R","R","A","A","A","A","A","A","R","R","M","M","M","M","M","M",null,null,null,null,null,null,null,null,null,null,null,null,null,null,null,{"$f":"COUNTIF(AZ65:$CD65,$AY$1)","v":4}]
[13,10061,"سالم",null,null,null,null,null,null,null,null,null,"R","R","R","VAC","VAC","VAC","VAC","VAC","VAC","VAC","VAC","VAC","VAC","VAC","R","R","EXR","A","A","A","A","A","R","R","M","M","M","M","EXR","M","R","R","H","H","H","EXR","H","H",6,"R","R","A","A","A","A","A","A","R","R","M","M","M","M","M","M",null,null,null,null,null,null,null,null,null,null,null,null,null,null,null,{"$f":"COUNTIF(AZ66:$CD66,$AY$1)","v":4}]
[14,10062,"عفيفي",null,null,null,null,null,null,null,null,null,"R","R","R","VAC","VAC","VAC","R","R","H","H","H","H","H","H","R","R","A","EXR","A","A","A","A","R","R","M","M","M","M","M","EXR","R","R","H","H","H","H","EXR","H",7,"R","R","A","A","A","A","A","A","R","R","M","M","M","M","M","M",null,null,null,null,null,null,null,null,null,null,null,null,null,null,null,{"$f":"COUNTIF(AZ67:$CD67,$AY$1)","v":4}]
[15,10063,"محمود",null,null,null,null,null,null,null,null,null,"R","R","R","VAC","VAC","VAC","VAC","VAC","VAC","VAC","VAC","VAC","VAC","VAC","R","R","A","A","A","EXR","A","A","R","R","M","M","M","EXR","M","M","R","R","H","H","H","H","EXR","H",6,"R","R","A","A","A","A","A","A","R","R","M","M","M","M","M","M",null,null,null,null,null,null,null,null,null,null,null,null,null,null,null,{"$f":"COUNTIF(AZ68:$CD68,$AY$1)","v":4}]
[16,10064,"جمال",null,0,0,0,0,0,0,0,0,"R","R","R","M","M","M","R","R","VAC","VAC","VAC","VAC","VAC","VAC","R","R","A","A","A","EXR","A","A","R","R","M","M","EXR","M","M","M","R","R","H","H","H","EXR","H","H",10,"R","R","A","A","A","A","A","A","R","R","M","M","M","M","M","M"]
[17,10065,"خالد",null,null,null,null,null,null,null,null,null,"R","R","R","VAC","VAC","VAC","VAC","VAC","VAC","VAC","VAC","VAC","VAC","VAC","R","R","A","A","A","A","EXR","A","R","R","EXR","M","M","M","M","M","R","R","H","EXR","H","H","H","H",{"$f":"COUNTIF($T70:$AX70,$AY$1)","v":6},"R","R","A","A","A","A","A","A","R","R","M","M","M","M","M","M",null,null,null,null,null,null,null,null,null,null,null,null,null,null,null,{"$f":"COUNTIF(AZ70:$CD70,$AY$1)","v":4}]
[18,10066,"مصعب",null,0,0,0,0,0,0,0,0,"R","R","R","VAC","VAC","VAC","R","R","H","H","H","H","H","H","R","R","A","A","A","A","A","A","R","R","EXR","EXR","M","M","M","M","R","R","EXR","H","H","H","H","H",10,"R","R","A","A","A","A","A","A","R","R","M","M","M","M","M","M",null,null,null,null,null,null,null,null,null,null,null,null,null,null,null,4,0,0,0,0,0,0,0,0,0,0,0,0,0,0,0,0,0,0,0,0,0,0,0,0,0,0,0,0,0,0,0,0,0,0,0,0,0,0,0,0,0,0,0,0,0,0,0,0,0,0,0,0,0,0,0,0,0,0,0,0,0,0,0,0,0,0,0,0,0,0,0,0,0,0,0,0,0,0,0,0,0,0,0,0,0,0,0,0,0,0,0,0,0,0,0,0,0,0,0,0,0,0,0,0,0,0,0,0,0,0,0,0,0,0,0,0,0,0,0,0,0,0,0,0,0,0,0,0,0,0,0,0,0,0,0,0,0,0,0,0,0]
[19,10067,"سالم",null,null,null,null,null,null,null,null,null,"R","R","R","VAC","VAC","VAC","VAC","VAC","VAC","VAC","VAC","VAC","VAC","VAC","R","R","A","A","EXR","A","A","A","R","R","M","M","EXR","M","M","M","R","R","H","EXR","H","H","H","H",{"$f":"COUNTIF($T72:$AX72,$AY$1)","v":6},"R","R","A","A","A","A","A","A","R","R","M","M","M","M","M","M",null,null,null,null,null,null,null,null,null,null,null,null,null,null,null,{"$f":"COUNTIF(AZ72:$CD72,$AY$1)","v":4}]
[20,10068,"عفيفي",null,null,null,null,null,null,null,null,null,"R","R","R","M","M","M","R","R","H","H","H","H","H","H","R","R","A","EXR","A","A","A","A","R","R","M","M","M","EXR","M","M","R","R","H","H","EXR","H","H","H",{"$f":"COUNTIF($T73:$AX73,$AY$1)","v":7},"R","R","A","A","A","A","A","A","R","R","M","M","M","M","M","M",null,null,null,null,null,null,null,null,null,null,null,null,null,null,null,{"$f":"COUNTIF(AZ73:$CD73,$AY$1)","v":4}]
[21,10069,"محمود",null,0,0,0,0,0,0,0,0,"R","R","R","VAC","VAC","VAC","R","R","H","H","H","H","H","H","R","R","A","A","A","A","A","EXR","R","R","M","M","VAC","M","EXR","M","R","R","H","H","H","EXR","H","H",10,"R","R","A","A","A","A","A","A","R","R","M","M","M","M","M","M"]
[22,10070,"جمال",null,0,0,0,0,0,0,0,0,"R","R","R","VAC","VAC","VAC","R","R","H","H","H","H","H","H","R","R","A","A","A","A","A","EXR","R","R","M","M","M","M","M","EXR","R","R","H","H","H","H","EXR","H",10,"R","R","A","A","A","A","A","A","R","R","M","M","M","M","M","M"]
[23,10071,"خالد",null,null,null,null,null,null,null,null,null,"R","R","R","VAC","VAC","VAC","VAC","VAC","VAC","VAC","VAC","VAC","VAC","VAC","R","R","EXR","A","A","A","A","A","R","R","EXR","M","M","M","M","M","R","R","H","EXR","H","H","H","H",{"$f":"COUNTIF($T76:$AX76,$AY$1)","v":6},"R","R","A","A","A","A","A","A","R","R","M","M","M","M","M","M",null,null,null,null,null,null,null,null,null,null,null,null,null,null,null,{"$f":"COUNTIF(AZ76:$CD76,$AY$1)","v":4}]
[24,10072,"مصعب",null,null,null,null,null,null,null,null,null,"R","R","R","VAC","VAC","VAC","R","R","VAC","VAC","VAC","VAC","VAC","VAC","R","R","A","A","EXR","A","A","A","R","R","M","M","M","M","EXR","M","R","R","H","H","H","H","H","EXR",{"$f":"COUNTIF($T77:$AX77,$AY$1)","v":7},"R","R","A","A","A","A","A","A","R","R","M","M","M","M","M","M",null,null,null,null,null,null,null,null,null,null,null,null,null,null,null,{"$f":"COUNTIF(AZ77:$CD77,$AY$1)","v":4}]
[25,10073,"سالم",null,0,0,0,0,0,0,0,0,"R","R","R","VAC","VAC","VAC","R","R","VAC","VAC","VAC","VAC","VAC","VAC","R","R","A","A","A","EXR","A","A","R","R","M","EXR","EXR","M","M","M","R","R","H","H","H","H","H","H",7,"R","R","A","A","A","A","A","A","R","R","M","M","M","M","M","M",null,null,null,null,null,null,null,null,null,null,null,null,null,null,null,4,0,0,0,0,0,0,0,0,0,0,0,0,0,0,0,0,0,0,0,0,0,0,0,0,0,0,0,0,0,0,0,0,0,0,0,0,0,0,0,0,0,0,0,0,0,0,0,0,0,0,0,0,0,0,0,0,0,0,0,0,0,0,0,0,0,0,0,0,0,0,0,0,0,0,0,0,0,0,0,0,0,0,0,0,0,0,0,0,0,0,0,0,0,0,0,0,0,0,0,0,0,0,0,0,0,0,0,0,0,0,0,0,0,0,0,0,0,0,0,0,0,0,0,0,0,0,0,0,0,0,0,0,0,0,0,0,0,0,0,0,0]
[26,10074,"عفيفي",null,null,null,null,null,null,null,null,null,"R","R","R","VAC","VAC","VAC","VAC","VAC","VAC","VAC","VAC","VAC","VAC","VAC","VAC","VAC","VAC","VAC","VAC","VAC","VAC","VAC","R","R","M","M","EXR","M","M","M","R","R","H","H","H","EXR","H","H",{"$f":"COUNTIF($T79:$AX79,$AY$1)","v":4},"R","R","A","A","A","A","A","A","R","R","M","M","M","M","M","M",null,null,null,null,null,null,null,null,null,null,null,null,null,null,null,{"$f":"COUNTIF(AZ79:$CD79,$AY$1)","v":4}]
[27,10075,"محمود",null,0,0,0,0,0,0,0,0,"R","R","R","VAC","VAC","VAC","R","R","H","H","H","H","H","H","R","R","A","A","EXR","EXR","A","EXR","R","R","M","M","M","M","M","M","R","R","H","H","EXR","H","H","H",11,"R","R","A","A","A","A","A","A","R","R","M","M","M","M","M","M",null,null,null,null,null,null,null,null,null,null,null,null,null,null,null,{"$f":"COUNTIF(AZ80:$CD80,$AY$1)","v":4}]
[28,10076,"جمال",null,null,null,null,null,null,null,null,null,"R","R","R","VAC","VAC","VAC","VAC","VAC","VAC","VAC","VAC","VAC","VAC","VAC","R","R","A","A","A","A","EXR","A","R","R","EXR","M","M","M","M","M","R","R","H","EXR","H","H","H","H",{"$f":"COUNTIF($T81:$AX81,$AY$1)","v":6},"R","R","A","A","A","A","A","A","R","R","M","M","M","M","M","M",null,null,null,null,null,null,null,null,null,null,null,null,null,null,null,{"$f":"COUNTIF(AZ81:$CD81,$AY$1)","v":4}]
[29,10077,"خالد",null,null,null,null,null,null,null,null,null,"R","R","R","VAC","VAC","VAC","VAC","VAC","VAC","VAC","VAC","VAC","VAC","VAC","R","R","A","A","A","EXR","A","A","R","R","M","EXR","M","M","M","M","R","R","EXR","H","H","H","H","H",6,"R","R","A","A","A","A","A","A","R","R","M","M","M","M","M","M",null,null,null,null,null,null,null,null,null,null,null,null,null,null,null,{"$f":"COUNTIF(AZ82:$CD82,$AY$1)","v":4}]
[30,10078,"مصعب",null,null,null,null,null,null,null,null,null,"R","R","R","VAC","VAC","VAC","VAC","VAC","VAC","VAC","VAC","VAC","VAC","VAC","R","R","A","A","EXR","A","A","A","R","R","M","M","EXR","M","M","M","R","R","H","EXR","H","H","H","H",6,"R","R","A","A","A","A","A","A","R","R","M","M","M","M","M","M",null,null,null,null,null,null,null,null,null,null,null,null,null,null,null,{"$f":"COUNTIF(AZ83:$CD83,$AY$1)","v":4}]
[31,10079,"سالم",null,0,0,0,0,0,0,0,0,"R","R","R","VAC","VAC","VAC","R","R","VAC","VAC","VAC","VAC","VAC","VAC","VAC","VAC","VAC","VAC","VAC","VAC","VAC","VAC","R","R","EXR","EXR","M","M","M","M","R","R","H","H","H","H","H","H",5,"R","R","A","A","A","A","A","A","R","R","M","M","M","M","M","M",null,null,null,null,null,null,null,null,null,null,null,null,null,null,null,4,0,0,0,0,0,0,0,0,0,0,0,0,0,0,0,0,0,0,0,0,0,0,0,0,0,0,0,0,0,0,0,0,0,0,0,0,0,0,0,0,0,0,0,0,0,0,0,0,0,0,0,0,0,0,0,0,0,0,0,0,0,0,0,0,0,0,0,0,0,0,0,0,0,0,0,0,0,0,0,0,0,0,0,0,0,0,0,0,0,0,0,0,0,0,0,0,0,0,0,0,0,0,0,0,0,0,0,0,0,0,0,0,0,0,0,0,0,0,0,0,0,0,0,0,0,0,0,0,0,0,0,0,0,0,0,0,0,0,0,0,0]
[32,10080,"عفيفي",null,null,null,null,null,null,null,null,null,"R","R","R","VAC","VAC","VAC","VAC","VAC","VAC","VAC","VAC","VAC","VAC","VAC","R","R","EXR","A","A","A","A","A","R","R","M","M","M","M","EXR","M","R","R","H","H","H","EXR","H","H",6,"R","R","A","A","A","A","A","A","R","R","M","M","M","M","M","M",null,null,null,null,null,null,null,null,null,null,null,null,null,null,null,{"$f":"COUNTIF(AZ85:$CD85,$AY$1)","v":4}]
[33,10081,"محمود",null,null,null,null,null,null,null,null,null,"R","R","R","VAC","VAC","VAC","R","R","H","H","H","H","H","H","R","R","A","A","EXR","A","A","A","R","R","M","M","M","M","M","EXR","R","R","H","H","H","H","H","EXR",7,"R","R","A","A","A","A","A","A","R","R","M","M","M","M","M","M",null,null,null,null,null,null,null,null,null,null,null,null,null,null,null,{"$f":"COUNTIF(AZ86:$CD86,$AY$1)","v":4}]
[34,10082,"جمال",null,null,null,null,null,null,null,null,null,"R","R","R","VAC","VAC","VAC","VAC","VAC","VAC","VAC","VAC","VAC","VAC","VAC","R","R","A","A","EXR","A","A","A","R","R","M","M","M","M","EXR","M","R","R","H","H","H","H","H","EXR",6,"R","R","A","A","A","A","A","A","R","R","M","M","M","M","M","M",null,null,null,null,null,null,null,null,null,null,null,null,null,null,null,{"$f":"COUNTIF(AZ87:$CD87,$AY$1)","v":4}]
[35,10083,"خالد",null,0,0,0,0,0,0,0,0,"R","R","R","VAC","VAC","VAC","R","R","H","H","H","H","H","H","R","R","A","A","A","EXR","A","A","R","R","EXR","M","M","M","M","M","R","R","H","H","H","H","EXR","H",10,"R","R","A","A","A","A","A","A","R","R","M","M","M","M","M","M",null,null,null,null,null,null,null,null,null,null,null,null,null,null,null,4,0,0,0,0,0,0,0,0,0,0,0,0,0,0,0,0,0,0,0,0,0,0,0,0,0,0,0,0,0,0,0,0,0,0,0,0,0,0,0,0,0,0,0,0,0,0,0,0,0,0,0,0,0,0,0,0,0,0,0,0,0,0,0,0,0,0,0,0,0,0,0,0,0,0,0,0,0,0,0,0,0,0,0,0,0,0,0,0,0,0,0,0,0,0,0,0,0,0,0,0,0,0,0,0,0,0,0,0,0,0,0,0,0,0,0,0,0,0,0,0,0,0,0,0,0,0,0,0,0,0,0,0,0,0,0,0,0,0,0,0,0]
[36,10084,"مصعب",null,0,0,0,0,0,0,0,0,"R","R","R","VAC","VAC","VAC","R","R","H","H","H","H","H","H","R","R","A","A","A","A","EXR","EXR","R","R","M","M","M","M","M","M","R","R","H","H","H","EXR","H","H",10,"R","R","A","A","A","A","A","A","R","R","M","M","M","M","M","M"]
[37,10085,"سالم",null,null,null,null,null,null,null,null,null,"R","R","R","VAC","VAC","VAC","VAC","VAC","VAC","VAC","VAC","VAC","VAC","VAC","R","R","A","A","A","A","A","EXR","R","R","M","EXR","M","M","M","M","R","R","H","H","EXR","H","H","H",{"$f":"COUNTIF($T90:$AX90,$AY$1)","v":6},"R","R","A","A","A","A","A","A","R","R","M","M","M","M","M","M",null,null,null,null,null,null,null,null,null,null,null,null,null,null,null,{"$f":"COUNTIF(AZ90:$CD90,$AY$1)","v":4}]
[38,10086,"عفيفي",null,0,0,0,0,0,0,0,0,"R","R","R","VAC","VAC","VAC","R","R","H","H","H","H","H","H","R","R","A","A","A","EXR","A","A","R","R","EXR","M","M","M","M","M","R","R","EXR","H","H","H","H","H",10,"R","R","A","A","A","A","A","A","R","R","M","M","M","M","M","M",null,null,null,null,null,null,null,null,null,null,null,null,null,null,null,4,0,0,0,0,0,0,0,0,0,0,0,0,0,0,0,0,0,0,0,0,0,0,0,0,0,0,0,0,0,0,0,0,0,0,0,0,0,0,0,0,0,0,0,0,0,0,0,0,0,0,0,0,0,0,0,0,0,0,0,0,0,0,0,0,0,0,0,0,0,0,0,0,0,0,0,0,0,0,0,0,0,0,0,0,0,0,0,0,0,0,0,0,0,0,0,0,0,0,0,0,0,0,0,0,0,0,0,0,0,0,0,0,0,0,0,0,0,0,0,0,0,0,0,0,0,0,0,0,0,0,0,0,0,0,0,0,0,0,0,0,0]
[39,10087,"محمود",null,null,null,null,null,null,null,null,null,"R","R","R","VAC","VAC","VAC","R","R","H","H","H","H","H","H","R","R","VAC","VAC","EXR","A","A","A","R","R","M","M","EXR","M","M","M","R","R","H","EXR","H","H","H","H",{"$f":"COUNTIF($T92:$AX92,$AY$1)","v":7},"R","R","A","A","A","A","A","A","R","R","M","M","M","M","M","M",null,null,null,null,null,null,null,null,null,null,null,null,null,null,null,{"$f":"COUNTIF(AZ92:$CD92,$AY$1)","v":4}]
[40,10088,"جمال",null,null,null,null,null,null,null,null,null,"R","R","R","VAC","VAC","VAC","VAC","VAC","VAC","VAC","VAC","VAC","VAC","VAC","R","R","A","A","A","A","A","A","R","R","M","EXR","M","M","M","M","R","R","H","EXR","H","H","H","H",{"$f":"COUNTIF($T93:$AX93,$AY$1)","v":6},"R","R","A","A","A","A","A","A","R","R","M","M","M","M","M","M",null,null,null,null,null,null,null,null,null,null,null,null,null,null,null,{"$f":"COUNTIF(AZ93:$CD93,$AY$1)","v":4}]
[41,10089,"خالد",null,null,null,null,null,null,null,null,null,"R","R","R","VAC","VAC","VAC","VAC","VAC","VAC","VAC","VAC","VAC","VAC","VAC","R","R","A","EXR","A","A","A","A","R","R","M","M","M","EXR","M","M","R","R","H","H","EXR","H","H","H",{"$f":"COUNTIF($T94:$AX94,$AY$1)","v":6},"R","R","A","A","A","A","A","A","R","R","M","M","M","M","M","M",null,null,null,null,null,null,null,null,null,null,null,null,null,null,null,{"$f":"COUNTIF(AZ94:$CD94,$AY$1)","v":4}]
[42,10090,"مصعب",null,null,null,null,null,null,null,null,null,"R","R","R","VAC","VAC","VAC","VAC","VAC","VAC","VAC","VAC","VAC","VAC","VAC","R","R","EXR","A","A","A","A","A","R","R","M","M","M","M","EXR","M","R","R","H","H","H","EXR","H","H",{"$f":"COUNTIF($T95:$AX95,$AY$1)","v":6},"R","R","A","A","A","A","A","A","R","R","M","M","M","M","M","M",null,null,null,null,null,null,null,null,null,null,null,null,null,null,null,{"$f":"COUNTIF(AZ95:$CD95,$AY$1)","v":4}]
[43,10091,"سالم",null,null,null,null,null,null,null,null,null,"R","R","R","VAC","VAC","VAC","VAC","VAC","VAC","VAC","VAC","VAC","VAC","VAC","R","R","A","EXR","A","A","A","A","R","R","M","M","M","M","M","EXR","R","R","H","H","H","H","EXR","H",{"$f":"COUNTIF($T96:$AX96,$AY$1)","v":6},"R","R","A","A","A","A","A","A","R","R","M","M","M","M","M","M",null,null,null,null,null,null,null,null,null,null,null,null,null,null,null,{"$f":"COUNTIF(AZ96:$CD96,$AY$1)","v":4}]
[44,10092,"عفيفي",null,0,0,0,0,0,0,0,0,"R","R","R","M","M","M","R","R","H","H","H","H","H","H","R","R","A","A","EXR","A","A","A","R","R","EXR","M","M","M","M","M","R","R","H","H","H","H","H","EXR",10,"R","R","A","A","A","A","A","A","R","R","M","M","M","M","M","M",null,null,null,null,null,null,null,null,null,null,null,null,null,null,null,4,0,0,0,0,0,0,0,0,0,0,0,0,0,0,0,0,0,0,0,0,0,0,0,0,0,0,0,0,0,0,0,0,0,0,0,0,0,0,0,0,0,0,0,0,0,0,0,0,0,0,0,0,0,0,0,0,0,0,0,0,0,0,0,0,0,0,0,0,0,0,0,0,0,0,0,0,0,0,0,0,0,0,0,0,0,0,0,0,0,0,0,0,0,0,0,0,0,0,0,0,0,0,0,0,0,0,0,0,0,0,0,0,0,0,0,0,0,0,0,0,0,0,0,0,0,0,0,0,0,0,0,0,0,0,0,0,0,0,0,0,0]
[45,10093,"محمود",null,null,null,null,null,null,null,null,null,"R","R","R","M","M","M","R","R","H","H","H","H","H","R","R","R","VAC","VAC","VAC","VAC","VAC","VAC","R","R","EXR","M","M","M","M","M","R","R","H","H","H","H","EXR","H",{"$f":"COUNTIF($T98:$AX98,$AY$1)","v":8},"R","R","A","A","A","A","A","A","R","R","M","M","M","M","M","M",null,null,null,null,null,null,null,null,null,null,null,null,null,null,null,{"$f":"COUNTIF(AZ98:$CD98,$AY$1)","v":4}]
[46,10094,"جمال",null,0,0,0,0,0,0,0,0,"R","R","R","M","M","M","R","R","VAC","VAC","VAC","VAC","VAC","VAC","R","R","A","A","EXR","EXR","A","A","R","R","M","M","M","M","M","M","R","R","H","H","H","EXR","H","H",10,"R","R","A","A","A","A","A","A","R","R","M","M","M","M","M","M"]
[47,10095,"خالد",null,null,null,null,null,null,null,null,null,"R","R","R","VAC","VAC","VAC","VAC","VAC","VAC","VAC","VAC","VAC","VAC","VAC","R","R","A","A","A","A","EXR","A","R","R","EXR","M","M","M","M","M","R","R","H","EXR","H","H","H","H",{"$f":"COUNTIF($T100:$AX100,$AY$1)","v":6},"R","R","A","A","A","A","A","A","R","R","M","M","M","M","M","M",null,null,null,null,null,null,null,null,null,null,null,null,null,null,null,{"$f":"COUNTIF(AZ100:$CD100,$AY$1)","v":4}]
[null,null,null,null,null,null,null,null,null,null,null,null,null,null,null,null,null,null,null,null,null,null,null,null,null,null,null,null,null,null,null,null,null,null,null,null,null,null,null,null,null,null,null,null,null,null,null,null,null,null,null,null,null,null,null,null,null,null,null,null,null,null,null,null,null,null,null,null,null,null,null,null,null,null,null,null,null,null,null,null,null,null,{"$f":"COUNTIF(AZ101:$CD101,$AY$1)","v":0}]
[1,10096,"خالد",null,null,null,null,null,null,null,null,null,"R","R","R","R","VAC","VAC","VAC","VAC","VAC","VAC","R","R","EXR","M","M","M","M","M","R","R","H","H","H","H","H","H","R","R","A","A","A","A","EXR","A","R","R","M","M",{"$f":"COUNTIF($T102:$AX102,$AY$1)","v":8},"M","M","M","M","R","R","H","H","H","H","H","H","R","R",null,null,null,null,null,null,null,null,null,null,null,null,null,null,null,null,null,{"$f":"COUNTIF(AZ102:$CD102,$AY$1)","v":4}]
[{"$f":"A102+1","v":2},10097,"مصعب",null,null,null,null,null,null,null,null,null,"R","R","R","R","A","A","A","A","A","A","R","R","M","EXR","M","M","M","M","R","R","H","H","H","H","H","H","R","R","A","A","A","A","A","EXR","R","R","M","M",8,"M","M","M","M","R","R","H","H","H","H","H","H","R","R",null,null,null,null,null,null,null,null,null,null,null,null,null,null,null,null,null,{"$f":"COUNTIF(AZ103:$CD103,$AY$1)","v":4}]
[{"$f":"A103+1","v":3},10098,"سالم",null,null,null,null,null,null,null,null,null,"R","R","R","R","VAC","VAC","VAC","VAC","VAC","VAC","R","R","M","M","EXR","M","M","M","R","R","H","H","H","H","H","H","R","R","A","A","A","A","EXR","A","R","R","M","M",8,"M","M","M","M","R","R","H","H","H","H","H","H","R","R",null,null,null,null,null,null,null,null,null,null,null,null,null,null,null,null,null,{"$f":"COUNTIF(AZ104:$CD104,$AY$1)","v":4}]
[4,10099,"عفيفي",null,null,null,null,null,null,null,null,null,"R","R","R","R","A","A","A","A","A","A","R","R","M","M","M","EXR","M","M","R","R","H","H","H","H","H","H","R","R","A","A","A","EXR","A","A","R","R","M","M",8,"M","M","M","M","R","R","H","H","H","H","H","H","R","R",null,null,null,null,null,null,null,null,null,null,null,null,null,null,null,null,null,{"$f":"COUNTIF(AZ105:$CD105,$AY$1)","v":4}]
[5,10100,"محمود",null,null,null,null,null,null,null,null,null,"R","R","R","R","VAC","VAC","VAC","VAC","VAC","VAC","VAC","VAC","VAC","VAC","VAC","VAC","VAC","VAC","R","R","EXR","H","H","H","H","H","R","R","A","A","EXR","A","A","A","R","R","M","M",6,"M","M","M","M","R","R","H","H","H","H","H","H","R","R",null,null,null,null,null,null,null,null,null,null,null,null,null,null,null,null,null,{"$f":"COUNTIF(AZ106:$CD106,$AY$1)","v":4}]
[6,10101,"جمال",null,null,null,null,null,null,null,null,null,"H","H","H","R","A","A","A","A","A","A","R","R","VAC","VAC","VAC","VAC","VAC","EXR","R","R","H","H","H","H","H","H","R","R","A","EXR","A","A","A","A","R","R","M","M",8,"M","M","M","M","R","R","H","H","H","H","H","H","R","R",null,null,null,null,null,null,null,null,null,null,null,null,null,null,null,null,null,{"$f":"COUNTIF(AZ107:$CD107,$AY$1)","v":4}]
[7,10102,"خالد",null,null,null,null,null,null,null,null,null,"R","R","R","R","VAC","VAC","VAC","VAC","VAC","VAC","R","R","M","M","M","M","EXR","M","R","R","H","H","H","H","H","H","R","R","EXR","A","A","A","A","A","R","R","M","M",8,"M","M","M","M","R","R","H","H","H","H","H","H","R","R",null,null,null,null,null,null,null,null,null,null,null,null,null,null,null,null,null,{"$f":"COUNTIF(AZ108:$CD108,$AY$1)","v":4}]
[8,10103,"مصعب",null,0,0,0,0,0,0,0,0,"R","R","R","VAC","VAC","VAC","VAC","VAC","VAC","VAC","R","R","M","M","M","M","M","M","R","R","H","H","H","H","H","H","R","R","A","EXR","A","A","A","A","R","R","M","M",7,"M","M","M","M","R","R","H","H","H","H","H","H","R","R"]
[9,10104,"سالم",null,null,null,null,null,null,null,null,null,"R","R","R","R","VAC","VAC","VAC","VAC","VAC","VAC","R","R","M","M","EXR","M","M","M","R","R","H","H","H","H","H","H","R","R","A","A","EXR","A","A","A","R","R","M","M",{"$f":"COUNTIF($T110:$AX110,$AY$1)","v":8},"M","M","M","M","R","R","H","H","H","H","H","H","R","R",null,null,null,null,null,null,null,null,null,null,null,null,null,null,null,null,null,{"$f":"COUNTIF(AZ110:$CD110,$AY$1)","v":4}]
[10,10105,"عفيفي",null,0,0,0,0,0,0,0,0,"R","R","R","R","VAC","VAC","VAC","VAC","VAC","VAC","R","R","M","M","M","M","M","M","R","R","H","H","H","H","H","EXR","R","R","A","A","A","A","A","A","R","R","EXR","M",8,"M","M","M","M","R","R","H","H","H","H","H","H","R","R",null,null,null,null,null,null,null,null,null,null,null,null,null,null,null,null,null,2,0,0,0,0,0,0,0,0,0,0,0,0,0,0,0,0,0,0,0,0,0,0,0,0,0,0,0,0,0,0,0,0,0,0,0,0,0,0,0,0,0,0,0,0,0,0,0,0,0,0,0,0,0,0,0,0,0,0,0,0,0,0,0,0,0,0,0,0,0,0,0,0,0,0,0,0,0,0,0,0,0,0,0,0,0,0,0,0,0,0,0,0,0,0,0,0,0,0,0,0,0,0,0,0,0,0,0,0,0,0,0,0,0,0,0,0,0,0,0,0,0,0,0,0,0,0,0,0,0,0,0,0,0,0,0,0,0,0,0,0,0]
[11,10106,"خالد",null,null,null,null,null,null,null,null,null,"R","R","R","R","VAC","VAC","VAC","VAC","VAC","VAC","R","R","M","M","EXR","M","M","EXR","R","R","H","H","H","H","H","H","R","R","A","A","A","A","A","A","R","R","M","M",8,"M","M","M","M","R","R","H","H","H","H","H","H","R","R",null,null,null,null,null,null,null,null,null,null,null,null,null,null,null,null,null,{"$f":"COUNTIF(AZ112:$CD112,$AY$1)","v":4}]
[12,10107,"مصعب",null,null,null,null,null,null,null,null,null,"R","R","R","R","VAC","VAC","VAC","VAC","VAC","VAC","R","R","M","EXR","M","M","M","M","R","R","H","H","H","EXR","H","H","R","R","A","A","A","A","A","A","R","R","M","M",{"$f":"COUNTIF($T113:$AX113,$AY$1)","v":8},"M","M","M","M","R","R","H","H","H","H","H","H","R","R",null,null,null,null,null,null,null,null,null,null,null,null,null,null,null,null,null,{"$f":"COUNTIF(AZ113:$CD113,$AY$1)","v":4}]
[13,10108,"سالم",null,null,null,null,null,null,null,null,null,"R","R","R","R","A","A","A","A","A","A","R","R","EXR","M","M","M","M","M","R","R","H","H","EXR","H","H","H","R","R","A","A","A","A","A","A","R","R","M","M",8,"M","M","M","M","R","R","H","H","H","H","H","H","R","R",null,null,null,null,null,null,null,null,null,null,null,null,null,null,null,null,null,{"$f":"COUNTIF(AZ114:$CD114,$AY$1)","v":4}]
[14,10109,"عفيفي",null,null,null,null,null,null,null,null,null,"R","R","R","R","VAC","VAC","VAC","VAC","VAC","VAC","VAC","VAC","VAC","VAC","VAC","VAC","VAC","VAC","R","R","H","EXR","H","H","H","H","R","R","A","A","A","A","A","A","R","R","M","M",6,"M","M","M","M","R","R","H","H","H","H","H","H","R","R",null,null,null,null,null,null,null,null,null,null,null,null,null,null,null,null,null,{"$f":"COUNTIF(AZ115:$CD115,$AY$1)","v":4}]
[15,10110,"محمود",null,null,null,null,null,null,null,null,null,"R","R","R","R","A","A","A","A","A","A","R","R","M","M","EXR","M","M","M","R","R","EXR","H","H","H","H","H","R","R","A","A","A","A","A","A","R","R","M","M",8,"M","M","M","M","R","R","H","H","H","H","H","H","R","R",null,null,null,null,null,null,null,null,null,null,null,null,null,null,null,null,null,{"$f":"COUNTIF(AZ116:$CD116,$AY$1)","v":4}]
[16,10111,"جمال",null,null,null,null,null,null,null,null,null,"R","R","R","R","VAC","VAC","VAC","VAC","VAC","VAC","VAC","VAC","VAC","VAC","VAC","VAC","VAC","VAC","R","R","H","H","H","H","H","H","R","R","A","A","A","A","A","EXR","R","R","M","M",6,"M","M","M","M","R","R","H","H","H","H","H","H","R","R",null,null,null,null,null,null,null,null,null,null,null,null,null,null,null,null,null,{"$f":"COUNTIF(AZ117:$CD117,$AY$1)","v":4}]
[17,10112,"خالد",null,null,null,null,null,null,null,null,null,"R","R","R","R","VAC","VAC","VAC","VAC","VAC","VAC","R","R","M","M","M","M","EXR","M","R","R","H","H","H","H","H","H","R","R","A","A","A","A","EXR","A","R","R","M","M",8,"M","M","M","M","R","R","H","H","H","H","H","H","R","R",null,null,null,null,null,null,null,null,null,null,null,null,null,null,null,null,null,{"$f":"COUNTIF(AZ118:$CD118,$AY$1)","v":4}]
[18,10113,"مصعب",null,null,null,null,null,null,null,null,null,"R","R","R","R","VAC","VAC","VAC","VAC","VAC","VAC","R","R","M","M","M","M","M","EXR","R","R","H","H","H","H","H","H","R","R","A","A","A","EXR","A","A","R","R","M","M",8,"M","M","M","M","R","R","H","H","H","H","H","H","R","R",null,null,null,null,null,null,null,null,null,null,null,null,null,null,null,null,null,{"$f":"COUNTIF(AZ119:$CD119,$AY$1)","v":4}]
[19,10114,"سالم",null,null,null,null,null,null,null,null,null,"R","R","R","R","VAC","VAC","VAC","VAC","VAC","VAC","R","R","M","M","M","M","EXR","M","R","R","H","H","H","H","H","H","R","R","A","A","EXR","A","A","A","R","R","M","M",8,"M","M","M","M","R","R","H","H","H","H","H","H","R","R",null,null,null,null,null,null,null,null,null,null,null,null,null,null,null,null,null,{"$f":"COUNTIF(AZ120:$CD120,$AY$1)","v":4}]
[20,10115,"عفيفي",null,null,null,null,null,null,null,null,null,"R","R","R","R","VAC","VAC","VAC","VAC","VAC","VAC","VAC","VAC","VAC","VAC","VAC","VAC","VAC","VAC","VAC","VAC","VAC","VAC","VAC","H","H","H","R","R","A","EXR","A","A","A","A","R","R","M","M",4,"M","M","M","M","R","R","H","H","H","H","H","H","R","R",null,null,null,null,null,null,null,null,null,null,null,null,null,null,null,null,null,{"$f":"COUNTIF(AZ121:$CD121,$AY$1)","v":4}]
[21,10116,"خالد",null,null,null,null,null,null,null,null,null,"R","R","R","R","VAC","VAC","VAC","VAC","VAC","VAC","VAC","VAC","VAC","VAC","VAC","VAC","VAC","VAC","R","R","H","H","H","H","H","H","R","R","EXR","A","A","A","A","A","R","R","M","M",6,"M","M","M","M","R","R","H","H","H","H","H","H","R","R",null,null,null,null,null,null,null,null,null,null,null,null,null,null,null,null,null,{"$f":"COUNTIF(AZ122:$CD122,$AY$1)","v":4}]
[22,10117,"مصعب",null,null,null,null,null,null,null,null,null,"R","R","R","R","VAC","VAC","VAC","VAC","VAC","VAC","R","R","EXR","M","M","M","M","M","R","R","H","H","H","H","EXR","H","R","R","A","A","A","A","A","A","R","R","M","M",8,"M","M","M","M","R","R","H","H","H","H","H","H","R","R",null,null,null,null,null,null,null,null,null,null,null,null,null,null,null,null,null,{"$f":"COUNTIF(AZ123:$CD123,$AY$1)","v":4}]
[23,10118,"سالم",null,null,null,null,null,null,null,null,null,"R","R","R","R","VAC","VAC","VAC","VAC","VAC","VAC","VAC","VAC","VAC","EXR","M","M","M","M","R","R","H","H","H","EXR","H","H","R","R","A","A","A","A","A","A","R","R","M","M",6,"M","M","M","M","R","R","H","H","H","H","H","H","R","R",null,null,null,null,null,null,null,null,null,null,null,null,null,null,null,null,null,{"$f":"COUNTIF(AZ124:$CD124,$AY$1)","v":4}]
[24,10119,"عفيفي",null,null,null,null,null,null,null,null,null,"R","R","R","R","VAC","VAC","VAC","VAC","VAC","VAC","VAC","VAC","VAC","VAC","VAC","VAC","VAC","VAC","R","R","H","H","EXR","H","H","H","R","R","A","A","A","A","A","A","R","R","M","M",6,"M","M","M","M","R","R","H","H","H","H","H","H","R","R",null,null,null,null,null,null,null,null,null,null,null,null,null,null,null,null,null,{"$f":"COUNTIF(AZ125:$CD125,$AY$1)","v":4}]
[25,10120,"محمود",null,null,null,null,null,null,null,null,null,"R","R","R","R","VAC","VAC","VAC","VAC","VAC","VAC","R","R","M","M","M","EXR","M","M","R","R","H","EXR","H","H","H","H","R","R","A","A","A","A","A","A","R","R","M","M",8,"M","M","M","M","R","R","H","H","H","H","H","H","R","R",null,null,null,null,null,null,null,null,null,null,null,null,null,null,null,null,null,{"$f":"COUNTIF(AZ126:$CD126,$AY$1)","v":4}]
[26,10121,"جمال",null,null,null,null,null,null,null,null,null,"R","R","R","R","VAC","VAC","VAC","VAC","VAC","VAC","VAC","R","M","M","M","M","EXR","M","R","R","EXR","H","H","H","H","H","R","R","A","A","A","A","A","A","R","R","M","M",7,"M","M","M","M","R","R","H","H","H","H","H","H","R","R",null,null,null,null,null,null,null,null,null,null,null,null,null,null,null,null,null,{"$f":"COUNTIF(AZ127:$CD127,$AY$1)","v":4}]
[27,10122,"خالد",null,null,null,null,null,null,null,null,null,"R","R","R","R","VAC","VAC","VAC","VAC","VAC","VAC","VAC","VAC","VAC","VAC","VAC","VAC","VAC","EXR","R","R","H","H","H","H","H","H","R","R","A","A","A","A","A","EXR","R","R","M","M",6,"M","M","M","M","R","R","H","H","H","H","H","H","R","R",null,null,null,null,null,null,null,null,null,null,null,null,null,null,null,null,null,{"$f":"COUNTIF(AZ128:$CD128,$AY$1)","v":4}]
[28,10123,"مصعب",null,null,null,null,null,null,null,null,null,"R","R","R","R","VAC","VAC","VAC","VAC","VAC","VAC","R","R","M","M","M","M","EXR","M","R","R","H","H","H","H","H","H","R","R","A","A","A","A","EXR","A","R","R","M","M",8,"M","M","M","M","R","R","H","H","H","H","H","H","R","R",null,null,null,null,null,null,null,null,null,null,null,null,null,null,null,null,null,{"$f":"COUNTIF(AZ129:$CD129,$AY$1)","v":4}]
[29,10124,"سالم",null,null,null,null,null,null,null,null,null,"R","R","R","R","VAC","VAC","VAC","VAC","VAC","VAC","R","R","M","M","M","EXR","M","M","R","R","H","H","H","H","H","H","R","R","A","A","A","EXR","A","A","R","R","M","M",8,"M","M","M","M","R","R","H","H","H","H","H","H","R","R",null,null,null,null,null,null,null,null,null,null,null,null,null,null,null,null,null,{"$f":"COUNTIF(AZ130:$CD130,$AY$1)","v":4}]
[30,10125,"عفيفي",null,null,null,null,null,null,null,null,null,"R","R","R","R","VAC","VAC","VAC","VAC","VAC","VAC","R","R","M","M","EXR","M","M","M","R","R","H","H","H","H","H","H","R","R","A","A","EXR","A","A","A","R","R","M","M",8,"M","M","M","M","R","R","H","H","H","H","H","H","R","R",null,null,null,null,null,null,null,null,null,null,null,null,null,null,null,null,null,{"$f":"COUNTIF(AZ131:$CD131,$AY$1)","v":4}]
[31,10126,"خالد",null,null,null,null,null,null,null,null,null,"R","R","R","R","VAC","VAC","VAC","VAC","VAC","VAC","VAC","VAC","VAC","VAC","VAC","VAC","VAC","VAC","R","R","H","H","H","H","H","H","R","R","A","EXR","A","A","A","A","R","R","M","M",6,"M","M","M","M","R","R","H","H","H","H","H","H","R","R",null,null,null,null,null,null,null,null,null,null,null,null,null,null,null,null,null,{"$f":"COUNTIF(AZ132:$CD132,$AY$1)","v":4}]
[32,10127,"مصعب",null,null,null,null,null,null,null,null,null,"R","R","R","R","VAC","VAC","VAC","VAC","VAC","VAC","VAC","VAC","VAC","VAC","VAC","VAC","VAC","VAC","R","R","H","H","H","H","H","H","R","R","EXR","A","A","A","A","A","R","R","M","M",6,"M","M","M","M","R","R","H","H","H","H","H","H","R","R",null,null,null,null,null,null,null,null,null,null,null,null,null,null,null,null,null,{"$f":"COUNTIF(AZ133:$CD133,$AY$1)","v":4}]
[33,10128,"سالم",null,null,null,null,null,null,null,null,null,"R","R","R","R","VAC","VAC","VAC","VAC","VAC","VAC","R","R","VAC","EXR","M","M","M","M","R","R","H","H","H","H","H","EXR","R","R","A","A","A","A","A","A","R","R","M","M",8,"M","M","M","M","R","R","H","H","H","H","H","H","R","R",null,null,null,null,null,null,null,null,null,null,null,null,null,null,null,null,null,{"$f":"COUNTIF(AZ134:$CD134,$AY$1)","v":4}]
[34,10129,"عفيفي",null,null,null,null,null,null,null,null,null,"R","R","R","R","VAC","VAC","VAC","VAC","VAC","VAC","R","R","M","M","EXR","M","M","M","R","R","H","H","H","H","EXR","H","R","R","A","A","A","A","A","A","R","R","M","M",8,"M","M","M","M","R","R","H","H","H","H","H","H","R","R",null,null,null,null,null,null,null,null,null,null,null,null,null,null,null,null,null,{"$f":"COUNTIF(AZ135:$CD135,$AY$1)","v":4}]
[35,10130,"محمود",null,null,null,null,null,null,null,null,null,"R","R","R","R","VAC","VAC","VAC","VAC","VAC","VAC","R","R","M","M","M","EXR","M","M","R","R","H","H","H","EXR","H","H","R","R","A","A","A","A","A","A","R","R","M","M",8,"M","M","M","M","R","R","H","H","H","H","H","H","R","R",null,null,null,null,null,null,null,null,null,null,null,null,null,null,null,null,null,{"$f":"COUNTIF(AZ136:$CD136,$AY$1)","v":4}]
[36,10131,"جمال",null,null,null,null,null,null,null,null,null,"R","R","R","R","VAC","VAC","VAC","VAC","VAC","VAC","VAC","VAC","VAC","VAC","VAC","VAC","VAC","VAC","R","R","H","H","EXR","H","H","H","R","R","A","A","A","A","A","A","R","R","M","M",6,"M","M","M","M","R","R","H","H","H","H","H","H","R","R",null,null,null,null,null,null,null,null,null,null,null,null,null,null,null,null,null,{"$f":"COUNTIF(AZ137:$CD137,$AY$1)","v":4}]
[37,10132,"خالد",null,null,null,null,null,null,null,null,null,"R","R","R","VAC","VAC","VAC","VAC","VAC","VAC","VAC","R","R","M","M","M","M","M","EXR","R","R","H","EXR","H","H","H","H","R","R","A","A","A","A","A","A","R","R","M","M",8,"M","M","M","M","R","R","H","H","H","H","H","H","R","R",null,null,null,null,null,null,null,null,null,null,null,null,null,null,null,null,null,{"$f":"COUNTIF(AZ138:$CD138,$AY$1)","v":4}]
[38,10133,"مصعب",null,null,null,null,null,null,null,null,null,"R","R","R","R","VAC","VAC","VAC","VAC","VAC","VAC","R","R","M","M","M","M","EXR","M","R","R","EXR","H","H","H","H","H","R","R","A","A","A","A","A","A","R","R","M","M",8,"M","M","M","M","R","R","H","H","H","H","H","H","R","R",null,null,null,null,null,null,null,null,null,null,null,null,null,null,null,null,null,{"$f":"COUNTIF(AZ139:$CD139,$AY$1)","v":4}]
[39,10134,"سالم",null,null,null,null,null,null,null,null,null,"R","R","R","R","A","A","A","A","A","A","R","R","M","M","M","EXR","M","M","R","R","H","H","H","H","H","H","R","R","A","A","A","A","A","EXR","R","R","M","M",8,"M","M","M","M","R","R","H","H","H","H","H","H","R","R",null,null,null,null,null,null,null,null,null,null,null,null,null,null,null,null,null,{"$f":"COUNTIF(AZ140:$CD140,$AY$1)","v":4}]
[40,10135,"عفيفي",null,null,null,null,null,null,null,null,null,"R","R","R","R","VAC","VAC","VAC","VAC","VAC","VAC","R","R","M","M","EXR","M","M","M","R","R","H","H","H","H","H","H","R","R","A","A","A","A","EXR","A","R","R","M","M",8,"M","M","M","M","R","R","H","H","H","H","H","H","R","R",null,null,null,null,null,null,null,null,null,null,null,null,null,null,null,null,null,{"$f":"COUNTIF(AZ141:$CD141,$AY$1)","v":4}]
[41,10136,"خالد",null,null,null,null,null,null,null,null,null,"R","R","R","R","VAC","VAC","VAC","VAC","VAC","VAC","VAC","VAC","VAC","VAC","VAC","VAC","VAC","VAC","R","R","H","H","H","H","H","H","R","R","A","A","A","EXR","A","A","R","R","M","M",6,"M","M","M","M","R","R","H","H","H","H","H","H","R","R",null,null,null,null,null,null,null,null,null,null,null,null,null,null,null,null,null,{"$f":"COUNTIF(AZ142:$CD142,$AY$1)","v":4}]
[42,10137,"مصعب",null,null,null,null,null,null,null,null,null,"R","R","R","R","VAC","VAC","VAC","VAC","VAC","VAC","R","R","EXR","M","M","M","M","M","R","R","H","H","H","H","H","H","R","R","A","A","EXR","A","A","A","R","R","M","M",8,"M","M","M","M","R","R","H","H","H","H","H","H","R","R",null,null,null,null,null,null,null,null,null,null,null,null,null,null,null,null,null,{"$f":"COUNTIF(AZ143:$CD143,$AY$1)","v":4}]
[43,10138,"سالم",null,null,null,null,null,null,null,null,null,"R","R","R","R","VAC","VAC","VAC","VAC","VAC","VAC","R","R","M","EXR","M","M","M","M","R","R","H","H","H","H","H","H","R","R","A","EXR","A","A","A","A","R","R","M","M",8,"M","M","M","M","R","R","H","H","H","H","H","H","R","R",null,null,null,null,null,null,null,null,null,null,null,null,null,null,null,null,null,{"$f":"COUNTIF(AZ144:$CD144,$AY$1)","v":4}]
[44,10139,"عفيفي",null,null,null,null,null,null,null,null,null,"R","R","R","R","VAC","VAC","VAC","VAC","VAC","VAC","R","R","M","M","EXR","M","M","M","R","R","H","H","H","H","H","H","R","R","EXR","A","A","A","A","A","R","R","M","M",8,"M","M","M","M","R","R","H","H","H","H","H","H","R","R",null,null,null,null,null,null,null,null,null,null,null,null,null,null,null,null,null,{"$f":"COUNTIF(AZ145:$CD145,$AY$1)","v":4}]
[45,10140,"محمود",null,0,0,0,0,0,0,0,0,"R","R","R","R","VAC","VAC","VAC","VAC","VAC","VAC","R","R","M","M","M","M","M","M","R","R","EXR","H","H","H","H","EXR","R","R","A","A","A","A","A","A","R","R","M","M",10,"M","M","M","M","R","R","H","H","H","H","H","H","R","R",0,0,0,0,0,0,0,0,0,0,0,0,0,0,0,0,0,2,0,0,0,0,0,0,0,0,0,0,0,0,0,0,0,0,0,0,0,0,0,0,0,0,0,0,0,0,0,0,0,0,0,0,0,0,0,0,0,0,0,0,0,0,0,0,0,0,0,0,0,0,0,0,0,0,0,0,0,0,0,0,0,0,0,0,0,0,0,0,0,0,0,0,0,0,0,0,0,0,0,0,0,0,0,0,0,0,0,0,0,0,0,0,0,0,0,0,0,0,0,0,0,0,0,0,0,0,0,0,0,0,0,0,0,0,0,0,0,0,0,0,0,0,0,0,0,0,0,0,0,0,0,0,0,0,0,0,0,0,0]
[46,10141,"جمال",null,null,null,null,null,null,null,null,null,"R","R","R","R","VAC","VAC","VAC","VAC","VAC","VAC","R","R","M","M","M","M","EXR","M","R","R","H","H","H","H","EXR","H","R","R","A","A","A","A","A","A","R","R","M","M",{"$f":"COUNTIF($T147:$AX147,$AY$1)","v":8},"M","M","M","M","R","R","H","H","H","H","H","H","R","R",null,null,null,null,null,null,null,null,null,null,null,null,null,null,null,null,null,{"$f":"COUNTIF(AZ147:$CD147,$AY$1)","v":4}]
[]
[1,10142,"خالد",null,null,null,null,null,null,null,null,null,"R","R","R","H","H","VAC","VAC","VAC","R","R","A","A","A","A","A","A","R","R","M","M","M","M","M","M","R","R","EXR","H","H","H","H","EXR","R","R","A","A","A","A",{"$f":"COUNTIF($T149:$AX149,$AY$1)","v":8},"A","A","R","R","M","M","M","M","M","M","R","R","H","H","H",null,null,null,null,null,null,null,null,null,null,null,null,null,null,null,null,{"$f":"COUNTIF(AZ149:$CD149,$AY$1)","v":4}]
[{"$f":"A149+1","v":2},10143,"مصعب",null,null,null,null,null,null,null,null,null,"R","R","R","VAC","VAC","VAC","VAC","VAC","VAC","VAC","VAC","A","A","A","A","A","R","R","M","EXR","M","M","M","M","R","R","H","H","H","EXR","H","H","R","R","A","A","A","A",6,"A","A","R","R","M","M","M","M","M","M","R","R","H","H","H",null,null,null,null,null,null,null,null,null,null,null,null,null,null,null,null,{"$f":"COUNTIF(AZ150:$CD150,$AY$1)","v":4}]
[{"$f":"A150+1","v":3},10144,"سالم",null,null,null,null,null,null,null,null,null,"VAC","VAC","VAC","VAC","VAC","VAC","VAC","VAC","VAC","VAC","EXR","A","A","A","A","A","R","R","M","M","M","M","M","M","R","R","H","H","H","H","EXR","H","R","R","A","A","A","A",6,"A","A","R","R","M","M","M","M","M","M","R","R","H","H","H",null,null,null,null,null,null,null,null,null,null,null,null,null,null,null,null,{"$f":"COUNTIF(AZ151:$CD151,$AY$1)","v":4}]
[{"$f":"A208+1","v":5},10145,"عفيفي",null,null,null,null,null,null,null,null,null,"R","R","R","VAC","VAC","VAC","VAC","VAC","R","R","EXR","A","A","A","A","A","R","R","M","M","M","M","M","M","R","R","H","H","H","H","EXR","H","R","R","A","A","A","A",8,"A","A","R","R","M","M","M","M","M","M","R","R","H","H","H",null,null,null,null,null,null,null,null,null,null,null,null,null,null,null,null,{"$f":"COUNTIF(AZ152:$CD152,$AY$1)","v":4}]
[6,10146,"محمود",null,null,null,null,null,null,null,null,null,"R","R","R","VAC","VAC","VAC","VAC","VAC","R","R","A","A","A","A","A","A","R","R","M","M","M","M","M","EXR","R","R","H","H","H","EXR","H","H","R","R","A","A","A","A",8,"A","A","R","R","M","M","M","M","M","M","R","R","H","H","H",null,null,null,null,null,null,null,null,null,null,null,null,null,null,null,null,{"$f":"COUNTIF(AZ153:$CD153,$AY$1)","v":4}]
[7,10147,"جمال",null,null,null,null,null,null,null,null,null,"R","R","R","H","VAC","VAC","VAC","VAC","VAC","VAC","A","A","A","A","A","A","R","R","M","M","M","M","EXR","M","R","R","H","H","EXR","H","H","H","R","R","A","A","A","A",6,"A","A","R","R","M","M","M","M","M","M","R","R","H","H","H",null,null,null,null,null,null,null,null,null,null,null,null,null,null,null,null,{"$f":"COUNTIF(AZ154:$CD154,$AY$1)","v":4}]
[8,10148,"خالد",null,null,null,null,null,null,null,null,null,"R","R","R","H","H","H","H","H","R","R","A","A","A","A","A","A","R","R","M","M","M","EXR","M","M","R","R","H","EXR","H","H","H","H","R","R","A","A","A","A",8,"A","A","R","R","M","M","M","M","M","M","R","R","H","H","H",null,null,null,null,null,null,null,null,null,null,null,null,null,null,null,null,{"$f":"COUNTIF(AZ155:$CD155,$AY$1)","v":4}]
[9,10149,"مصعب",null,null,null,null,null,null,null,null,null,"R","R","R","VAC","VAC","VAC","VAC","VAC","VAC","VAC","VAC","VAC","VAC","VAC","VAC","VAC","R","R","M","M","M","M","M","M","R","R","EXR","H","H","H","H","H","R","R","A","A","A","A",6,"A","A","R","R","M","M","M","M","M","M","R","R","H","H","H",null,null,null,null,null,null,null,null,null,null,null,null,null,null,null,null,{"$f":"COUNTIF(AZ156:$CD156,$AY$1)","v":4}]
[10,10150,"سالم",null,0,"X",0,0,0,0,"X",0,"VAC","VAC","VAC","VAC","VAC","VAC","VAC","VAC","VAC","VAC","VAC","VAC","VAC","VAC","EXR","EXR","R","R","M","M","M","M","M","EXR","R","R","H","H","H","H","H","H","R","R","A","A","A","A",9,"A","A","R","R","M","M","M","M","M","M","R","R","H","H","H",0,0,0,0,0,0,0,0,0,0,0,0,0,0,0,0,0,0,0,0,0,0,0,0,0,0,0,0,0,0,0,0,0,0,0,0,0,0,0,0,0,0,0,0,0,0,0,0,0,0,0,0,0,0,0,0,0,0,0,0,0,0,0,0,0,0,0,0,0,0,0,0,0,0,0,0,0,0,0,0,0,0,0,0,0,0,0,0,0,0,0,0,0,0,0,0,0,0,0,0,0,0,0,0,0,0,0,0,0,0,0,0,0,0,0,0,0,0,0,0,0,0,0,0,0,0,0,0,0,0,0,0,0,0,0,0,0,0,0,0,0,0,0,0,0,0,0,0,0,0,0,0,0,0,0,0,0,0,0,0,0,0,0,0,0,0]
[{"$f":"A64+1","v":12},10151,"عفيفي",null,null,null,null,null,null,null,null,null,"R","R","R","VAC","VAC","VAC","VAC","VAC","VAC","VAC","VAC","VAC","VAC","VAC","EXR","EXR","R","R","M","M","M","M","M","M","R","R","EXR","H","H","H","H","H","R","R","A","A","A","A",{"$f":"COUNTIF($T158:$AX158,$AY$1)","v":6},"A","A","R","R","M","M","M","M","M","M","R","R","H","H","H",null,null,null,null,null,null,null,null,null,null,null,null,null,null,null,null,{"$f":"COUNTIF(AZ158:$CD158,$AY$1)","v":4}]
[13,10152,"خالد",null,0,0,0,0,0,0,0,0,"R","R","R","VAC","VAC","VAC","VAC","VAC","R","R","A","A","A","A","A","EXR","R","R","M","M","M","M","M","M","R","R","H","H","H","H","H","EXR","R","R","A","A","A","A",10,"A","A","R","R","M","M","M","M","M","M","R","R","H","H","H",null,null,null,null,null,null,null,null,null,null,null,null,null,null,null,null,3,0,0,0,0,0,0,0,0,0,0,0,0,0,0,0,0,0,0,0,0,0,0,0,0,0,0,0,0,0,0,0,0,0,0,0,0,0,0,0,0,0,0,0,0,0,0,0,0,0,0,0,0,0,0,0,0,0,0,0,0,0,0,0,0,0,0,0,0,0,0,0,0,0,0,0,0,0,0,0,0,0,0,0,0,0,0,0,0,0,0,0,0,0,0,0,0,0,0,0,0,0,0,0,0,0,0,0,0,0,0,0,0,0,0,0,0,0,0,0,0,0,0,0,0,0,0,0,0,0,0,0,0,0,0,0,0,0,0,0,0,0]
[14,10153,"مصعب",null,null,null,null,null,null,null,null,null,"R","R","R","VAC","VAC","VAC","VAC","VAC","R","R","A","A","A","A","A","A","R","R","M","M","M","M","M","EXR","R","R","H","H","H","EXR","H","H","R","R","A","A","A","A",{"$f":"COUNTIF($T160:$AX160,$AY$1)","v":8},"A","A","R","R","M","M","M","M","M","M","R","R","H","H","H",null,null,null,null,null,null,null,null,null,null,null,null,null,null,null,null,{"$f":"COUNTIF(AZ160:$CD160,$AY$1)","v":4}]
[15,10154,"سالم",null,null,null,null,null,null,null,null,null,"VAC","VAC","VAC","VAC","VAC","VAC","VAC","VAC","R","R","A","A","A","A","A","A","R","R","EXR","M","M","M","M","M","R","R","H","H","H","H","EXR","H","R","R","A","A","A","A",{"$f":"COUNTIF($T161:$AX161,$AY$1)","v":8},"A","A","R","R","M","M","M","M","M","M","R","R","H","H","H",null,null,null,null,null,null,null,null,null,null,null,null,null,null,null,null,{"$f":"COUNTIF(AZ161:$CD161,$AY$1)","v":4}]
[17,10155,"عفيفي",null,0,0,0,0,0,0,0,0,"R","R","R","VAC","VAC","VAC","VAC","VAC","VAC","VAC","VAC","VAC","VAC","VAC","VAC","VAC","R","R","M","EXR","M","M","M","M","R","R","EXR","H","H","H","H","H","R","R","A","A","A","A",8,"A","A","R","R","M","M","M","M","M","M","R","R","H","H","H",null,null,null,null,null,null,null,null,null,null,null,null,null,null,null,null,3,0,0,0,0,0,0,0,0,0,0,0,0,0,0,0,0,0,0,0,0,0,0,0,0,0,0,0,0,0,0,0,0,0,0,0,0,0,0,0,0,0,0,0,0,0,0,0,0,0,0,0,0,0,0,0,0,0,0,0,0,0,0,0,0,0,0,0,0,0,0,0,0,0,0,0,0,0,0,0,0,0,0,0,0,0,0,0,0,0,0,0,0,0,0,0,0,0,0,0,0,0,0,0,0,0,0,0,0,0,0,0,0,0,0,0,0,0,0,0,0,0,0,0,0,0,0,0,0,0,0,0,0,0,0,0,0,0,0,0,0,0]
[17,10156,"محمود",null,null,null,null,null,null,null,null,null,"R","R","R","VAC","VAC","VAC","VAC","VAC","VAC","VAC","VAC","VAC","VAC","VAC","A","A","R","R","M","M","EXR","M","M","M","R","R","H","H","H","EXR","H","H","R","R","A","A","A","A",{"$f":"COUNTIF($T163:$AX163,$AY$1)","v":6},"A","A","R","R","M","M","M","M","M","M","R","R","H","H","H",null,null,null,null,null,null,null,null,null,null,null,null,null,null,null,null,{"$f":"COUNTIF(AZ163:$CD163,$AY$1)","v":4}]
[18,10157,"جمال",null,0,0,0,0,0,0,0,0,"R","R","R","VAC","VAC","VAC","VAC","VAC","R","R","A","A","A","A","A","A","R","R","M","M","M","EXR","M","M","R","R","H","H","H","H","H","H","R","R","EXR","A","A","A",8,"A","A","R","R","M","M","M","M","M","M","R","R","H","H","H",null,null,null,null,null,null,null,null,null,null,null,null,null,null,null,null,3,0,0,0,0,0,0,0,0,0,0,0,0,0,0,0,0,0,0,0,0,0,0,0,0,0,0,0,0,0,0,0,0,0,0,0,0,0,0,0,0,0,0,0,0,0,0,0,0,0,0,0,0,0,0,0,0,0,0,0,0,0,0,0,0,0,0,0,0,0,0,0,0,0,0,0,0,0,0,0,0,0,0,0,0,0,0,0,0,0,0,0,0,0,0,0,0,0,0,0,0,0,0,0,0,0,0,0,0,0,0,0,0,0,0,0,0,0,0,0,0,0,0,0,0,0,0,0,0,0,0,0,0,0,0,0,0,0,0,0,0,0]
[20,10158,"خالد",null,0,0,0,0,0,0,0,0,"R","R","R","VAC","VAC","VAC","VAC","VAC","R","R","A","A","A","A","A","A","R","R","EXR","EXR","VAC","M","M","M","R","R","H","H","H","EXR","H","H","R","R","A","A","A","A",11,"A","A","R","R","M","M","M","M","M","M","R","R","H","H","H"]
[{"$f":"A72+1","v":20},10159,"مصعب",null,null,null,null,null,null,null,null,null,"R","R","R","VAC","VAC","VAC","VAC","VAC","VAC","VAC","VAC","A","A","A","A","A","R","R","VAC","VAC","VAC","VAC","VAC","EXR","R","R","H","H","EXR","H","H","H","R","R","A","A","A","A",{"$f":"COUNTIF($T166:$AX166,$AY$1)","v":6},"A","A","R","R","M","M","M","M","M","M","R","R","H","H","H",null,null,null,null,null,null,null,null,null,null,null,null,null,null,null,null,{"$f":"COUNTIF(AZ166:$CD166,$AY$1)","v":4}]
[21,10160,"سالم",null,null,null,null,null,null,null,null,null,"R","R","R","VAC","VAC","VAC","VAC","VAC","R","R","A","A","A","A","A","A","R","R","EXR","M","M","M","M","M","R","R","H","EXR","H","H","H","H","R","R","A","A","A","A",{"$f":"COUNTIF($T167:$AX167,$AY$1)","v":8},"A","A","R","R","M","M","M","M","M","M","R","R","H","H","H",null,null,null,null,null,null,null,null,null,null,null,null,null,null,null,null,{"$f":"COUNTIF(AZ167:$CD167,$AY$1)","v":4}]
[22,10161,"عفيفي",null,null,null,null,null,null,null,null,null,"VAC","VAC","VAC","VAC","VAC","VAC","VAC","H","R","R","A","A","A","A","A","A","R","R","M","EXR","M","M","M","M","R","R","EXR","H","H","H","H","H","R","R","A","A","A","A",{"$f":"COUNTIF($T168:$AX168,$AY$1)","v":8},"A","A","R","R","M","M","M","M","M","M","R","R","H","H","H",null,null,null,null,null,null,null,null,null,null,null,null,null,null,null,null,{"$f":"COUNTIF(AZ168:$CD168,$AY$1)","v":4}]
[23,10162,"خالد",null,null,null,null,null,null,null,null,null,"R","R","R","VAC","VAC","VAC","VAC","VAC","VAC","VAC","VAC","VAC","VAC","VAC","VAC","VAC","R","R","M","M","EXR","M","M","M","R","R","H","EXR","H","H","H","H","R","R","A","A","A","A",{"$f":"COUNTIF($T169:$AX169,$AY$1)","v":6},"A","A","R","R","M","M","M","M","M","M","R","R","H","H","H",null,null,null,null,null,null,null,null,null,null,null,null,null,null,null,null,{"$f":"COUNTIF(AZ169:$CD169,$AY$1)","v":4}]
[25,10163,"مصعب",null,0,0,0,0,0,0,0,0,"R","R","R","VAC","VAC","VAC","VAC","VAC","VAC","VAC","VAC","VAC","VAC","VAC","VAC","VAC","R","R","M","M","M","M","M","EXR","R","R","H","H","EXR","H","H","H","R","R","A","A","A","A",8,"A","A","R","R","M","M","M","M","M","M","R","R","H","H","H"]
[25,10164,"سالم",null,null,null,null,null,null,null,null,null,"R","R","R","H","H","H","H","H","R","R","A","A","A","A","A","A","R","R","M","M","M","M","EXR","M","R","R","H","H","H","EXR","H","H","R","R","A","A","A","A",{"$f":"COUNTIF($T171:$AX171,$AY$1)","v":8},"A","A","R","R","M","M","M","M","M","M","R","R","H","H","H",null,null,null,null,null,null,null,null,null,null,null,null,null,null,null,null,{"$f":"COUNTIF(AZ171:$CD171,$AY$1)","v":4}]
[26,10165,"عفيفي",null,null,null,null,null,null,null,null,null,"R","R","R","VAC","VAC","VAC","VAC","VAC","R","R","A","A","A","A","A","A","R","R","M","M","M","M","M","EXR","R","R","H","H","H","H","EXR","H","R","R","A","A","A","A",{"$f":"COUNTIF($T172:$AX172,$AY$1)","v":8},"A","A","R","R","M","M","M","M","M","M","R","R","H","H","H",null,null,null,null,null,null,null,null,null,null,null,null,null,null,null,null,{"$f":"COUNTIF(AZ172:$CD172,$AY$1)","v":4}]
[28,10166,"محمود",null,0,0,0,0,0,0,0,0,"R","R","R","VAC","VAC","VAC","VAC","VAC","R","R","A","A","A","A","A","A","R","R","M","M","M","M","M","M","R","R","EXR","EXR","H","H","H","H","R","R","A","A","A","A",10,"A","A","R","R","M","M","M","M","M","M","R","R","H","H","H"]
[28,10167,"جمال",null,0,0,0,0,0,0,0,0,"R","R","R","VAC","VAC","VAC","VAC","VAC","R","R","A","A","A","A","A","A","R","R","M","EXR","M","M","M","M","R","R","H","H","H","H","H","EXR","R","R","A","A","A","A",8,"A","A","R","R","M","M","M","M","M","M","R","R","H","H","H",null,null,null,null,null,null,null,null,null,null,null,null,null,null,null,null,3,0,0,0,0,0,0,0,0,0,0,0,0,0,0,0,0,0,0,0,0,0,0,0,0,0,0,0,0,0,0,0,0,0,0,0,0,0,0,0,0,0,0,0,0,0,0,0,0,0,0,0,0,0,0,0,0,0,0,0,0,0,0,0,0,0,0,0,0,0,0,0,0,0,0,0,0,0,0,0,0,0,0,0,0,0,0,0,0,0,0,0,0,0,0,0,0,0,0,0,0,0,0,0,0,0,0,0,0,0,0,0,0,0,0,0,0,0,0,0,0,0,0,0,0,0,0,0,0,0,0,0,0,0,0,0,0,0,0,0,0,0]
[29,10168,"خالد",null,null,null,null,null,null,null,null,null,"R","R","R","H","H","H","H","H","R","R","A","A","A","A","A","A","R","R","M","M","EXR","M","M","M","R","R","H","H","H","EXR","H","H","R","R","A","A","A","A",{"$f":"COUNTIF($T175:$AX175,$AY$1)","v":8},"A","A","R","R","M","M","M","M","M","M","R","R","H","H","H",null,null,null,null,null,null,null,null,null,null,null,null,null,null,null,null,{"$f":"COUNTIF(AZ175:$CD175,$AY$1)","v":4}]
[30,10169,"مصعب",null,null,null,null,null,null,null,null,null,"R","R","R","VAC","VAC","VAC","VAC","VAC","R","R","A","A","A","A","A","A","R","R","M","M","M","EXR","M","M","R","R","H","H","EXR","H","H","H","R","R","A","A","A","A",{"$f":"COUNTIF($T176:$AX176,$AY$1)","v":8},"A","A","R","R","M","M","M","M","M","M","R","R","H","H","H",null,null,null,null,null,null,null,null,null,null,null,null,null,null,null,null,{"$f":"COUNTIF(AZ176:$CD176,$AY$1)","v":4}]
[31,10170,"سالم",null,null,null,null,null,null,null,null,null,"R","R","R","VAC","VAC","VAC","VAC","VAC","R","R","A","A","A","A","A","A","R","R","M","M","M","M","EXR","M","R","R","H","EXR","H","H","H","H","R","R","A","A","A","A",{"$f":"COUNTIF($T177:$AX177,$AY$1)","v":8},"A","A","R","R","M","M","M","M","M","M","R","R","H","H","H",null,null,null,null,null,null,null,null,null,null,null,null,null,null,null,null,{"$f":"COUNTIF(AZ177:$CD177,$AY$1)","v":4}]
[32,10171,"عفيفي",null,null,null,null,null,null,null,null,null,"R","R","R","VAC","VAC","VAC","VAC","VAC","R","R","A","A","A","A","A","A","R","R","M","M","M","M","M","EXR","R","R","EXR","H","H","H","H","H","R","R","A","A","A","A",{"$f":"COUNTIF($T178:$AX178,$AY$1)","v":8},"A","A","R","R","M","M","M","M","M","M","R","R","H","H","H",null,null,null,null,null,null,null,null,null,null,null,null,null,null,null,null,{"$f":"COUNTIF(AZ178:$CD178,$AY$1)","v":4}]
[34,10172,"خالد",null,0,0,0,0,0,0,0,0,"R","R","R","VAC","VAC","VAC","VAC","VAC","R","R","A","A","A","A","A","A","R","R","EXR","EXR","M","M","M","M","R","R","H","EXR","H","H","H","H","R","R","A","A","A","A",11,"A","A","R","R","M","M","M","M","M","M","R","R","H","H","H",null,null,null,null,null,null,null,null,null,null,null,null,null,null,null,null,{"$f":"COUNTIF(AZ179:$CD179,$AY$1)","v":4}]
[{"$f":"A86+1","v":34},10173,"مصعب",null,null,null,null,null,null,null,null,null,"R","R","R","VAC","VAC","VAC","VAC","VAC","VAC","VAC","VAC","VAC","VAC","A","A","A","R","R","M","EXR","M","M","M","M","R","R","H","H","EXR","H","H","H","R","R","A","A","A","A",{"$f":"COUNTIF($T180:$AX180,$AY$1)","v":6},"A","A","R","R","M","M","M","M","M","M","R","R","H","H","H",null,null,null,null,null,null,null,null,null,null,null,null,null,null,null,null,{"$f":"COUNTIF(AZ180:$CD180,$AY$1)","v":4}]
[{"$f":"A87+1","v":35},10174,"سالم",null,null,null,null,null,null,null,null,null,"R","R","R","H","H","H","H","H","R","R","A","A","A","A","A","A","R","R","M","M","EXR","M","M","M","R","R","H","H","H","EXR","H","H","R","R","A","A","A","A",{"$f":"COUNTIF($T181:$AX181,$AY$1)","v":8},"A","A","R","R","M","M","M","M","M","M","R","R","H","H","H",null,null,null,null,null,null,null,null,null,null,null,null,null,null,null,null,{"$f":"COUNTIF(AZ181:$CD181,$AY$1)","v":4}]
[{"$f":"A88+1","v":36},10175,"عفيفي",null,null,null,null,null,null,null,null,null,"R","R","R","VAC","VAC","VAC","VAC","VAC","R","R","A","A","A","A","A","A","R","R","M","M","M","EXR","M","M","R","R","H","H","H","H","EXR","H","R","R","A","A","A","A",{"$f":"COUNTIF($T182:$AX182,$AY$1)","v":8},"A","A","R","R","M","M","M","M","M","M","R","R","H","H","H",null,null,null,null,null,null,null,null,null,null,null,null,null,null,null,null,{"$f":"COUNTIF(AZ182:$CD182,$AY$1)","v":4}]
[38,10176,"محمود",null,0,0,0,0,0,0,0,0,"R","R","R","VAC","VAC","VAC","VAC","VAC","VAC","VAC","VAC","VAC","VAC","VAC","VAC","VAC","R","R","EXR","EXR","M","M","M","M","R","R","H","H","H","H","H","EXR","R","R","A","A","A","A",9,"A","A","R","R","M","M","M","M","M","M","R","R","H","H","H",null,null,null,null,null,null,null,null,null,null,null,null,null,null,null,null,{"$f":"COUNTIF(AZ183:$CD183,$AY$1)","v":4}]
[{"$f":"A90+1","v":38},10177,"جمال",null,null,null,null,null,null,null,null,null,"R","R","R","H","H","H","H","H","R","R","A","A","A","A","A","A","R","R","M","M","M","M","M","EXR","R","R","H","H","H","H","EXR","H","R","R","A","A","A","A",{"$f":"COUNTIF($T184:$AX184,$AY$1)","v":8},"A","A","R","R","M","M","M","M","M","M","R","R","H","H","H",null,null,null,null,null,null,null,null,null,null,null,null,null,null,null,null,{"$f":"COUNTIF(AZ184:$CD184,$AY$1)","v":4}]
[39,10178,"خالد",null,null,null,null,null,null,null,null,null,"R","R","R","VAC","VAC","VAC","VAC","VAC","R","R","A","A","A","A","A","A","R","R","EXR","M","M","M","M","M","R","R","H","H","H","EXR","H","H","R","R","A","A","A","A",{"$f":"COUNTIF($T185:$AX185,$AY$1)","v":8},"A","A","R","R","M","M","M","M","M","M","R","R","H","H","H",null,null,null,null,null,null,null,null,null,null,null,null,null,null,null,null,{"$f":"COUNTIF(AZ185:$CD185,$AY$1)","v":4}]
[41,10179,"مصعب",null,0,0,0,0,0,0,0,0,"R","R","R","VAC","VAC","VAC","VAC","VAC","R","R","A","A","A","A","A","A","R","R","M","EXR","M","M","M","M","R","R","H","H","H","H","H","EXR","R","R","VAC","VAC","A","A",10,"A","A","R","R","M","M","M","M","M","M","R","R","H","H","H",null,null,null,null,null,null,null,null,null,null,null,null,null,null,null,null,3,0,0,0,0,0,0,0,0,0,0,0,0,0,0,0,0,0,0,0,0,0,0,0,0,0,0,0,0,0,0,0,0,0,0,0,0,0,0,0,0,0,0,0,0,0,0,0,0,0,0,0,0,0,0,0,0,0,0,0,0,0,0,0,0,0,0,0,0,0,0,0,0,0,0,0,0,0,0,0,0,0,0,0,0,0,0,0,0,0,0,0,0,0,0,0,0,0,0,0,0,0,0,0,0,0,0,0,0,0,0,0,0,0,0,0,0,0,0,0,0,0,0,0,0,0,0,0,0,0,0,0,0,0,0,0,0,0,0,0,0,0]
[41,10180,"سالم",0,0,0,0,0,0,0,0,0,"R","R","R","VAC","VAC","VAC","VAC","VAC","VAC","VAC","A","A","A","A","A","A","R","R","M","M","EXR","M","M","M","R","R","H","EXR","H","H","H","H","R","R","A","A","A","A",6,"A","A","R","R","M","M","M","M","M","M","R","R","H","H","H",0,0,0,0,0,0,0,0,0,0,0,0,0,0,0,0,4,0,0,0,0,0,0,0,0,0,0,0,0,0,0,0,0,0,0,0,0,0,0,0,0,0,0,0,0,0,0,0,0,0,0,0,0,0,0,0,0,0,0,0,0,0,0,0,0,0,0,0,0,0,0,0,0,0,0,0,0,0,0,0,0,0,0,0,0,0,0,0,0,0,0,0,0,0,0,0,0,0,0,0,0,0,0,0,0,0,0,0,0,0,0,0,0,0,0,0,0,0,0,0,0,0,0,0,0,0,0,0,0,0,0,0,0,0,0,0,0,0,0,0,0,0,0,0,0,0,0,0,0,0,0,0,0,0,0,0,0,0,0,0,0,0,0,0,0]
[42,10181,"عفيفي",null,null,null,null,null,null,null,null,null,"R","R","R","VAC","VAC","VAC","VAC","VAC","VAC","VAC","VAC","VAC","VAC","VAC","A","EXR","R","R","M","M","M","M","M","M","R","R","EXR","H","H","H","H","H","R","R","A","A","A","A",{"$f":"COUNTIF($T188:$AX188,$AY$1)","v":6},"A","A","R","R","M","M","M","M","M","M","R","R","H","H","H",null,null,null,null,null,null,null,null,null,null,null,null,null,null,null,null,{"$f":"COUNTIF(AZ188:$CD188,$AY$1)","v":4}]
[43,10182,"خالد",null,null,null,null,null,null,null,null,null,"R","R","R","VAC","VAC","VAC","VAC","VAC","R","R","A","A","A","A","A","A","R","R","M","M","M","M","EXR","M","R","R","H","EXR","H","H","H","H","R","R","A","A","A","A",8,"A","A","R","R","M","M","M","M","M","M","R","R","H","H","H",null,null,null,null,null,null,null,null,null,null,null,null,null,null,null,null,{"$f":"COUNTIF(AZ189:$CD189,$AY$1)","v":4}]
[44,10183,"مصعب",null,null,null,null,null,null,null,null,null,"R","R","R","VAC","VAC","VAC","VAC","VAC","VAC","VAC","VAC","VAC","VAC","A","A","A","R","R","M","M","M","M","M","EXR","R","R","H","H","EXR","H","H","H","R","R","A","A","A","A",6,"A","A","R","R","M","M","M","M","M","M","R","R","H","H","H",null,null,null,null,null,null,null,null,null,null,null,null,null,null,null,null,{"$f":"COUNTIF(AZ190:$CD190,$AY$1)","v":4}]
[45,10184,"سالم",null,null,null,null,null,null,null,null,null,"R","R","R","VAC","VAC","VAC","VAC","VAC","VAC","VAC","VAC","VAC","VAC","VAC","VAC","VAC","VAC","VAC","VAC","VAC","VAC","VAC","VAC","VAC","R","R","H","H","H","H","EXR","H","R","R","A","A","A","A",4,"A","A","R","R","M","M","M","M","M","M","R","R","H","H","H",null,null,null,null,null,null,null,null,null,null,null,null,null,null,null,null,{"$f":"COUNTIF(AZ191:$CD191,$AY$1)","v":4}]
[46,10185,"عفيفي",null,null,null,null,null,null,null,null,null,"R","R","R","VAC","VAC","VAC","VAC","VAC","R","R","A","A","A","A","A","A","R","R","M","M","EXR","M","M","M","R","R","H","H","H","H","H","EXR","R","R","A","A","A","A",8,"A","A","R","R","M","M","M","M","M","M","R","R","H","H","H",null,null,null,null,null,null,null,null,null,null,null,null,null,null,null,null,{"$f":"COUNTIF(AZ192:$CD192,$AY$1)","v":4}]
[47,10186,"محمود",null,null,null,null,null,null,null,null,null,"R","R","R","VAC","VAC","VAC","VAC","VAC","R","R","A","A","A","A","A","A","R","R","M","M","M","M","EXR","M","R","R","H","H","H","EXR","H","H","R","R","A","A","A","A",8,"A","A","R","R","M","M","M","M","M","M","R","R","H","H","H",null,null,null,null,null,null,null,null,null,null,null,null,null,null,null,null,{"$f":"COUNTIF(AZ193:$CD193,$AY$1)","v":4}]
[]
[{"$f":"A194+1","v":1},10187,"خالد",null,null,null,null,null,null,null,null,null,"VAC","VAC","VAC","VAC","VAC","VAC","VAC","R","R","A","A","A","A","A","R","R","R","A","A","A","A","A","R","R","A","A","A","A","A","R","R","R","A","A","A","A","A","A",{"$f":"COUNTIF($T195:$AX195,$AY$1)","v":10},"R","R","A","A","A","A","A","A","R","R","A","A","A","A","A",null,null,null,null,null,null,null,null,null,null,null,null,null,null,null,null,{"$f":"COUNTIF(AZ195:$CD195,$AY$1)","v":4}]
[{"$f":"A195+1","v":2},10188,"مصعب",null,null,null,null,null,null,null,null,null,"R","N1","R","VAC","VAC","VAC","VAC","VAC","VAC","VAC","VAC","R","N1","R","N1","R","N1","N1","R","N1","N1","R","N1","R","N1","R","N1","R","R","N1","R","N1","R","N1","R","N1","R","N1",{"$f":"COUNTIF($T196:$AX196,$AY$1)","v":13},null,null,null,null,null,null,null,null,null,null,"A","A","A","A","A",null,null,null,null,null,null,null,null,null,null,null,null,null,null,null,null,{"$f":"COUNTIF(AZ196:$CD196,$AY$1)","v":0}]
[3,10189,"سالم",null,null,null,null,null,null,null,null,null,"R","R","R","A","R","R","A","A","A","A","A","A","R","R","R","A","A","A","A","A","R","R","R","A","A","A","A","A","R","R","A","A","A","A","A","A","R","R",{"$f":"COUNTIF($T197:$AX197,$AY$1)","v":10},"A","A","A","A","A","R","R","R",null,null,"A","A","A","A","A",null,null,null,null,null,null,null,null,null,null,null,null,null,null,null,null,{"$f":"COUNTIF(AZ197:$CD197,$AY$1)","v":3}]
[4,10190,"عفيفي",null,null,null,null,null,null,null,null,null,"R","R","R","M","R","R","M","M","R","R","M","M","R","R","M","M","M","M","M","M","R","R","M","M","M","M","M","M","R","R","M","M","M","M","M","M","R","R",{"$f":"COUNTIF($T198:$AX198,$AY$1)","v":10},"M","M","M","M","M","M","R","R",null,null,"A","A","A","A","A",null,null,null,null,null,null,null,null,null,null,null,null,null,null,null,null,{"$f":"COUNTIF(AZ198:$CD198,$AY$1)","v":2}]
[]
[1,10191,"سالم",null,0,0,0,0,0,0,0,0,0,0,0,0,0,0,0,"??","VAC","VAC","VAC","??","??","VAC","VAC","VAC","VAC","VAC","VAC","R","VAC","VAC","VAC","VAC","VAC","VAC","VAC","VAC","VAC","VAC","VAC","VAC","R","R","A","A","A","A",{"$f":"COUNTIF($T200:$AX200,$AY$1)","v":3},"A","A","R","R","M","M","M","M",null,null,null,null,null,null,null,null,null,null,null,null,null,null,null,null,null,null,null,null,null,null,null,{"$f":"COUNTIF(AZ200:$CD200,$AY$1)","v":2}]
[]
[]
[]
[]
[1,10192,"سالم",null,0,0,0,0,0,0,0,0,0,0,0,0,0,0,0,null,null,null,null,null,null,null,null,null,null,null,null,null,"A10","A10","A10","A10","A10","R","R","A10","A10","A10","A10","A10","R","R","A10","A10","A10","A10",{"$f":"COUNTIF($T205:$AX205,$AY$1)","v":4},"A10","R","R","A10","A10","A10","A10","A10","R","R","A10",null,null,null,null,null,null,null,null,null,null,null,null,null,null,null,null,null,null,null,null,{"$f":"COUNTIF(AZ205:$CD205,$AY$1)","v":4}]
[]
[{"$f":"A215+1","v":1},10193,"سالم",null,null,null,null,null,null,null,null,null,"R","R","R","VAC","VAC","VAC","R","R","H","H","H","H","H","H","R","R","A","A","A","A","A","A","A","A","A","A","A","A","A","A","A","A","A","A","A","A","A","A",{"$f":"COUNTIF($T207:$AX207,$AY$1)","v":3},"R","R","A","A","A","A","A","A","R","R","M",null,null,null,null,null,null,null,null,null,null,null,null,null,null,null,null,null,null,null,null,{"$f":"COUNTIF(AZ207:$CD207,$AY$1)","v":4}]
[{"$f":"A151+1","v":4},10194,"سالم",null,null,null,null,null,null,null,null,null,"R","R","R","VAC","VAC","VAC","VAC","VAC","R","R","A","VAC","VAC","VAC","VAC","VAC","R","R","M","M","M","M","M","M","M","M","M","M","M","M","M","M","M","M","M","M","M","M",{"$f":"COUNTIF($T208:$AX208,$AY$1)","v":4},"A","A","R","R","M","M","M","M","M","M","R",null,null,null,null,null,null,null,null,null,null,null,null,null,null,null,null,null,null,null,null,{"$f":"COUNTIF(AZ208:$CD208,$AY$1)","v":3}]
[]
[null,null,null,"M",null,null,null,null,null,null,null,null,{"$f":"COUNTIF(M$5:M$198,$D210)","v":0},0,0,9,8,8,9,{"$f":"COUNTIF(T$5:T$208,$D210)","v":9},9,9,17,17,28,29,27,30,28,{"$f":"COUNTIF(AD$5:AD$208,$D210)","v":32},39,36,37,40,40,37,37,40,39,{"$f":"COUNTIF(AN$5:AN$208,$D210)","v":43},39,42,46,45,45,44,43,45,46,47,null,{"$f":"COUNTIF(AZ$5:AZ$198,$D210)","v":47},47,47,47,46,46,45,45,{"$f":"COUNTIF(BH$5:BH$198,$D210)","v":45},45,47,47,47,47,47,{"$f":"COUNTIF(BO$5:BO$208,$D210)","v":47},0,0,0,0,0,0,0,0,0,0,0,0,0,0,0,{"$f":"COUNTIF(CE$5:CE$208,$D210)","v":0},0,0,0,0,0,0,0,0,0,0,0,0,0,0]
[null,null,null,"A",null,null,null,null,null,null,null,null,0,0,0,31,6,6,7,7,7,8,33,36,35,37,38,37,37,36,34,35,39,38,42,42,44,43,44,43,44,42,43,44,44,45,47,48,48,48,null,46,46,49,49,49,48,48,48,48,48,52,52,52,4,4,0,0,0,0,0,0,0,0,0,0,0,0,0,0,0,0,0,0,0,0,0,0,0,0,0,0,0,0,0,0,0]
[null,null,null,"H",null,null,null,null,null,null,null,null,1,1,1,7,6,5,5,6,19,19,19,19,19,19,39,34,37,38,35,40,40,42,42,43,43,43,37,37,39,35,38,39,40,37,40,36,38,41,null,48,48,48,48,48,48,46,46,46,46,46,46,45,45,45,1,0,0,0,0,0,0,0,0,0,0,0,0,0,0,0,0,0,0,0,0,0,0,0,0,0,0,0,0,0,0]
[null,null,null,"R",null,null,null,null,null,null,null,null,182,181,182,44,34,34,23,25,32,31,33,35,45,47,45,44,46,45,46,46,48,49,49,49,45,47,47,47,49,49,48,47,48,47,47,46,51,50,null,48,48,45,45,46,47,50,50,48,48,45,45,46,94,48,0,0,0,0,0,0,0,0,0,0,0,0,0,0,0,0,0,0,0,0,0,0,0,0,0,0,0,0,0,0,0]
[null,null,null,"A10",null,null,null,null,null,null,null,null,0,0,0,0,0,0,0,0,0,0,0,0,0,0,0,0,0,0,0,0,1,1,1,1,1,0,0,1,1,1,1,1,0,0,1,1,1,1,null,0,0,0,0,0,0,0,0,0,0,0,0,0,0,0,0,0,0,0,0,0,0,0,0,0,0,0,0,0,0,0,0,0,0,0,0,0,0,0,0,0,0,0,0,0,0]
[null,null,null,"Absent",null,null,null,null,null,null,null,null,0,0,0,0,0,0,0,{"$f":"COUNTIF(T$5:T$208,\"U\")","v":0},0,0,0,0,0,0,0,0,0,0,0,0,0,0,0,0,0,0,0,0,0,0,0,0,0,0,0,0,0,0,null,0,0,0,0,0,0,0,0,0,0,0,0,0,0,0,{"$f":"COUNTIF(BO$5:BO$208,\"U\")","v":0},0,0,0,0,0,0,0,0,0,0,0,0,0,0,0,0,0,0,0,0,0,0,0,0,0,0,0,0,0,0]
[null,null,null,"Vacation",null,null,null,null,null,null,null,null,0,0,0,0,0,0,0,{"$f":"COUNTIF(T$5:T$208,\"VAC\")","v":145},126,126,89,85,60,56,29,28,25,22,12,11,12,10,7,5,4,5,6,5,4,4,4,4,3,3,4,4,1,1,null,0,0,0,0,0,0,0,0,0,0,0,0,0,0,0,{"$f":"COUNTIF(BO$5:BO$208,\"VAC\")","v":0},0,0,0,0,0,0,0,0,0,0,0,0,0,0,0,0,0,0,0,0,0,0,0,0,0,0,0,0,0,0]
[null,null,null,"SICK",null,null,null,null,null,null,null,null,0,0,0,0,0,0,0,{"$f":"COUNTIF(T$5:T$208,\"SIK\")","v":0},{"$f":"COUNTIF(U$5:U$208,\"SIK\")","v":0},0,0,0,0,0,0,0,0,0,0,0,0,0,0,0,0,0,0,0,0,0,0,0,0,0,0,0,0,0,null,0,0,0,0,0,0,0,0,0,0,0,0,0,0,0,{"$f":"COUNTIF(BO$5:BO$208,\"SIK\")","v":0},{"$f":"COUNTIF(BP$5:BP$208,\"SIK\")","v":0},0,0,0,0,0,0,0,0,0,0,0,0,0,0,0,0,0,0,0,0,0,0,0,0,0,0,0,0,0]
[null,null,null,"EXR",null,null,null,null,null,null,null,null,{"$f":"COUNTIF(M$5:M$208,$D218)","v":0},0,0,0,0,0,0,{"$f":"COUNTIF(T$5:T$208,$D218)","v":0},{"$f":"COUNTIF(U$5:U$208,$D218)","v":0},0,2,0,4,5,14,20,19,19,27,24,16,14,12,17,19,16,20,18,18,20,14,13,14,17,12,13,9,5,null,0,0,0,0,0,0,0,0,{"$f":"COUNTIF(BH$5:BH$208,$D218)","v":0},0,0,0,0,0,0,{"$f":"COUNTIF(BO$5:BO$208,$D218)","v":0},{"$f":"COUNTIF(BP$5:BP$208,$D218)","v":0},0,0,0,0,0,0,0,0,0,0,0,0,0,0,0,0,0,0,0,0,0,0,0,0,0,0,0,0,0]