{"text_format":"1","workbook":"xlsx","n_sheets":2,"sheets":["البيانات","كشف حساب تفصيلي"],"not_rendered":{"charts":0,"images":0,"macros":1,"external_links":1,"defined_names":7,"comments":0,"pivot_tables":0},"unopened":[],"bounds":{"document_bytes":16777216,"sheet_cells":100000,"rows_first":2000,"rows_last":500,"rows_between":2000,"halvings":0,"cell_chars":16384,"cell_head_chars":4096},"cells_cut":0,"cells_raw":0,"read":"whole","date_system":"1900"}

{"sheet":"البيانات","index":0,"n_rows":654,"n_cols":22,"rows_kept":654,"cut":false,"hidden":false,"merged":[[1,3,2,7]]}
[null,null,null,null,null,null,null,null,"طـــباعـــة"]
[null,null,null,"الحــــــــــــــــــــــــــــــركات اليــــــــــــــــــومــــــــــــــية",null,null,null,null,"طـــباعـــة","طـــباعـــة"]
[]
[null,"م","التاريخ","إسم الحساب","مدين","دائن","رقم الفاتورة /سند","البيـــــــان","رقم المرجع","رقم المستند"]
[null,1,"2014-12-26","احمد",100,null,14578,"مبيعات",125,144,null,null,null,null,null,null,null,null,null,null,null,{"$f":"IFERROR(INDEX($D$5:$D$9000,MATCH(0,COUNTIF($V$4:$V4,$D$5:$D$9000),0)),\"\")","v":"احمد"}]
[null,2,"2014-12-30","احمد",200,null,255,"مبيعات",1452,54,null,null,null,null,null,null,null,null,null,null,null,{"$f":"IFERROR(INDEX($D$5:$D$9000,MATCH(0,COUNTIF($V$4:$V5,$D$5:$D$9000),0)),\"\")","v":"فايز"}]
[null,3,"2015-01-01","احمد",null,500,55545,"دفعه",2524,56,null,null,null,null,null,null,null,null,null,null,null,{"$f":"IFERROR(INDEX($D$5:$D$9000,MATCH(0,COUNTIF($V$4:$V6,$D$5:$D$9000),0)),\"\")","v":"شركة النور "}]
[null,4,"2015-01-02","احمد",null,500,255,"دفعه",554,549,null,null,null,null,null,null,null,null,null,null,null,{"$f":"IFERROR(INDEX($D$5:$D$9000,MATCH(0,COUNTIF($V$4:$V7,$D$5:$D$9000),0)),\"\")","v":"فارس"}]
[null,5,"2015-01-03","احمد",2000,null,564,"مبيعات",252,89,null,null,null,null,null,null,null,null,null,null,null,{"$f":"IFERROR(INDEX($D$5:$D$9000,MATCH(0,COUNTIF($V$4:$V8,$D$5:$D$9000),0)),\"\")","v":0}]
[null,6,"2015-01-06","احمد",5000,null,547,"مبيعات",2547,99,null,null,null,null,null,null,null,null,null,null,null,{"$f":"IFERROR(INDEX($D$5:$D$9000,MATCH(0,COUNTIF($V$4:$V9,$D$5:$D$9000),0)),\"\")","v":""}]
[null,7,"2019-07-06","فايز",10000,15000,600,"مبيعات ",100,100,null,null,null,null,null,null,null,null,null,null,null,{"$f":"IFERROR(INDEX($D$5:$D$9000,MATCH(0,COUNTIF($V$4:$V10,$D$5:$D$9000),0)),\"\")","v":""}]
[null,8,"2019-07-08","شركة النور ",2000,null,200,"مبيعات",150,120,null,null,null,null,null,null,null,null,null,null,null,{"$f":"IFERROR(INDEX($D$5:$D$9000,MATCH(0,COUNTIF($V$4:$V11,$D$5:$D$9000),0)),\"\")","v":""}]
[null,9,"2019-07-15","فارس",5000,null,201,"مبيعات",155,121,null,null,null,null,null,null,null,null,null,null,null,{"$f":"IFERROR(INDEX($D$5:$D$9000,MATCH(0,COUNTIF($V$4:$V12,$D$5:$D$9000),0)),\"\")","v":""}]
[null,null,null,null,null,null,null,null,null,null,null,null,null,null,null,null,null,null,null,null,null,{"$f":"IFERROR(INDEX($D$5:$D$9000,MATCH(0,COUNTIF($V$4:$V13,$D$5:$D$9000),0)),\"\")","v":""}]
[null,null,null,null,null,null,null,null,null,null,null,null,null,null,null,null,null,null,null,null,null,{"$f":"IFERROR(INDEX($D$5:$D$9000,MATCH(0,COUNTIF($V$4:$V14,$D$5:$D$9000),0)),\"\")","v":""}]
{"$rows_left_out":640}
{"sheet":"كشف حساب تفصيلي","index":1,"n_rows":106,"n_cols":13,"rows_kept":106,"cut":false,"hidden":false,"merged":[[105,8,105,9],[4,8,4,9],[1,5,1,7],[102,1,102,4],[102,6,102,7],[104,8,104,9],[8,1,8,4],[6,8,6,9],[6,6,6,7],[6,5,7,5],[6,4,7,4],[6,1,7,1],[6,3,7,3],[6,2,7,2]]}
[]
[null,null,null,null,2019,"كشــــف حـــركة حســـــاب            "]
[null,"الفترة من :-","2015-01-01",null,null,null,null,"الى :-","2019-08-01"]
[null,"اسم العميل :-","احمد"]
[null,"العنوان :-",null,null,null,"رقـم الحســـاب :-",1200045,"تاريخ الكشــف",{"$f":"NOW()","v":"2019-07-27T11:11:34.570"}]
[]
[null,"التاريخ","رقم المستند","رقم المرجع","رقم الحركـة","وصــــف الحـــركــة","قيمـــة الحــركة",null,"الرصيد"]
[null,null,null,null,null,null,"مدين","دائن","مدين","دائــن"]
[null,"رصيـــــــــــــــيد ســــــــــــــابق (اول المدة)",null,null,null,null,{"$f":"IFERROR(VLOOKUP(DATE(YEAR(C3),1,1)&$C$4,IF({1,0},البيانات!C5:C500&البيانات!D5:D500,البيانات!E5:E500),2,0),\"\")","v":0},{"$f":"IFERROR(VLOOKUP(DATE(YEAR(C3),1,1)&$C$4,IF({1,0},البيانات!C5:C500&البيانات!D5:D500,البيانات!F5:F500),2,0),\"\")","v":500},{"$f":"IF(B9=\"\",\"\",IF(SUM($G9:G$9)-SUM($H9:H$9)>0,SUM($G9:G$9)-SUM($H9:H$9),0))","v":0},{"$f":"IF(B9=\"\",\"\",IF(SUM($H9:H$9)-SUM($G9:G$9)>0,SUM($H9:H$9)-SUM($G9:G$9),0))","v":500}]
[null,{"$f":"IF(ROWS(B$10:B10)<=SUMPRODUCT((البيانات!$D$5:$D$4112=$C$4)*(البيانات!$C$5:$C$4112>=$C$3)*(البيانات!$C$5:$C$4112<=$I$3)),INDEX(البيانات!$C$5:$C$4112,SMALL(IF((البيانات!$D$5:$D$4112=$C$4)*(البيانات!$C$5:$C$4112>=$C$3)*(البيانات!$C$5:$C$4112<=$I$3),ROW(البيانات!$C$5:$C$4112)-ROW(البيانات!$C$5)+1),ROWS(B$10:B10))),\"\")","v":"2015-01-01"},{"$f":"IF(ROWS(B$10:B10)<=SUMPRODUCT((البيانات!$D$5:$D$4112=$C$4)*(البيانات!$C$5:$C$4112>=$C$3)*(البيانات!$C$5:$C$4112<=$I$3)),INDEX(البيانات!$J$5:$J$4112,SMALL(IF((البيانات!$D$5:$D$4112=$C$4)*(البيانات!$C$5:$C$4112>=$C$3)*(البيانات!$C$5:$C$4112<=$I$3),ROW(البيانات!$C$5:$C$4112)-ROW(البيانات!$C$5)+1),ROWS(B$10:B10))),\"\")","v":56},{"$f":"IF(ROWS(B$10:B10)<=SUMPRODUCT((البيانات!$D$5:$D$4112=$C$4)*(البيانات!$C$5:$C$4112>=$C$3)*(البيانات!$C$5:$C$4112<=$I$3)),INDEX(البيانات!$I$5:$I$4111,SMALL(IF((البيانات!$D$5:$D$4112=$C$4)*(البيانات!$C$5:$C$4112>=$C$3)*(البيانات!$C$5:$C$4112<=$I$3),ROW(البيانات!$C$5:$C$4112)-ROW(البيانات!$C$5)+1),ROWS(B$10:B10))),\"\")","v":2524},{"$f":"IF(ROWS(B$10:B10)<=SUMPRODUCT((البيانات!$D$5:$D$4112=$C$4)*(البيانات!$C$5:$C$4112>=$C$3)*(البيانات!$C$5:$C$4112<=$I$3)),INDEX(البيانات!$G$5:$G$4112,SMALL(IF((البيانات!$D$5:$D$4112=$C$4)*(البيانات!$C$5:$C$4112>=$C$3)*(البيانات!$C$5:$C$4112<=$I$3),ROW(البيانات!$C$5:$C$4112)-ROW(البيانات!$C$5)+1),ROWS(B$10:B10))),\"\")","v":55545},{"$f":"IF(ROWS(B$10:B10)<=SUMPRODUCT((البيانات!$D$5:$D$4112=$C$4)*(البيانات!$C$5:$C$4112>=$C$3)*(البيانات!$C$5:$C$4112<=$I$3)),INDEX(البيانات!$H$5:$H$4112,SMALL(IF((البيانات!$D$5:$D$4112=$C$4)*(البيانات!$C$5:$C$4112>=$C$3)*(البيانات!$C$5:$C$4112<=$I$3),ROW(البيانات!$C$5:$C$4112)-ROW(البيانات!$C$5)+1),ROWS(B$10:B10))),\"\")","v":"دفعه"},{"$f":"IF(ROWS(B$10:B10)<=SUMPRODUCT((البيانات!$D$5:$D$4112=$C$4)*(البيانات!$C$5:$C$4112>=$C$3)*(البيانات!$C$5:$C$4112<=$I$3)),INDEX(البيانات!$E$5:$E$4112,SMALL(IF((البيانات!$D$5:$D$4112=$C$4)*(البيانات!$C$5:$C$4112>=$C$3)*(البيانات!$C$5:$C$4112<=$I$3),ROW(البيانات!$C$5:$C$4112)-ROW(البيانات!$C$5)+1),ROWS(B$10:B10))),\"\")","v":0},{"$f":"IF(ROWS(B$10:B10)<=SUMPRODUCT((البيانات!$D$5:$D$4112=$C$4)*(البيانات!$C$5:$C$4112>=$C$3)*(البيانات!$C$5:$C$4112<=$I$3)),INDEX(البيانات!$F$5:$F$4112,SMALL(IF((البيانات!$D$5:$D$4112=$C$4)*(البيانات!$C$5:$C$4112>=$C$3)*(البيانات!$C$5:$C$4112<=$I$3),ROW(البيانات!$C$5:$C$4112)-ROW(البيانات!$C$5)+1),ROWS(B$10:B10))),\"\")","v":500},{"$f":"IF(B10=\"\",\"\",IF(SUM($G$9:G10)-SUM($H$9:H10)>0,SUM($G$9:G10)-SUM($H$9:H10),0))","v":0},{"$f":"IF(B10=\"\",\"\",IF(SUM($H$9:H10)-SUM($G$9:G10)>0,SUM($H$9:H10)-SUM($G$9:G10),0))","v":1000}]
[null,{"$f":"IF(ROWS(B$10:B11)<=SUMPRODUCT((البيانات!$D$5:$D$4112=$C$4)*(البيانات!$C$5:$C$4112>=$C$3)*(البيانات!$C$5:$C$4112<=$I$3)),INDEX(البيانات!$C$5:$C$4112,SMALL(IF((البيانات!$D$5:$D$4112=$C$4)*(البيانات!$C$5:$C$4112>=$C$3)*(البيانات!$C$5:$C$4112<=$I$3),ROW(البيانات!$C$5:$C$4112)-ROW(البيانات!$C$5)+1),ROWS(B$10:B11))),\"\")","v":"2015-01-02"},{"$f":"IF(ROWS(B$10:B11)<=SUMPRODUCT((البيانات!$D$5:$D$4112=$C$4)*(البيانات!$C$5:$C$4112>=$C$3)*(البيانات!$C$5:$C$4112<=$I$3)),INDEX(البيانات!$J$5:$J$4112,SMALL(IF((البيانات!$D$5:$D$4112=$C$4)*(البيانات!$C$5:$C$4112>=$C$3)*(البيانات!$C$5:$C$4112<=$I$3),ROW(البيانات!$C$5:$C$4112)-ROW(البيانات!$C$5)+1),ROWS(B$10:B11))),\"\")","v":549},{"$f":"IF(ROWS(B$10:B11)<=SUMPRODUCT((البيانات!$D$5:$D$4112=$C$4)*(البيانات!$C$5:$C$4112>=$C$3)*(البيانات!$C$5:$C$4112<=$I$3)),INDEX(البيانات!$I$5:$I$4111,SMALL(IF((البيانات!$D$5:$D$4112=$C$4)*(البيانات!$C$5:$C$4112>=$C$3)*(البيانات!$C$5:$C$4112<=$I$3),ROW(البيانات!$C$5:$C$4112)-ROW(البيانات!$C$5)+1),ROWS(B$10:B11))),\"\")","v":554},{"$f":"IF(ROWS(B$10:B11)<=SUMPRODUCT((البيانات!$D$5:$D$4112=$C$4)*(البيانات!$C$5:$C$4112>=$C$3)*(البيانات!$C$5:$C$4112<=$I$3)),INDEX(البيانات!$G$5:$G$4112,SMALL(IF((البيانات!$D$5:$D$4112=$C$4)*(البيانات!$C$5:$C$4112>=$C$3)*(البيانات!$C$5:$C$4112<=$I$3),ROW(البيانات!$C$5:$C$4112)-ROW(البيانات!$C$5)+1),ROWS(B$10:B11))),\"\")","v":255},{"$f":"IF(ROWS(B$10:B11)<=SUMPRODUCT((البيانات!$D$5:$D$4112=$C$4)*(البيانات!$C$5:$C$4112>=$C$3)*(البيانات!$C$5:$C$4112<=$I$3)),INDEX(البيانات!$H$5:$H$4112,SMALL(IF((البيانات!$D$5:$D$4112=$C$4)*(البيانات!$C$5:$C$4112>=$C$3)*(البيانات!$C$5:$C$4112<=$I$3),ROW(البيانات!$C$5:$C$4112)-ROW(البيانات!$C$5)+1),ROWS(B$10:B11))),\"\")","v":"دفعه"},{"$f":"IF(ROWS(B$10:B11)<=SUMPRODUCT((البيانات!$D$5:$D$4112=$C$4)*(البيانات!$C$5:$C$4112>=$C$3)*(البيانات!$C$5:$C$4112<=$I$3)),INDEX(البيانات!$E$5:$E$4112,SMALL(IF((البيانات!$D$5:$D$4112=$C$4)*(البيانات!$C$5:$C$4112>=$C$3)*(البيانات!$C$5:$C$4112<=$I$3),ROW(البيانات!$C$5:$C$4112)-ROW(البيانات!$C$5)+1),ROWS(B$10:B11))),\"\")","v":0},{"$f":"IF(ROWS(B$10:B11)<=SUMPRODUCT((البيانات!$D$5:$D$4112=$C$4)*(البيانات!$C$5:$C$4112>=$C$3)*(البيانات!$C$5:$C$4112<=$I$3)),INDEX(البيانات!$F$5:$F$4112,SMALL(IF((البيانات!$D$5:$D$4112=$C$4)*(البيانات!$C$5:$C$4112>=$C$3)*(البيانات!$C$5:$C$4112<=$I$3),ROW(البيانات!$C$5:$C$4112)-ROW(البيانات!$C$5)+1),ROWS(B$10:B11))),\"\")","v":500},{"$f":"IF(B11=\"\",\"\",IF(SUM($G$9:G11)-SUM($H$9:H11)>0,SUM($G$9:G11)-SUM($H$9:H11),0))","v":0},{"$f":"IF(B11=\"\",\"\",IF(SUM($H$9:H11)-SUM($G$9:G11)>0,SUM($H$9:H11)-SUM($G$9:G11),0))","v":1500}]
[null,{"$f":"IF(ROWS(B$10:B12)<=SUMPRODUCT((البيانات!$D$5:$D$4112=$C$4)*(البيانات!$C$5:$C$4112>=$C$3)*(البيانات!$C$5:$C$4112<=$I$3)),INDEX(البيانات!$C$5:$C$4112,SMALL(IF((البيانات!$D$5:$D$4112=$C$4)*(البيانات!$C$5:$C$4112>=$C$3)*(البيانات!$C$5:$C$4112<=$I$3),ROW(البيانات!$C$5:$C$4112)-ROW(البيانات!$C$5)+1),ROWS(B$10:B12))),\"\")","v":"2015-01-03"},{"$f":"IF(ROWS(B$10:B12)<=SUMPRODUCT((البيانات!$D$5:$D$4112=$C$4)*(البيانات!$C$5:$C$4112>=$C$3)*(البيانات!$C$5:$C$4112<=$I$3)),INDEX(البيانات!$J$5:$J$4112,SMALL(IF((البيانات!$D$5:$D$4112=$C$4)*(البيانات!$C$5:$C$4112>=$C$3)*(البيانات!$C$5:$C$4112<=$I$3),ROW(البيانات!$C$5:$C$4112)-ROW(البيانات!$C$5)+1),ROWS(B$10:B12))),\"\")","v":89},{"$f":"IF(ROWS(B$10:B12)<=SUMPRODUCT((البيانات!$D$5:$D$4112=$C$4)*(البيانات!$C$5:$C$4112>=$C$3)*(البيانات!$C$5:$C$4112<=$I$3)),INDEX(البيانات!$I$5:$I$4111,SMALL(IF((البيانات!$D$5:$D$4112=$C$4)*(البيانات!$C$5:$C$4112>=$C$3)*(البيانات!$C$5:$C$4112<=$I$3),ROW(البيانات!$C$5:$C$4112)-ROW(البيانات!$C$5)+1),ROWS(B$10:B12))),\"\")","v":252},{"$f":"IF(ROWS(B$10:B12)<=SUMPRODUCT((البيانات!$D$5:$D$4112=$C$4)*(البيانات!$C$5:$C$4112>=$C$3)*(البيانات!$C$5:$C$4112<=$I$3)),INDEX(البيانات!$G$5:$G$4112,SMALL(IF((البيانات!$D$5:$D$4112=$C$4)*(البيانات!$C$5:$C$4112>=$C$3)*(البيانات!$C$5:$C$4112<=$I$3),ROW(البيانات!$C$5:$C$4112)-ROW(البيانات!$C$5)+1),ROWS(B$10:B12))),\"\")","v":564},{"$f":"IF(ROWS(B$10:B12)<=SUMPRODUCT((البيانات!$D$5:$D$4112=$C$4)*(البيانات!$C$5:$C$4112>=$C$3)*(البيانات!$C$5:$C$4112<=$I$3)),INDEX(البيانات!$H$5:$H$4112,SMALL(IF((البيانات!$D$5:$D$4112=$C$4)*(البيانات!$C$5:$C$4112>=$C$3)*(البيانات!$C$5:$C$4112<=$I$3),ROW(البيانات!$C$5:$C$4112)-ROW(البيانات!$C$5)+1),ROWS(B$10:B12))),\"\")","v":"مبيعات"},{"$f":"IF(ROWS(B$10:B12)<=SUMPRODUCT((البيانات!$D$5:$D$4112=$C$4)*(البيانات!$C$5:$C$4112>=$C$3)*(البيانات!$C$5:$C$4112<=$I$3)),INDEX(البيانات!$E$5:$E$4112,SMALL(IF((البيانات!$D$5:$D$4112=$C$4)*(البيانات!$C$5:$C$4112>=$C$3)*(البيانات!$C$5:$C$4112<=$I$3),ROW(البيانات!$C$5:$C$4112)-ROW(البيانات!$C$5)+1),ROWS(B$10:B12))),\"\")","v":2000},{"$f":"IF(ROWS(B$10:B12)<=SUMPRODUCT((البيانات!$D$5:$D$4112=$C$4)*(البيانات!$C$5:$C$4112>=$C$3)*(البيانات!$C$5:$C$4112<=$I$3)),INDEX(البيانات!$F$5:$F$4112,SMALL(IF((البيانات!$D$5:$D$4112=$C$4)*(البيانات!$C$5:$C$4112>=$C$3)*(البيانات!$C$5:$C$4112<=$I$3),ROW(البيانات!$C$5:$C$4112)-ROW(البيانات!$C$5)+1),ROWS(B$10:B12))),\"\")","v":0},{"$f":"IF(B12=\"\",\"\",IF(SUM($G$9:G12)-SUM($H$9:H12)>0,SUM($G$9:G12)-SUM($H$9:H12),0))","v":500},{"$f":"IF(B12=\"\",\"\",IF(SUM($H$9:H12)-SUM($G$9:G12)>0,SUM($H$9:H12)-SUM($G$9:G12),0))","v":0}]
[null,{"$f":"IF(ROWS(B$10:B13)<=SUMPRODUCT((البيانات!$D$5:$D$4112=$C$4)*(البيانات!$C$5:$C$4112>=$C$3)*(البيانات!$C$5:$C$4112<=$I$3)),INDEX(البيانات!$C$5:$C$4112,SMALL(IF((البيانات!$D$5:$D$4112=$C$4)*(البيانات!$C$5:$C$4112>=$C$3)*(البيانات!$C$5:$C$4112<=$I$3),ROW(البيانات!$C$5:$C$4112)-ROW(البيانات!$C$5)+1),ROWS(B$10:B13))),\"\")","v":"2015-01-06"},{"$f":"IF(ROWS(B$10:B13)<=SUMPRODUCT((البيانات!$D$5:$D$4112=$C$4)*(البيانات!$C$5:$C$4112>=$C$3)*(البيانات!$C$5:$C$4112<=$I$3)),INDEX(البيانات!$J$5:$J$4112,SMALL(IF((البيانات!$D$5:$D$4112=$C$4)*(البيانات!$C$5:$C$4112>=$C$3)*(البيانات!$C$5:$C$4112<=$I$3),ROW(البيانات!$C$5:$C$4112)-ROW(البيانات!$C$5)+1),ROWS(B$10:B13))),\"\")","v":99},{"$f":"IF(ROWS(B$10:B13)<=SUMPRODUCT((البيانات!$D$5:$D$4112=$C$4)*(البيانات!$C$5:$C$4112>=$C$3)*(البيانات!$C$5:$C$4112<=$I$3)),INDEX(البيانات!$I$5:$I$4111,SMALL(IF((البيانات!$D$5:$D$4112=$C$4)*(البيانات!$C$5:$C$4112>=$C$3)*(البيانات!$C$5:$C$4112<=$I$3),ROW(البيانات!$C$5:$C$4112)-ROW(البيانات!$C$5)+1),ROWS(B$10:B13))),\"\")","v":2547},{"$f":"IF(ROWS(B$10:B13)<=SUMPRODUCT((البيانات!$D$5:$D$4112=$C$4)*(البيانات!$C$5:$C$4112>=$C$3)*(البيانات!$C$5:$C$4112<=$I$3)),INDEX(البيانات!$G$5:$G$4112,SMALL(IF((البيانات!$D$5:$D$4112=$C$4)*(البيانات!$C$5:$C$4112>=$C$3)*(البيانات!$C$5:$C$4112<=$I$3),ROW(البيانات!$C$5:$C$4112)-ROW(البيانات!$C$5)+1),ROWS(B$10:B13))),\"\")","v":547},{"$f":"IF(ROWS(B$10:B13)<=SUMPRODUCT((البيانات!$D$5:$D$4112=$C$4)*(البيانات!$C$5:$C$4112>=$C$3)*(البيانات!$C$5:$C$4112<=$I$3)),INDEX(البيانات!$H$5:$H$4112,SMALL(IF((البيانات!$D$5:$D$4112=$C$4)*(البيانات!$C$5:$C$4112>=$C$3)*(البيانات!$C$5:$C$4112<=$I$3),ROW(البيانات!$C$5:$C$4112)-ROW(البيانات!$C$5)+1),ROWS(B$10:B13))),\"\")","v":"مبيعات"},{"$f":"IF(ROWS(B$10:B13)<=SUMPRODUCT((البيانات!$D$5:$D$4112=$C$4)*(البيانات!$C$5:$C$4112>=$C$3)*(البيانات!$C$5:$C$4112<=$I$3)),INDEX(البيانات!$E$5:$E$4112,SMALL(IF((البيانات!$D$5:$D$4112=$C$4)*(البيانات!$C$5:$C$4112>=$C$3)*(البيانات!$C$5:$C$4112<=$I$3),ROW(البيانات!$C$5:$C$4112)-ROW(البيانات!$C$5)+1),ROWS(B$10:B13))),\"\")","v":5000},{"$f":"IF(ROWS(B$10:B13)<=SUMPRODUCT((البيانات!$D$5:$D$4112=$C$4)*(البيانات!$C$5:$C$4112>=$C$3)*(البيانات!$C$5:$C$4112<=$I$3)),INDEX(البيانات!$F$5:$F$4112,SMALL(IF((البيانات!$D$5:$D$4112=$C$4)*(البيانات!$C$5:$C$4112>=$C$3)*(البيانات!$C$5:$C$4112<=$I$3),ROW(البيانات!$C$5:$C$4112)-ROW(البيانات!$C$5)+1),ROWS(B$10:B13))),\"\")","v":0},{"$f":"IF(B13=\"\",\"\",IF(SUM($G$9:G13)-SUM($H$9:H13)>0,SUM($G$9:G13)-SUM($H$9:H13),0))","v":5500},{"$f":"IF(B13=\"\",\"\",IF(SUM($H$9:H13)-SUM($G$9:G13)>0,SUM($H$9:H13)-SUM($G$9:G13),0))","v":0}]
[null,{"$f":"IF(ROWS(B$10:B14)<=SUMPRODUCT((البيانات!$D$5:$D$4112=$C$4)*(البيانات!$C$5:$C$4112>=$C$3)*(البيانات!$C$5:$C$4112<=$I$3)),INDEX(البيانات!$C$5:$C$4112,SMALL(IF((البيانات!$D$5:$D$4112=$C$4)*(البيانات!$C$5:$C$4112>=$C$3)*(البيانات!$C$5:$C$4112<=$I$3),ROW(البيانات!$C$5:$C$4112)-ROW(البيانات!$C$5)+1),ROWS(B$10:B14))),\"\")","v":""},{"$f":"IF(ROWS(B$10:B14)<=SUMPRODUCT((البيانات!$D$5:$D$4112=$C$4)*(البيانات!$C$5:$C$4112>=$C$3)*(البيانات!$C$5:$C$4112<=$I$3)),INDEX(البيانات!$J$5:$J$4112,SMALL(IF((البيانات!$D$5:$D$4112=$C$4)*(البيانات!$C$5:$C$4112>=$C$3)*(البيانات!$C$5:$C$4112<=$I$3),ROW(البيانات!$C$5:$C$4112)-ROW(البيانات!$C$5)+1),ROWS(B$10:B14))),\"\")","v":""},{"$f":"IF(ROWS(B$10:B14)<=SUMPRODUCT((البيانات!$D$5:$D$4112=$C$4)*(البيانات!$C$5:$C$4112>=$C$3)*(البيانات!$C$5:$C$4112<=$I$3)),INDEX(البيانات!$I$5:$I$4111,SMALL(IF((البيانات!$D$5:$D$4112=$C$4)*(البيانات!$C$5:$C$4112>=$C$3)*(البيانات!$C$5:$C$4112<=$I$3),ROW(البيانات!$C$5:$C$4112)-ROW(البيانات!$C$5)+1),ROWS(B$10:B14))),\"\")","v":""},{"$f":"IF(ROWS(B$10:B14)<=SUMPRODUCT((البيانات!$D$5:$D$4112=$C$4)*(البيانات!$C$5:$C$4112>=$C$3)*(البيانات!$C$5:$C$4112<=$I$3)),INDEX(البيانات!$G$5:$G$4112,SMALL(IF((البيانات!$D$5:$D$4112=$C$4)*(البيانات!$C$5:$C$4112>=$C$3)*(البيانات!$C$5:$C$4112<=$I$3),ROW(البيانات!$C$5:$C$4112)-ROW(البيانات!$C$5)+1),ROWS(B$10:B14))),\"\")","v":""},{"$f":"IF(ROWS(B$10:B14)<=SUMPRODUCT((البيانات!$D$5:$D$4112=$C$4)*(البيانات!$C$5:$C$4112>=$C$3)*(البيانات!$C$5:$C$4112<=$I$3)),INDEX(البيانات!$H$5:$H$4112,SMALL(IF((البيانات!$D$5:$D$4112=$C$4)*(البيانات!$C$5:$C$4112>=$C$3)*(البيانات!$C$5:$C$4112<=$I$3),ROW(البيانات!$C$5:$C$4112)-ROW(البيانات!$C$5)+1),ROWS(B$10:B14))),\"\")","v":""},{"$f":"IF(ROWS(B$10:B14)<=SUMPRODUCT((البيانات!$D$5:$D$4112=$C$4)*(البيانات!$C$5:$C$4112>=$C$3)*(البيانات!$C$5:$C$4112<=$I$3)),INDEX(البيانات!$E$5:$E$4112,SMALL(IF((البيانات!$D$5:$D$4112=$C$4)*(البيانات!$C$5:$C$4112>=$C$3)*(البيانات!$C$5:$C$4112<=$I$3),ROW(البيانات!$C$5:$C$4112)-ROW(البيانات!$C$5)+1),ROWS(B$10:B14))),\"\")","v":""},{"$f":"IF(ROWS(B$10:B14)<=SUMPRODUCT((البيانات!$D$5:$D$4112=$C$4)*(البيانات!$C$5:$C$4112>=$C$3)*(البيانات!$C$5:$C$4112<=$I$3)),INDEX(البيانات!$F$5:$F$4112,SMALL(IF((البيانات!$D$5:$D$4112=$C$4)*(البيانات!$C$5:$C$4112>=$C$3)*(البيانات!$C$5:$C$4112<=$I$3),ROW(البيانات!$C$5:$C$4112)-ROW(البيانات!$C$5)+1),ROWS(B$10:B14))),\"\")","v":""},{"$f":"IF(B14=\"\",\"\",IF(SUM($G$9:G14)-SUM($H$9:H14)>0,SUM($G$9:G14)-SUM($H$9:H14),0))","v":""},{"$f":"IF(B14=\"\",\"\",IF(SUM($H$9:H14)-SUM($G$9:G14)>0,SUM($H$9:H14)-SUM($G$9:G14),0))","v":""}]
[null,{"$f":"IF(ROWS(B$10:B15)<=SUMPRODUCT((البيانات!$D$5:$D$4112=$C$4)*(البيانات!$C$5:$C$4112>=$C$3)*(البيانات!$C$5:$C$4112<=$I$3)),INDEX(البيانات!$C$5:$C$4112,SMALL(IF((البيانات!$D$5:$D$4112=$C$4)*(البيانات!$C$5:$C$4112>=$C$3)*(البيانات!$C$5:$C$4112<=$I$3),ROW(البيانات!$C$5:$C$4112)-ROW(البيانات!$C$5)+1),ROWS(B$10:B15))),\"\")","v":""},{"$f":"IF(ROWS(B$10:B15)<=SUMPRODUCT((البيانات!$D$5:$D$4112=$C$4)*(البيانات!$C$5:$C$4112>=$C$3)*(البيانات!$C$5:$C$4112<=$I$3)),INDEX(البيانات!$J$5:$J$4112,SMALL(IF((البيانات!$D$5:$D$4112=$C$4)*(البيانات!$C$5:$C$4112>=$C$3)*(البيانات!$C$5:$C$4112<=$I$3),ROW(البيانات!$C$5:$C$4112)-ROW(البيانات!$C$5)+1),ROWS(B$10:B15))),\"\")","v":""},{"$f":"IF(ROWS(B$10:B15)<=SUMPRODUCT((البيانات!$D$5:$D$4112=$C$4)*(البيانات!$C$5:$C$4112>=$C$3)*(البيانات!$C$5:$C$4112<=$I$3)),INDEX(البيانات!$I$5:$I$4111,SMALL(IF((البيانات!$D$5:$D$4112=$C$4)*(البيانات!$C$5:$C$4112>=$C$3)*(البيانات!$C$5:$C$4112<=$I$3),ROW(البيانات!$C$5:$C$4112)-ROW(البيانات!$C$5)+1),ROWS(B$10:B15))),\"\")","v":""},{"$f":"IF(ROWS(B$10:B15)<=SUMPRODUCT((البيانات!$D$5:$D$4112=$C$4)*(البيانات!$C$5:$C$4112>=$C$3)*(البيانات!$C$5:$C$4112<=$I$3)),INDEX(البيانات!$G$5:$G$4112,SMALL(IF((البيانات!$D$5:$D$4112=$C$4)*(البيانات!$C$5:$C$4112>=$C$3)*(البيانات!$C$5:$C$4112<=$I$3),ROW(البيانات!$C$5:$C$4112)-ROW(البيانات!$C$5)+1),ROWS(B$10:B15))),\"\")","v":""},{"$f":"IF(ROWS(B$10:B15)<=SUMPRODUCT((البيانات!$D$5:$D$4112=$C$4)*(البيانات!$C$5:$C$4112>=$C$3)*(البيانات!$C$5:$C$4112<=$I$3)),INDEX(البيانات!$H$5:$H$4112,SMALL(IF((البيانات!$D$5:$D$4112=$C$4)*(البيانات!$C$5:$C$4112>=$C$3)*(البيانات!$C$5:$C$4112<=$I$3),ROW(البيانات!$C$5:$C$4112)-ROW(البيانات!$C$5)+1),ROWS(B$10:B15))),\"\")","v":""},{"$f":"IF(ROWS(B$10:B15)<=SUMPRODUCT((البيانات!$D$5:$D$4112=$C$4)*(البيانات!$C$5:$C$4112>=$C$3)*(البيانات!$C$5:$C$4112<=$I$3)),INDEX(البيانات!$E$5:$E$4112,SMALL(IF((البيانات!$D$5:$D$4112=$C$4)*(البيانات!$C$5:$C$4112>=$C$3)*(البيانات!$C$5:$C$4112<=$I$3),ROW(البيانات!$C$5:$C$4112)-ROW(البيانات!$C$5)+1),ROWS(B$10:B15))),\"\")","v":""},{"$f":"IF(ROWS(B$10:B15)<=SUMPRODUCT((البيانات!$D$5:$D$4112=$C$4)*(البيانات!$C$5:$C$4112>=$C$3)*(البيانات!$C$5:$C$4112<=$I$3)),INDEX(البيانات!$F$5:$F$4112,SMALL(IF((البيانات!$D$5:$D$4112=$C$4)*(البيانات!$C$5:$C$4112>=$C$3)*(البيانات!$C$5:$C$4112<=$I$3),ROW(البيانات!$C$5:$C$4112)-ROW(البيانات!$C$5)+1),ROWS(B$10:B15))),\"\")","v":""},{"$f":"IF(B15=\"\",\"\",IF(SUM($G$9:G15)-SUM($H$9:H15)>0,SUM($G$9:G15)-SUM($H$9:H15),0))","v":""},{"$f":"IF(B15=\"\",\"\",IF(SUM($H$9:H15)-SUM($G$9:G15)>0,SUM($H$9:H15)-SUM($G$9:G15),0))","v":""}]
{"$rows_left_out":91}