{"text_format":"1","workbook":"xlsx","n_sheets":9,"sheets":["Form","Main of Month","31-07-2019","01-08-2019","03-08-2019","04-08-2019","05-08-2019","06-08-2019","31-08-2019"],"not_rendered":{"charts":0,"images":0,"macros":1,"external_links":0,"defined_names":151,"comments":0,"pivot_tables":0},"unopened":[],"bounds":{"document_bytes":16777216,"sheet_cells":100000,"rows_first":2000,"rows_last":500,"rows_between":2000,"halvings":0,"cell_chars":16384,"cell_head_chars":4096},"cells_cut":0,"cells_raw":0,"read":"whole","date_system":"1900"}

{"sheet":"Form","index":0,"n_rows":493,"n_cols":32,"rows_kept":493,"cut":false,"hidden":false,"merged":[]}
[null,null,null,null,null,null,null,null,null,null,null,null,null,null,null,"رجــــوع"]
["#","App. Date","Name","Surname","Pasaport No.","Date of birth","Note of status","Price $","Paid $","Route","Unpaid $","GT","Case of appl","TG.Gov",null,"رجــــوع","رجــــوع",null,null,"TOTAL"]
[null,null,null,null,null,null,null,null,{"$f":"IF(J3<>\"\",\"\",H3)","v":0},null,{"$f":"IF(AND(I3=\"\",J3<>\"\"),H3,\"\")","v":""},{"$f":"IF(C3=\"\",\"\",25)","v":""},null,{"$f":"IF(M3=\"Extractor\",62.5,0)","v":0},null,null,null,"DONE",null,"Total amount",null,"Net profit",null,"Route","Coun of Rout",null,"Total Unpaid",null,{"$f":"Noblanks(J2:J499)","v":"Route"},null,"Note of status","Count of Mistake"]
[null,null,null,null,null,null,null,null,0,null,"","",null,0,null,null,null,"CANCELLED",null,{"$f":"SUM(H2:H70)","v":0},null,{"$f":"T4-V14","v":0},null,{"$f":"IF(ISERROR(INDEX($AC$3:$AC$70,MATCH(0,COUNTIF($X$3:X3,$AC$3:$AC$69),0))),\"\",INDEX($AC$3:$AC$69,MATCH(0,COUNTIF($X$3:X3,$AC$3:$AC$69),0)))","v":""},{"$f":"IF(X4=\"\",\"\",COUNTIF(J2:J100,X4))","v":""},null,{"$f":"IF(X4<>\"\",SUMPRODUCT(--($J$2:$J$69=X4),$K$2:$K$69),\"\")","v":""},{"$f":"IF(K2=\"\",\"\",J2)","v":"Route"},{"$f":"Noblanks(J3:J500)","v":""},null,"MISTAKE IN DOB",{"$f":"COUNTIF(C2:C70,\"Mistake\")","v":0}]
[null,null,null,null,null,null,null,null,0,null,"","",null,0,null,null,null,"REFUSED",null,null,null,null,null,{"$f":"IF(ISERROR(INDEX($AC$3:$AC$70,MATCH(0,COUNTIF($X$3:X4,$AC$3:$AC$69),0))),\"\",INDEX($AC$3:$AC$69,MATCH(0,COUNTIF($X$3:X4,$AC$3:$AC$69),0)))","v":""},"",null,"",{"$f":"IF(K3=\"\",\"\",J3)","v":""},{"$f":"Noblanks(J4:J501)","v":""}]
[null,null,null,null,null,null,null,null,0,null,"","",null,0,null,null,null,"MISTAKE",null,"Total Paid",null,"Difrent amount",null,{"$f":"IF(ISERROR(INDEX($AC$3:$AC$70,MATCH(0,COUNTIF($X$3:X5,$AC$3:$AC$69),0))),\"\",INDEX($AC$3:$AC$69,MATCH(0,COUNTIF($X$3:X5,$AC$3:$AC$69),0)))","v":""},"",{"$f":"IF(K2=\"\",\"\",J2)","v":"Route"},{"$f":"IF(X6<>\"\",SUMPRODUCT(--($J$2:$J$69=X6),$K$2:$K$69),\"\")","v":""},"",{"$f":"Noblanks(J5:J502)","v":""}]
[null,null,null,null,null,null,null,null,0,null,"","",null,0,null,null,null,"GREEN PASS.",null,{"$f":"SUM(I2:I70)","v":0},null,{"$f":"T4-(T7+T10)","v":0},null,{"$f":"IF(ISERROR(INDEX($AC$3:$AC$70,MATCH(0,COUNTIF($X$3:X6,$AC$3:$AC$69),0))),\"\",INDEX($AC$3:$AC$69,MATCH(0,COUNTIF($X$3:X6,$AC$3:$AC$69),0)))","v":""},{"$f":"IF(X7=\"\",\"\",COUNTIF(J5:J103,X7))","v":""},"","","",{"$f":"Noblanks(J6:J503)","v":""}]
[null,null,null,null,null,null,null,null,0,null,"","",null,0,null,null,null,null,null,null,null,null,null,{"$f":"IF(ISERROR(INDEX($AC$3:$AC$70,MATCH(0,COUNTIF($X$3:X7,$AC$3:$AC$69),0))),\"\",INDEX($AC$3:$AC$69,MATCH(0,COUNTIF($X$3:X7,$AC$3:$AC$69),0)))","v":""},"","","","",{"$f":"Noblanks(J7:J504)","v":""}]
[null,null,null,null,null,null,null,null,0,null,"","",null,0,null,null,null,"official time",null,"Total UnPaid",null,"No. of applicants",null,{"$f":"IF(ISERROR(INDEX($AC$3:$AC$70,MATCH(0,COUNTIF($X$3:X8,$AC$3:$AC$69),0))),\"\",INDEX($AC$3:$AC$69,MATCH(0,COUNTIF($X$3:X8,$AC$3:$AC$69),0)))","v":""},"","","","",{"$f":"Noblanks(J8:J505)","v":""}]
[null,null,null,null,null,null,null,null,0,null,"","",null,0,null,null,null,"official holiday",null,{"$f":"SUM(K2:K70)","v":0},null,{"$f":"COUNT(B:B)","v":0},null,{"$f":"IF(ISERROR(INDEX($AC$3:$AC$70,MATCH(0,COUNTIF($X$3:X9,$AC$3:$AC$69),0))),\"\",INDEX($AC$3:$AC$69,MATCH(0,COUNTIF($X$3:X9,$AC$3:$AC$69),0)))","v":""},"","","","",{"$f":"Noblanks(J9:J506)","v":""}]
[null,null,null,null,null,null,null,null,0,null,"","",null,0,null,null,null,"other",null,null,null,null,null,{"$f":"IF(ISERROR(INDEX($AC$3:$AC$70,MATCH(0,COUNTIF($X$3:X10,$AC$3:$AC$69),0))),\"\",INDEX($AC$3:$AC$69,MATCH(0,COUNTIF($X$3:X10,$AC$3:$AC$69),0)))","v":""},"","","","",{"$f":"Noblanks(J10:J507)","v":""}]
[null,null,null,null,null,null,null,null,0,null,"","",null,0,null,null,null,null,null,"Total GT",null,null,null,{"$f":"IF(ISERROR(INDEX($AC$3:$AC$70,MATCH(0,COUNTIF($X$3:X11,$AC$3:$AC$69),0))),\"\",INDEX($AC$3:$AC$69,MATCH(0,COUNTIF($X$3:X11,$AC$3:$AC$69),0)))","v":""},"","","","",{"$f":"Noblanks(J11:J508)","v":""}]
[null,null,null,null,null,null,null,null,0,null,"","",null,0,null,null,null,null,null,{"$f":"SUM(L2:L70)","v":0},null,"Cost amount",null,{"$f":"IF(ISERROR(INDEX($AC$3:$AC$70,MATCH(0,COUNTIF($X$3:X12,$AC$3:$AC$69),0))),\"\",INDEX($AC$3:$AC$69,MATCH(0,COUNTIF($X$3:X12,$AC$3:$AC$69),0)))","v":""},"","","","",{"$f":"Noblanks(J12:J509)","v":""}]
[null,null,null,null,null,null,null,null,0,null,"","",null,0,null,null,null,null,null,null,null,{"$f":"IF(AND(T13<>\"\",T16<>\"\"),T13+T16,\"\")","v":0},null,{"$f":"IF(ISERROR(INDEX($AC$3:$AC$70,MATCH(0,COUNTIF($X$3:X13,$AC$3:$AC$69),0))),\"\",INDEX($AC$3:$AC$69,MATCH(0,COUNTIF($X$3:X13,$AC$3:$AC$69),0)))","v":""},"","","","",{"$f":"Noblanks(J13:J510)","v":""}]
[null,null,null,null,null,null,null,null,0,null,"","",null,0,null,null,null,null,null,"Total T.Gov",null,null,null,{"$f":"IF(ISERROR(INDEX($AC$3:$AC$70,MATCH(0,COUNTIF($X$3:X14,$AC$3:$AC$69),0))),\"\",INDEX($AC$3:$AC$69,MATCH(0,COUNTIF($X$3:X14,$AC$3:$AC$69),0)))","v":""},"","","","",{"$f":"Noblanks(J14:J511)","v":""}]
[null,null,null,null,null,null,null," "," ",null,"","",null,0,null,null,null,null,null,{"$f":"SUM(N2:N70)","v":0},null,null,null,{"$f":"IF(ISERROR(INDEX($AC$3:$AC$70,MATCH(0,COUNTIF($X$3:X15,$AC$3:$AC$69),0))),\"\",INDEX($AC$3:$AC$69,MATCH(0,COUNTIF($X$3:X15,$AC$3:$AC$69),0)))","v":""},"","","","",{"$f":"Noblanks(J15:J512)","v":""}]
[null,null,null,null,null,null,null," "," ",null,{"$f":"IF(AND(I17=\"\",J17<>\"\"),H17,\"\")","v":""},"",null,0,null,null,null,null,null,null,null,null,null,{"$f":"IF(ISERROR(INDEX($AC$3:$AC$70,MATCH(0,COUNTIF($X$3:X16,$AC$3:$AC$69),0))),\"\",INDEX($AC$3:$AC$69,MATCH(0,COUNTIF($X$3:X16,$AC$3:$AC$69),0)))","v":""},"","","","",{"$f":"Noblanks(J16:J513)","v":""}]
[null,null,null,null,null,null," "," "," ",null,{"$f":"IF(AND(I18=\"\",J18<>\"\"),H18,\"\")","v":""},"",null,0,null,null,null,null,null,null,null,null,null,{"$f":"IF(ISERROR(INDEX($AC$3:$AC$70,MATCH(0,COUNTIF($X$3:X17,$AC$3:$AC$69),0))),\"\",INDEX($AC$3:$AC$69,MATCH(0,COUNTIF($X$3:X17,$AC$3:$AC$69),0)))","v":""},"","","","",{"$f":"Noblanks(J17:J514)","v":""}]
[null,null,null,null,null,null," "," "," ",null,"","",null,0,null,null,null,null,null,null,null,null,null,{"$f":"IF(ISERROR(INDEX($AC$3:$AC$70,MATCH(0,COUNTIF($X$3:X18,$AC$3:$AC$69),0))),\"\",INDEX($AC$3:$AC$69,MATCH(0,COUNTIF($X$3:X18,$AC$3:$AC$69),0)))","v":""},"","","","",{"$f":"Noblanks(J18:J515)","v":""}]
[null,null,null,null,null,null," "," "," ",null,"","",null,0,null,null,null,null,null,null,null,null,null,{"$f":"IF(ISERROR(INDEX($AC$3:$AC$70,MATCH(0,COUNTIF($X$3:X19,$AC$3:$AC$69),0))),\"\",INDEX($AC$3:$AC$69,MATCH(0,COUNTIF($X$3:X19,$AC$3:$AC$69),0)))","v":""},"","","","",{"$f":"Noblanks(J19:J516)","v":""}]
[null,null,null,null,null,null," ",null,0,null,"","",null,0,null,null,null,null,null,null,null,null,null,{"$f":"IF(ISERROR(INDEX($AC$3:$AC$70,MATCH(0,COUNTIF($X$3:X20,$AC$3:$AC$69),0))),\"\",INDEX($AC$3:$AC$69,MATCH(0,COUNTIF($X$3:X20,$AC$3:$AC$69),0)))","v":""},"","","","",{"$f":"Noblanks(J20:J517)","v":""}]
[null,null,null,null,null,null," ",null,0,null,"","",null,0,null,null,null,null,null,null,null,null,null,{"$f":"IF(ISERROR(INDEX($AC$3:$AC$70,MATCH(0,COUNTIF($X$3:X21,$AC$3:$AC$69),0))),\"\",INDEX($AC$3:$AC$69,MATCH(0,COUNTIF($X$3:X21,$AC$3:$AC$69),0)))","v":""},"","","","",{"$f":"Noblanks(J21:J518)","v":""},null,null,{"$f":"IFERROR(INDEX($J$2:$J$492,SMALL(IF($J$2:$J$492<>\"\",ROW($J$1:$J$492)-ROW($J$2)+1,\"\"),ROWS(AF$21:$AJ22))),\"\")","v":""}]
[null,null,null,null,null,null," ",null,0,null,"","",null,0,null,null,null,null,null,null,null,"Done",null,null,{"$f":"Noblanks(Z25:Z518)","v":""},null,{"$f":"IFERROR(INDEX($J$2:$J$492,SMALL(IF($J$2:$J$492<>\"\",ROW($J$1:$J$492)-ROW($J$2)+1,\"\"),ROWS(AF$21:$AJ23))),\"\")","v":""},"",{"$f":"Noblanks(J22:J519)","v":""}]
[null,null,null,null,null,null," ",null,{"$f":"IF(J24<>\"\",\"\",H24)","v":0},null,"","",null,0,null,null,null,null,null,null,null,"Cancelled",null,null,null,"",null,"",{"$f":"Noblanks(J23:J520)","v":""},null,null,{"$f":"IFERROR(INDEX($J$2:$J$492,SMALL(IF($J$2:$J$492<>\"\",ROW($J$1:$J$492)-ROW($J$2)+1,\"\"),ROWS(AF$21:$AJ24))),\"\")","v":""}]
[null,null,null,null,null,null," ",null,0,null,"","",null,0,null,null,null,null,null,null,null,"Refused",null,null,null,"",null,"",{"$f":"Noblanks(J24:J521)","v":""},null,null,{"$f":"IFERROR(INDEX($J$2:$J$492,SMALL(IF($J$2:$J$492<>\"\",ROW($J$1:$J$492)-ROW($J$2)+1,\"\"),ROWS(AF$21:$AJ25))),\"\")","v":""}]
[null,null,null,null,null,null," ",null,0,null,"","",null,0,null,null,null,null,null,null,null,"Green pass.",null,null,null,"",null,"",{"$f":"Noblanks(J25:J522)","v":""}]
[null,null,null,null,null,null," ",null,0,null,"","",null,0,null,null,null,null,null,null,null,"Mistake",null,null,null,"",null,"",{"$f":"Noblanks(J26:J523)","v":""}]
[null,null,null,null,null,null," ",null,0,null,"","",null,0,null,null,null,null,null,null,null,null,null,null,null,"",null,"",{"$f":"Noblanks(J27:J524)","v":""}]
[null,null,null,null,null,null," ",null,0,null,"","",null,0,null,null,null,null,null,null,null,null,null,null,null,"",null,"",{"$f":"Noblanks(J28:J525)","v":""}]
[null,null,null,null,null,null," ",null,0,null,"","",null,0,null,null,null,null,null,null,null,null,null,null,null,"",null,"",{"$f":"Noblanks(J29:J526)","v":""}]
[null,null,null,null,null,null," ",null,0,null,"","",null,0,null,null,null,null,null,null,null,null,null,null,null,"",null,"",{"$f":"Noblanks(J30:J527)","v":""}]
[null,null,null,null,null,null," ",null,0,null,"","",null,0,null,null,null,null,null,null,null,null,null,null,null,"",null,"",{"$f":"Noblanks(J31:J528)","v":""}]
[null,null,null,null,null,null," ",null,0,null,"","",null,0,null,null,null,null,null,null,null,null,null,null,null,"",null,"",{"$f":"Noblanks(J32:J529)","v":""}]
[null,null,null,null,null,null," ",null,0,null,"","",null,0,null,null,null,null,null,null,null,null,null,null,null,"",null,"",{"$f":"Noblanks(J33:J530)","v":""}]
[null,null,null,null,null,null," ",null,0,null,"","",null,0,null,null,null,null,null,null,null,null,null,null,null,"",null,"",{"$f":"Noblanks(J34:J531)","v":""}]
[null,null,null,null,null,null," ",null,0,null,"","",null,0,null,null,null,null,null,null,null,null,null,null,null,"",null,"",{"$f":"Noblanks(J35:J532)","v":""}]
[null,null,null,null,null,null," ",null,0,null,"","",null,0,null,null,null,null,null,null,null,null,null,null,null,"",null,"",{"$f":"Noblanks(J36:J533)","v":""}]
[null,null,null,null,null,null," ",null,0,null,"","",null,0,null,null,null,null,null,null,null,null,null,null,null,"",null,"",{"$f":"Noblanks(J37:J534)","v":""}]
[null,null,null,null,null,null," ",null,0,null,"","",null,0,null,null,null,null,null,null,null,null,null,null,null,"",null,"",{"$f":"Noblanks(J38:J535)","v":""}]
[null,null,null,null,null,null," ",null,0,null,"","",null,0,null,null,null,null,null,null,null,null,null,null,null,"",null,"",{"$f":"Noblanks(J39:J536)","v":""}]
[null,null,null,null,null,null," ",null,0,null,"","",null,0,null,null,null,null,null,null,null,null,null,null,null,"",null,"",{"$f":"Noblanks(J40:J537)","v":""}]
[null,null,null,null,null,null," ",null,0,null,"","",null,0,null,null,null,null,null,null,null,null,null,null,null,"",null,"",{"$f":"Noblanks(J41:J538)","v":""}]
[null,null,null,null,null,null," ",null,0,null,"","",null,0,null,null,null,null,null,null,null,null,null,null,null,"",null,"",{"$f":"Noblanks(J42:J539)","v":""}]
[null,null,null,null,null,null," ",null,0,null,"","",null,0,null,null,null,null,null,null,null,null,null,null,null,"",null,"",{"$f":"Noblanks(J43:J540)","v":""}]
[null,null,null,null,null,null," ",null,0,null,"","",null,0,null,null,null,null,null,null,null,null,null,null,null,"",null,"",{"$f":"Noblanks(J44:J541)","v":""}]
[null,null,null,null,null,null," ",null,0,null,"","",null,0,null,null,null,null,null,null,null,null,null,null,null,"",null,"",{"$f":"Noblanks(J45:J542)","v":""}]
[null,null,null,null,null,null," ",null,0,null,"","",null,0,null,null,null,null,null,null,null,null,null,null,null,"",null,"",{"$f":"Noblanks(J46:J543)","v":""}]
[null,null,null,null,null,null," ",null,0,null,"","",null,0,null,null,null,null,null,null,null,null,null,null,null,"",null,"",{"$f":"Noblanks(J47:J544)","v":""}]
[null,null,null,null,null,null," ",null,0,null,"","",null,0,null,null,null,null,null,null,null,null,null,null,null,"",null,"",{"$f":"Noblanks(J48:J545)","v":""}]
[null,null,null,null,null,null," ",null,0,null,"","",null,0,null,null,null,null,null,null,null,null,null,null,null,"",null,"",{"$f":"Noblanks(J49:J546)","v":""}]
[null,null,null,null,null,null," ",null,0,null,"","",null,0,null,null,null,null,null,null,null,null,null,null,null,"",null,"",{"$f":"Noblanks(J50:J547)","v":""}]
[null,null,null,null,null,null," ",null,0,null,"","",null,0,null,null,null,null,null,null,null,null,null,null,null,"",null,"",{"$f":"Noblanks(J51:J548)","v":""}]
[null,null,null,null,null,null," ",null,0,null,"","",null,0,null,null,null,null,null,null,null,null,null,null,null,"",null,"",{"$f":"Noblanks(J52:J549)","v":""}]
[null,null,null,null,null,null," ",null,0,null,"","",null,0,null,null,null,null,null,null,null,null,null,null,null,"",null,"",{"$f":"Noblanks(J53:J550)","v":""}]
[null,null,null,null,null,null," ",null,0,null,"","",null,0,null,null,null,null,null,null,null,null,null,null,null,"",null,"",{"$f":"Noblanks(J54:J551)","v":""}]
[null,null,null,null,null,null," ",null,0,null,"","",null,0,null,null,null,null,null,null,null,null,null,null,null,"",null,"",{"$f":"Noblanks(J55:J552)","v":""}]
[null,null,null,null,null,null," ",null,0,null,"","",null,0,null,null,null,null,null,null,null,null,null,null,null,"",null,"",{"$f":"Noblanks(J56:J553)","v":""}]
[null,null,null,null,null,null," ",null,0,null,"","",null,0,null,null,null,null,null,null,null,null,null,null,null,"",null,"",{"$f":"Noblanks(J57:J554)","v":""}]
[null,null,null,null,null,null," ",null,0,null,"","",null,0,null,null,null,null,null,null,null,null,null,null,null,"",null,"",{"$f":"Noblanks(J58:J555)","v":""}]
[null,null,null,null,null,null," ",null,0,null,"","",null,0,null,null,null,null,null,null,null,null,null,null,null,"",null,"",{"$f":"Noblanks(J59:J556)","v":""}]
[null,null,null,null,null,null," ",null,0,null,"","",null,0,null,null,null,null,null,null,null,null,null,null,null,"",null,"",{"$f":"Noblanks(J60:J557)","v":""}]
[null,null,null,null,null,null," ",null,0,null,"","",null,0,null,null,null,null,null,null,null,null,null,null,null,"",null,"",{"$f":"Noblanks(J61:J558)","v":""}]
[null,null,null,null,null,null," ",null,0,null,"","",null,0,null,null,null,null,null,null,null,null,null,null,null,"",null,"",{"$f":"Noblanks(J62:J559)","v":""}]
[null,null,null,null,null,null," ",null,0,null,{"$f":"IF(AND(I64=\"\",J64<>\"\"),H64,\"\")","v":""},"",null,0,null,null,null,null,null,null,null,null,null,null,null,"",null,"",{"$f":"Noblanks(J63:J560)","v":""}]
[null,null,null,null,null,null," ",null,0,null,{"$f":"IF(AND(I65=\"\",J65<>\"\"),H65,\"\")","v":""},"",null,0,null,null,null,null,null,null,null,null,null,null,null,"",null,"",{"$f":"Noblanks(J64:J561)","v":""}]
[null,null,null,null,null,null," ",null,0,null,"","",null,0,null,null,null,null,null,null,null,null,null,null,null,"",null,"",{"$f":"Noblanks(J65:J562)","v":""}]
[null,null,null,null,null,null," ",null,{"$f":"IF(J67<>\"\",\"\",H67)","v":0},null,"",{"$f":"IF(C67=\"\",\"\",25)","v":""},null,{"$f":"IF(M67=\"Extractor\",62.5,0)","v":0},null,null,null,null,null,null,null,null,null,null,null,"",null,"",{"$f":"Noblanks(J66:J563)","v":""}]
[null,null,null,null,null,null," ",null,0,null,"","",null,0,null,null,null,null,null,null,null,null,null,null,null,"",null,"",{"$f":"Noblanks(J67:J564)","v":""}]
[null,null,null,null,null,null," ",null,0,null,"","",null,0,null,null,null,null,null,null,null,null,null,null,null,"",null,{"$f":"IF(K67=\"\",\"\",J67)","v":""},{"$f":"Noblanks(J68:J565)","v":""}]
[null,null,null,null,null,null," ",null,0,null,"","",null,0,null,null,null,null,null,null,null,null,null,null,null,{"$f":"IF(K66=\"\",\"\",J66)","v":""},null,"",{"$f":"Noblanks(J69:J566)","v":""}]
[null,null,null,null,null,null," "," ",null,null,null,null,null,null,null,null,null,null,null,null,null,null,null,null,null,"",null,"",{"$f":"Noblanks(J70:J567)","v":""}]
[null,null,null,null,null,null," "," ",null,null,null,null,null,null,null,null,null,null,null,null,null,null,null,null,null,"",null,null,{"$f":"Noblanks(J71:J568)","v":""}]
[null,null,null,null,null,null," "," ",null,null,null,null,null,null,null,null,null,null,null,null,null,null,null,null,null,"",null,null,{"$f":"Noblanks(J72:J569)","v":""}]
[null,null,null,null,null,null," "," ",null,null,null,null,null,null,null,null,null,null,null,null,null,null,null,null,null,"",null,null,{"$f":"Noblanks(J73:J570)","v":""}]
[null,null,null,null,null,null," "," ",null,null,null,null,null,null,null,null,null,null,null,null,null,null,null,null,null,"",null,null,{"$f":"Noblanks(J74:J571)","v":""}]
[null,null,null,null,null,null," "," ",null,null,null,null,null,null,null,null,null,null,null,null,null,null,null,null,null,"",null,null,{"$f":"Noblanks(J75:J572)","v":""}]
[null,null,null,null,null,null," "," ",null,null,null,null,null,null,null,null,null,null,null,null,null,null,null,null,null,"",null,null,{"$f":"Noblanks(J76:J573)","v":""}]
[null,null,null,null,null,null," "," ",null,null,null,null,null,null,null,null,null,null,null,null,null,null,null,null,null,"",null,null,{"$f":"Noblanks(J77:J574)","v":""}]
[null,null,null,null,null,null," "," ",null,null,null,null,null,null,null,null,null,null,null,null,null,null,null,null,null,"",null,null,{"$f":"Noblanks(J78:J575)","v":""}]
[null,null,null,null,null,null," "," ",null,null,null,null,null,null,null,null,null,null,null,null,null,null,null,null,null,"",null,null,{"$f":"Noblanks(J79:J576)","v":""}]
[null,null,null,null,null,null," "," ",null,null,null,null,null,null,null,null,null,null,null,null,null,null,null,null,null,"",null,null,{"$f":"Noblanks(J80:J577)","v":""}]
[null,null,null,null,null,null," "," ",null,null,null,null,null,null,null,null,null,null,null,null,null,null,null,null,null,"",null,null,{"$f":"Noblanks(J81:J578)","v":""}]
[null,null,null,null,null,null," "," ",null,null,null,null,null,null,null,null,null,null,null,null,null,null,null,null,null,"",null,null,{"$f":"Noblanks(J82:J579)","v":""}]
[null,null,null,null,null,null," "," ",null,null,null,null,null,null,null,null,null,null,null,null,null,null,null,null,null,"",null,null,{"$f":"Noblanks(J83:J580)","v":""}]
[null,null,null,null,null,null," "," ",null,null,null,null,null,null,null,null,null,null,null,null,null,null,null,null,null,"",null,null,{"$f":"Noblanks(J84:J581)","v":""}]
[null,null,null,null,null,null," "," ",null,null,null,null,null,null,null,null,null,null,null,null,null,null,null,null,null,"",null,null,{"$f":"Noblanks(J85:J582)","v":""}]
[null,null,null,null,null,null," "," ",null,null,null,null,null,null,null,null,null,null,null,null,null,null,null,null,null,"",null,null,{"$f":"Noblanks(J86:J583)","v":""}]
[null,null,null,null,null,null," "," ",null,null,null,null,null,null,null,null,null,null,null,null,null,null,null,null,null,"",null,null,{"$f":"Noblanks(J87:J584)","v":""}]
[null,null,null,null,null,null," "," ",null,null,null,null,null,null,null,null,null,null,null,null,null,null,null,null,null,"",null,null,{"$f":"Noblanks(J88:J585)","v":""}]
[null,null,null,null,null,null," "," ",null,null,null,null,null,null,null,null,null,null,null,null,null,null,null,null,null,"",null,null,{"$f":"Noblanks(J89:J586)","v":""}]
[null,null,null,null,null,null," "," ",null,null,null,null,null,null,null,null,null,null,null,null,null,null,null,null,null,"",null,null,{"$f":"Noblanks(J90:J587)","v":""}]
[null,null,null,null,null,null," "," ",null,null,null,null,null,null,null,null,null,null,null,null,null,null,null,null,null,"",null,null,{"$f":"Noblanks(J91:J588)","v":""}]
[null,null,null,null,null,null," "," ",null,null,null,null,null,null,null,null,null,null,null,null,null,null,null,null,null,"",null,null,{"$f":"Noblanks(J92:J589)","v":""}]
[null,null,null,null,null,null," ",null,null,null,null,null,null,null,null,null,null,null,null,null,null,null,null,null,null,"",null,null,{"$f":"Noblanks(J93:J590)","v":""}]
[null,null,null,null,null,null," ",null,null,null,null,null,null,null,null,null,null,null,null,null,null,null,null,null,null,"",null,null,{"$f":"Noblanks(J94:J591)","v":""}]
[null,null,null,null,null,null," ",null,null,null,null,null,null,null,null,null,null,null,null,null,null,null,null,null,null,"",null,null,{"$f":"Noblanks(J95:J592)","v":""}]
[null,null,null,null,null,null," ",null,null,null,null,null,null,null,null,null,null,null,null,null,null,null,null,null,null,"",null,null,{"$f":"Noblanks(J96:J593)","v":""}]
[null,null,null,null,null,null," ",null,null,null,null,null,null,null,null,null,null,null,null,null,null,null,null,null,null,"",null,null,{"$f":"Noblanks(J97:J594)","v":""}]
[null,null,null,null,null,null," ",null,null,null,null,null,null,null,null,null,null,null,null,null,null,null,null,null,null,"",null,null,{"$f":"Noblanks(J98:J595)","v":""}]
[null,null,null,null,null,null," ",null,null,null,null,null,null,null,null,null,null,null,null,null,null,null,null,null,null,"",null,null,{"$f":"Noblanks(J99:J596)","v":""}]
[null,null,null,null,null,null," ",null,null,null,null,null,null,null,null,null,null,null,null,null,null,null,null,null,null,"",null,null,{"$f":"Noblanks(J100:J597)","v":""}]
[null,null,null,null,null,null," ",null,null,null,null,null,null,null,null,null,null,null,null,null,null,null,null,null,null,"",null,null,{"$f":"Noblanks(J101:J598)","v":""}]
[null,null,null,null,null,null," ",null,null,null,null,null,null,null,null,null,null,null,null,null,null,null,null,null,null,null,null,null,{"$f":"Noblanks(J102:J599)","v":""}]
[null,null,null,null,null,null," ",null,null,null,null,null,null,null,null,null,null,null,null,null,null,null,null,null,null,null,null,null,{"$f":"Noblanks(J103:J600)","v":""}]
[null,null,null,null,null,null," ",null,null,null,null,null,null,null,null,null,null,null,null,null,null,null,null,null,null,null,null,null,{"$f":"Noblanks(J104:J601)","v":""}]
[null,null,null,null,null,null," ",null,null,null,null,null,null,null,null,null,null,null,null,null,null,null,null,null,null,null,null,null,{"$f":"Noblanks(J105:J602)","v":""}]
[null,null,null,null,null,null," ",null,null,null,null,null,null,null,null,null,null,null,null,null,null,null,null,null,null,null,null,null,{"$f":"Noblanks(J106:J603)","v":""}]
[null,null,null,null,null,null," ",null,null,null,null,null,null,null,null,null,null,null,null,null,null,null,null,null,null,null,null,null,{"$f":"Noblanks(J107:J604)","v":""}]
[null,null,null,null,null,null," ",null,null,null,null,null,null,null,null,null,null,null,null,null,null,null,null,null,null,null,null,null,{"$f":"Noblanks(J108:J605)","v":""}]
[null,null,null,null,null,null," ",null,null,null,null,null,null,null,null,null,null,null,null,null,null,null,null,null,null,null,null,null,{"$f":"Noblanks(J109:J606)","v":""}]
[null,null,null,null,null,null," ",null,null,null,null,null,null,null,null,null,null,null,null,null,null,null,null,null,null,null,null,null,{"$f":"Noblanks(J110:J607)","v":""}]
[null,null,null,null,null,null," ",null,null,null,null,null,null,null,null,null,null,null,null,null,null,null,null,null,null,null,null,null,{"$f":"Noblanks(J111:J608)","v":""}]
[null,null,null,null,null,null," ",null,null,null,null,null,null,null,null,null,null,null,null,null,null,null,null,null,null,null,null,null,{"$f":"Noblanks(J112:J609)","v":""}]
[null,null,null,null,null,null," ",null,null,null,null,null,null,null,null,null,null,null,null,null,null,null,null,null,null,null,null,null,{"$f":"Noblanks(J113:J610)","v":""}]
[null,null,null,null,null,null," ",null,null,null,null,null,null,null,null,null,null,null,null,null,null,null,null,null,null,null,null,null,{"$f":"Noblanks(J114:J611)","v":""}]
[null,null,null,null,null,null," ",null,null,null,null,null,null,null,null,null,null,null,null,null,null,null,null,null,null,null,null,null,{"$f":"Noblanks(J115:J612)","v":""}]
[null,null,null,null,null,null," ",null,null,null,null,null,null,null,null,null,null,null,null,null,null,null,null,null,null,null,null,null,{"$f":"Noblanks(J116:J613)","v":""}]
[null,null,null,null,null,null," ",null,null,null,null,null,null,null,null,null,null,null,null,null,null,null,null,null,null,null,null,null,{"$f":"Noblanks(J117:J614)","v":""}]
[null,null,null,null,null,null," ",null,null,null,null,null,null,null,null,null,null,null,null,null,null,null,null,null,null,null,null,null,{"$f":"Noblanks(J118:J615)","v":""}]
[null,null,null,null,null,null," ",null,null,null,null,null,null,null,null,null,null,null,null,null,null,null,null,null,null,null,null,null,{"$f":"Noblanks(J119:J616)","v":""}]
[null,null,null,null,null,null," ",null,null,null,null,null,null,null,null,null,null,null,null,null,null,null,null,null,null,null,null,null,{"$f":"Noblanks(J120:J617)","v":""}]
[null,null,null,null,null,null," ",null,null,null,null,null,null,null,null,null,null,null,null,null,null,null,null,null,null,null,null,null,{"$f":"Noblanks(J121:J618)","v":""}]
[null,null,null,null,null,null," ",null,null,null,null,null,null,null,null,null,null,null,null,null,null,null,null,null,null,null,null,null,{"$f":"Noblanks(J122:J619)","v":""}]
[null,null,null,null,null,null," ",null,null,null,null,null,null,null,null,null,null,null,null,null,null,null,null,null,null,null,null,null,{"$f":"Noblanks(J123:J620)","v":""}]
[null,null,null,null,null,null," ",null,null,null,null,null,null,null,null,null,null,null,null,null,null,null,null,null,null,null,null,null,{"$f":"Noblanks(J124:J621)","v":""}]
[null,null,null,null,null,null," ",null,null,null,null,null,null,null,null,null,null,null,null,null,null,null,null,null,null,null,null,null,{"$f":"Noblanks(J125:J622)","v":""}]
[null,null,null,null,null,null," ",null,null,null,null,null,null,null,null,null,null,null,null,null,null,null,null,null,null,null,null,null,{"$f":"Noblanks(J126:J623)","v":""}]
[null,null,null,null,null,null," ",null,null,null,null,null,null,null,null,null,null,null,null,null,null,null,null,null,null,null,null,null,{"$f":"Noblanks(J127:J624)","v":""}]
[null,null,null,null,null,null," ",null,null,null,null,null,null,null,null,null,null,null,null,null,null,null,null,null,null,null,null,null,{"$f":"Noblanks(J128:J625)","v":""}]
[null,null,null,null,null,null," ",null,null,null,null,null,null,null,null,null,null,null,null,null,null,null,null,null,null,null,null,null,{"$f":"Noblanks(J129:J626)","v":""}]
[null,null,null,null,null,null," ",null,null,null,null,null,null,null,null,null,null,null,null,null,null,null,null,null,null,null,null,null,{"$f":"Noblanks(J130:J627)","v":""}]
[null,null,null,null,null,null," ",null,null,null,null,null,null,null,null,null,null,null,null,null,null,null,null,null,null,null,null,null,{"$f":"Noblanks(J131:J628)","v":""}]
[null,null,null,null,null,null," ",null,null,null,null,null,null,null,null,null,null,null,null,null,null,null,null,null,null,null,null,null,{"$f":"Noblanks(J132:J629)","v":""}]
[null,null,null,null,null,null," ",null,null,null,null,null,null,null,null,null,null,null,null,null,null,null,null,null,null,null,null,null,{"$f":"Noblanks(J133:J630)","v":""}]
[null,null,null,null,null,null," ",null,null,null,null,null,null,null,null,null,null,null,null,null,null,null,null,null,null,null,null,null,{"$f":"Noblanks(J134:J631)","v":""}]
[null,null,null,null,null,null," ",null,null,null,null,null,null,null,null,null,null,null,null,null,null,null,null,null,null,null,null,null,{"$f":"Noblanks(J135:J632)","v":""}]
[null,null,null,null,null,null," ",null,null,null,null,null,null,null,null,null,null,null,null,null,null,null,null,null,null,null,null,null,{"$f":"Noblanks(J136:J633)","v":""}]
[null,null,null,null,null,null," ",null,null,null,null,null,null,null,null,null,null,null,null,null,null,null,null,null,null,null,null,null,{"$f":"Noblanks(J137:J634)","v":""}]
[null,null,null,null,null,null," ",null,null,null,null,null,null,null,null,null,null,null,null,null,null,null,null,null,null,null,null,null,{"$f":"Noblanks(J138:J635)","v":""}]
[null,null,null,null,null,null," ",null,null,null,null,null,null,null,null,null,null,null,null,null,null,null,null,null,null,null,null,null,{"$f":"Noblanks(J139:J636)","v":""}]
[null,null,null,null,null,null," ",null,null,null,null,null,null,null,null,null,null,null,null,null,null,null,null,null,null,null,null,null,{"$f":"Noblanks(J140:J637)","v":""}]
[null,null,null,null,null,null," ",null,null,null,null,null,null,null,null,null,null,null,null,null,null,null,null,null,null,null,null,null,{"$f":"Noblanks(J141:J638)","v":""}]
[null,null,null,null,null,null," ",null,null,null,null,null,null,null,null,null,null,null,null,null,null,null,null,null,null,null,null,null,{"$f":"Noblanks(J142:J639)","v":""}]
[null,null,null,null,null,null," ",null,null,null,null,null,null,null,null,null,null,null,null,null,null,null,null,null,null,null,null,null,{"$f":"Noblanks(J143:J640)","v":""}]
[null,null,null,null,null,null," ",null,null,null,null,null,null,null,null,null,null,null,null,null,null,null,null,null,null,null,null,null,{"$f":"Noblanks(J144:J641)","v":""}]
[null,null,null,null,null,null," ",null,null,null,null,null,null,null,null,null,null,null,null,null,null,null,null,null,null,null,null,null,{"$f":"Noblanks(J145:J642)","v":""}]
[null,null,null,null,null,null," ",null,null,null,null,null,null,null,null,null,null,null,null,null,null,null,null,null,null,null,null,null,{"$f":"Noblanks(J146:J643)","v":""}]
[null,null,null,null,null,null," ",null,null,null,null,null,null,null,null,null,null,null,null,null,null,null,null,null,null,null,null,null,{"$f":"Noblanks(J147:J644)","v":""}]
[null,null,null,null,null,null," ",null,null,null,null,null,null,null,null,null,null,null,null,null,null,null,null,null,null,null,null,null,{"$f":"Noblanks(J148:J645)","v":""}]
[null,null,null,null,null,null," ",null,null,null,null,null,null,null,null,null,null,null,null,null,null,null,null,null,null,null,null,null,{"$f":"Noblanks(J149:J646)","v":""}]
[null,null,null,null,null,null," ",null,null,null,null,null,null,null,null,null,null,null,null,null,null,null,null,null,null,null,null,null,{"$f":"Noblanks(J150:J647)","v":""}]
[null,null,null,null,null,null," ",null,null,null,null,null,null,null,null,null,null,null,null,null,null,null,null,null,null,null,null,null,{"$f":"Noblanks(J151:J648)","v":""}]
[null,null,null,null,null,null," ",null,null,null,null,null,null,null,null,null,null,null,null,null,null,null,null,null,null,null,null,null,{"$f":"Noblanks(J152:J649)","v":""}]
[null,null,null,null,null,null," ",null,null,null,null,null,null,null,null,null,null,null,null,null,null,null,null,null,null,null,null,null,{"$f":"Noblanks(J153:J650)","v":""}]
[null,null,null,null,null,null," ",null,null,null,null,null,null,null,null,null,null,null,null,null,null,null,null,null,null,null,null,null,{"$f":"Noblanks(J154:J651)","v":""}]
[null,null,null,null,null,null," ",null,null,null,null,null,null,null,null,null,null,null,null,null,null,null,null,null,null,null,null,null,{"$f":"Noblanks(J155:J652)","v":""}]
[null,null,null,null,null,null," ",null,null,null,null,null,null,null,null,null,null,null,null,null,null,null,null,null,null,null,null,null,{"$f":"Noblanks(J156:J653)","v":""}]
[null,null,null,null,null,null," ",null,null,null,null,null,null,null,null,null,null,null,null,null,null,null,null,null,null,null,null,null,{"$f":"Noblanks(J157:J654)","v":""}]
[null,null,null,null,null,null," ",null,null,null,null,null,null,null,null,null,null,null,null,null,null,null,null,null,null,null,null,null,{"$f":"Noblanks(J158:J655)","v":""}]
[null,null,null,null,null,null," ",null,null,null,null,null,null,null,null,null,null,null,null,null,null,null,null,null,null,null,null,null,{"$f":"Noblanks(J159:J656)","v":""}]
[null,null,null,null,null,null," ",null,null,null,null,null,null,null,null,null,null,null,null,null,null,null,null,null,null,null,null,null,{"$f":"Noblanks(J160:J657)","v":""}]
[null,null,null,null,null,null," ",null,null,null,null,null,null,null,null,null,null,null,null,null,null,null,null,null,null,null,null,null,{"$f":"Noblanks(J161:J658)","v":""}]
[null,null,null,null,null,null," ",null,null,null,null,null,null,null,null,null,null,null,null,null,null,null,null,null,null,null,null,null,{"$f":"Noblanks(J162:J659)","v":""}]
[null,null,null,null,null,null," ",null,null,null,null,null,null,null,null,null,null,null,null,null,null,null,null,null,null,null,null,null,{"$f":"Noblanks(J163:J660)","v":""}]
[null,null,null,null,null,null," ",null,null,null,null,null,null,null,null,null,null,null,null,null,null,null,null,null,null,null,null,null,{"$f":"Noblanks(J164:J661)","v":""}]
[null,null,null,null,null,null," ",null,null,null,null,null,null,null,null,null,null,null,null,null,null,null,null,null,null,null,null,null,{"$f":"Noblanks(J165:J662)","v":""}]
[null,null,null,null,null,null," ",null,null,null,null,null,null,null,null,null,null,null,null,null,null,null,null,null,null,null,null,null,{"$f":"Noblanks(J166:J663)","v":""}]
[null,null,null,null,null,null," ",null,null,null,null,null,null,null,null,null,null,null,null,null,null,null,null,null,null,null,null,null,{"$f":"Noblanks(J167:J664)","v":""}]
[null,null,null,null,null,null," ",null,null,null,null,null,null,null,null,null,null,null,null,null,null,null,null,null,null,null,null,null,{"$f":"Noblanks(J168:J665)","v":""}]
[null,null,null,null,null,null," ",null,null,null,null,null,null,null,null,null,null,null,null,null,null,null,null,null,null,null,null,null,{"$f":"Noblanks(J169:J666)","v":""}]
[null,null,null,null,null,null," ",null,null,null,null,null,null,null,null,null,null,null,null,null,null,null,null,null,null,null,null,null,{"$f":"Noblanks(J170:J667)","v":""}]
[null,null,null,null,null,null," ",null,null,null,null,null,null,null,null,null,null,null,null,null,null,null,null,null,null,null,null,null,{"$f":"Noblanks(J171:J668)","v":""}]
[null,null,null,null,null,null," ",null,null,null,null,null,null,null,null,null,null,null,null,null,null,null,null,null,null,null,null,null,{"$f":"Noblanks(J172:J669)","v":""}]
[null,null,null,null,null,null," ",null,null,null,null,null,null,null,null,null,null,null,null,null,null,null,null,null,null,null,null,null,{"$f":"Noblanks(J173:J670)","v":""}]
[null,null,null,null,null,null," ",null,null,null,null,null,null,null,null,null,null,null,null,null,null,null,null,null,null,null,null,null,{"$f":"Noblanks(J174:J671)","v":""}]
[null,null,null,null,null,null," ",null,null,null,null,null,null,null,null,null,null,null,null,null,null,null,null,null,null,null,null,null,{"$f":"Noblanks(J175:J672)","v":""}]
[null,null,null,null,null,null," ",null,null,null,null,null,null,null,null,null,null,null,null,null,null,null,null,null,null,null,null,null,{"$f":"Noblanks(J176:J673)","v":""}]
[null,null,null,null,null,null," ",null,null,null,null,null,null,null,null,null,null,null,null,null,null,null,null,null,null,null,null,null,{"$f":"Noblanks(J177:J674)","v":""}]
[null,null,null,null,null,null," ",null,null,null,null,null,null,null,null,null,null,null,null,null,null,null,null,null,null,null,null,null,{"$f":"Noblanks(J178:J675)","v":""}]
[null,null,null,null,null,null," ",null,null,null,null,null,null,null,null,null,null,null,null,null,null,null,null,null,null,null,null,null,{"$f":"Noblanks(J179:J676)","v":""}]
[null,null,null,null,null,null," ",null,null,null,null,null,null,null,null,null,null,null,null,null,null,null,null,null,null,null,null,null,{"$f":"Noblanks(J180:J677)","v":""}]
[null,null,null,null,null,null," ",null,null,null,null,null,null,null,null,null,null,null,null,null,null,null,null,null,null,null,null,null,{"$f":"Noblanks(J181:J678)","v":""}]
[null,null,null,null,null,null," ",null,null,null,null,null,null,null,null,null,null,null,null,null,null,null,null,null,null,null,null,null,{"$f":"Noblanks(J182:J679)","v":""}]
[null,null,null,null,null,null," ",null,null,null,null,null,null,null,null,null,null,null,null,null,null,null,null,null,null,null,null,null,{"$f":"Noblanks(J183:J680)","v":""}]
[null,null,null,null,null,null," ",null,null,null,null,null,null,null,null,null,null,null,null,null,null,null,null,null,null,null,null,null,{"$f":"Noblanks(J184:J681)","v":""}]
[null,null,null,null,null,null," ",null,null,null,null,null,null,null,null,null,null,null,null,null,null,null,null,null,null,null,null,null,{"$f":"Noblanks(J185:J682)","v":""}]
[null,null,null,null,null,null," ",null,null,null,null,null,null,null,null,null,null,null,null,null,null,null,null,null,null,null,null,null,{"$f":"Noblanks(J186:J683)","v":""}]
[null,null,null,null,null,null," ",null,null,null,null,null,null,null,null,null,null,null,null,null,null,null,null,null,null,null,null,null,{"$f":"Noblanks(J187:J684)","v":""}]
[null,null,null,null,null,null," ",null,null,null,null,null,null,null,null,null,null,null,null,null,null,null,null,null,null,null,null,null,{"$f":"Noblanks(J188:J685)","v":""}]
[null,null,null,null,null,null," ",null,null,null,null,null,null,null,null,null,null,null,null,null,null,null,null,null,null,null,null,null,{"$f":"Noblanks(J189:J686)","v":""}]
[null,null,null,null,null,null," ",null,null,null,null,null,null,null,null,null,null,null,null,null,null,null,null,null,null,null,null,null,{"$f":"Noblanks(J190:J687)","v":""}]
[null,null,null,null,null,null," ",null,null,null,null,null,null,null,null,null,null,null,null,null,null,null,null,null,null,null,null,null,{"$f":"Noblanks(J191:J688)","v":""}]
[null,null,null,null,null,null," ",null,null,null,null,null,null,null,null,null,null,null,null,null,null,null,null,null,null,null,null,null,{"$f":"Noblanks(J192:J689)","v":""}]
[null,null,null,null,null,null," ",null,null,null,null,null,null,null,null,null,null,null,null,null,null,null,null,null,null,null,null,null,{"$f":"Noblanks(J193:J690)","v":""}]
[null,null,null,null,null,null," ",null,null,null,null,null,null,null,null,null,null,null,null,null,null,null,null,null,null,null,null,null,{"$f":"Noblanks(J194:J691)","v":""}]
[null,null,null,null,null,null," ",null,null,null,null,null,null,null,null,null,null,null,null,null,null,null,null,null,null,null,null,null,{"$f":"Noblanks(J195:J692)","v":""}]
[null,null,null,null,null,null," ",null,null,null,null,null,null,null,null,null,null,null,null,null,null,null,null,null,null,null,null,null,{"$f":"Noblanks(J196:J693)","v":""}]
[null,null,null,null,null,null," ",null,null,null,null,null,null,null,null,null,null,null,null,null,null,null,null,null,null,null,null,null,{"$f":"Noblanks(J197:J694)","v":""}]
[null,null,null,null,null,null," "]
[null,null,null,null,null,null," "]
[null,null,null,null,null,null," "]
[null,null,null,null,null,null," "]
[null,null,null,null,null,null," "]
[null,null,null,null,null,null," "]
[null,null,null,null,null,null," "]
[null,null,null,null,null,null," "]
[null,null,null,null,null,null," "]
[null,null,null,null,null,null," "]
[null,null,null,null,null,null," "]
[null,null,null,null,null,null," "]
[null,null,null,null,null,null," "]
[null,null,null,null,null,null," "]
[null,null,null,null,null,null," "]
[null,null,null,null,null,null," "]
[null,null,null,null,null,null," "]
[null,null,null,null,null,null," "]
[null,null,null,null,null,null," "]
[null,null,null,null,null,null," "]
[null,null,null,null,null,null," "]
[null,null,null,null,null,null," "]
[null,null,null,null,null,null," "]
[null,null,null,null,null,null," "]
[null,null,null,null,null,null," "]
[null,null,null,null,null,null," "]
[null,null,null,null,null,null," "]
[null,null,null,null,null,null," "]
[null,null,null,null,null,null," "]
[null,null,null,null,null,null," "]
[null,null,null,null,null,null," "]
[null,null,null,null,null,null," "]
[null,null,null,null,null,null," "]
[null,null,null,null,null,null," "]
[null,null,null,null,null,null," "]
[null,null,null,null,null,null," "]
[null,null,null,null,null,null," "]
[null,null,null,null,null,null," "]
[null,null,null,null,null,null," "]
[null,null,null,null,null,null," "]
[null,null,null,null,null,null," "]
[null,null,null,null,null,null," "]
[null,null,null,null,null,null," "]
[null,null,null,null,null,null," "]
[null,null,null,null,null,null," "]
[null,null,null,null,null,null," "]
[null,null,null,null,null,null," "]
[null,null,null,null,null,null," "]
[null,null,null,null,null,null," "]
[null,null,null,null,null,null," "]
[null,null,null,null,null,null," "]
[null,null,null,null,null,null," "]
[null,null,null,null,null,null," "]
[null,null,null,null,null,null," "]
[null,null,null,null,null,null," "]
[null,null,null,null,null,null," "]
[null,null,null,null,null,null," "]
[null,null,null,null,null,null," "]
[null,null,null,null,null,null," "]
[null,null,null,null,null,null," "]
[null,null,null,null,null,null," "]
[null,null,null,null,null,null," "]
[null,null,null,null,null,null," "]
[null,null,null,null,null,null," "]
[null,null,null,null,null,null," "]
[null,null,null,null,null,null," "]
[null,null,null,null,null,null," "]
[null,null,null,null,null,null," "]
[null,null,null,null,null,null," "]
[null,null,null,null,null,null," "]
[null,null,null,null,null,null," "]
[null,null,null,null,null,null," "]
[null,null,null,null,null,null," "]
[null,null,null,null,null,null," "]
[null,null,null,null,null,null," "]
[null,null,null,null,null,null," "]
[null,null,null,null,null,null," "]
[null,null,null,null,null,null," "]
[null,null,null,null,null,null," "]
[null,null,null,null,null,null," "]
[null,null,null,null,null,null," "]
[null,null,null,null,null,null," "]
[null,null,null,null,null,null," "]
[null,null,null,null,null,null," "]
[null,null,null,null,null,null," "]
[null,null,null,null,null,null," "]
[null,null,null,null,null,null," "]
[null,null,null,null,null,null," "]
[null,null,null,null,null,null," "]
[null,null,null,null,null,null," "]
[null,null,null,null,null,null," "]
[null,null,null,null,null,null," "]
[null,null,null,null,null,null," "]
[null,null,null,null,null,null," "]
[null,null,null,null,null,null," "]
[null,null,null,null,null,null," "]
[null,null,null,null,null,null," "]
[null,null,null,null,null,null," "]
[null,null,null,null,null,null," "]
[null,null,null,null,null,null," "]
[null,null,null,null,null,null," "]
[null,null,null,null,null,null," "]
[null,null,null,null,null,null," "]
[null,null,null,null,null,null," "]
[null,null,null,null,null,null," "]
[null,null,null,null,null,null," "]
[null,null,null,null,null,null," "]
[null,null,null,null,null,null," "]
[null,null,null,null,null,null," "]
[null,null,null,null,null,null," "]
[null,null,null,null,null,null," "]
[null,null,null,null,null,null," "]
[null,null,null,null,null,null," "]
[null,null,null,null,null,null," "]
[null,null,null,null,null,null," "]
[null,null,null,null,null,null," "]
[null,null,null,null,null,null," "]
[null,null,null,null,null,null," "]
[null,null,null,null,null,null," "]
[null,null,null,null,null,null," "]
[null,null,null,null,null,null," "]
[null,null,null,null,null,null," "]
[null,null,null,null,null,null," "]
[null,null,null,null,null,null," "]
[null,null,null,null,null,null," "]
[null,null,null,null,null,null," "]
[null,null,null,null,null,null," "]
[null,null,null,null,null,null," "]
[null,null,null,null,null,null," "]
[null,null,null,null,null,null," "]
[null,null,null,null,null,null," "]
[null,null,null,null,null,null," "]
[null,null,null,null,null,null," "]
[null,null,null,null,null,null," "]
[null,null,null,null,null,null," "]
[null,null,null,null,null,null," "]
[null,null,null,null,null,null," "]
[null,null,null,null,null,null," "]
[null,null,null,null,null,null," "]
[null,null,null,null,null,null," "]
[null,null,null,null,null,null," "]
[null,null,null,null,null,null," "]
[null,null,null,null,null,null," "]
[null,null,null,null,null,null," "]
[null,null,null,null,null,null," "]
[null,null,null,null,null,null," "]
[null,null,null,null,null,null," "]
[null,null,null,null,null,null," "]
[null,null,null,null,null,null," "]
[null,null,null,null,null,null," "]
[null,null,null,null,null,null," "]
[null,null,null,null,null,null," "]
[null,null,null,null,null,null," "]
[null,null,null,null,null,null," "]
[null,null,null,null,null,null," "]
[null,null,null,null,null,null," "]
[null,null,null,null,null,null," "]
[null,null,null,null,null,null," "]
[null,null,null,null,null,null," "]
[null,null,null,null,null,null," "]
[null,null,null,null,null,null," "]
[null,null,null,null,null,null," "]
[null,null,null,null,null,null," "]
[null,null,null,null,null,null," "]
[null,null,null,null,null,null," "]
[null,null,null,null,null,null," "]
[null,null,null,null,null,null," "]
[null,null,null,null,null,null," "]
[null,null,null,null,null,null," "]
[null,null,null,null,null,null," "]
[null,null,null,null,null,null," "]
[null,null,null,null,null,null," "]
[null,null,null,null,null,null," "]
[null,null,null,null,null,null," "]
[null,null,null,null,null,null," "]
[null,null,null,null,null,null," "]
[null,null,null,null,null,null," "]
[null,null,null,null,null,null," "]
[null,null,null,null,null,null," "]
[null,null,null,null,null,null," "]
[null,null,null,null,null,null," "]
[null,null,null,null,null,null," "]
[null,null,null,null,null,null," "]
[null,null,null,null,null,null," "]
[null,null,null,null,null,null," "]
[null,null,null,null,null,null," "]
[null,null,null,null,null,null," "]
[null,null,null,null,null,null," "]
[null,null,null,null,null,null," "]
[null,null,null,null,null,null," "]
[null,null,null,null,null,null," "]
[null,null,null,null,null,null," "]
[null,null,null,null,null,null," "]
[null,null,null,null,null,null," "]
[null,null,null,null,null,null," "]
[null,null,null,null,null,null," "]
[null,null,null,null,null,null," "]
[null,null,null,null,null,null," "]
[null,null,null,null,null,null," "]
[null,null,null,null,null,null," "]
[null,null,null,null,null,null," "]
[null,null,null,null,null,null," "]
[null,null,null,null,null,null," "]
[null,null,null,null,null,null," "]
[null,null,null,null,null,null," "]
[null,null,null,null,null,null," "]
[null,null,null,null,null,null," "]
[null,null,null,null,null,null," "]
[null,null,null,null,null,null," "]
[null,null,null,null,null,null," "]
[null,null,null,null,null,null," "]
[null,null,null,null,null,null," "]
[null,null,null,null,null,null," "]
[null,null,null,null,null,null," "]
[null,null,null,null,null,null," "]
[null,null,null,null,null,null," "]
[null,null,null,null,null,null," "]
[null,null,null,null,null,null," "]
[null,null,null,null,null,null," "]
[null,null,null,null,null,null," "]
[null,null,null,null,null,null," "]
[null,null,null,null,null,null," "]
[null,null,null,null,null,null," "]
[null,null,null,null,null,null," "]
[null,null,null,null,null,null," "]
[null,null,null,null,null,null," "]
[null,null,null,null,null,null," "]
[null,null,null,null,null,null," "]
[null,null,null,null,null,null," "]
[null,null,null,null,null,null," "]
[null,null,null,null,null,null," "]
[null,null,null,null,null,null," "]
[null,null,null,null,null,null," "]
[null,null,null,null,null,null," "]
[null,null,null,null,null,null," "]
[null,null,null,null,null,null," "]
[null,null,null,null,null,null," "]
[null,null,null,null,null,null," "]
[null,null,null,null,null,null," "]
[null,null,null,null,null,null," "]
[null,null,null,null,null,null," "]
[null,null,null,null,null,null," "]
[null,null,null,null,null,null," "]
[null,null,null,null,null,null," "]
[null,null,null,null,null,null," "]
[null,null,null,null,null,null," "]
[null,null,null,null,null,null," "]
[null,null,null,null,null,null," "]
[null,null,null,null,null,null," "]
[null,null,null,null,null,null," "]
[null,null,null,null,null,null," "]
[null,null,null,null,null,null," "]
[null,null,null,null,null,null," "]
[null,null,null,null,null,null," "]
[null,null,null,null,null,null," "]
[null,null,null,null,null,null," "]
[null,null,null,null,null,null," "]
[null,null,null,null,null,null," "]
[null,null,null,null,null,null," "]
[null,null,null,null,null,null," "]
[null,null,null,null,null,null," "]
[null,null,null,null,null,null," "]
[null,null,null,null,null,null," "]
[null,null,null,null,null,null," "]
[null,null,null,null,null,null," "]
[null,null,null,null,null,null," "]
[null,null,null,null,null,null," "]
[null,null,null,null,null,null," "]
[null,null,null,null,null,null," "]
[null,null,null,null,null,null," "]
[null,null,null,null,null,null," "]
[null,null,null,null,null,null," "]
[null,null,null,null,null,null," "]
[null,null,null,null,null,null," "]
[null,null,null,null,null,null," "]
[null,null,null,null,null,null," "]
[null,null,null,null,null,null," "]
[null,null,null,null,null,null," "]
[null,null,null,null,null,null," "]
[null,null,null,null,null,null," "]
[null,null,null,null,null,null," "]
[null,null,null,null,null,null," "]
[null,null,null,null,null,null," "]
[null,null,null,null,null,null," "]
[null,null,null,null,null,null," "]
[null,null,null,null,null,null," "]
[null,null,null,null,null,null," "]
[null,null,null,null,null,null," "]
[null,null,null,null,null,null," "]
[null,null,null,null,null,null," "]
[null,null,null,null,null,null," "]
[null,null,null,null,null,null," "]
[null,null,null,null,null,null," "]
[null,null,null,null,null,null," "]
[null,null,null,null,null,null," "]

{"sheet":"Main of Month","index":1,"n_rows":101,"n_cols":16384,"rows_kept":101,"cut":false,"hidden":false,"merged":[[1,29,1,30]]}
[null,null,null,{"$f":"EOMONTH(NOW(),0)","v":"2019-08-31"},null,null,null,null,null,null,null,null,null,null,null,"Main of Month","Main of Month",null,null,null,null,null,null,null,null,null,null,null,null,null,null,null,null,null,null,null,null,null,null,null,null,null,null,null,null,null,null,null,null,null,null,null,null,null,null,null,null,null,null,null,null,null,null,null,null,null,null,null,null,null,null,null,null,null,null,null,null,null,null,null,null,null,null,null,null,null,null,null,null,null,null,null,null,null,null,null,null,null,null,null,null,null,null,null,null,null,null,null,null,null,null,null,null,null,null,null,null,null,null,null,null,null,null,null,null,null,null,null,null,null,null,null,null,null,null,null,null,null,null,null,null,null,null,null,null,null,null,null,null,null,null,null,null,null,null,null,null,null,null,null,null,null,null,null,null,null,null,null,null,null,null,null,null,null,null,null,null,null,null,null,null,null,null,null,null,null,null,null,null,null,null,null,null,null,null,null,null,null,null,null,null,null,null,null,null,null,null,null,null,null,null,null,null,null,null,null,null,null,null,null,null,null,null,null,null,null,null,null,null,null,null,null,null,null,null,null,null,null,null,null,null,null,null,null,null,null,null,null,null,null,null,null,null,null,null,null,null,null,null,null,null,null,null,null,null,null,null,null,null,null,null,null,null,null,null,null,null,null,null,null,null,null,null,null,null,null,null,null,null,null,null,null,null,null,null,null,null,null,null,null,null,null,null,null,null,null,null,null,null,null,null,null,null,null,null,null,null,null,null,null,null,null,null,null,null,null,null,null,null,null,null,null,null,null,null,null,null,null,null,null,null,null,null,null,null,null,null,null,null,null,null,null,null,null,null,null,null,null,null,null,null,null,null,null,null,null,null,null,null,null,null,null,null,null,null,null,null,null,null,null,null,null,null,null,null,null,null,null,null,null,null,null,null,null,null,null,null,null,null,null,null,null,null,null,null,null,null,null,null,null,null,null,null,null,null,null,null,null,null,null,null,null,null,null,null,null,null,null,null,null,null,null,null,null,null,null,null,null,null,null,null,null,null,null,null,null,null,null,null,null,null,null,null,null,null,null,null,null,null,null,null,null,null,null,null,null,null,null,null,null,null,null,null,null,null,null,null,null,null,null,null,null,null,null,null,null,null,null,null,null,null,null,null,null,null,null,null,null,null,null,null,null,null,null,null,null,null,null,null,null,null,null,null,null,null,null,null,null,null,null,null,null,null,null,null,null,null,null,null,null,null,null,null,null,null,null,null,null,null,null,null,null,null,null,null,null,null,null,null,null,null,null,null,null,null,null,null,null,null,null,null,null,null,null,null,null,null,null,null,null,null,null,null,null,null,null,null,null,null,null,null,null,null,null,null,null,null,null,null,null,null,null,null,null,null,null,null,null,null,null,null,null,null,null,null,null,null,null,null,null,null,null,null,null,null,null,null,null,null,null,null,null,null,null,null,null,null,null,null,null,null,null,null,null,null,null,null,null,null,null,null,null,null,null,null,null,null,null,null,null,null,null,null,null,null,null,null,null,null,null,null,null,null,null,null,null,null,null,null,null,null,null,null,null,null,null,null,null,null,null,null,null,null,null,null,null,null,null,null,null,null,null,null,null,null,null,null,null,null,null,null,null,null,null,null,null,null,null,null,null,null,null,null,null,null,null,null,null,null,null,null,null,null,null,null,null,null,null,null,null,null,null,null,null,null,null,null,null,null,null,null,null,null,null,null,null,null,null,null,null,null,null,null,null,null,null,null,null,null,null,null,null,null,null,null,null,null,null,null,null,null,null,null,null,null,null,null,null,null,null,null,null,null,null,null,null,null,null,null,null,null,null,null,null,null,null,null,null,null,null,null,null,null,null,null,null,null,null,null,null,null,null,null,null,null,null,null,null,null,null,null,null,null,null,null,null,null,null,null,null,null,null,null,null,null,null,null,null,null,null,null,null,null,null,null,null,null,null,null,null,null,null,null,null,null,null,null,null,null,null,null,null,null,null,null,null,null,null,null,null,null,null,null,null,null,null,null,null,null,null,null,null,null,null,null,null,null,null,null,null,null,null,null,null,null,null,null,null,null,null,null,null,null,null,null,null,null,null,null,null,null,null,null,null,null,null,null,null,null,null,null,null,null,null,null,null,null,null,null,null,null,null,null,null,null,null,null,null,null,null,null,null,null,null,null,null,null,null,null,null,null,null,null,null,null,null,null,null,null,null,null,null,null,null,null,null,null,null,null,null,null,null,null,null,null,null,null,null,null,null,null,null,null,null,null,null,null,null,null,null,null,null,null,null,null,null,null,null,null,null,null,null,null,null,null,null,null,null,null,null,null,null,null,null,null,null,null,null,null,null,null,null,null,null,null,null,null,null,null,null,null,null,null,null,null,null,null,null,null,null,null,null,null,null,null,null,null,null,null,null,null,null,null,null,null,null,null,null,null,null,null,null,null,null,null,null,null,null,null,null,null,null,null,null,null,null,null,null,null,null,null,null,null,null,null,null,null,null,null,null,null,null,null,null,null,null,null,null,null,null,null,null,null,null,null,null,null,null,null,null,null,null,null,null,null,null,null,null,null,null,null,null,null,null,null,null,null,null,null,null,null,null,null,null,null,null,null,null,null,null,null,null,null,null,null,null,null,null,null,null,null,null,null,null,null,null,null,null,null,null,null,null,null,null,null,null,null,null,null,null,null,null,null,null,null,null,null,null,null,null,null,null,null,null,null,null,null,null,null,null,null,null,null,null,null,null,null,null,null,null,null,null,null,null,null,null,null,null,null,null,null,null,null,null,null,null,null,null,null,null,null,null,null,null,null,null,null,null,null,null,null,null,null,null,null,null,null,null,null,null,null,null,null,null,null,null,null,null,null,null,null,null,null,null,null,null,null,null,null,null,null,null,null,null,null,null,null,null,null,null,null,null,null,null,null,null,null,null,null,null,null,null,null,null,null,null,null,null,null,null,null,null,null,null,null,null,null,null,null,null,null,null,null,null,null,null,null,null,null,null,null,null,null,null,null,null,null,null,null,null,null,null,null,null,null,null,null,null,null,null,null,null,null,null,null,null,null,null,null,null,null,null,null,null,null,null,null,null,null,null,null,null,null,null,null,null,null,null,null,null,null,null,null,null,null,null,null,null,null,null,null,null,null,null,null,null,null,null,null,null,null,null,null,null,null,null,null,null,null,null,null,null,null,null,null,null,null,null,null,null,null,null,null,null,null,null,null,null,null,null,null,null,null,null,null,null,null,null,null,null,null,null,null,null,null,null,null,null,null,null,null,null,null,null,null,null,null,null,null,null,null,null,null,null,null,null,null,null,null,null,null,null,null,null,null,null,null,null,null,null,null,null,null,null,null,null,null,null,null,null,null,null,null,null,null,null,null,null,null,null,null,null,null,null,null,null,null,null,null,null,null,null,null,null,null,null,null,null,null,null,null,null,null,null,null,null,null,null,null,null,null,null,null,null,null,null,null,null,null,null,null,null,null,null,null,null,null,null,null,null,null,null,null,null,null,null,null,null,null,null,null,null,null,null,null,null,null,null,null,null,null,null,null,null,null,null,null,null,null,null,null,null,null,null,null,null,null,null,null,null,null,null,null,null,null,null,null,null,null,null,null,null,null,null,null,null,null,null,null,null,null,null,null,null,null,null,null,null,null,null,null,null,null,null,null,null,null,null,null,null,null,null,null,null,null,null,null,null,null,null,null,null,null,null,null,null,null,null,null,null,null,null,null,null,null,null,null,null,null,null,null,null,null,null,null,null,null,null,null,null,null,null,null,null,null,null,null,null,null,null,null,null,null,null,null,null,null,null,null,null,null,null,null,null,null,null,null,null,null,null,null,null,null,null,null,null,null,null,null,null,null,null,null,null,null,null,null,null,null,null,null,null,null,null,null,null,null,null,null,null,null,null,null,null,null,null,null,null,null,null,null,null,null,null,null,null,null,null,null,null,null,null,null,null,null,null,null,null,null,null,null,null,null,null,null,null,null,null,null,null,null,null,null,null,null,null,null,null,null,null,null,null,null,null,null,null,null,null,null,null,null,null,null,null,null,null,null,null,null,null,null,null,null,null,null,null,null,null,null,null,null,null,null,null,null,null,null,null,null,null,null,null,null,null,null,null,null,null,null,null,null,null,null,null,null,null,null,null,null,null,null,null,null,null,null,null,null,null,null,null,null,null,null,null,null,null,null,null,null,null,null,null,null,null,null,null,null,null,null,null,null,null,null,null,null,null,null,null,null,null,null,null,null,null,null,null,null,null,null,null,null,null,null,null,null,null,null,null,null,null,null,null,null,null,null,null,null,null,null,null,null,null,null,null,null,null,null,null,null,null,null,null,null,null,null,null,null,null,null,null,null,null,null,null,null,null,null,null,null,null,null,null,null,null,null,null,null,null,null,null,null,null,null,null,null,null,null,null,null,null,null,null,null,null,null,null,null,null,null,null,null,null,null,null,null,null,null,null,null,null,null,null,null,null,null,null,null,null,null,null,null,null,null,null,null,null,null,null,null,null,null,null,null,null,null,null,null,null,null,null,null,null,null,null,null,null,null,null,null,null,null,null,null,null,null,null,null,null,null,null,null,null,null,null,null,null,null,null,null,null,null,null,null,null,null,null,null,null,null,null,null,null,null,null,null,null,null,null,null,null,null,null,null,null,null,null,null,null,null,null,null,null,null,null,null,null,null,null,null,null,null,null,null,null,null,null,null,null,null,null,null,null,null,null,null,null,null,null,null,null,null,null,null,null,null,null,null,null,null,null,null,null,null,null,null,null,null,null,null,null,null,null,null,null,null,null,null,null,null,null,null,null,null,null,null,null,null,null,null,null,null,null,null,null,null,null,null,null,null,null,null,null,null,null,null,null,null,null,null,null,null,null,null,null,null,null,null,null,null,null,null,null,null,null,null,null,null,null,null,null,null,null,null,null,null,null,null,null,null,null,null,null,null,null,null,null,null,null,null,null,null,null,null,null,null,null,null,null,null,null,null,null,null,null,null,null,null,null,null,null,null,null,null,null,null,null,null,null,null,null,null,null,null,null,null,null,null,null,null,null,null,null,null,null,null,null,null,null,null,null,null,null,null,null,null,null,null,null,null,null,null,null,null,null,null,null,null,null,null,null,null,null,null,null,null,null,null,null,null,null,null,null,null,null,null,null,null,null,null,null,null,null,null,null,null,null,null,null,null,null,null,null,null,null,null,null,null,null,null,null,null,null,null,null,null,null,null,null,null,null,null,null,null,null,null,null,null,null,null,null,null,null,null,null,null,null,null,null,null,null,null,null,null,null,null,null,null,null,null,null,null,null,null,null,null,null,null,null,null,null,null,null,null,null,null,null,null,null,null,null,null,null,null,null,null,null,null,null,null,null,null,null,null,null,null,null,null,null,null,null,null,null,null,null,null,null,null,null,null,null,null,null,null,null,null,null,null,null,null,null,null,null,null,null,null,null,null,null,null,null,null,null,null,null,null,null,null,null,null,null,null,null,null,null,null,null,null,null,null,null,null,null,null,null,null,null,null,null,null,null,null,null,null,null,null,null,null,null,null,null,null,null,null,null,null,null,null,null,null,null,null,null,null,null,null,null,null,null,null,null,null,null,null,null,null,null,null,null,null,null,null,null,null,null,null,null,null,null,null,null,null,null,null,null,null,null,null,null,null,null,null,null,null,null,null,null,null,null,null,null,null,null,null,null,null,null,null,null,null,null,null,null,null,null,null,null,null,null,null,null,null,null,null,null,null,null,null,null,null,null,null,null,null,null,null,null,null,null,null,null,null,null,null,null,null,null,null,null,null,null,null,null,null,null,null,null,null,null,null,null,null,null,null,null,null,null,null,null,null,null,null,null,null,null,null,null,null,null,null,null,null,null,null,null,null,null,null,null,null,null,null,null,null,null,null,null,null,null,null,null,null,null,null,null,null,null,null,null,null,null,null,null,null,null,null,null,null,null,null,null,null,null,null,null,null,null,null,null,null,null,null,null,null,null,null,null,null,null,null,null,null,null,null,null,null,null,null,null,null,null,null,null,null,null,null,null,null,null,null,null,null,null,null,null,null,null,null,null,null,null,null,null,null,null,null,null,null,null,null,null,null,null,null,null,null,null,null,null,null,null,null,null,null,null,null,null,null,null,null,null,null,null,null,null,null,null,null,null,null,null,null,null,null,null,null,null,null,null,null,null,null,null,null,null,null,null,null,null,null,null,null,null,null,null,null,null,null,null,null,null,null,null,null,null,null,null,null,null,null,null,null,null,null,null,null,null,null,null,null,null,null,null,null,null,null,null,null,null,null,null,null,null,null,null,null,null,null,null,null,null,null,null,null,null,null,null,null,null,null,null,null,null,null,null,null,null,null,null,null,null,null,null,null,null,null,null,null,null,null,null,null,null,null,null,null,null,null,null,null,null,null,null,null,null,null,null,null,null,null,null,null,null,null,null,null,null,null,null,null,null,null,null,null,null,null,null,null,null,null,null,null,null,null,null,null,null,null,null,null,null,null,null,null,null,null,null,null,null,null,null,null,null,null,null,null,null,null,null,null,null,null,null,null,null,null,null,null,null,null,null,null,null,null,null,null,null,null,null,null,null,null,null,null,null,null,null,null,null,null,null,null,null,null,null,null,null,null,null,null,null,null,null,null,null,null,null,null,null,null,null,null,null,null,null,null,null,null,null,null,null,null,null,null,null,null,null,null,null,null,null,null,null,null,null,null,null,null,null,null,null,null,null,null,null,null,null,null,null,null,null,null,null,null,null,null,null,null,null,null,null,null,null,null,null,null,null,null,null,null,null,null,null,null,null,null,null,null,null,null,null,null,null,null,null,null,null,null,null,null,null,null,null,null,null,null,null,null,null,null,null,null,null,null,null,null,null,null,null,null,null,null,null,null,null,null,null,null,null,null,null,null,null,null,null,null,null,null,null,null,null,null,null,null,null,null,null,null,null,null,null,null,null,null,null,null,null,null,null,null,null,null,null,null,null,null,null,null,null,null,null,null,null,null,null,null,null,null,null,null,null,null,null,null,null,null,null,null,null,null,null,null,null,null,null,null,null,null,null,null,null,null,null,null,null,null,null,null,null,null,null,null,null,null,null,null,null,null,null,null,null,null,null,null,null,null,null,null,null,null,null,null,null,null,null,null,null,null,null,null,null,null,null,null,null,null,null,null,null,null,null,null,null,null,null,null,null,null,null,null,null,null,null,null,null,null,null,null,null,null,null,null,null,null,null,null,null,null,null,null,null,null,null,null,null,null,null,null,null,null,null,null,null,null,null,null,null,null,null,null,null,null,null,null,null,null,null,null,null,null,null,null,null,null,null,null,null,null,null,null,null,null,null,null,null,null,null,null,null,null,null,null,null,null,null,null,null,null,null,null,null,null,null,null,null,null,null,null,null,null,null,null,null,null,null,null,null,null,null,null,null,null,null,null,null,null,null,null,null,null,null,null,null,null,null,null,null,null,null,null,null,null,null,null,null,null,null,null,null,null,null,null,null,null,null,null,null,null,null,null,null,null,null,null,null,null,null,null,null,null,null,null,null,null,null,null,null,null,null,null,null,null,null,null,null,null,null,null,null,null,null,null,null,null,null,null,null,null,null,null,null,null,null,null,null,null,null,null,null,null,null,null,null,null,null,null,null,null,null,null,null,null,null,null,null,null,null,null,null,null,null,null,null,null,null,null,null,null,null,null,null,null,null,null,null,null,null,null,null,null,null,null,null,null,null,null,null,null,null,null,null,null,null,null,null,null,null,null,null,null,null,null,null,null,null,null,null,null,null,null,null,null,null,null,null,null,null,null,null,null,null,null,null,null,null,null,null,null,null,null,null,null,null,null,null,null,null,null,null,null,null,null,null,null,null,null,null,null,null,null,null,null,null,null,null,null,null,null,null,null,null,null,null,null,null,null,null,null,null,null,null,null,null,null,null,null,null,null,null,null,null,null,null,null,null,null,null,null,null,null,null,null,null,null,null,null,null,null,null,null,null,null,null,null,null,null,null,null,null,null,null,null,null,null,null,null,null,null,null,null,null,null,null,null,null,null,null,null,null,null,null,null,null,null,null,null,null,null,null,null,null,null,null,null,null,null,null,null,null,null,null,null,null,null,null,null,null,null,null,null,null,null,null,null,null,null,null,null,null,null,null,null,null,null,null,null,null,null,null,null,null,null,null,null,null,null,null,null,null,null,null,null,null,null,null,null,null,null,null,null,null,null,null,null,null,null,null,null,null,null,null,null,null,null,null,null,null,null,null,null,null,null,null,null,null,null,null,null,null,null,null,null,null,null,null,null,null,null,null,null,null,null,null,null,null,null,null,null,null,null,null,null,null,null,null,null,null,null,null,null,null,null,null,null,null,null,null,null,null,null,null,null,null,null,null,null,null,null,null,null,null,null,null,null,null,null,null,null,null,null,null,null,null,null,null,null,null,null,null,null,null,null,null,null,null,null,null,null,null,null,null,null,null,null,null,null,null,null,null,null,null,null,null,null,null,null,null,null,null,null,null,null,null,null,null,null,null,null,null,null,null,null,null,null,null,null,null,null,null,null,null,null,null,null,null,null,null,null,null,null,null,null,null,null,null,null,null,null,null,null,null,null,null,null,null,null,null,null,null,null,null,null,null,null,null,null,null,null,null,null,null,null,null,null,null,null,null,null,null,null,null,null,null,null,null,null,null,null,null,null,null,null,null,null,null,null,null,null,null,null,null,null,null,null,null,null,null,null,null,null,null,null,null,null,null,null,null,null,null,null,null,null,null,null,null,null,null,null,null,null,null,null,null,null,null,null,null,null,null,null,null,null,null,null,null,null,null,null,null,null,null,null,null,null,null,null,null,null,null,null,null,null,null,null,null,null,null,null,null,null,null,null,null,null,null,null,null,null,null,null,null,null,null,null,null,null,null,null,null,null,null,null,null,null,null,null,null,null,null,null,null,null,null,null,null,null,null,null,null,null,null,null,null,null,null,null,null,null,null,null,null,null,null,null,null,null,null,null,null,null,null,null,null,null,null,null,null,null,null,null,null,null,null,null,null,null,null,null,null,null,null,null,null,null,null,null,null,null,null,null,null,null,null,null,null,null,null,null,null,null,null,null,null,null,null,null,null,null,null,null,null,null,null,null,null,null,null,null,null,null,null,null,null,null,null,null,null,null,null,null,null,null,null,null,null,null,null,null,null,null,null,null,null,null,null,null,null,null,null,null,null,null,null,null,null,null,null,null,null,null,null,null,null,null,null,null,null,null,null,null,null,null,null,null,null,null,null,null,null,null,null,null,null,null,null,null,null,null,null,null,null,null,null,null,null,null,null,null,null,null,null,null,null,null,null,null,null,null,null,null,null,null,null,null,null,null,null,null,null,null,null,null,null,null,null,null,null,null,null,null,null,null,null,null,null,null,null,null,null,null,null,null,null,null,null,null,null,null,null,null,null,null,null,null,null,null,null,null,null,null,null,null,null,null,null,null,null,null,null,null,null,null,null,null,null,null,null,null,null,null,null,null,null,null,null,null,null,null,null,null,null,null,null,null,null,null,null,null,null,null,null,null,null,null,null,null,null,null,null,null,null,null,null,null,null,null,null,null,null,null,null,null,null,null,null,null,null,null,null,null,null,null,null,null,null,null,null,null,null,null,null,null,null,null,null,null,null,null,null,null,null,null,null,null,null,null,null,null,null,null,null,null,null,null,null,null,null,null,null,null,null,null,null,null,null,null,null,null,null,null,null,null,null,null,null,null,null,null,null,null,null,null,null,null,null,null,null,null,null,null,null,null,null,null,null,null,null,null,null,null,null,null,null,null,null,null,null,null,null,null,null,null,null,null,null,null,null,null,null,null,null,null,null,null,null,null,null,null,null,null,null,null,null,null,null,null,null,null,null,null,null,null,null,null,null,null,null,null,null,null,null,null,null,null,null,null,null,null,null,null,null,null,null,null,null,null,null,null,null,null,null,null,null,null,null,null,null,null,null,null,null,null,null,null,null,null,null,null,null,null,null,null,null,null,null,null,null,null,null,null,null,null,null,null,null,null,null,null,null,null,null,null,null,null,null,null,null,null,null,null,null,null,null,null,null,null,null,null,null,null,null,null,null,null,null,null,null,null,null,null,null,null,null,null,null,null,null,null,null,null,null,null,null,null,null,null,null,null,null,null,null,null,null,null,null,null,null,null,null,null,null,null,null,null,null,null,null,null,null,null,null,null,null,null,null,null,null,null,null,null,null,null,null,null,null,null,null,null,null,null,null,null,null,null,null,null,null,null,null,null,null,null,null,null,null,null,null,null,null,null,null,null,null,null,null,null,null,null,null,null,null,null,null,null,null,null,null,null,null,null,null,null,null,null,null,null,null,null,null,null,null,null,null,null,null,null,null,null,null,null,null,null,null,null,null,null,null,null,null,null,null,null,null,null,null,null,null,null,null,null,null,null,null,null,null,null,null,null,null,null,null,null,null,null,null,null,null,null,null,null,null,null,null,null,null,null,null,null,null,null,null,null,null,null,null,null,null,null,null,null,null,null,null,null,null,null,null,null,null,null,null,null,null,null,null,null,null,null,null,null,null,null,null,null,null,null,null,null,null,null,null,null,null,null,null,null,null,null,null,null,null,null,null,null,null,null,null,null,null,null,null,null,null,null,null,null,null,null,null,null,null,null,null,null,null,null,null,null,null,null,null,null,null,null,null,null,null,null,null,null,null,null,null,null,null,null,null,null,null,null,null,null,null,null,null,null,null,null,null,null,null,null,null,null,null,null,null,null,null,null,null,null,null,null,null,null,null,null,null,null,null,null,null,null,null,null,null,null,null,null,null,null,null,null,null,null,null,null,null,null,null,null,null,null,null,null,null,null,null,null,null,null,null,null,null,null,null,null,null,null,null,null,null,null,null,null,null,null,null,null,null,null,null,null,null,null,null,null,null,null,null,null,null,null,null,null,null,null,null,null,null,null,null,null,null,null,null,null,null,null,null,null,null,null,null,null,null,null,null,null,null,null,null,null,null,null,null,null,null,null,null,null,null,null,null,null,null,null,null,null,null,null,null,null,null,null,null,null,null,null,null,null,null,null,null,null,null,null,null,null,null,null,null,null,null,null,null,null,null,null,null,null,null,null,null,null,null,null,null,null,null,null,null,null,null,null,null,null,null,null,null,null,null,null,null,null,null,null,null,null,null,null,null,null,null,null,null,null,null,null,null,null,null,null,null,null,null,null,null,null,null,null,null,null,null,null,null,null,null,null,null,null,null,null,null,null,null,null,null,null,null,null,null,null,null,null,null,null,null,null,null,null,null,null,null,null,null,null,null,null,null,null,null,null,null,null,null,null,null,null,null,null,null,null,null,null,null,null,null,null,null,null,null,null,null,null,null,null,null,null,null,null,null,null,null,null,null,null,null,null,null,null,null,null,null,null,null,null,null,null,null,null,null,null,null,null,null,null,null,null,null,null,null,null,null,null,null,null,null,null,null,null,null,null,null,null,null,null,null,null,null,null,null,null,null,null,null,null,null,null,null,null,null,null,null,null,null,null,null,null,null,null,null,null,null,null,null,null,null,null,null,null,null,null,null,null,null,null,null,null,null,null,null,null,null,null,null,null,null,null,null,null,null,null,null,null,null,null,null,null,null,null,null,null,null,null,null,null,null,null,null,null,null,null,null,null,null,null,null,null,null,null,null,null,null,null,null,null,null,null,null,null,null,null,null,null,null,null,null,null,null,null,null,null,null,null,null,null,null,null,null,null,null,null,null,null,null,null,null,null,null,null,null,null,null,null,null,null,null,null,null,null,null,null,null,null,null,null,null,null,null,null,null,null,null,null,null,null,null,null,null,null,null,null,null,null,null,null,null,null,null,null,null,null,null,null,null,null,null,null,null,null,null,null,null,null,null,null,null,null,null,null,null,null,null,null,null,null,null,null,null,null,null,null,null,null,null,null,null,null,null,null,null,null,null,null,null,null,null,null,null,null,null,null,null,null,null,null,null,null,null,null,null,null,null,null,null,null,null,null,null,null,null,null,null,null,null,null,null,null,null,null,null,null,null,null,null,null,null,null,null,null,null,null,null,null,null,null,null,null,null,null,null,null,null,null,null,null,null,null,null,null,null,null,null,null,null,null,null,null,null,null,null,null,null,null,null,null,null,null,null,null,null,null,null,null,null,null,null,null,null,null,null,null,null,null,null,null,null,null,null,null,null,null,null,null,null,null,null,null,null,null,null,null,null,null,null,null,null,null,null,null,null,null,null,null,null,null,null,null,null,null,null,null,null,null,null,null,null,null,null,null,null,null,null,null,null,null,null,null,null,null,null,null,null,null,null,null,null,null,null,null,null,null,null,null,null,null,null,null,null,null,null,null,null,null,null,null,null,null,null,null,null,null,null,null,null,null,null,null,null,null,null,null,null,null,null,null,null,null,null,null,null,null,null,null,null,null,null,null,null,null,null,null,null,null,null,null,null,null,null,null,null,null,null,null,null,null,null,null,null,null,null,null,null,null,null,null,null,null,null,null,null,null,null,null,null,null,null,null,null,null,null,null,null,null,null,null,null,null,null,null,null,null,null,null,null,null,null,null,null,null,null,null,null,null,null,null,null,null,null,null,null,null,null,null,null,null,null,null,null,null,null,null,null,null,null,null,null,null,null,null,null,null,null,null,null,null,null,null,null,null,null,null,null,null,null,null,null,null,null,null,null,null,null,null,null,null,null,null,null,null,null,null,null,null,null,null,null,null,null,null,null,null,null,null,null,null,null,null,null,null,null,null,null,null,null,null,null,null,null,null,null,null,null,null,null,null,null,null,null,null,null,null,null,null,null,null,null,null,null,null,null,null,null,null,null,null,null,null,null,null,null,null,null,null,null,null,null,null,null,null,null,null,null,null,null,null,null,null,null,null,null,null,null,null,null,null,null,null,null,null,null,null,null,null,null,null,null,null,null,null,null,null,null,null,null,null,null,null,null,null,null,null,null,null,null,null,null,null,null,null,null,null,null,null,null,null,null,null,null,null,null,null,null,null,null,null,null,null,null,null,null,null,null,null,null,null,null,null,null,null,null,null,null,null,null,null,null,null,null,null,null,null,null,null,null,null,null,null,null,null,null,null,null,null,null,null,null,null,null,null,null,null,null,null,null,null,null,null,null,null,null,null,null,null,null,null,null,null,null,null,null,null,null,null,null,null,null,null,null,null,null,null,null,null,null,null,null,null,null,null,null,null,null,null,null,null,null,null,null,null,null,null,null,null,null,null,null,null,null,null,null,null,null,null,null,null,null,null,null,null,null,null,null,null,null,null,null,null,null,null,null,null,null,null,null,null,null,null,null,null,null,null,null,null,null,null,null,null,null,null,null,null,null,null,null,null,null,null,null,null,null,null,null,null,null,null,null,null,null,null,null,null,null,null,null,null,null,null,null,null,null,null,null,null,null,null,null,null,null,null,null,null,null,null,null,null,null,null,null,null,null,null,null,null,null,null,null,null,null,null,null,null,null,null,null,null,null,null,null,null,null,null,null,null,null,null,null,null,null,null,null,null,null,null,null,null,null,null,null,null,null,null,null,null,null,null,null,null,null,null,null,null,null,null,null,null,null,null,null,null,null,null,null,null,null,null,null,null,null,null,null,null,null,null,null,null,null,null,null,null,null,null,null,null,null,null,null,null,null,null,null,null,null,null,null,null,null,null,null,null,null,null,null,null,null,null,null,null,null,null,null,null,null,null,null,null,null,null,null,null,null,null,null,null,null,null,null,null,null,null,null,null,null,null,null,null,null,null,null,null,null,null,null,null,null,null,null,null,null,null,null,null,null,null,null,null,null,null,null,null,null,null,null,null,null,null,null,null,null,null,null,null,null,null,null,null,null,null,null,null,null,null,null,null,null,null,null,null,null,null,null,null,null,null,null,null,null,null,null,null,null,null,null,null,null,null,null,null,null,null,null,null,null,null,null,null,null,null,null,null,null,null,null,null,null,null,null,null,null,null,null,null,null,null,null,null,null,null,null,null,null,null,null,null,null,null,null,null,null,null,null,null,null,null,null,null,null,null,null,null,null,null,null,null,null,null,null,null,null,null,null,null,null,null,null,null,null,null,null,null,null,null,null,null,null,null,null,null,null,null,null,null,null,null,null,null,null,null,null,null,null,null,null,null,null,null,null,null,null,null,null,null,null,null,null,null,null,null,null,null,null,null,null,null,null,null,null,null,null,null,null,null,null,null,null,null,null,null,null,null,null,null,null,null,null,null,null,null,null,null,null,null,null,null,null,null,null,null,null,null,null,null,null,null,null,null,null,null,null,null,null,null,null,null,null,null,null,null,null,null,null,null,null,null,null,null,null,null,null,null,null,null,null,null,null,null,null,null,null,null,null,null,null,null,null,null,null,null,null,null,null,null,null,null,null,null,null,null,null,null,null,null,null,null,null,null,null,null,null,null,null,null,null,null,null,null,null,null,null,null,null,null,null,null,null,null,null,null,null,null,null,null,null,null,null,null,null,null,null,null,null,null,null,null,null,null,null,null,null,null,null,null,null,null,null,null,null,null,null,null,null,null,null,null,null,null,null,null,null,null,null,null,null,null,null,null,null,null,null,null,null,null,null,null,null,null,null,null,null,null,null,null,null,null,null,null,null,null,null,null,null,null,null,null,null,null,null,null,null,null,null,null,null,null,null,null,null,null,null,null,null,null,null,null,null,null,null,null,null,null,null,null,null,null,null,null,null,null,null,null,null,null,null,null,null,null,null,null,null,null,null,null,null,null,null,null,null,null,null,null,null,null,null,null,null,null,null,null,null,null,null,null,null,null,null,null,null,null,null,null,null,null,null,null,null,null,null,null,null,null,null,null,null,null,null,null,null,null,null,null,null,null,null,null,null,null,null,null,null,null,null,null,null,null,null,null,null,null,null,null,null,null,null,null,null,null,null,null,null,null,null,null,null,null,null,null,null,null,null,null,null,null,null,null,null,null,null,null,null,null,null,null,null,null,null,null,null,null,null,null,null,null,null,null,null,null,null,null,null,null,null,null,null,null,null,null,null,null,null,null,null,null,null,null,null,null,null,null,null,null,null,null,null,null,null,null,null,null,null,null,null,null,null,null,null,null,null,null,null,null,null,null,null,null,null,null,null,null,null,null,null,null,null,null,null,null,null,null,null,null,null,null,null,null,null,null,null,null,null,null,null,null,null,null,null,null,null,null,null,null,null,null,null,null,null,null,null,null,null,null,null,null,null,null,null,null,null,null,null,null,null,null,null,null,null,null,null,null,null,null,null,null,null,null,null,null,null,null,null,null,null,null,null,null,null,null,null,null,null,null,null,null,null,null,null,null,null,null,null,null,null,null,null,null,null,null,null,null,null,null,null,null,null,null,null,null,null,null,null,null,null,null,null,null,null,null,null,null,null,null,null,null,null,null,null,null,null,null,null,null,null,null,null,null,null,null,null,null,null,null,null,null,null,null,null,null,null,null,null,null,null,null,null,null,null,null,null,null,null,null,null,null,null,null,null,null,null,null,null,null,null,null,null,null,null,null,null,null,null,null,null,null,null,null,null,null,null,null,null,null,null,null,null,null,null,null,null,null,null,null,null,null,null,null,null,null,null,null,null,null,null,null,null,null,null,null,null,null,null,null,null,null,null,null,null,null,null,null,null,null,null,null,null,null,null,null,null,null,null,null,null,null,null,null,null,null,null,null,null,null,null,null,null,null,null,null,null,null,null,null,null,null,null,null,null,null,null,null,null,null,null,null,null,null,null,null,null,null,null,null,null,null,null,null,null,null,null,null,null,null,null,null,null,null,null,null,null,null,null,null,null,null,null,null,null,null,null,null,null,null,null,null,null,null,null,null,null,null,null,null,null,null,null,null,null,null,null,null,null,null,null,null,null,null,null,null,null,null,null,null,null,null,null,null,null,null,null,null,null,null,null,null,null,null,null,null,null,null,null,null,null,null,null,null,null,null,null,null,null,null,null,null,null,null,null,null,null,null,null,null,null,null,null,null,null,null,null,null,null,null,null,null,null,null,null,null,null,null,null,null,null,null,null,null,null,null,null,null,null,null,null,null,null,null,null,null,null,null,null,null,null,null,null,null,null,null,null,null,null,null,null,null,null,null,null,null,null,null,null,null,null,null,null,null,null,null,null,null,null,null,null,null,null,null,null,null,null,null,null,null,null,null,null,null,null,null,null,null,null,null,null,null,null,null,null,null,null,null,null,null,null,null,null,null,null,null,null,null,null,null,null,null,null,null,null,null,null,null,null,null,null,null,null,null,null,null,null,null,null,null,null,null,null,null,null,null,null,null,null,null,null,null,null,null,null,null,null,null,null,null,null,null,null,null,null,null,null,null,null,null,null,null,null,null,null,null,null,null,null,null,null,null,null,null,null,null,null,null,null,null,null,null,null,null,null,null,null,null,null,null,null,null,null,null,null,null,null,null,null,null,null,null,null,null,null,null,null,null,null,null,null,null,null,null,null,null,null,null,null,null,null,null,null,null,null,null,null,null,null,null,null,null,null,null,null,null,null,null,null,null,null,null,null,null,null,null,null,null,null,null,null,null,null,null,null,null,null,null,null,null,null,null,null,null,null,null,null,null,null,null,null,null,null,null,null,null,null,null,null,null,null,null,null,null,null,null,null,null,null,null,null,null,null,null,null,null,null,null,null,null,null,null,null,null,null,null,null,null,null,null,null,null,null,null,null,null,null,null,null,null,null,null,null,null,null,null,null,null,null,null,null,null,null,null,null,null,null,null,null,null,null,null,null,null,null,null,null,null,null,null,null,null,null,null,null,null,null,null,null,null,null,null,null,null,null,null,null,null,null,null,null,null,null,null,null,null,null,null,null,null,null,null,null,null,null,null,null,null,null,null,null,null,null,null,null,null,null,null,null,null,null,null,null,null,null,null,null,null,null,null,null,null,null,null,null,null,null,null,null,null,null,null,null,null,null,null,null,null,null,null,null,null,null,null,null,null,null,null,null,null,null,null,null,null,null,null,null,null,null,null,null,null,null,null,null,null,null,null,null,null,null,null,null,null,null,null,null,null,null,null,null,null,null,null,null,null,null,null,null,null,null,null,null,null,null,null,null,null,null,null,null,null,null,null,null,null,null,null,null,null,null,null,null,null,null,null,null,null,null,null,null,null,null,null,null,null,null,null,null,null,null,null,null,null,null,null,null,null,null,null,null,null,null,null,null,null,null,null,null,null,null,null,null,null,null,null,null,null,null,null,null,null,null,null,null,null,null,null,null,null,null,null,null,null,null,null,null,null,null,null,null,null,null,null,null,null,null,null,null,null,null,null,null,null,null,null,null,null,null,null,null,null,null,null,null,null,null,null,null,null,null,null,null,null,null,null,null,null,null,null,null,null,null,null,null,null,null,null,null,null,null,null,null,null,null,null,null,null,null,null,null,null,null,null,null,null,null,null,null,null,null,null,null,null,null,null,null,null,null,null,null,null,null,null,null,null,null,null,null,null,null,null,null,null,null,null,null,null,null,null,null,null,null,null,null,null,null,null,null,null,null,null,null,null,null,null,null,null,null,null,null,null,null,null,null,null,null,null,null,null,null,null,null,null,null,null,null,null,null,null,null,null,null,null,null,null,null,null,null,null,null,null,null,null,null,null,null,null,null,null,null,null,null,null,null,null,null,null,null,null,null,null,null,null,null,null,null,null,null,null,null,null,null,null,null,null,null,null,null,null,null,null,null,null,null,null,null,null,null,null,null,null,null,null,null,null,null,null,null,null,null,null,null,null,null,null,null,null,null,null,null,null,null,null,null,null,null,null,null,null,null,null,null,null,null,null,null,null,null,null,null,null,null,null,null,null,null,null,null,null,null,null,null,null,null,null,null,null,null,null,null,null,null,null,null,null,null,null,null,null,null,null,null,null,null,null,null,null,null,null,null,null,null,null,null,null,null,null,null,null,null,null,null,null,null,null,null,null,null,null,null,null,null,null,null,null,null,null,null,null,null,null,null,null,null,null,null,null,null,null,null,null,null,null,null,null,null,null,null,null,null,null,null,null,null,null,null,null,null,null,null,null,null,null,null,null,null,null,null,null,null,null,null,null,null,null,null,null,null,null,null,null,null,null,null,null,null,null,null,null,null,null,null,null,null,null,null,null,null,null,null,null,null,null,null,null,null,null,null,null,null,null,null,null,null,null,null,null,null,null,null,null,null,null,null,null,null,null,null,null,null,null,null,null,null,null,null,null,null,null,null,null,null,null,null,null,null,null,null,null,null,null,null,null,null,null,null,null,null,null,null,null,null,null,null,null,null,null,null,null,null,null,null,null,null,null,null,null,null,null,null,null,null,null,null,null,null,null,null,null,null,null,null,null,null,null,null,null,null,null,null,null,null,null,null,null,null,null,null,null,null,null,null,null,null,null,null,null,null,null,null,null,null,null,null,null,null,null,null,null,null,null,null,null,null,null,null,null,null,null,null,null,null,null,null,null,null,null,null,null,null,null,null,null,null,null,null,null,null,null,null,null,null,null,null,null,null,null,null,null,null,null,null,null,null,null,null,null,null,null,null,null,null,null,null,null,null,null,null,null,null,null,null,null,null,null,null,null,null,null,null,null,null,null,null,null,null,null,null,null,null,null,null,null,null,null,null,null,null,null,null,null,null,null,null,null,null,null,null,null,null,null,null,null,null,null,null,null,null,null,null,null,null,null,null,null,null,null,null,null,null,null,null,null,null,null,null,null,null,null,null,null,null,null,null,null,null,null,null,null,null,null,null,null,null,null,null,null,null,null,null,null,null,null,null,null,null,null,null,null,null,null,null,null,null,null,null,null,null,null,null,null,null,null,null,null,null,null,null,null,null,null,null,null,null,null,null,null,null,null,null,null,null,null,null,null,null,null,null,null,null,null,null,null,null,null,null,null,null,null,null,null,null,null,null,null,null,null,null,null,null,null,null,null,null,null,null,null,null,null,null,null,null,null,null,null,null,null,null,null,null,null,null,null,null,null,null,null,null,null,null,null,null,null,null,null,null,null,null,null,null,null,null,null,null,null,null,null,null,null,null,null,null,null,null,null,null,null,null,null,null,null,null,null,null,null,null,null,null,null,null,null,null,null,null,null,null,null,null,null,null,null,null,null,null,null,null,null,null,null,null,null,null,null,null,null,null,null,null,null,null,null,null,null,null,null,null,null,null,null,null,null,null,null,null,null,null,null,null,null,null,null,null,null,null,null,null,null,null,null,null,null,null,null,null,null,null,null,null,null,null,null,null,null,null,null,null,null,null,null,null,null,null,null,null,null,null,null,null,null,null,null,null,null,null,null,null,null,null,null,null,null,null,null,null,null,null,null,null,null,null,null,null,null,null,null,null,null,null,null,null,null,null,null,null,null,null,null,null,null,null,null,null,null,null,null,null,null,null,null,null,null,null,null,null,null,null,null,null,null,null,null,null,null,null,null,null,null,null,null,null,null,null,null,null,null,null,null,null,null,null,null,null,null,null,null,null,null,null,null,null,null,null,null,null,null,null,null,null,null,null,null,null,null,null,null,null,null,null,null,null,null,null,null,null,null,null,null,null,null,null,null,null,null,null,null,null,null,null,null,null,null,null,null,null,null,null,null,null,null,null,null,null,null,null,null,null,null,null,null,null,null,null,null,null,null,null,null,null,null,null,null,null,null,null,null,null,null,null,null,null,null,null,null,null,null,null,null,null,null,null,null,null,null,null,null,null,null,null,null,null,null,null,null,null,null,null,null,null,null,null,null,null,null,null,null,null,null,null,null,null,null,null,null,null,null,null,null,null,null,null,null,null,null,null,null,null,null,null,null,null,null,null,null,null,null,null,null,null,null,null,null,null,null,null,null,null,null,null,null,null,null,null,null,null,null,null,null,null,null,null,null,null,null,null,null,null,null,null,null,null,null,null,null,null,null,null,null,null,null,null,null,null,null,null,null,null,null,null,null,null,null,null,null,null,null,null,null,null,null,null,null,null,null,null,null,null,null,null,null,null,null,null,null,null,null,null,null,null,null,null,null,null,null,null,null,null,null,null,null,null,null,null,null,null,null,null,null,null,null,null,null,null,null,null,null,null,null,null,null,null,null,null,null,null,null,null,null,null,null,null,null,null,null,null,null,null,null,null,null,null,null,null,null,null,null,null,null,null,null,null,null,null,null,null,null,null,null,null,null,null,null,null,null,null,null,null,null,null,null,null,null,null,null,null,null,null,null,null,null,null,null,null,null,null,null,null,null,null,null,null,null,null,null,null,null,null,null,null,null,null,null,null,null,null,null,null,null,null,null,null,null,null,null,null,null,null,null,null,null,null,null,null,null,null,null,null,null,null,null,null,null,null,null,null,null,null,null,null,null,null,null,null,null,null,null,null,null,null,null,null,null,null,null,null,null,null,null,null,null,null,null,null,null,null,null,null,null,null,null,null,null,null,null,null,null,null,null,null,null,null,null,null,null,null,null,null,null,null,null,null,null,null,null,null,null,null,null,null,null,null,null,null,null,null,null,null,null,null,null,null,null,null,null,null,null,null,null,null,null,null,null,null,null,null,null,null,null,null,null,null,null,null,null,null,null,null,null,null,null,null,null,null,null,null,null,null,null,null,null,null,null,null,null,null,null,null,null,null,null,null,null,null,null,null,null,null,null,null,null,null,null,null,null,null,null,null,null,null,null,null,null,null,null,null,null,null,null,null,null,null,null,null,null,null,null,null,null,null,null,null,null,null,null,null,null,null,null,null,null,null,null,null,null,null,null,null,null,null,null,null,null,null,null,null,null,null,null,null,null,null,null,null,null,null,null,null,null,null,null,null,null,null,null,null,null,null,null,null,null,null,null,null,null,null,null,null,null,null,null,null,null,null,null,null,null,null,null,null,null,null,null,null,null,null,null,null,null,null,null,null,null,null,null,null,null,null,null,null,null,null,null,null,null,null,null,null,null,null,null,null,null,null,null,null,null,null,null,null,null,null,null,null,null,null,null,null,null,null,null,null,null,null,null,null,null,null,null,null,null,null,null,null,null,null,null,null,null,null,null,null,null,null,null,null,null,null,null,null,null,null,null,null,null,null,null,null,null,null,null,null,null,null,null,null,null,null,null,null,null,null,null,null,null,null,null,null,null,null,null,null,null,null,null,null,null,null,null,null,null,null,null,null,null,null,null,null,null,null,null,null,null,null,null,null,null,null,null,null,null,null,null,null,null,null,null,null,null,null,null,null,null,null,null,null,null,null,null,null,null,null,null,null,null,null,null,null,null,null,null,null,null,null,null,null,null,null,null,null,null,null,null,null,null,null,null,null,null,null,null,null,null,null,null,null,null,null,null,null,null,null,null,null,null,null,null,null,null,null,null,null,null,null,null,null,null,null,null,null,null,null,null,null,null,null,null,null,null,null,null,null,null,null,null,null,null,null,null,null,null,null,null,null,null,null,null,null,null,null,null,null,null,null,null,null,null,null,null,null,null,null,null,null,null,null,null,null,null,null,null,null,null,null,null,null,null,null,null,null,null,null,null,null,null,null,null,null,null,null,null,null,null,null,null,null,null,null,null,null,null,null,null,null,null,null,null,null,null,null,null,null,null,null,null,null,null,null,null,null,null,null,null,null,null,null,null,null,null,null,null,null,null,null,null,null,null,null,null,null,null,null,null,null,null,null,null,null,null,null,null,null,null,null,null,null,null,null,null,null,null,null,null,null,null,null,null,null,null,null,null,null,null,null,null,null,null,null,null,null,null,null,null,null,null,null,null,null,null,null,null,null,null,null,null,null,null,null,null,null,null,null,null,null,null,null,null,null,null,null,null,null,null,null,null,null,null,null,null,null,null,null,null,null,null,null,null,null,null,null,null,null,null,null,null,null,null,null,null,null,null,null,null,null,null,null,null,null,null,null,null,null,null,null,null,null,null,null,null,null,null,null,null,null,null,null,null,null,null,null,null,null,null,null,null,null,null,null,null,null,null,null,null,null,null,null,null,null,null,null,null,null,null,null,null,null,null,null,null,null,null,null,null,null,null,null,null,null,null,null,null,null,null,null,null,null,null,null,null,null,null,null,null,null,null,null,null,null,null,null,null,null,null,null,null,null,null,null,null,null,null,null,null,null,null,null,null,null,null,null,null,null,null,null,null,null,null,null,null,null,null,null,null,null,null,null,null,null,null,null,null,null,null,null,null,null,null,null,null,null,null,null,null,null,null,null,null,null,null,null,null,null,null,null,null,null,null,null,null,null,null,null,null,null,null,null,null,null,null,null,null,null,null,null,null,null,null,null,null,null,null,null,null,null,null,null,null,null,null,null,null,null,null,null,null,null,null,null,null,null,null,null,null,null,null,null,null,null,null,null,null,null,null,null,null,null,null,null,null,null,null,null,null,null,null,null,null,null,null,null,null,null,null,null,null,null,null,null,null,null,null,null,null,null,null,null,null,null,null,null,null,null,null,null,null,null,null,null,null,null,null,null,null,null,null,null,null,null,null,null,null,null,null,null,null,null,null,null,null,null,null,null,null,null,null,null,null,null,null,null,null,null,null,null,null,null,null,null,null,null,null,null,null,null,null,null,null,null,null,null,null,null,null,null,null,null,null,null,null,null,null,null,null,null,null,null,null,null,null,null,null,null,null,null,null,null,null,null,null,null,null,null,null,null,null,null,null,null,null,null,null,null,null,null,null,null,null,null,null,null,null,null,null,null,null,null,null,null,null,null,null,null,null,null,null,null,null,null,null,null,null,null,null,null,null,null,null,null,null,null,null,null,null,null,null,null,null,null,null,null,null,null,null,null,null,null,null,null,null,null,null,null,null,null,null,null,null,null,null,null,null,null,null,null,null,null,null,null,null,null,null,null,null,null,null,null,null,null,null,null,null,null,null,null,null,null,null,null,null,null,null,null,null,null,null,null,null,null,null,null,null,null,null,null,null,null,null,null,null,null,null,null,null,null,null,null,null,null,null,null,null,null,null,null,null,null,null,null,null,null,null,null,null,null,null,null,null,null,null,null,null,null,null,null,null,null,null,null,null,null,null,null,null,null,null,null,null,null,null,null,null,null,null,null,null,null,null,null,null,null,null,null,null,null,null,null,null,null,null,null,null,null,null,null,null,null,null,null,null,null,null,null,null,null,null,null,null,null,null,null,null,null,null,null,null,null,null,null,null,null,null,null,null,null,null,null,null,null,null,null,null,null,null,null,null,null,null,null,null,null,null,null,null,null,null,null,null,null,null,null,null,null,null,null,null,null,null,null,null,null,null,null,null,null,null,null,null,null,null,null,null,null,null,null,null,null,null,null,null,null,null,null,null,null,null,null,null,null,null,null,null,null,null,null,null,null,null,null,null,null,null,null,null,null,null,null,null,null,null,null,null,null,null,null,null,null,null,null,null,null,null,null,null,null,null,null,null,null,null,null,null,null,null,null,null,null,null,null,null,null,null,null,null,null,null,null,null,null,null,null,null,null,null,null,null,null,null,null,null,null,null,null,null,null,null,null,null,null,null,null,null,null,null,null,null,null,null,null,null,null,null,null,null,null,null,null,null,null,null,null,null,null,null,null,null,null,null,null,null,null,null,null,null,null,null,null,null,null,null,null,null,null,null,null,null,null,null,null,null,null,null,null,null,null,null,null,null,null,null,null,null,null,null,null,null,null,null,null,null,null,null,null,null,null,null,null,null,null,null,null,null,null,null,null,null,null,null,null,null,null,null,null,null,null,null,null,null,null,null,null,null,null,null,null,null,null,null,null,null,null,null,null,null,null,null,null,null,null,null,null,null,null,null,null,null,null,null,null,null,null,null,null,null,null,null,null,null,null,null,null,null,null,null,null,null,null,null,null,null,null,null,null,null,null,null,null,null,null,null,null,null,null,null,null,null,null,null,null,null,null,null,null,null,null,null,null,null,null,null,null,null,null,null,null,null,null,null,null,null,null,null,null,null,null,null,null,null,null,null,null,null,null,null,null,null,null,null,null,null,null,null,null,null,null,null,null,null,null,null,null,null,null,null,null,null,null,null,null,null,null,null,null,null,null,null,null,null,null,null,null,null,null,null,null,null,null,null,null,null,null,null,null,null,null,null,null,null,null,null,null,null,null,null,null,null,null,null,null,null,null,null,null,null,null,null,null,null,null,null,null,null,null,null,null,null,null,null,null,null,null,null,null,null,null,null,null,null,null,null,null,null,null,null,null,null,null,null,null,null,null,null,null,null,null,null,null,null,null,null,null,null,null,null,null,null,null,null,null,null,null,null,null,null,null,null,null,null,null,null,null,null,null,null,null,null,null,null,null,null,null,null,null,null,null,null,null,null,null,null,null,null,null,null,null,null,null,null,null,null,null,null,null,null,null,null,null,null,null,null,null,null,null,null,null,null,null,null,null,null,null,null,null,null,null,null,null,null,null,null,null,null,null,null,null,null,null,null,null,null,null,null,null,null,null,null,null,null,null,null,null,null,null,null,null,null,null,null,null,null,null,null,null,null,null,null,null,null,null,null,null,null,null,null,null,null,null,null,null,null,null,null,null,null,null,null,null,null,null,null,null,null,null,null,null,null,null,null,null,null,null,null,null,null,null,null,null,null,null,null,null,null,null,null,null,null,null,null,null,null,null,null,null,null,null,null,null,null,null,null,null,null,null,null,null,null,null,null,null,null,null,null,null,null,null,null,null,null,null,null,null,null,null,null,null,null,null,null,null,null,null,null,null,null,null,null,null,null,null,null,null,null,null,null,null,null,null,null,null,null,null,null,null,null,null,null,null,null,null,null,null,null,null,null,null,null,null,null,null,null,null,null,null,null,null,null,null,null,null,null,null,null,null,null,null,null,null,null,null,null,null,null,null,null,null,null,null,null,null,null,null,null,null,null,null,null,null,null,null,null,null,null,null,null,null,null,null,null,null,null,null,null,null,null,null,null,null,null,null,null,null,null,null,null,null,null,null,null,null,null,null,null,null,null,null,null,null,null,null,null,null,null,null,null,null,null,null,null,null,null,null,null,null,null,null,null,null,null,null,null,null,null,null,null,null,null,null,null,null,null,null,null,null,null,null,null,null,null,null,null,null,null,null,null,null,null,null,null,null,null,null,null,null,null,null,null,null,null,null,null,null,null,null,null,null,null,null,null,null,null,null,null,null,null,null,null,null,null,null,null,null,null,null,null,null,null,null,null,null,null,null,null,null,null,null,null,null,null,null,null,null,null,null,null,null,null,null,null,null,null,null,null,null,null,null,null,null,null,null,null,null,null,null,null,null,null,null,null,null,null,null,null,null,null,null,null,null,null,null,null,null,null,null,null,null,null,null,null,null,null,null,null,null,null,null,null,null,null,null,null,null,null,null,null,null,null,null,null,null,null,null,null,null,null,null,null,null,null,null,null,null,null,null,null,null,null,null,null,null,null,null,null,null,null,null,null,null,null,null,null,null,null,null,null,null,null,null,null,null,null,null,null,null,null,null,null,null,null,null,null,null,null,null,null,null,null,null,null,null,null,null,null,null,null,null,null,null,null,null,null,null,null,null,null,null,null,null,null,null,null,null,null,null,null,null,null,null,null,null,null,null,null,null,null,null,null,null,null,null,null,null,null,null,null,null,null,null,null,null,null,null,null,null,null,null,null,null,null,null,null,null,null,null,null,null,null,null,null,null,null,null,null,null,null,null,null,null,null,null,null,null,null,null,null,null,null,null,null,null,null,null,null,null,null,null,null,null,null,null,null,null,null,null,null,null,null,null,null,null,null,null,null,null,null,null,null,null,null,null,null,null,null,null,null,null,null,null,null,null,null,null,null,null,null,null,null,null,null,null,null,null,null,null,null,null,null,null,null,null,null,null,null,null,null,null,null,null,null,null,null,null,null,null,null,null,null,null,null,null,null,null,null,null,null,null,null,null,null,null,null,null,null,null,null,null,null,null,null,null,null,null,null,null,null,null,null,null,null,null,null,null,null,null,null,null,null,null,null,null,null,null,null,null,null,null,null,null,null,null,null,null,null,null,null,null,null,null,null,null,null,null,null,null,null,null,null,null,null,null,null,null,null,null,null,null,null,null,null,null,null,null,null,null,null,null,null,null,null,null,null,null,null,null,null,null,null,null,null,null,null,null,null,null,null,null,null,null,null,null,null,null,null,null,null,null,null,null,null,null,null,null,null,null,null,null,null,null,null,null,null,null,null,null,null,null,null,null,null,null,null,null,null,null,null,null,null,null,null,null,null,null,null,null,null,null,null,null,null,null,null,null,null,null,null,null,null,null,null,null,null,null,null,null,null,null,null,null,null,null,null,null,null,null,null,null,null,null,null,null,null,null,null,null,null,null,null,null,null,null,null,null,null,null,null,null,null,null,null,null,null,null,null,null,null,null,null,null,null,null,null,null,null,null,null,null,null,null,null,null,null,null,null,null,null,null,null,null,null,null,null,null,null,null,null,null,null,null,null,null,null,null,null,null,null,null,null,null,null,null,null,null,null,null,null,null,null,null,null,null,null,null,null,null,null,null,null,null,null,null,null,null,null,null,null,null,null,null,null,null,null,null,null,null,null,null,null,null,null,null,null,null,null,null,null,null,null,null,null,null,null,null,null,null,null,null,null,null,null,null,null,null,null,null,null,null,null,null,null,null,null,null,null,null,null,null,null,null,null,null,null,null,null,null,null,null,null,null,null,null,null,null,null,null,null,null,null,null,null,null,null,null,null,null,null,null,null,null,null,null,null,null,null,null,null,null,null,null,null,null,null,null,null,null,null,null,null,null,null,null,null,null,null,null,null,null,null,null,null,null,null,null,null,null,null,null,null,null,null,null,null,null,null,null,null,null,null,null,null,null,null,null,null,null,null,null,null,null,null,null,null,null,null,null,null,null,null,null,null,null,null,null,null,null,null,null,null,null,null,null,null,null,null,null,null,null,null,null,null,null,null,null,null,null,null,null,null,null,null,null,null,null,null,null,null,null,null,null,null,null,null,null,null,null,null,null,null,null,null,null,null,null,null,null,null,null,null,null,null,null,null,null,null,null,null,null,null,null,null,null,null,null,null,null,null,null,null,null,null,null,null,null,null,null,null,null,null,null,null,null,null,null,null,null,null,null,null,null,null,null,null,null,null,null,null,null,null,null,null,null,null,null,null,null,null,null,null,null,null,null,null,null,null,null,null,null,null,null,null,null,null,null,null,null,null,null,null,null,null,null,null,null,null,null,null,null,null,null,null,null,null,null,null,null,null,null,null,null,null,null,null,null,null,null,null,null,null,null,null,null,null,null,null,null,null,null,null,null,null,null,null,null,null,null,null,null,null,null,null,null,null,null,null,null,null,null,null,null,null,null,null,null,null,null,null,null,null,null,null,null,null,null,null,null,null,null,null,null,null,null,null,null,null,null,null,null,null,null,null,null,null,null,null,null,null,null,null,null,null,null,null,null,null,null,null,null,null,null,null,null,null,null,null,null,null,null,null,null,null,null,null,null,null,null,null,null,null,null,null,null,null,null,null,null,null,null,null,null,null,null,null,null,null,null,null,null,null,null,null,null,null,null,null,null,null,null,null,null,null,null,null,null,null,null,null,null,null,null,null,null,null,null,null,null,null,null,null,null,null,null,null,null,null,null,null,null,null,null,null,null,null,null,null,null,null,null,null,null,null,null,null,null,null,null,null,null,null,null,null,null,null,null,null,null,null,null,null,null,null,null,null,null,null,null,null,null,null,null,null,null,null,null,null,null,null,null,null,null,null,null,null,null,null,null,null,null,null,null,null,null,null,null,null,null,null,null,null,null,null,null,null,null,null,null,null,null,null,null,null,null,null,null,null,null,null,null,null,null,null,null,null,null,null,null,null,null,null,null,null,null,null,null,null,null,null,null,null,null,null,null,null,null,null,null,null,null,null,null,null,null,null,null,null,null,null,null,null,null,null,null,null,null,null,null,null,null,null,null,null,null,null,null,null,null,null,null,null,null,null,null,null,null,null,null,null,null,null,null,null,null,null,null,null,null,null,null,null,null,null,null,null,null,null,null,null,null,null,null,null,null,null,null,null,null,null,null,null,null,null,null,null,null,null,null,null,null,null,null,null,null,null,null,null,null,null,null,null,null,null,null,null,null,null,null,null,null,null,null,null,null,null,null,null,null,null,null,null,null,null,null,null,null,null,null,null,null,null,null,null,null,null,null,null,null,null,null,null,null,null,null,null,null,null,null,null,null,null,null,null,null,null,null,null,null,null,null,null,null,null,null,null,null,null,null,null,null,null,null,null,null,null,null,null,null,null,null,null,null,null,null,null,null,null,null,null,null,null,null,null,null,null,null,null,null,null,null,null,null,null,null,null,null,null,null,null,null,null,null,null,null,null,null,null,null,null,null,null,null,null,null,null,null,null,null,null,null,null,null,null,null,null,null,null,null,null,null,null,null,null,null,null,null,null,null,null,null,null,null,null,null,null,null,null,null,null,null,null,null,null,null,null,null,null,null,null,null,null,null,null,null,null,null,null,null,null,null,null,null,null,null,null,null,null,null,null,null,null,null,null,null,null,null,null,null,null,null,null,null,null,null,null,null,null,null,null,null,null,null,null,null,null,null,null,null,null,null,null,null,null,null,null,null,null,null,null,null,null,null,null,null,null,null,null,null,null,null,null,null,null,null,null,null,null,null,null,null,null,null,null,null,null,null,null,null,null,null,null,null,null,null,null,null,null,null,null,null,null,null,null,null,null,null,null,null,null,null,null,null,null,null,null,null,null,null,null,null,null,null,null,null,null,null,null,null,null,null,null,null,null,null,null,null,null,null,null,null,null,null,null,null,null,null,null,null,null,null,null,null,null,null,null,null,null,null,null,null,null,null,null,null,null,null,null,null,null,null,null,null,null,null,null,null,null,null,null,null,null,null,null,null,null,null,null,null,null,null,null,null,null,null,null,null,null,null,null,null,null,null,null,null,null,null,null,null,null,null,null,null,null,null,null,null,null,null,null,null,null,null,null,null,null,null,null,null,null,null,null,null,null,null,null,null,null,null,null,null,null,null,null,null,null,null,null,null,null,null,null,null,null,null,null,null,null,null,null,null,null,null,null,null,null,null,null,null,null,null,null,null,null,null,null,null,null,null,null,null,null,null,null,null,null,null,null,null,null,null,null,null,null,null,null,null,null,null,null,null,null,null,null,null,null,null,null,null,null,null,null,null,null,null,null,null,null,null,null,null,null,null,null,null,null,null,null,null,null,null,null,null,null,null,null,null,null,null,null,null,null,null,null,null,null,null,null,null,null,null,null,null,null,null,null,null,null,null,null,null,null,null,null,null,null,null,null,null,null,null,null,null,null,null,null,null,null,null,null,null,null,null,null,null,null,null,null,null,null,null,null,null,null,null,null,null,null,null,null,null,null,null,null,null,null,null,null,null,null,null,null,null,null,null,null,null,null,null,null,null,null,null,null,null,null,null,null,null,null,null,null,null,null,null,null,null,null,null,null,null,null,null,null,null,null,null,null,null,null,null,null,null,null,null,null,null,null,null,null,null,null,null,null,null,null,null,null,null,null,null,null,null,null,null,null,null,null,null,null,null,null,null,null,null,null,null,null,null,null,null,null,null,null,null,null,null,null,null,null,null,null,null,null,null,null,null,null,null,null,null,null,null,null,null,null,null,null,null,null,null,null,null,null,null,null,null,null,null,null,null,null,null,null,null,null,null,null,null,null,null,null,null,null,null,null,null,null,null,null,null,null,null,null,null,null,null,null,null,null,null,null,null,null,null,null,null,null,null,null,null,null,null,null,null,null,null,null,null,null,null,null,null,null,null,null,null,null,null,null,null,null,null,null,null,null,null,null,null,null,null,null,null,null,null,null,null,null,null,null,null,null,null,null,null,null,null,null,null,null,null,null,null,null,null,null,null,null,null,null,null,null,null,null,null,null,null,null,null,null,null,null,null,null,null,null,null,null,null,null,null,null,null,null,null,null,null,null,null,null,null,null,null,null,null,null,null,null,null,null,null,null,null,null,null,null,null,null,null,null,null,null,null,null,null,null,null,null,null,null,null,null,null,null,null,null,null,null,null,null,null,null,null,null,null,null,null,null,null,null,null,null,null,null,null,null,null,null,null,null,null,null,null,null,null,null,null,null,null,null,null,null,null,null,null,null,null,null,null,null,null,null,null,null,null,null,null,null,null,null,null,null,null,null,null,null,null,null,null,null,null,null,null,null,null,null,null,null,null,null,null,null,null,null,null,null,null,null,null,null,null,null,null,null,null,null,null,null,null,null,null,null,null,null,null,null,null,null,null,null,null,null,null,null,null,null,null,null,null,null,null,null,null,null,null,null,null,null,null,null,null,null,null,null,null,null,null,null,null,null,null,null,null,null,null,null,null,null,null,null,null,null,null,null,null,null,null,null,null,null,null,null,null,null,null,null,null,null,null,null,null,null,null,null,null,null,null,null,null,null,null,null,null,null,null,null,null,null,null,null,null,null,null,null,null,null,null,null,null,null,null,null,null,null,null,null,null,null,null,null,null,null,null,null,null,null,null,null,null,null,null,null,null,null,null,null,null,null,null,null,null,null,null,null,null,null,null,null,null,null,null,null,null,null,null,null,null,null,null,null,null,null,null,null,null,null,null,null,null,null,null,null,null,null,null,null,null,null,null,null,null,null,null,null,null,null,null,null,null,null,null,null,null,null,null,null,null,null,null,null,null,null,null,null,null,null,null,null,null,null,null,null,null,null,null,null,null,null,null,null,null,null,null,null,null,null,null,null,null,null,null,null,null,null,null,null,null,null,null,null,null,null,null,null,null,null,null,null,null,null,null,null,null,null,null,null,null,null,null,null,null,null,null,null,null,null,null,null,null,null,null,null,null,null,null,null,null,null,null,null,null,null,null,null,null,null,null,null,null,null,null,null,null,null,null,null,null,null,null,null,null,null,null,null,null,null,null,null,null,null,null,null,null,null,null,null,null,null,null,null,null,null,null,null,null,null,null,null,null,null,null,null,null,null,null,null,null,null,null,null,null,null,null,null,null,null,null,null,null,null,null,null,null,null,null,null,null,null,null,null,null,null,null,null,null,null,null,null,null,null,null,null,null,null,null,null,null,null,null,null,null,null,null,null,null,null,null,null,null,null,null,null,null,null,null,null,null,null,null,null,null,null,null,null,null,null,null,null,null,null,null,null,null,null,null,null,null,null,null,null,null,null,null,null,null,null,null,null,null,null,null,null,null,null,null,null,null,null,null,null,null,null,null,null,null,null,null,null,null,null,null,null,null,null,null,null,null,null,null,null,null,null,null,null,null,null,null,null,null,null,null,null,null,null,null,null,null,null,null,null,null,null,null,null,null,null,null,null,null,null,null,null,null,null,null,null,null,null,null,null,null,null,null,null,null,null,null,null,null,null,null,null,null,null,null,null,null,null,null,null,null,null,null,null,null,null,null,null,null,null,null,null,null,null,null,null,null,null,null,null,null,null,null,null,null,null,null,null,null,null,null,null,null,null,null,null,null,null,null,null,null,null,null,null,null,null,null,null,null,null,null,null,null,null,null,null,null,null,null,null,null,null,null,null,null,null,null,null,null,null,null,null,null,null,null,null,null,null,null,null,null,null,null,null,null,null,null,null,null,null,null,null,null,null,null,null,null,null,null,null,null,null,null,null,null,null,null,null,null,null,null,null,null,null,null,null,null,null,null,null,null,null,null,null,null,null,null,null,null,null,null,null,null,null,null,null,null,null,null,null,null,null,null,null,null,null,null,null,null,null,null,null,null,null,null,null,null,null,null,null,null,null,null,null,null,null,null,null,null,null,null,null,null,null,null,null,null,null,null,null,null,null,null,null,null,null,null,null,null,null,null,null,null,null,null,null,null,null,null,null,null,null,null,null,null,null,null,null,null,null,null,null,null,null,null,null,null,null,null,null,null,null,null,null,null,null,null,null,null,null,null,null,null,null,null,null,null,null,null,null,null,null,null,null,null,null,null,null,null,null,null,null,null,null,null,null,null,null,null,null,null,null,null,null,null,null,null,null,null,null,null,null,null,null,null,null,null,null,null,null,null,null,null,null,null,null,null,null,null,null,null,null,null,null,null,null,null,null,null,null,null,null,null,null,null,null,null,null,null,null,null,null,null,null,null,null,null,null,null,null,null,null,null,null,null,null,null,null,null,null,null,null,null,null,null,null,null,null,null,null,null,null,null,null,null,null,null,null,null,null,null,null,null,null,null,null,null,null,null,null,null,null,null,null,null,null,null,null,null,null,null,null,null,null,null,null,null,null,null,null,null,null,null,null,null,null,null,null,null,null,null,null,null,null,null,null,null,null,null,null,null,null,null,null,null,null,null,null,null,null,null,null,null,null,null,null,null,null,null,null,null,null,null,null,null,null,null,null,null,null,null,null,null,null,null,null,null,null,null,null,null,null,null,null,null,null,null,null,null,null,null,null,null,null,null,null,null,null,null,null,null,null,null,null,null,null,null,null,null,null,null,null,null,null,null,null,null,null,null,null,null,null,null,null,null,null,null,null,null,null,null,null,null,null,null,null,null,null,null,null,null,null,null,null,null,null,null,null,null,null,null,null,null,null,null,null,null,null,null,null,null,null,null,null,null,null,null,null,null,null,null,null,null,null,null,null,null,null,null,null,null,null,null,null,null,null,null,null,null,null,null,null,null,null,null,null,null,null,null,null,null,null,null,null,null,null,null,null,null,null,null,null,null,null,null,null,null,null,null,null,null,null,null,null,null,null,null,null,null,null,null,null,null,null,null,null,null,null,null,null,null,null,null,null,null,null,null,null,null,null,null,null,null,null,null,null,null,null,null,null,null,null,null,null,null,null,null,null,null,null,null,null,null,null,null,null,null,null,null,null,null,null,null,null,null,null,null,null,null,null,null,null,null,null,null,null,null,null,null,null,null,null,null,null,null,null,null,null,null,null,null,null,null,null,null,null,null,null,null,null,null,null,null,null,null,null,null,null,null,null,null,null,null,null,null,null,null,null,null,null,null,null,null,null,null,null,null,null,null,null,null,null,null,null,null,null,null,null,null,null,null,null,null,null,null,null,null,null,null,null,null,null,null,null,null,null,null,null,null,null,null,null,null,null,null,null,null,null,null,null,null,null,null,null,null,null,null,null,null,null,null,null,null,null,null,null,null,null,null,null,null,null,null,null,null,null,null,null,null,null,null,null,null,null,null,null,null,null,null,null,null,null,null,null,null,null,null,null,null,null,null,null,null,null,null,null,null,null,null,null,null,null,null,null,null,null,null,null,null,null,null,null,null,null,null,null,null,null,null,null,null,null,null,null,null,null,null,null,null,null,null,null,null,null,null,null,null,null,null,null,null,null,null,null,null,null,null,null,null,null,null,null,null,null,null,null,null,null,null,null,null,null,null,null,null,null,null,null,null,null,null,null,null,null,null,null,null,null,null,null,null,null,null,null,null,null,null,null,null,null,null,null,null,null,null,null,null,null,null,null,null,null,null,null,null,null,null,null,null,null,null,null,null,null,null,null,null,null,null,null,null,null,null,null,null,null,null,null,null,null,null,null,null,null,null,null,null,null,null,null,null,null,null,null,null,null,null,null,null,null,null,null,null,null,null,null,null,null,null,null,null,null,null,null,null,null,null,null,null,null,null,null,null,null,null,null,null,null,null,null,null,null,null,null,null,null,null,null,null,null,null,null,null,null,null,null,null,null,null,null,null,null,null,null,null,null,null,null,null,null,null,null,null,null,null,null,null,null,null,null,null,null,null,null,null,null,null,null,null,null,null,null,null,null,null,null,null,null,null,null,null,null,null,null,null,null,null,null,null,null,null,null,null,null,null,null,null,null,null,null,null,null,null,null,null,null,null,null,null,null,null,null,null,null,null,null,null,null,null,null,null,null,null,null,null,null,null,null,null,null,null,null,null,null,null,null,null,null,null,null,null,null,null,null,null,null,null,null,null,null,null,null,null,null,null,null,null,null,null,null,null,null,null,null,null,null,null,null,null,null,null,null,null,null,null,null,null,null,null,null,null,null,null,null,null,null,null,null,null,null,null,null,null,null,null,null,null,null,null,null,null,null,null,null,null,null,null,null,null,null,null,null,null,null,null,null,null,null,null,null,null,null,null,null,null,null,null,null,null,null,null,null,null,null,null,null,null,null,null,null,null,null,null,null,null,null,null,null,null,null,null,null,null,null,null,null,null,null,null,null,null,null,null,null,null,null,null,null,null,null,null,null,null,null,null,null,null,null,null,null,null,null,null,null,null,null,null,null,null,null,null,null,null,null,null,null,null,null,null,null,null,null,null,null,null,null,null,null,null,null,null,null,null,null,null,null,null,null,null,null,null,null,null,null,null,null,null,null,null,null,null,null,null,null,null,null,null,null,null,null,null,null,null,null,null,null,null,null,null,null,null,null,null,null,null,null,null,null,null,null,null,null,null,null,null,null,null,null,null,null,null,null,null,null,null,null,null,null,null,null,null,null,null,null,null,null,null,null,null,null,null,null,null,null,null,null,null,null,null,null,null,null,null,null,null,null,null,null,null,null,null,null,null,null,null,null,null,null,null,null,null,null,null,null,null,null,null,null,null,null,null,null,null,null,null,null,null,null,null,null,null,null,null,null,null,null,null,null,null,null,null,null,null,null,null,null,null,null,null,null,null,null,null,null,null,null,null,null,null,null,null,null,null,null,null,null,null,null,null,null,null,null,null,null,null,null,null,null,null,null,null,null,null,null,null,null,null,null,null,null,null,null,null,null,null,null,null,null,null,null,null,null,null,null,null,null,null,null,null,null,null,null,null,null,null,null,null,null,null,null,null,null,null,null,null,null,null,null,null,null,null,null,null,null,null,null,null,null,null,null,null,null,null,null,null,null,null,null,null,null,null,null,null,null,null,null,null,null,null,null,null,null,null,null,null,null,null,null,null,null,null,null,null,null,null,null,null,null,null,null,null,null,null,null,null,null,null,null,null,null,null,null,null,null,null,null,null,null,null,null,null,null,null,null,null,null,null,null,null,null,null,null,null,null,null,null,null,null,null,null,null,null,null,null,null,null,null,null,null,null,null,null,null,null,null,null,null,null,null,null,null,null,null,null,null,null,null,null,null,null,null,null,null,null,null,null,null,null,null,null,null,null,null,null,null,null,null,null,null,null,null,null,null,null,null,null,null,null,null,null,null,null,null,null,null,null,null,null,null,null,null,null,null,null,null,null,null,null,null,null,null,null,null,null,null,null,null,null,null,null,null,null,null,null,null,null,null,null,null,null,null,null,null,null,null,null,null,null,null,null,null,null,null,null,null,null,null,null,null,null,null,null,null,null,null,null,null,null,null,null,null,null,null,null,null,null,null,null,null,null,null,null,null,null,null,null,null,null,null,null,null,null,null,null,null,null,null,null,null,null,null,null,null,null,null,null,null,null,null,null,null,null,null,null,null,null,null,null,null,null,null,null,null,null,null,null,null,null,null,null,null,null,null,null,null,null,null,null,null,null,null,null,null,null,null,null,null,null,null,null,null,null,null,null,null,null,null,null,null,null,null,null,null,null,null,null,null,null,null,null,null,null,null,null,null,null,null,null,null,null,null,null,null,null,null,null,null,null,null,null,null,null,null,null,null,null,null,null,null,null,null,null,null,null,null,null,null,null,null,null,null,null,null,null,null,null,null,null,null,null,null,null,null,null,null,null,null,null,null,null,null,null,null,null,null,null,null,null,null,null,null,null,null,null,null,null,null,null,null,null,null,null,null,null,null,null,null,null,null,null,null,null,null,null,null,null,null,null,null,null,null,null,null,null,null,null,null,null,null,null,null,null,null,null,null,null,null,null,null,null,null,null,null,null,null,null,null,null,null,null,null,null,null,null,null,null,null,null,null,null,null,null,null,null,null,null,null,null,null,null,null,null,null,null,null,null,null,null,null,null,null,null,null,null,null,null,null,null,null,null,null,null,null,null,null,null,null,null,null,null,null,null,null,null,null,null,null,null,null,null,null,null,null,null,null,null,null,null,null,null,null,null,null,null,null,null,null,null,null,null,null,null,null,null,null,null,null,null,null,null,null,null,null,null,null,null,null,null,null,null,null,null,null,null,null,null,null,null,null,null,null,null,null,null,null,null,null,null,null,null,null,null,null,null,null,null,null,null,null,null,null,null,null,null,null,null,null,null,null,null,null,null,null,null,null,null,null,null,null,null,null,null,null,null,null,null,null,null,null,null,null,null,null,null,null,null,null,null,null,null,null,null,null,null,null,null,null,null,null,null,null,null,null,null,null,null,null,null,null,null,null,null,null,null,null,null,null,null,null,null,null,null,null,null,null,null,null,null,null,null,null,null,null,null,null,null,null,null,null,null,null,null,null,null,null,null,null,null,null,null,null,null,null,null,null,null,null,null,null,null,null,null,null,null,null,null,null,null,null,null,null,null,null,null,null,null,null,null,null,null,null,null,null,null,null,null,null,null,null,null,null,null,null,null,null,null,null,null,null,null,null,null,null,null,null,null,null,null,null,null,null,null,null,null,null,null,null,null,null,null,null,null,null,null,null,null,null,null,null,null,null,null,null,null,null,null,null,null,null,null,null,null,null,null,null,null,null,null,null,null,null,null,null,null,null,null,null,null,null,null,null,null,null,null,null,null,null,null,null,null,null,null,null,null,null,null,null,null,null,null,null,null,null,null,null,null,null,null,null,null,null,null,null,null,null,null,null,null,null,null,null,null,null,null,null,null,null,null,null,null,null,null,null,null,null,null,null,null,null,null,null,null,null,null,null,null,null,null,null,null,null,null,null,null,null,null,null,null,null,null,null,null,null,null,null,null,null,null,null,null,null,null,null,null,null,null,null,null,null,null,null,null,null,null,null,null,null,null,null,null,null,null,null,null,null,null,null,null,null,null,null,null,null,null,null,null,null,null,null,null,null,null,null,null,null,null,null,null,null,null,null,null,null,null,null,null,null,null,null,null,null,null,null,null,null,null,null,null,null,null,null,null,null,null,null,null,null,null,null,null,null,null,null,null,null,null,null,null,null,null,null,null,null,null,null,null,null,null,null,null,null,null,null,null,null,null,null,null,null,null,null,null,null,null,null,null,null,null,null,null,{"$f":"IF($A$1=\"عطلة رسمية\",\"False\",IF($A$1=\"دوام رسمى\",\"True\",\"AAA\"))","v":"AAA"}]
[null,"App. Date","Name","Surname","Pasaport No.","Date of birth",null,"Index","Sheet Name","No. of App.","Go To sheet","Total of Paid $","Total of Unpaid $",null,"Official time + work","Form","Form","Total amount","Total GT","Total TG.Gov",null,"Cost amount","Net profit",null,"Total amount of Month",null,"Route","Total of Unpaid (Rout)",null,"Count of Sheets Color",null,null,"Official Activity"]
[null,null,null,null,null,null,null,3,{"$f":"INDEX(SheetNames,H3)","v":"31-07-2019"},{"$f":"IF(I3=\"\",\"\",INDIRECT(\"'\"&$I3&\"'!$V10\"))","v":0},{"$f":"HYPERLINK(\"#'\"&I3&\"'!H3\",\"Go To Sheet\")","v":"Go To Sheet"},{"$f":"IF(I3=\"\",\"\",INDIRECT(\"'\"&$I3&\"'!$T7\"))","v":0},{"$f":"IF(I3=\"\",\"\",INDIRECT(\"'\"&$I3&\"'!$T10\"))","v":0},null,"Official time - work","2019-07-16","2019-07-31",{"$f":"IF(I3=\"\",\"\",INDIRECT(\"'\"&$I3&\"'!$T4\"))","v":240},{"$f":"IF(I3=\"\",\"\",INDIRECT(\"'\"&$I3&\"'!$T13\"))","v":1725},{"$f":"IF(I3=\"\",\"\",INDIRECT(\"'\"&$I3&\"'!$T16\"))","v":62.5},null,{"$f":"IF(I3=\"\",\"\",INDIRECT(\"'\"&$I3&\"'!$V14\"))","v":1787.5},{"$f":"IF(I3=\"\",\"\",INDIRECT(\"'\"&$I3&\"'!$V4\"))","v":-1547.5},null,{"$f":"SUM(R3:R70)","v":{"$error":"#REF!"}},null,{"$f":"IF(I3=\"\",\"\",INDIRECT(\"'\"&$I3&\"'!$X4\")) & \" # \" &'31-07-2019'!Y4","v":"ihab # 2"},{"$f":"IF(I3=\"\",\"\",INDIRECT(\"'\"&$I3&\"'!$AA4\"))","v":240},null,3,null,{"$f":"Module5.WhatColor(AE3)","v":5},{"$f":"IF(AF3=1,\"other\",IF(AF3=4,\"official time + work\",IF(AF3=5,\"official time - work\",IF(AF3=3,\"official holiday\",\"\"))))","v":"official time - work"}]
[null,null,null,null,null,null,null,4,{"$f":"INDEX(SheetNames,H4)","v":"01-08-2019"},{"$f":"IF(I4=\"\",\"\",INDIRECT(\"'\"&$I4&\"'!$V10\"))","v":0},"Go To Sheet",0,0,null,"Official holiday","2019-07-16","2019-08-03",{"$f":"IF(I4=\"\",\"\",INDIRECT(\"'\"&$I4&\"'!$T4\"))","v":0},{"$f":"IF(I4=\"\",\"\",INDIRECT(\"'\"&$I4&\"'!$T13\"))","v":0},{"$f":"IF(I4=\"\",\"\",INDIRECT(\"'\"&$I4&\"'!$T16\"))","v":0},null,{"$f":"IF(I4=\"\",\"\",INDIRECT(\"'\"&$I4&\"'!$V14\"))","v":0},{"$f":"IF(I4=\"\",\"\",INDIRECT(\"'\"&$I4&\"'!$V4\"))","v":0},null,null,null,{"$f":"IF(I4=\"\",\"\",INDIRECT(\"'\"&$I4&\"'!$X4\")) & \" # \" &'31-07-2019'!Y5","v":" # "},{"$f":"IF(I4=\"\",\"\",INDIRECT(\"'\"&$I4&\"'!$AA4\"))","v":""},null,1,null,{"$f":"Module5.WhatColor(AE4)","v":4},{"$f":"IF(AF4=1,\"other\",IF(AF4=4,\"official time + work\",IF(AF4=5,\"official time - work\",IF(AF4=3,\"official holiday\",\"\"))))","v":"official time + work"}]
[null,null,null,null,null,null,null,5,"03-08-2019",1,"Go To Sheet",0,0,null,"Other","2019-07-22",null,0,1725,0,null,1725,-1725,null,"Cost amount of Month",null,{"$f":"IF(I5=\"\",\"\",INDIRECT(\"'\"&$I5&\"'!$X4\")) & \" # \" &'31-07-2019'!Y6","v":" # "},"",null,1,null,3,"official holiday"]
[null,null,null,null,null,null,null,6,"04-08-2019",0,"Go To Sheet",0,0,null,null,"2019-07-18",null,0,0,0,null,0,0,null,{"$f":"SUM(V3:V70)","v":{"$error":"#REF!"}},null,{"$f":"IF(I6=\"\",\"\",INDIRECT(\"'\"&$I6&\"'!$X4\")) & \" # \" &'31-07-2019'!Y7","v":" # "},"",null,1,null,1,"other"]
[null,null,null,null,null,null,null,7,"05-08-2019",0,"Go To Sheet",0,0,null,null,"2019-07-17",null,0,0,0,null,0,0,null,null,null,{"$f":"IF(I7=\"\",\"\",INDIRECT(\"'\"&$I7&\"'!$X4\")) & \" # \" &'31-07-2019'!Y8","v":" # "},""]
[null,null,null,null,null,null,null,8,"06-08-2019",0,"Go To Sheet",0,0,null,null,"2019-07-16",null,0,0,0,null,0,0,null,"Net Profit of Month",null,{"$f":"IF(I8=\"\",\"\",INDIRECT(\"'\"&$I8&\"'!$X4\")) & \" # \" &'31-07-2019'!Y9","v":" # "},""]
[null,null,null,null,null,null,null,9,"Form (2)",{"$error":"#REF!"},"Go To Sheet",{"$error":"#REF!"},{"$error":"#REF!"},null,null,"2019-07-15",null,{"$error":"#REF!"},{"$error":"#REF!"},{"$error":"#REF!"},null,{"$error":"#REF!"},{"$error":"#REF!"},null,{"$f":"SUM(W3:W70)","v":{"$error":"#REF!"}},null,{"$f":"IF(I9=\"\",\"\",INDIRECT(\"'\"&$I9&\"'!$X4\")) & \" # \" &'31-07-2019'!Y10","v":{"$error":"#REF!"}},{"$error":"#REF!"}]
[null,null,null,null,null,null,null,10,{"$error":"#REF!"},{"$error":"#REF!"},{"$error":"#REF!"},{"$error":"#REF!"},{"$error":"#REF!"},null,null,"2019-07-14",null,{"$error":"#REF!"},{"$error":"#REF!"},{"$error":"#REF!"},null,{"$error":"#REF!"},{"$error":"#REF!"},null,null,null,{"$f":"IF(I10=\"\",\"\",INDIRECT(\"'\"&$I10&\"'!$X4\")) & \" # \" &'31-07-2019'!Y11","v":{"$error":"#REF!"}},{"$error":"#REF!"}]
[null,null,null,null,null,null,null,11,{"$error":"#REF!"},{"$error":"#REF!"},{"$error":"#REF!"},{"$error":"#REF!"},{"$error":"#REF!"},null,null,"2019-07-11",null,{"$error":"#REF!"},{"$error":"#REF!"},{"$error":"#REF!"},null,{"$error":"#REF!"},{"$error":"#REF!"},null,"Total amount of (Rout)",null,{"$f":"IF(I11=\"\",\"\",INDIRECT(\"'\"&$I11&\"'!$X4\")) & \" # \" &'31-07-2019'!Y12","v":{"$error":"#REF!"}},{"$error":"#REF!"}]
[null,null,null,null,null,null,null,12,{"$error":"#REF!"},{"$error":"#REF!"},{"$error":"#REF!"},{"$error":"#REF!"},{"$error":"#REF!"},null,null,"2019-07-10",null,{"$error":"#REF!"},{"$error":"#REF!"},{"$error":"#REF!"},null,{"$error":"#REF!"},{"$error":"#REF!"},null,{"$f":"SUM(AB2:AB70)","v":{"$error":"#REF!"}},null,{"$f":"IF(I12=\"\",\"\",INDIRECT(\"'\"&$I12&\"'!$X4\")) & \" # \" &'31-07-2019'!Y13","v":{"$error":"#REF!"}},{"$error":"#REF!"}]
[null,null,null,null,null,null,null,13,{"$error":"#REF!"},{"$error":"#REF!"},{"$error":"#REF!"},{"$error":"#REF!"},{"$error":"#REF!"},null,null,"2019-07-09",null,{"$error":"#REF!"},{"$error":"#REF!"},{"$error":"#REF!"},null,{"$error":"#REF!"},{"$error":"#REF!"},null,null,null,{"$f":"IF(I13=\"\",\"\",INDIRECT(\"'\"&$I13&\"'!$X4\")) & \" # \" &'31-07-2019'!Y14","v":{"$error":"#REF!"}},{"$error":"#REF!"}]
[null,null,null,null,null,null,null,14,{"$error":"#REF!"},{"$error":"#REF!"},{"$error":"#REF!"},{"$error":"#REF!"},{"$error":"#REF!"},null,null,"2019-07-08",null,{"$error":"#REF!"},{"$error":"#REF!"},{"$error":"#REF!"},null,{"$error":"#REF!"},{"$error":"#REF!"},null,null,null,{"$f":"IF(I14=\"\",\"\",INDIRECT(\"'\"&$I14&\"'!$X4\")) & \" # \" &'31-07-2019'!Y15","v":{"$error":"#REF!"}},{"$error":"#REF!"}]
[null,null,null,null,null,null,null,15,{"$error":"#REF!"},{"$error":"#REF!"},{"$error":"#REF!"},{"$error":"#REF!"},{"$error":"#REF!"},null,null,"2019-07-07",null,{"$error":"#REF!"},{"$error":"#REF!"},{"$error":"#REF!"},null,{"$error":"#REF!"},{"$error":"#REF!"},null,null,null,{"$f":"IF(I15=\"\",\"\",INDIRECT(\"'\"&$I15&\"'!$X4\")) & \" # \" &'31-07-2019'!Y16","v":{"$error":"#REF!"}},{"$error":"#REF!"}]
[null,null,null,null,null,null,null,16,{"$error":"#REF!"},{"$error":"#REF!"},{"$error":"#REF!"},{"$error":"#REF!"},{"$error":"#REF!"},null,null,"2019-07-04",null,{"$error":"#REF!"},{"$error":"#REF!"},{"$error":"#REF!"},null,{"$error":"#REF!"},{"$error":"#REF!"},null,null,null,{"$f":"IF(I16=\"\",\"\",INDIRECT(\"'\"&$I16&\"'!$X4\")) & \" # \" &'31-07-2019'!Y17","v":{"$error":"#REF!"}},{"$error":"#REF!"}]
[null,null,null,null,null,null,null,17,{"$error":"#REF!"},{"$error":"#REF!"},{"$error":"#REF!"},{"$error":"#REF!"},{"$error":"#REF!"},null,null,"2019-07-03",null,{"$error":"#REF!"},{"$error":"#REF!"},{"$error":"#REF!"},null,{"$error":"#REF!"},{"$error":"#REF!"},null,null,null,{"$f":"IF(I17=\"\",\"\",INDIRECT(\"'\"&$I17&\"'!$X4\")) & \" # \" &'31-07-2019'!Y18","v":{"$error":"#REF!"}},{"$error":"#REF!"}]
[null,null,null,null,null,null,null,18,{"$error":"#REF!"},{"$error":"#REF!"},{"$error":"#REF!"},{"$error":"#REF!"},{"$error":"#REF!"},null,null,"2019-07-02",null,{"$error":"#REF!"},{"$error":"#REF!"},{"$error":"#REF!"},null,{"$error":"#REF!"},{"$error":"#REF!"},null,null,null,{"$f":"IF(I18=\"\",\"\",INDIRECT(\"'\"&$I18&\"'!$X4\")) & \" # \" &'31-07-2019'!Y19","v":{"$error":"#REF!"}},{"$error":"#REF!"}]
[null,null,null,null,null,null," ",19,{"$error":"#REF!"},{"$error":"#REF!"},{"$error":"#REF!"},{"$error":"#REF!"},{"$error":"#REF!"},null,null,"2019-07-23",null,{"$error":"#REF!"},{"$error":"#REF!"},{"$error":"#REF!"},null,{"$error":"#REF!"},{"$error":"#REF!"},null,null,null,{"$f":"IF(I19=\"\",\"\",INDIRECT(\"'\"&$I19&\"'!$X4\")) & \" # \" &'31-07-2019'!Y20","v":{"$error":"#REF!"}},{"$error":"#REF!"}]
[null,null,null,null,null,null," ",20,{"$error":"#REF!"},{"$error":"#REF!"},{"$error":"#REF!"},{"$error":"#REF!"},{"$error":"#REF!"},null,null,"2019-07-24",null,{"$error":"#REF!"},{"$error":"#REF!"},{"$error":"#REF!"},null,{"$error":"#REF!"},{"$error":"#REF!"},null,null,null,{"$f":"IF(I20=\"\",\"\",INDIRECT(\"'\"&$I20&\"'!$X4\")) & \" # \" &'31-07-2019'!Y21","v":{"$error":"#REF!"}},{"$error":"#REF!"}]
[null,null,null,null,null,null," ",21,{"$error":"#REF!"},{"$error":"#REF!"},{"$error":"#REF!"},{"$error":"#REF!"},{"$error":"#REF!"},null,null,"2019-07-25",null,{"$error":"#REF!"},{"$error":"#REF!"},{"$error":"#REF!"},null,{"$error":"#REF!"},{"$error":"#REF!"},null,null,null,{"$f":"IF(I21=\"\",\"\",INDIRECT(\"'\"&$I21&\"'!$X4\")) & \" # \" &'31-07-2019'!Y22","v":{"$error":"#REF!"}},{"$error":"#REF!"}]
[null,null,null,null,null,null," ",22,{"$error":"#REF!"},{"$error":"#REF!"},{"$error":"#REF!"},{"$error":"#REF!"},{"$error":"#REF!"},null,null,"2019-08-01",null,{"$error":"#REF!"},{"$error":"#REF!"},{"$error":"#REF!"},null,{"$error":"#REF!"},{"$error":"#REF!"},null,null,null,{"$f":"IF(I22=\"\",\"\",INDIRECT(\"'\"&$I22&\"'!$X4\")) & \" # \" &'31-07-2019'!Y23","v":{"$error":"#REF!"}},{"$error":"#REF!"}]
[null,null,null,null,null,null," ",23,{"$error":"#REF!"},{"$error":"#REF!"},{"$error":"#REF!"},{"$error":"#REF!"},{"$error":"#REF!"},null,null,null,null,{"$error":"#REF!"},{"$error":"#REF!"},{"$error":"#REF!"},null,{"$error":"#REF!"},{"$error":"#REF!"},null,null,null,{"$f":"IF(I23=\"\",\"\",INDIRECT(\"'\"&$I23&\"'!$X4\")) & \" # \" &'31-07-2019'!Y24","v":{"$error":"#REF!"}},{"$error":"#REF!"}]
[null,null,null,null,null,null," ",24,{"$error":"#REF!"},{"$error":"#REF!"},{"$error":"#REF!"},{"$error":"#REF!"},{"$error":"#REF!"},null,null,null,null,{"$error":"#REF!"},{"$error":"#REF!"},{"$error":"#REF!"},null,{"$error":"#REF!"},{"$error":"#REF!"},null,null,null,{"$f":"IF(I24=\"\",\"\",INDIRECT(\"'\"&$I24&\"'!$X4\")) & \" # \" &'31-07-2019'!Y25","v":{"$error":"#REF!"}},{"$error":"#REF!"}]
[null,null,null,null,null,null," ",25,{"$error":"#REF!"},{"$error":"#REF!"},{"$error":"#REF!"},{"$error":"#REF!"},{"$error":"#REF!"},null,null,null,null,{"$error":"#REF!"},{"$error":"#REF!"},{"$error":"#REF!"},null,{"$error":"#REF!"},{"$error":"#REF!"},null,null,null,{"$f":"IF(I25=\"\",\"\",INDIRECT(\"'\"&$I25&\"'!$X4\")) & \" # \" &'31-07-2019'!Y26","v":{"$error":"#REF!"}},{"$error":"#REF!"}]
[null,null,null,null,null,null," ",26,{"$error":"#REF!"},{"$error":"#REF!"},{"$error":"#REF!"},{"$error":"#REF!"},{"$error":"#REF!"},null,null,null,null,{"$error":"#REF!"},{"$error":"#REF!"},{"$error":"#REF!"},null,{"$error":"#REF!"},{"$error":"#REF!"},null,null,null,{"$f":"IF(I26=\"\",\"\",INDIRECT(\"'\"&$I26&\"'!$X4\")) & \" # \" &'31-07-2019'!Y27","v":{"$error":"#REF!"}},{"$error":"#REF!"}]
[null,null,null,null,null,null," ",27,{"$error":"#REF!"},{"$error":"#REF!"},{"$error":"#REF!"},{"$error":"#REF!"},{"$error":"#REF!"},null,null,null,null,{"$error":"#REF!"},{"$error":"#REF!"},{"$error":"#REF!"},null,{"$error":"#REF!"},{"$error":"#REF!"},null,null,null,{"$f":"IF(I27=\"\",\"\",INDIRECT(\"'\"&$I27&\"'!$X4\")) & \" # \" &'31-07-2019'!Y28","v":{"$error":"#REF!"}},{"$error":"#REF!"}]
[null,null,null,null,null,null," ",28,{"$error":"#REF!"},{"$error":"#REF!"},{"$error":"#REF!"},{"$error":"#REF!"},{"$error":"#REF!"},null,null,null,null,{"$error":"#REF!"},{"$error":"#REF!"},{"$error":"#REF!"},null,{"$error":"#REF!"},{"$error":"#REF!"},null,null,null,{"$f":"IF(I28=\"\",\"\",INDIRECT(\"'\"&$I28&\"'!$X4\")) & \" # \" &'31-07-2019'!Y29","v":{"$error":"#REF!"}},{"$error":"#REF!"}]
[null,null,null,null,null,null," ",29,{"$error":"#REF!"},{"$error":"#REF!"},{"$error":"#REF!"},{"$error":"#REF!"},{"$error":"#REF!"},null,null,null,null,{"$error":"#REF!"},{"$error":"#REF!"},{"$error":"#REF!"},null,{"$error":"#REF!"},{"$error":"#REF!"},null,null,null,{"$f":"IF(I29=\"\",\"\",INDIRECT(\"'\"&$I29&\"'!$X4\")) & \" # \" &'31-07-2019'!Y30","v":{"$error":"#REF!"}},{"$error":"#REF!"}]
[null,null,null,null,null,null," ",30,{"$error":"#REF!"},{"$error":"#REF!"},{"$error":"#REF!"},{"$error":"#REF!"},{"$error":"#REF!"},null,null,null,null,{"$error":"#REF!"},{"$error":"#REF!"},{"$error":"#REF!"},null,{"$error":"#REF!"},{"$error":"#REF!"},null,null,null,{"$f":"IF(I30=\"\",\"\",INDIRECT(\"'\"&$I30&\"'!$X4\")) & \" # \" &'31-07-2019'!Y31","v":{"$error":"#REF!"}},{"$error":"#REF!"}]
[null,null,null,null,null,null," ",31,{"$error":"#REF!"},{"$error":"#REF!"},{"$error":"#REF!"},{"$error":"#REF!"},{"$error":"#REF!"},null,null,null,null,{"$error":"#REF!"},{"$error":"#REF!"},{"$error":"#REF!"},null,{"$error":"#REF!"},{"$error":"#REF!"},null,null,null,{"$f":"IF(I31=\"\",\"\",INDIRECT(\"'\"&$I31&\"'!$X4\")) & \" # \" &'31-07-2019'!Y32","v":{"$error":"#REF!"}},{"$error":"#REF!"}]
[null,null,null,null,null,null," ",32,{"$error":"#REF!"},null,{"$error":"#REF!"},{"$error":"#REF!"},{"$error":"#REF!"},null,null,null,null,{"$error":"#REF!"},{"$error":"#REF!"},{"$error":"#REF!"},null,{"$error":"#REF!"},{"$error":"#REF!"},null,null,null,{"$f":"IF(I32=\"\",\"\",INDIRECT(\"'\"&$I32&\"'!$X4\")) & \" # \" &'31-07-2019'!Y33","v":{"$error":"#REF!"}},{"$error":"#REF!"}]
[null,null,null,null,null,null," ",33,{"$error":"#REF!"},null,{"$error":"#REF!"},{"$error":"#REF!"},{"$error":"#REF!"},null,null,null,null,{"$error":"#REF!"},{"$error":"#REF!"},{"$error":"#REF!"},null,{"$error":"#REF!"},{"$error":"#REF!"},null,null,null,{"$f":"IF(I33=\"\",\"\",INDIRECT(\"'\"&$I33&\"'!$X4\")) & \" # \" &'31-07-2019'!Y34","v":{"$error":"#REF!"}},{"$error":"#REF!"}]
[null,null,null,null,null,null," ",34,{"$error":"#REF!"},null,{"$error":"#REF!"},{"$error":"#REF!"},{"$error":"#REF!"},null,null,null,null,{"$error":"#REF!"},{"$error":"#REF!"},{"$error":"#REF!"},null,{"$error":"#REF!"},{"$error":"#REF!"},null,null,null,{"$f":"IF(I34=\"\",\"\",INDIRECT(\"'\"&$I34&\"'!$X4\")) & \" # \" &'31-07-2019'!Y35","v":{"$error":"#REF!"}},{"$error":"#REF!"}]
[null,null,null,null,null,null," ",35,{"$error":"#REF!"},null,{"$error":"#REF!"},{"$f":"IF(I35=\"\",\"\",INDIRECT(\"'\"&$I35&\"'!$T7\"))","v":{"$error":"#REF!"}},{"$f":"IF(I35=\"\",\"\",INDIRECT(\"'\"&$I35&\"'!$T10\"))","v":{"$error":"#REF!"}},null,null,null,null,{"$error":"#REF!"},{"$error":"#REF!"},{"$error":"#REF!"},null,{"$error":"#REF!"},{"$error":"#REF!"},null,null,null,{"$f":"IF(I35=\"\",\"\",INDIRECT(\"'\"&$I35&\"'!$X4\")) & \" # \" &'31-07-2019'!Y36","v":{"$error":"#REF!"}},{"$error":"#REF!"}]
[null,null,null,null,null,null," ",36,{"$error":"#REF!"},null,{"$error":"#REF!"},{"$error":"#REF!"},{"$error":"#REF!"},null,null,null,null,{"$error":"#REF!"},{"$error":"#REF!"},{"$error":"#REF!"},null,{"$error":"#REF!"},{"$error":"#REF!"},null,null,null,{"$f":"IF(I36=\"\",\"\",INDIRECT(\"'\"&$I36&\"'!$X4\")) & \" # \" &'31-07-2019'!Y37","v":{"$error":"#REF!"}},{"$error":"#REF!"}]
[null,null,null,null,null,null," ",37,{"$error":"#REF!"},null,{"$error":"#REF!"},{"$error":"#REF!"},{"$error":"#REF!"},null,null,null,null,{"$error":"#REF!"},{"$error":"#REF!"},{"$error":"#REF!"},null,{"$error":"#REF!"},{"$error":"#REF!"},null,null,null,{"$f":"IF(I37=\"\",\"\",INDIRECT(\"'\"&$I37&\"'!$X4\")) & \" # \" &'31-07-2019'!Y38","v":{"$error":"#REF!"}},{"$error":"#REF!"}]
[null,null,null,null,null,null," ",38,{"$error":"#REF!"},null,{"$error":"#REF!"},{"$error":"#REF!"},{"$error":"#REF!"},null,null,null,null,{"$error":"#REF!"},{"$error":"#REF!"},{"$error":"#REF!"},null,{"$error":"#REF!"},{"$error":"#REF!"},null,null,null,{"$f":"IF(I38=\"\",\"\",INDIRECT(\"'\"&$I38&\"'!$X4\")) & \" # \" &'31-07-2019'!Y39","v":{"$error":"#REF!"}},{"$error":"#REF!"}]
[null,null,null,null,null,null," ",39,{"$error":"#REF!"},null,{"$error":"#REF!"},{"$error":"#REF!"},{"$error":"#REF!"},null,null,null,null,{"$error":"#REF!"},{"$error":"#REF!"},{"$error":"#REF!"},null,{"$error":"#REF!"},{"$error":"#REF!"},null,null,null,{"$f":"IF(I39=\"\",\"\",INDIRECT(\"'\"&$I39&\"'!$X4\")) & \" # \" &'31-07-2019'!Y40","v":{"$error":"#REF!"}},{"$error":"#REF!"}]
[null,null,null,null,null,null," ",40,{"$error":"#REF!"},null,{"$error":"#REF!"},{"$error":"#REF!"},{"$error":"#REF!"},null,null,null,null,{"$error":"#REF!"},{"$error":"#REF!"},{"$error":"#REF!"},null,{"$error":"#REF!"},{"$error":"#REF!"},null,null,null,{"$f":"IF(I40=\"\",\"\",INDIRECT(\"'\"&$I40&\"'!$X4\")) & \" # \" &'31-07-2019'!Y41","v":{"$error":"#REF!"}},{"$error":"#REF!"}]
[null,null,null,null,null,null," ",41,{"$error":"#REF!"},null,{"$error":"#REF!"},{"$error":"#REF!"},{"$error":"#REF!"},null,null,null,null,{"$error":"#REF!"},{"$error":"#REF!"},{"$error":"#REF!"},null,{"$error":"#REF!"},{"$error":"#REF!"},null,null,null,{"$f":"IF(I41=\"\",\"\",INDIRECT(\"'\"&$I41&\"'!$X4\")) & \" # \" &'31-07-2019'!Y42","v":{"$error":"#REF!"}},{"$error":"#REF!"}]
[null,null,null,null,null,null," ",42,{"$error":"#REF!"},null,{"$error":"#REF!"},{"$error":"#REF!"},{"$error":"#REF!"},null,null,null,null,{"$error":"#REF!"},{"$error":"#REF!"},{"$error":"#REF!"},null,{"$error":"#REF!"},{"$error":"#REF!"},null,null,null,{"$f":"IF(I42=\"\",\"\",INDIRECT(\"'\"&$I42&\"'!$X4\")) & \" # \" &'31-07-2019'!Y43","v":{"$error":"#REF!"}},{"$error":"#REF!"}]
[null,null,null,null,null,null," ",43,{"$error":"#REF!"},null,{"$error":"#REF!"},{"$error":"#REF!"},{"$error":"#REF!"},null,null,null,null,{"$error":"#REF!"},{"$error":"#REF!"},{"$error":"#REF!"},null,{"$error":"#REF!"},{"$error":"#REF!"},null,null,null,{"$f":"IF(I43=\"\",\"\",INDIRECT(\"'\"&$I43&\"'!$X4\")) & \" # \" &'31-07-2019'!Y44","v":{"$error":"#REF!"}},{"$error":"#REF!"}]
[null,null,null,null,null,null," ",44,{"$error":"#REF!"},null,{"$error":"#REF!"},{"$error":"#REF!"},{"$error":"#REF!"},null,null,null,null,{"$error":"#REF!"},{"$error":"#REF!"},{"$error":"#REF!"},null,{"$error":"#REF!"},{"$error":"#REF!"},null,null,null,{"$f":"IF(I44=\"\",\"\",INDIRECT(\"'\"&$I44&\"'!$X4\")) & \" # \" &'31-07-2019'!Y45","v":{"$error":"#REF!"}},{"$error":"#REF!"}]
[null,null,null,null,null,null," ",45,{"$error":"#REF!"},null,{"$error":"#REF!"},{"$error":"#REF!"},{"$error":"#REF!"},null,null,null,null,{"$error":"#REF!"},{"$error":"#REF!"},{"$error":"#REF!"},null,{"$error":"#REF!"},{"$error":"#REF!"},null,null,null,{"$f":"IF(I45=\"\",\"\",INDIRECT(\"'\"&$I45&\"'!$X4\")) & \" # \" &'31-07-2019'!Y46","v":{"$error":"#REF!"}},{"$error":"#REF!"}]
[null,null,null,null,null,null," ",46,{"$error":"#REF!"},null,{"$error":"#REF!"},{"$error":"#REF!"},{"$error":"#REF!"},null,null,null,null,{"$error":"#REF!"},{"$error":"#REF!"},{"$error":"#REF!"},null,{"$error":"#REF!"},{"$error":"#REF!"},null,null,null,{"$f":"IF(I46=\"\",\"\",INDIRECT(\"'\"&$I46&\"'!$X4\")) & \" # \" &'31-07-2019'!Y47","v":{"$error":"#REF!"}},{"$error":"#REF!"}]
[null,null,null,null,null,null," ",47,{"$error":"#REF!"},null,{"$error":"#REF!"},{"$error":"#REF!"},{"$error":"#REF!"},null,null,null,null,{"$error":"#REF!"},{"$error":"#REF!"},{"$error":"#REF!"},null,{"$error":"#REF!"},{"$error":"#REF!"},null,null,null,{"$f":"IF(I47=\"\",\"\",INDIRECT(\"'\"&$I47&\"'!$X4\")) & \" # \" &'31-07-2019'!Y48","v":{"$error":"#REF!"}},{"$error":"#REF!"}]
[null,null,null,null,null,null," ",null,"Form",null,"Go To Sheet",0,0,null,null,null,null,0,0,0,null,0,0,null,null,null,{"$f":"IF(I48=\"\",\"\",INDIRECT(\"'\"&$I48&\"'!$X4\")) & \" # \" &'31-07-2019'!Y49","v":" # "},""]
[null,null,null,null,null,null," ",null,"Form",null,"Go To Sheet",0,0,null,null,null,null,0,0,0,null,0,0,null,null,null,{"$f":"IF(I49=\"\",\"\",INDIRECT(\"'\"&$I49&\"'!$X4\")) & \" # \" &'31-07-2019'!Y50","v":" # "},""]
[null,null,null,null,null,null," ",null,"Form",null,"Go To Sheet",0,0,null,null,null,null,0,0,0,null,0,0,null,null,null,{"$f":"IF(I50=\"\",\"\",INDIRECT(\"'\"&$I50&\"'!$X4\")) & \" # \" &'31-07-2019'!Y51","v":" # "},""]
[null,null,null,null,null,null," ",52,{"$error":"#REF!"},null,{"$error":"#REF!"},{"$error":"#REF!"},{"$error":"#REF!"},null,null,null,null,{"$error":"#REF!"},{"$error":"#REF!"},{"$error":"#REF!"},null,{"$error":"#REF!"},{"$error":"#REF!"},null,null,null,{"$f":"IF(I51=\"\",\"\",INDIRECT(\"'\"&$I51&\"'!$X4\")) & \" # \" &'31-07-2019'!Y52","v":{"$error":"#REF!"}},{"$error":"#REF!"}]
[null,null,null,null,null,null," ",53,{"$error":"#REF!"},null,{"$error":"#REF!"},{"$error":"#REF!"},{"$error":"#REF!"},null,null,null,null,{"$error":"#REF!"},{"$error":"#REF!"},{"$error":"#REF!"},null,{"$error":"#REF!"},{"$error":"#REF!"},null,null,null,{"$f":"IF(I52=\"\",\"\",INDIRECT(\"'\"&$I52&\"'!$X4\")) & \" # \" &'31-07-2019'!Y53","v":{"$error":"#REF!"}},{"$error":"#REF!"}]
[null,null,null,null,null,null," ",54,{"$error":"#REF!"},null,{"$error":"#REF!"},{"$error":"#REF!"},{"$error":"#REF!"},null,null,null,null,{"$error":"#REF!"},{"$error":"#REF!"},{"$error":"#REF!"},null,{"$error":"#REF!"},{"$error":"#REF!"},null,null,null,{"$f":"IF(I53=\"\",\"\",INDIRECT(\"'\"&$I53&\"'!$X4\")) & \" # \" &'31-07-2019'!Y54","v":{"$error":"#REF!"}},{"$error":"#REF!"}]
[null,null,null,null,null,null," ",55,{"$error":"#REF!"},null,{"$error":"#REF!"},{"$error":"#REF!"},{"$error":"#REF!"},null,null,null,null,{"$error":"#REF!"},{"$error":"#REF!"},{"$error":"#REF!"},null,{"$error":"#REF!"},{"$error":"#REF!"},null,null,null,{"$f":"IF(I54=\"\",\"\",INDIRECT(\"'\"&$I54&\"'!$X4\")) & \" # \" &'31-07-2019'!Y55","v":{"$error":"#REF!"}},{"$error":"#REF!"}]
[null,null,null,null,null,null," ",56,{"$error":"#REF!"},null,{"$error":"#REF!"},{"$error":"#REF!"},{"$error":"#REF!"},null,null,null,null,{"$error":"#REF!"},{"$error":"#REF!"},{"$error":"#REF!"},null,{"$error":"#REF!"},{"$error":"#REF!"},null,null,null,{"$f":"IF(I55=\"\",\"\",INDIRECT(\"'\"&$I55&\"'!$X4\")) & \" # \" &'31-07-2019'!Y56","v":{"$error":"#REF!"}},{"$error":"#REF!"}]
[null,null,null,null,null,null," ",57,{"$error":"#REF!"},null,{"$error":"#REF!"},{"$error":"#REF!"},{"$error":"#REF!"},null,null,null,null,{"$error":"#REF!"},{"$error":"#REF!"},{"$error":"#REF!"},null,{"$error":"#REF!"},{"$error":"#REF!"},null,null,null,{"$f":"IF(I56=\"\",\"\",INDIRECT(\"'\"&$I56&\"'!$X4\")) & \" # \" &'31-07-2019'!Y57","v":{"$error":"#REF!"}},{"$error":"#REF!"}]
[null,null,null,null,null,null," ",58,{"$error":"#REF!"},null,{"$error":"#REF!"},{"$error":"#REF!"},{"$error":"#REF!"},null,null,null,null,{"$error":"#REF!"},{"$error":"#REF!"},{"$error":"#REF!"},null,{"$error":"#REF!"},{"$error":"#REF!"},null,null,null,{"$f":"IF(I57=\"\",\"\",INDIRECT(\"'\"&$I57&\"'!$X4\")) & \" # \" &'31-07-2019'!Y58","v":{"$error":"#REF!"}},{"$error":"#REF!"}]
[null,null,null,null,null,null," ",59,{"$error":"#REF!"},null,{"$error":"#REF!"},{"$error":"#REF!"},{"$error":"#REF!"},null,null,null,null,{"$error":"#REF!"},{"$error":"#REF!"},{"$error":"#REF!"},null,{"$error":"#REF!"},{"$error":"#REF!"},null,null,null,{"$f":"IF(I58=\"\",\"\",INDIRECT(\"'\"&$I58&\"'!$X4\")) & \" # \" &'31-07-2019'!Y59","v":{"$error":"#REF!"}},{"$error":"#REF!"}]
[null,null,null,null,null,null," ",60,{"$error":"#REF!"},null,{"$error":"#REF!"},{"$error":"#REF!"},{"$error":"#REF!"},null,null,null,null,{"$error":"#REF!"},{"$error":"#REF!"},{"$error":"#REF!"},null,{"$error":"#REF!"},{"$error":"#REF!"},null,null,null,{"$f":"IF(I59=\"\",\"\",INDIRECT(\"'\"&$I59&\"'!$X4\")) & \" # \" &'31-07-2019'!Y60","v":{"$error":"#REF!"}},{"$error":"#REF!"}]
[null,null,null,null,null,null," ",61,{"$error":"#REF!"},null,{"$error":"#REF!"},{"$error":"#REF!"},{"$error":"#REF!"},null,null,null,null,{"$error":"#REF!"},{"$error":"#REF!"},{"$error":"#REF!"},null,{"$error":"#REF!"},{"$error":"#REF!"},null,null,null,{"$f":"IF(I60=\"\",\"\",INDIRECT(\"'\"&$I60&\"'!$X4\")) & \" # \" &'31-07-2019'!Y61","v":{"$error":"#REF!"}},{"$error":"#REF!"}]
[null,null,null,null,null,null," ",62,{"$error":"#REF!"},null,{"$error":"#REF!"},{"$error":"#REF!"},{"$error":"#REF!"},null,null,null,null,{"$error":"#REF!"},{"$error":"#REF!"},{"$error":"#REF!"},null,{"$error":"#REF!"},{"$error":"#REF!"},null,null,null,{"$f":"IF(I61=\"\",\"\",INDIRECT(\"'\"&$I61&\"'!$X4\")) & \" # \" &'31-07-2019'!Y62","v":{"$error":"#REF!"}},{"$error":"#REF!"}]
[null,null,null,null,null,null," ",63,{"$error":"#REF!"},null,{"$error":"#REF!"},{"$error":"#REF!"},{"$error":"#REF!"},null,null,null,null,{"$error":"#REF!"},{"$error":"#REF!"},{"$error":"#REF!"},null,{"$error":"#REF!"},{"$error":"#REF!"},null,null,null,{"$f":"IF(I62=\"\",\"\",INDIRECT(\"'\"&$I62&\"'!$X4\")) & \" # \" &'31-07-2019'!Y63","v":{"$error":"#REF!"}},{"$error":"#REF!"}]
[null,null,null,null,null,null," ",64,{"$error":"#REF!"},null,{"$error":"#REF!"},{"$error":"#REF!"},{"$error":"#REF!"},null,null,null,null,{"$error":"#REF!"},{"$error":"#REF!"},{"$error":"#REF!"},null,{"$error":"#REF!"},{"$error":"#REF!"},null,null,null,{"$f":"IF(I63=\"\",\"\",INDIRECT(\"'\"&$I63&\"'!$X4\")) & \" # \" &'31-07-2019'!Y64","v":{"$error":"#REF!"}},{"$error":"#REF!"}]
[null,null,null,null,null,null," ",65,{"$error":"#REF!"},null,{"$error":"#REF!"},{"$error":"#REF!"},{"$error":"#REF!"},null,null,null,null,{"$error":"#REF!"},{"$error":"#REF!"},{"$error":"#REF!"},null,{"$error":"#REF!"},{"$error":"#REF!"},null,null,null,{"$f":"IF(I64=\"\",\"\",INDIRECT(\"'\"&$I64&\"'!$X4\")) & \" # \" &'31-07-2019'!Y65","v":{"$error":"#REF!"}},{"$error":"#REF!"}]
[null,null,null,null,null,null," ",66,{"$error":"#REF!"},null,{"$error":"#REF!"},{"$error":"#REF!"},{"$error":"#REF!"},null,null,null,null,{"$error":"#REF!"},{"$error":"#REF!"},{"$error":"#REF!"},null,{"$error":"#REF!"},{"$error":"#REF!"},null,null,null,{"$f":"IF(I65=\"\",\"\",INDIRECT(\"'\"&$I65&\"'!$X4\")) & \" # \" &'31-07-2019'!Y66","v":{"$error":"#REF!"}},{"$error":"#REF!"}]
[null,null,null,null,null,null," ",67,{"$error":"#REF!"},null,{"$error":"#REF!"},{"$error":"#REF!"},{"$error":"#REF!"},null,null,null,null,{"$error":"#REF!"},{"$error":"#REF!"},{"$error":"#REF!"},null,{"$error":"#REF!"},{"$error":"#REF!"},null,null,null,{"$f":"IF(I66=\"\",\"\",INDIRECT(\"'\"&$I66&\"'!$X4\")) & \" # \" &'31-07-2019'!Y67","v":{"$error":"#REF!"}},{"$error":"#REF!"}]
[null,null,null,null,null,null," ",68,{"$error":"#REF!"},null,{"$f":"HYPERLINK(\"#'\"&I67&\"'!H3\",\"Go To Sheet\")","v":{"$error":"#REF!"}},{"$error":"#REF!"},{"$error":"#REF!"},null,null,null,null,{"$error":"#REF!"},{"$error":"#REF!"},{"$error":"#REF!"},null,{"$error":"#REF!"},{"$error":"#REF!"},null,null,null,{"$f":"IF(I67=\"\",\"\",INDIRECT(\"'\"&$I67&\"'!$X4\")) & \" # \" &'31-07-2019'!Y68","v":{"$error":"#REF!"}},{"$error":"#REF!"}]
[null,null,null,null,null,null," ",69,{"$f":"INDEX(SheetNames,H68)","v":{"$error":"#REF!"}},null,{"$error":"#REF!"},{"$error":"#REF!"},{"$error":"#REF!"},null,null,null,null,{"$f":"IF(I68=\"\",\"\",INDIRECT(\"'\"&$I68&\"'!$T4\"))","v":{"$error":"#REF!"}},{"$f":"IF(I68=\"\",\"\",INDIRECT(\"'\"&$I68&\"'!$T13\"))","v":{"$error":"#REF!"}},{"$f":"IF(I68=\"\",\"\",INDIRECT(\"'\"&$I68&\"'!$T16\"))","v":{"$error":"#REF!"}},null,{"$f":"IF(I68=\"\",\"\",INDIRECT(\"'\"&$I68&\"'!$V14\"))","v":{"$error":"#REF!"}},{"$f":"IF(I68=\"\",\"\",INDIRECT(\"'\"&$I68&\"'!$V4\"))","v":{"$error":"#REF!"}},null,null,null,{"$f":"IF(I68=\"\",\"\",INDIRECT(\"'\"&$I68&\"'!$X4\")) & \" # \" &'31-07-2019'!Y69","v":{"$error":"#REF!"}},{"$f":"IF(I68=\"\",\"\",INDIRECT(\"'\"&$I68&\"'!$AA4\"))","v":{"$error":"#REF!"}}]
[null,null,null,null,null,null," ",70,{"$error":"#REF!"},null,{"$error":"#REF!"},{"$error":"#REF!"},{"$error":"#REF!"},null,null,null,null,{"$error":"#REF!"},{"$error":"#REF!"},{"$error":"#REF!"},null,{"$error":"#REF!"},{"$error":"#REF!"},null,null,null,{"$f":"IF(I69=\"\",\"\",INDIRECT(\"'\"&$I69&\"'!$X4\")) & \" # \" &'31-07-2019'!Y70","v":{"$error":"#REF!"}},{"$error":"#REF!"}]
[null,null,null,null,null,null," ",null,null,null,null,null,null,null,null,null,null,"","","",null,"","",null,null,null,{"$f":"IF(I70=\"\",\"\",INDIRECT(\"'\"&$I70&\"'!$X4\")) & \" # \" &'31-07-2019'!Y71","v":" # "},""]
[null,null,null,null,null,null," "]
[null,null,null,null,null,null," "," "]
[null,null,null,null,null,null," "," "]
[null,null,null,null,null,null," "," "]
[null,null,null,null,null,null," "," "]
[null,null,null,null,null,null," "," "]
[null,null,null,null,null,null," "," "]
[null,null,null,null,null,null," "," "]
[null,null,null,null,null,null," "," "]
[null,null,null,null,null,null," "," "]
[null,null,null,null,null,null," "," "]
[null,null,null,null,null,null," "," "]
[null,null,null,null,null,null," "," "]
[null,null,null,null,null,null," "," "]
[null,null,null,null,null,null," "," "]
[null,null,null,null,null,null," "," "]
[null,null,null,null,null,null," "," "]
[null,null,null,null,null,null," "," "]
[null,null,null,null,null,null," "," "]
[null,null,null,null,null,null," "," "]
[null,null,null,null,null,null," "," "]
[null,null,null,null,null,null," "," "]
[null,null,null,null,null,null," "," "]
[null,null,null,null,null,null," "," "]
[null,null,null,null,null,null," "]
[null,null,null,null,null,null," "]
[null,null,null,null,null,null," "]
[null,null,null,null,null,null," "]
[null,null,null,null,null,null," "]
[null,null,null,null,null,null," "]
[null,null,null,null,null,null," "]

{"sheet":"31-07-2019","index":2,"n_rows":493,"n_cols":32,"rows_kept":493,"cut":false,"hidden":false,"merged":[[0,19,0,24]]}
["Official time + work","App. Date","Name","Surname","Pasaport No.","Date of birth","Note of status","Price $","Paid $","Route","Unpaid $","GT","Case of appl","TG.Gov",null,"رجــــوع","رجــــوع",null,null,"TOTAL"]
[null,null,null,null,null,null,null,120,{"$f":"IF(J2<>\"\",\"\",H2)","v":""},"ihab",{"$f":"IF(AND(I2=\"\",J2<>\"\"),H2,\"\")","v":120},25,"Extractor",{"$f":"IF(M2=\"Extractor\",62.5,0)","v":62.5}]
[null,null,null,null,124523,null,null,120,"","ihab",120,25,null,{"$f":"IF(M3=\"Extractor\",62.5,0)","v":0},null,null,null,"DONE",null,"Total amount",null,"Net profit",null,"Route","Coun of Rout",null,"Total Unpaid",null,{"$f":"Noblanks(J2:J499)","v":"ihab"},null,"Note of status","Count of Mistake"]
[null,null,null,"mnmxncvmn",null,null,null," "," ",null,"",25,null,0,null,null,null,"CANCELLED",null,{"$f":"SUM(H2:H69)","v":240},null,{"$f":"T4-V14","v":-1547.5},null,{"$f":"IF(ISERROR(INDEX($AC$3:$AC$70,MATCH(0,COUNTIF($X$3:X3,$AC$3:$AC$69),0))),\"\",INDEX($AC$3:$AC$69,MATCH(0,COUNTIF($X$3:X3,$AC$3:$AC$69),0)))","v":"ihab"},{"$f":"IF(X4=\"\",\"\",COUNTIF(J2:J100,X4))","v":2},null,{"$f":"IF(X4<>\"\",SUMPRODUCT(--($J$2:$J$69=X4),$K$2:$K$69),\"\")","v":240},{"$f":"IF(K2=\"\",\"\",J2)","v":"ihab"},{"$f":"Noblanks(J3:J500)","v":"ihab"},null,"MISTAKE IN DOB",{"$f":"COUNTIF(C2:C70,\"Mistake\")","v":0}]
[null,null,"m,mvmmnvc",null,null,"2008-01-01",null," "," ",null,"",25,null,0,null,null,null,"REFUSED",null,null,null,null,null,{"$f":"IF(ISERROR(INDEX($AC$3:$AC$70,MATCH(0,COUNTIF($X$3:X4,$AC$3:$AC$69),0))),\"\",INDEX($AC$3:$AC$69,MATCH(0,COUNTIF($X$3:X4,$AC$3:$AC$69),0)))","v":""},"",null,"",{"$f":"IF(K3=\"\",\"\",J3)","v":"ihab"},{"$f":"Noblanks(J4:J501)","v":""}]
[null,null,null,null,null,null,null," "," ",null,"",25,null,0,null,null,null,"MISTAKE",null,"Total Paid",null,"Difrent amount",null,{"$f":"IF(ISERROR(INDEX($AC$3:$AC$70,MATCH(0,COUNTIF($X$3:X5,$AC$3:$AC$69),0))),\"\",INDEX($AC$3:$AC$69,MATCH(0,COUNTIF($X$3:X5,$AC$3:$AC$69),0)))","v":""},"",{"$f":"IF(K2=\"\",\"\",J2)","v":"ihab"},{"$f":"IF(X6<>\"\",SUMPRODUCT(--($J$2:$J$69=X6),$K$2:$K$69),\"\")","v":""},"",{"$f":"Noblanks(J5:J502)","v":""}]
[null,null,null,null,null,null,null," "," ",null,"",25,null,0,null,null,null,"GREEN PASS.",null,{"$f":"SUM(I2:I67)","v":0},null,{"$f":"T4-(T7+T10)","v":240},null,{"$f":"IF(ISERROR(INDEX($AC$3:$AC$70,MATCH(0,COUNTIF($X$3:X6,$AC$3:$AC$69),0))),\"\",INDEX($AC$3:$AC$69,MATCH(0,COUNTIF($X$3:X6,$AC$3:$AC$69),0)))","v":""},{"$f":"IF(X7=\"\",\"\",COUNTIF(J5:J103,X7))","v":""},"ihab",{"$f":"IF(X7<>\"\",SUMPRODUCT(--($J$2:$J$69=X7),$K$2:$K$69),\"\")","v":""},"",{"$f":"Noblanks(J6:J503)","v":""}]
[null,null,null,null,null,null,null," "," ",null,"",25,null,0,null,null,null,null,null,null,null,null,null,{"$f":"IF(ISERROR(INDEX($AC$3:$AC$70,MATCH(0,COUNTIF($X$3:X7,$AC$3:$AC$69),0))),\"\",INDEX($AC$3:$AC$69,MATCH(0,COUNTIF($X$3:X7,$AC$3:$AC$69),0)))","v":""},{"$f":"IF(X8=\"\",\"\",COUNTIF(J6:J104,X8))","v":""},"","","",{"$f":"Noblanks(J7:J504)","v":""}]
[null,null,null,null,22525353,null,null," "," ",null,"",25,null,0,null,null,null,"official time",null,"Total UnPaid",null,"No. of applicants",null,{"$f":"IF(ISERROR(INDEX($AC$3:$AC$70,MATCH(0,COUNTIF($X$3:X8,$AC$3:$AC$69),0))),\"\",INDEX($AC$3:$AC$69,MATCH(0,COUNTIF($X$3:X8,$AC$3:$AC$69),0)))","v":""},"","","","",{"$f":"Noblanks(J8:J505)","v":""}]
[null,null,null,null,null,null,null," "," ",null,"",25,null,0,null,null,null,"official holiday",null,{"$f":"SUM(K4:K15)","v":0},null,{"$f":"COUNT(B:B)","v":0},null,{"$f":"IF(ISERROR(INDEX($AC$3:$AC$70,MATCH(0,COUNTIF($X$3:X9,$AC$3:$AC$69),0))),\"\",INDEX($AC$3:$AC$69,MATCH(0,COUNTIF($X$3:X9,$AC$3:$AC$69),0)))","v":""},"","","","",{"$f":"Noblanks(J9:J506)","v":""}]
[null,null,null,null,null,null,null," "," ",null,"",25,null,0,null,null,null,"other",null,null,null,null,null,{"$f":"IF(ISERROR(INDEX($AC$3:$AC$70,MATCH(0,COUNTIF($X$3:X10,$AC$3:$AC$69),0))),\"\",INDEX($AC$3:$AC$69,MATCH(0,COUNTIF($X$3:X10,$AC$3:$AC$69),0)))","v":""},"","","","",{"$f":"Noblanks(J10:J507)","v":""}]
[null,null,null,null,null,null,null," "," ",null,"",25,null,0,null,null,null,null,null,"Total GT",null,null,null,{"$f":"IF(ISERROR(INDEX($AC$3:$AC$70,MATCH(0,COUNTIF($X$3:X11,$AC$3:$AC$69),0))),\"\",INDEX($AC$3:$AC$69,MATCH(0,COUNTIF($X$3:X11,$AC$3:$AC$69),0)))","v":""},"","","","",{"$f":"Noblanks(J11:J508)","v":""}]
[null,null,null,null,null,null,null," "," ",null,"",25,null,0,null,null,null,null,null,{"$f":"SUM(L2:L70)","v":1725},null,"Cost amount",null,{"$f":"IF(ISERROR(INDEX($AC$3:$AC$70,MATCH(0,COUNTIF($X$3:X12,$AC$3:$AC$69),0))),\"\",INDEX($AC$3:$AC$69,MATCH(0,COUNTIF($X$3:X12,$AC$3:$AC$69),0)))","v":""},"","","","",{"$f":"Noblanks(J12:J509)","v":""}]
[null,null,null,null,null,null,null," "," ",null,"",25,null,0,null,null,null,null,null,null,null,{"$f":"IF(OR(T13<>\"\",T16<>\"\"),T13+T16,\"\")","v":1787.5},null,{"$f":"IF(ISERROR(INDEX($AC$3:$AC$70,MATCH(0,COUNTIF($X$3:X13,$AC$3:$AC$69),0))),\"\",INDEX($AC$3:$AC$69,MATCH(0,COUNTIF($X$3:X13,$AC$3:$AC$69),0)))","v":""},"","","","",{"$f":"Noblanks(J13:J510)","v":""}]
[null,null,null,null,null,null,null," "," ",null,"",25,null,0,null,null,null,null,null,"Total TG.Gov",null,null,null,{"$f":"IF(ISERROR(INDEX($AC$3:$AC$70,MATCH(0,COUNTIF($X$3:X14,$AC$3:$AC$69),0))),\"\",INDEX($AC$3:$AC$69,MATCH(0,COUNTIF($X$3:X14,$AC$3:$AC$69),0)))","v":""},"","","","",{"$f":"Noblanks(J14:J511)","v":""}]
[null,null,null,null,null,null,null," "," ",null,"",25,null,0,null,null,null,null,null,{"$f":"SUM(N2:N73)","v":62.5},null,null,null,{"$f":"IF(ISERROR(INDEX($AC$3:$AC$70,MATCH(0,COUNTIF($X$3:X15,$AC$3:$AC$69),0))),\"\",INDEX($AC$3:$AC$69,MATCH(0,COUNTIF($X$3:X15,$AC$3:$AC$69),0)))","v":""},"","","","",{"$f":"Noblanks(J15:J512)","v":""}]
[null,null,null,null,null,null,null," "," ",null,{"$f":"IF(AND(I17=\"\",J17<>\"\"),H17,\"\")","v":""},25,null,0,null,null,null,null,null,null,null,null,null,{"$f":"IF(ISERROR(INDEX($AC$3:$AC$70,MATCH(0,COUNTIF($X$3:X16,$AC$3:$AC$69),0))),\"\",INDEX($AC$3:$AC$69,MATCH(0,COUNTIF($X$3:X16,$AC$3:$AC$69),0)))","v":""},"","","","",{"$f":"Noblanks(J16:J513)","v":""}]
[null,null,null,null,null,null," "," "," ",null,{"$f":"IF(AND(I18=\"\",J18<>\"\"),H18,\"\")","v":""},25,null,0,null,null,null,null,null,null,null,null,null,{"$f":"IF(ISERROR(INDEX($AC$3:$AC$70,MATCH(0,COUNTIF($X$3:X17,$AC$3:$AC$69),0))),\"\",INDEX($AC$3:$AC$69,MATCH(0,COUNTIF($X$3:X17,$AC$3:$AC$69),0)))","v":""},"","","","",{"$f":"Noblanks(J17:J514)","v":""}]
[null,null,null,null,null,null," "," "," ",null,"",25,null,0,null,null,null,null,null,null,null,null,null,{"$f":"IF(ISERROR(INDEX($AC$3:$AC$70,MATCH(0,COUNTIF($X$3:X18,$AC$3:$AC$69),0))),\"\",INDEX($AC$3:$AC$69,MATCH(0,COUNTIF($X$3:X18,$AC$3:$AC$69),0)))","v":""},"","","","",{"$f":"Noblanks(J18:J515)","v":""}]
[null,null,null,null,null,null," "," "," ",null,"",25,null,0,null,null,null,null,null,null,null,null,null,{"$f":"IF(ISERROR(INDEX($AC$3:$AC$70,MATCH(0,COUNTIF($X$3:X19,$AC$3:$AC$69),0))),\"\",INDEX($AC$3:$AC$69,MATCH(0,COUNTIF($X$3:X19,$AC$3:$AC$69),0)))","v":""},"","","","",{"$f":"Noblanks(J19:J516)","v":""}]
[null,null,null,null,null,null," ",null,0,null,"",25,null,0,null,null,null,null,null,null,null,null,null,{"$f":"IF(ISERROR(INDEX($AC$3:$AC$70,MATCH(0,COUNTIF($X$3:X20,$AC$3:$AC$69),0))),\"\",INDEX($AC$3:$AC$69,MATCH(0,COUNTIF($X$3:X20,$AC$3:$AC$69),0)))","v":""},"","","","",{"$f":"Noblanks(J20:J517)","v":""}]
[null,null,null,null,null,null," ",null,0,null,"",25,null,0,null,null,null,null,null,null,null,null,null,{"$f":"IF(ISERROR(INDEX($AC$3:$AC$70,MATCH(0,COUNTIF($X$3:X21,$AC$3:$AC$69),0))),\"\",INDEX($AC$3:$AC$69,MATCH(0,COUNTIF($X$3:X21,$AC$3:$AC$69),0)))","v":""},"","","","",{"$f":"Noblanks(J21:J518)","v":""},null,null,{"$f":"IFERROR(INDEX($J$2:$J$492,SMALL(IF($J$2:$J$492<>\"\",ROW($J$1:$J$492)-ROW($J$2)+1,\"\"),ROWS(AF$21:$AJ22))),\"\")","v":""}]
[null,null,null,null,null,null," ",null,0,null,"",25,null,0,null,null,null,null,null,null,null,"Done",null,null,{"$f":"Noblanks(Z25:Z518)","v":""},null,{"$f":"IFERROR(INDEX($J$2:$J$492,SMALL(IF($J$2:$J$492<>\"\",ROW($J$1:$J$492)-ROW($J$2)+1,\"\"),ROWS(AF$21:$AJ23))),\"\")","v":""},"",{"$f":"Noblanks(J22:J519)","v":""}]
[null,null,null,null,null,null," ",null,0,null,"",25,null,0,null,null,null,null,null,null,null,"Cancelled",null,null,null,{"$f":"IF(K20=\"\",\"\",J20)","v":""},null,"",{"$f":"Noblanks(J23:J520)","v":""},null,null,{"$f":"IFERROR(INDEX($J$2:$J$492,SMALL(IF($J$2:$J$492<>\"\",ROW($J$1:$J$492)-ROW($J$2)+1,\"\"),ROWS(AF$21:$AJ24))),\"\")","v":""}]
[null,null,null,null,null,null," ",null,0,null,"",25,null,0,null,null,null,null,null,null,null,"Refused",null,null,null,"",null,"",{"$f":"Noblanks(J24:J521)","v":""},null,null,{"$f":"IFERROR(INDEX($J$2:$J$492,SMALL(IF($J$2:$J$492<>\"\",ROW($J$1:$J$492)-ROW($J$2)+1,\"\"),ROWS(AF$21:$AJ25))),\"\")","v":""}]
[null,null,null,null,null,null," ",null,0,null,"",25,null,0,null,null,null,null,null,null,null,"Green pass.",null,null,null,"",null,"",{"$f":"Noblanks(J25:J522)","v":""}]
[null,null,null,null,null,null," ",null,0,null,"",25,null,0,null,null,null,null,null,null,null,"Mistake",null,null,null,"",null,"",{"$f":"Noblanks(J26:J523)","v":""}]
[null,null,null,null,null,null," ",null,0,null,"",25,null,0,null,null,null,null,null,null,null,null,null,null,null,"",null,"",{"$f":"Noblanks(J27:J524)","v":""}]
[null,null,null,null,null,null," ",null,0,null,"",25,null,0,null,null,null,null,null,null,null,null,null,null,null,"",null,"",{"$f":"Noblanks(J28:J525)","v":""}]
[null,null,null,null,null,null," ",null,0,null,"",25,null,0,null,null,null,null,null,null,null,null,null,null,null,"",null,"",{"$f":"Noblanks(J29:J526)","v":""}]
[null,null,null,null,null,null," ",null,0,null,"",25,null,0,null,null,null,null,null,null,null,null,null,null,null,"",null,"",{"$f":"Noblanks(J30:J527)","v":""}]
[null,null,null,null,null,null," ",null,0,null,"",25,null,0,null,null,null,null,null,null,null,null,null,null,null,"",null,"",{"$f":"Noblanks(J31:J528)","v":""}]
[null,null,null,null,null,null," ",null,0,null,"",25,null,0,null,null,null,null,null,null,null,null,null,null,null,"",null,"",{"$f":"Noblanks(J32:J529)","v":""}]
[null,null,null,null,null,null," ",null,0,null,"",25,null,0,null,null,null,null,null,null,null,null,null,null,null,"",null,"",{"$f":"Noblanks(J33:J530)","v":""}]
[null,null,null,null,null,null," ",null,0,null,"",25,null,0,null,null,null,null,null,null,null,null,null,null,null,"",null,"",{"$f":"Noblanks(J34:J531)","v":""}]
[null,null,null,null,null,null," ",null,0,null,"",25,null,0,null,null,null,null,null,null,null,null,null,null,null,"",null,"",{"$f":"Noblanks(J35:J532)","v":""}]
[null,null,null,null,null,null," ",null,0,null,"",25,null,0,null,null,null,null,null,null,null,null,null,null,null,"",null,"",{"$f":"Noblanks(J36:J533)","v":""}]
[null,null,null,null,null,null," ",null,0,null,"",25,null,0,null,null,null,null,null,null,null,null,null,null,null,"",null,"",{"$f":"Noblanks(J37:J534)","v":""}]
[null,null,null,null,null,null," ",null,0,null,"",25,null,0,null,null,null,null,null,null,null,null,null,null,null,"",null,"",{"$f":"Noblanks(J38:J535)","v":""}]
[null,null,null,null,null,null," ",null,0,null,"",25,null,0,null,null,null,null,null,null,null,null,null,null,null,"",null,"",{"$f":"Noblanks(J39:J536)","v":""}]
[null,null,null,null,null,null," ",null,0,null,"",25,null,0,null,null,null,null,null,null,null,null,null,null,null,"",null,"",{"$f":"Noblanks(J40:J537)","v":""}]
[null,null,null,null,null,null," ",null,0,null,"",25,null,0,null,null,null,null,null,null,null,null,null,null,null,"",null,"",{"$f":"Noblanks(J41:J538)","v":""}]
[null,null,null,null,null,null," ",null,0,null,"",25,null,0,null,null,null,null,null,null,null,null,null,null,null,"",null,"",{"$f":"Noblanks(J42:J539)","v":""}]
[null,null,null,null,null,null," ",null,0,null,"",25,null,0,null,null,null,null,null,null,null,null,null,null,null,"",null,"",{"$f":"Noblanks(J43:J540)","v":""}]
[null,null,null,null,null,null," ",null,0,null,"",25,null,0,null,null,null,null,null,null,null,null,null,null,null,"",null,"",{"$f":"Noblanks(J44:J541)","v":""}]
[null,null,null,null,null,null," ",null,0,null,"",25,null,0,null,null,null,null,null,null,null,null,null,null,null,"",null,"",{"$f":"Noblanks(J45:J542)","v":""}]
[null,null,null,null,null,null," ",null,0,null,"",25,null,0,null,null,null,null,null,null,null,null,null,null,null,"",null,"",{"$f":"Noblanks(J46:J543)","v":""}]
[null,null,null,null,null,null," ",null,0,null,"",25,null,0,null,null,null,null,null,null,null,null,null,null,null,"",null,"",{"$f":"Noblanks(J47:J544)","v":""}]
[null,null,null,null,null,null," ",null,0,null,"",25,null,0,null,null,null,null,null,null,null,null,null,null,null,"",null,"",{"$f":"Noblanks(J48:J545)","v":""}]
[null,null,null,null,null,null," ",null,0,null,"",25,null,0,null,null,null,null,null,null,null,null,null,null,null,"",null,"",{"$f":"Noblanks(J49:J546)","v":""}]
[null,null,null,null,null,null," ",null,0,null,"",25,null,0,null,null,null,null,null,null,null,null,null,null,null,"",null,"",{"$f":"Noblanks(J50:J547)","v":""}]
[null,null,null,null,null,null," ",null,0,null,"",25,null,0,null,null,null,null,null,null,null,null,null,null,null,"",null,"",{"$f":"Noblanks(J51:J548)","v":""}]
[null,null,null,null,null,null," ",null,0,null,"",25,null,0,null,null,null,null,null,null,null,null,null,null,null,"",null,"",{"$f":"Noblanks(J52:J549)","v":""}]
[null,null,null,null,null,null," ",null,0,null,"",25,null,0,null,null,null,null,null,null,null,null,null,null,null,"",null,"",{"$f":"Noblanks(J53:J550)","v":""}]
[null,null,null,null,null,null," ",null,0,null,"",25,null,0,null,null,null,null,null,null,null,null,null,null,null,"",null,"",{"$f":"Noblanks(J54:J551)","v":""}]
[null,null,null,null,null,null," ",null,0,null,"",25,null,0,null,null,null,null,null,null,null,null,null,null,null,"",null,"",{"$f":"Noblanks(J55:J552)","v":""}]
[null,null,null,null,null,null," ",null,0,null,"",25,null,0,null,null,null,null,null,null,null,null,null,null,null,"",null,"",{"$f":"Noblanks(J56:J553)","v":""}]
[null,null,null,null,null,null," ",null,0,null,"",25,null,0,null,null,null,null,null,null,null,null,null,null,null,"",null,"",{"$f":"Noblanks(J57:J554)","v":""}]
[null,null,null,null,null,null," ",null,0,null,"",25,null,0,null,null,null,null,null,null,null,null,null,null,null,"",null,"",{"$f":"Noblanks(J58:J555)","v":""}]
[null,null,null,null,null,null," ",null,0,null,"",25,null,0,null,null,null,null,null,null,null,null,null,null,null,"",null,"",{"$f":"Noblanks(J59:J556)","v":""}]
[null,null,null,null,null,null," ",null,0,null,"",25,null,0,null,null,null,null,null,null,null,null,null,null,null,"",null,"",{"$f":"Noblanks(J60:J557)","v":""}]
[null,null,null,null,null,null," ",null,0,null,"",25,null,0,null,null,null,null,null,null,null,null,null,null,null,"",null,"",{"$f":"Noblanks(J61:J558)","v":""}]
[null,null,null,null,null,null," ",null,0,null,"",25,null,0,null,null,null,null,null,null,null,null,null,null,null,"",null,"",{"$f":"Noblanks(J62:J559)","v":""}]
[null,null,null,null,null,null," ",null,0,null,{"$f":"IF(AND(I64=\"\",J64<>\"\"),H64,\"\")","v":""},25,null,0,null,null,null,null,null,null,null,null,null,null,null,"",null,"",{"$f":"Noblanks(J63:J560)","v":""}]
[null,null,null,null,null,null," ",null,0,null,{"$f":"IF(AND(I65=\"\",J65<>\"\"),H65,\"\")","v":""},25,null,0,null,null,null,null,null,null,null,null,null,null,null,"",null,"",{"$f":"Noblanks(J64:J561)","v":""}]
[null,null,null,null,null,null," ",null,{"$f":"IF(J66<>\"\",\"\",H66)","v":0},null,"",25,null,0,null,null,null,null,null,null,null,null,null,null,null,"",null,"",{"$f":"Noblanks(J65:J562)","v":""}]
[null,null,null,null,null,null," ",null,0,null,"",25,null,{"$f":"IF(M67=\"Extractor\",62.5,0)","v":0},null,null,null,null,null,null,null,null,null,null,null,"",null,"",{"$f":"Noblanks(J66:J563)","v":""}]
[null,null,null,null,null,null," ",null,0,null,"",25,null,0,null,null,null,null,null,null,null,null,null,null,null,"",null,"",{"$f":"Noblanks(J67:J564)","v":""}]
[null,null,null,null,null,null," ",null,0,null,"",25,null,0,null,null,null,null,null,null,null,null,null,null,null,"",null,{"$f":"IF(K67=\"\",\"\",J67)","v":""},{"$f":"Noblanks(J68:J565)","v":""}]
[null,null,null,null,null,null," ",null,0,null,"",25,null,0,null,null,null,null,null,null,null,null,null,null,null,"",null,"",{"$f":"Noblanks(J69:J566)","v":""}]
[null,null,null,null,null,null," "," ",null,null,null,null,null,null,null,null,null,null,null,null,null,null,null,null,null,"",null,"",{"$f":"Noblanks(J70:J567)","v":""}]
[null,null,null,null,null,null," "," ",null,null,null,null,null,null,null,null,null,null,null,null,null,null,null,null,null,"",null,null,{"$f":"Noblanks(J71:J568)","v":""}]
[null,null,null,null,null,null," "," ",null,null,null,null,null,null,null,null,null,null,null,null,null,null,null,null,null,"",null,null,{"$f":"Noblanks(J72:J569)","v":""}]
[null,null,null,null,null,null," "," ",null,null,null,null,null,null,null,null,null,null,null,null,null,null,null,null,null,"",null,null,{"$f":"Noblanks(J73:J570)","v":""}]
[null,null,null,null,null,null," "," ",null,null,null,null,null,null,null,null,null,null,null,null,null,null,null,null,null,"",null,null,{"$f":"Noblanks(J74:J571)","v":""}]
[null,null,null,null,null,null," "," ",null,null,null,null,null,null,null,null,null,null,null,null,null,null,null,null,null,"",null,null,{"$f":"Noblanks(J75:J572)","v":""}]
[null,null,null,null,null,null," "," ",null,null,null,null,null,null,null,null,null,null,null,null,null,null,null,null,null,"",null,null,{"$f":"Noblanks(J76:J573)","v":""}]
[null,null,null,null,null,null," "," ",null,null,null,null,null,null,null,null,null,null,null,null,null,null,null,null,null,"",null,null,{"$f":"Noblanks(J77:J574)","v":""}]
[null,null,null,null,null,null," "," ",null,null,null,null,null,null,null,null,null,null,null,null,null,null,null,null,null,"",null,null,{"$f":"Noblanks(J78:J575)","v":""}]
[null,null,null,null,null,null," "," ",null,null,null,null,null,null,null,null,null,null,null,null,null,null,null,null,null,"",null,null,{"$f":"Noblanks(J79:J576)","v":""}]
[null,null,null,null,null,null," "," ",null,null,null,null,null,null,null,null,null,null,null,null,null,null,null,null,null,"",null,null,{"$f":"Noblanks(J80:J577)","v":""}]
[null,null,null,null,null,null," "," ",null,null,null,null,null,null,null,null,null,null,null,null,null,null,null,null,null,"",null,null,{"$f":"Noblanks(J81:J578)","v":""}]
[null,null,null,null,null,null," "," ",null,null,null,null,null,null,null,null,null,null,null,null,null,null,null,null,null,"",null,null,{"$f":"Noblanks(J82:J579)","v":""}]
[null,null,null,null,null,null," "," ",null,null,null,null,null,null,null,null,null,null,null,null,null,null,null,null,null,"",null,null,{"$f":"Noblanks(J83:J580)","v":""}]
[null,null,null,null,null,null," "," ",null,null,null,null,null,null,null,null,null,null,null,null,null,null,null,null,null,"",null,null,{"$f":"Noblanks(J84:J581)","v":""}]
[null,null,null,null,null,null," "," ",null,null,null,null,null,null,null,null,null,null,null,null,null,null,null,null,null,"",null,null,{"$f":"Noblanks(J85:J582)","v":""}]
[null,null,null,null,null,null," "," ",null,null,null,null,null,null,null,null,null,null,null,null,null,null,null,null,null,"",null,null,{"$f":"Noblanks(J86:J583)","v":""}]
[null,null,null,null,null,null," "," ",null,null,null,null,null,null,null,null,null,null,null,null,null,null,null,null,null,{"$f":"IF(K84=\"\",\"\",J84)","v":""},null,null,{"$f":"Noblanks(J87:J584)","v":""}]
[null,null,null,null,null,null," "," ",null,null,null,null,null,null,null,null,null,null,null,null,null,null,null,null,null,"",null,null,{"$f":"Noblanks(J88:J585)","v":""}]
[null,null,null,null,null,null," "," ",null,null,null,null,null,null,null,null,null,null,null,null,null,null,null,null,null,"",null,null,{"$f":"Noblanks(J89:J586)","v":""}]
[null,null,null,null,null,null," "," ",null,null,null,null,null,null,null,null,null,null,null,null,null,null,null,null,null,"",null,null,{"$f":"Noblanks(J90:J587)","v":""}]
[null,null,null,null,null,null," "," ",null,null,null,null,null,null,null,null,null,null,null,null,null,null,null,null,null,"",null,null,{"$f":"Noblanks(J91:J588)","v":""}]
[null,null,null,null,null,null," "," ",null,null,null,null,null,null,null,null,null,null,null,null,null,null,null,null,null,"",null,null,{"$f":"Noblanks(J92:J589)","v":""}]
[null,null,null,null,null,null," ",null,null,null,null,null,null,null,null,null,null,null,null,null,null,null,null,null,null,"",null,null,{"$f":"Noblanks(J93:J590)","v":""}]
[null,null,null,null,null,null," ",null,null,null,null,null,null,null,null,null,null,null,null,null,null,null,null,null,null,"",null,null,{"$f":"Noblanks(J94:J591)","v":""}]
[null,null,null,null,null,null," ",null,null,null,null,null,null,null,null,null,null,null,null,null,null,null,null,null,null,"",null,null,{"$f":"Noblanks(J95:J592)","v":""}]
[null,null,null,null,null,null," ",null,null,null,null,null,null,null,null,null,null,null,null,null,null,null,null,null,null,"",null,null,{"$f":"Noblanks(J96:J593)","v":""}]
[null,null,null,null,null,null," ",null,null,null,null,null,null,null,null,null,null,null,null,null,null,null,null,null,null,"",null,null,{"$f":"Noblanks(J97:J594)","v":""}]
[null,null,null,null,null,null," ",null,null,null,null,null,null,null,null,null,null,null,null,null,null,null,null,null,null,"",null,null,{"$f":"Noblanks(J98:J595)","v":""}]
[null,null,null,null,null,null," ",null,null,null,null,null,null,null,null,null,null,null,null,null,null,null,null,null,null,"",null,null,{"$f":"Noblanks(J99:J596)","v":""}]
[null,null,null,null,null,null," ",null,null,null,null,null,null,null,null,null,null,null,null,null,null,null,null,null,null,"",null,null,{"$f":"Noblanks(J100:J597)","v":""}]
[null,null,null,null,null,null," ",null,null,null,null,null,null,null,null,null,null,null,null,null,null,null,null,null,null,"",null,null,{"$f":"Noblanks(J101:J598)","v":""}]
[null,null,null,null,null,null," ",null,null,null,null,null,null,null,null,null,null,null,null,null,null,null,null,null,null,null,null,null,{"$f":"Noblanks(J102:J599)","v":""}]
[null,null,null,null,null,null," ",null,null,null,null,null,null,null,null,null,null,null,null,null,null,null,null,null,null,null,null,null,{"$f":"Noblanks(J103:J600)","v":""}]
[null,null,null,null,null,null," ",null,null,null,null,null,null,null,null,null,null,null,null,null,null,null,null,null,null,null,null,null,{"$f":"Noblanks(J104:J601)","v":""}]
[null,null,null,null,null,null," ",null,null,null,null,null,null,null,null,null,null,null,null,null,null,null,null,null,null,null,null,null,{"$f":"Noblanks(J105:J602)","v":""}]
[null,null,null,null,null,null," ",null,null,null,null,null,null,null,null,null,null,null,null,null,null,null,null,null,null,null,null,null,{"$f":"Noblanks(J106:J603)","v":""}]
[null,null,null,null,null,null," ",null,null,null,null,null,null,null,null,null,null,null,null,null,null,null,null,null,null,null,null,null,{"$f":"Noblanks(J107:J604)","v":""}]
[null,null,null,null,null,null," ",null,null,null,null,null,null,null,null,null,null,null,null,null,null,null,null,null,null,null,null,null,{"$f":"Noblanks(J108:J605)","v":""}]
[null,null,null,null,null,null," ",null,null,null,null,null,null,null,null,null,null,null,null,null,null,null,null,null,null,null,null,null,{"$f":"Noblanks(J109:J606)","v":""}]
[null,null,null,null,null,null," ",null,null,null,null,null,null,null,null,null,null,null,null,null,null,null,null,null,null,null,null,null,{"$f":"Noblanks(J110:J607)","v":""}]
[null,null,null,null,null,null," ",null,null,null,null,null,null,null,null,null,null,null,null,null,null,null,null,null,null,null,null,null,{"$f":"Noblanks(J111:J608)","v":""}]
[null,null,null,null,null,null," ",null,null,null,null,null,null,null,null,null,null,null,null,null,null,null,null,null,null,null,null,null,{"$f":"Noblanks(J112:J609)","v":""}]
[null,null,null,null,null,null," ",null,null,null,null,null,null,null,null,null,null,null,null,null,null,null,null,null,null,null,null,null,{"$f":"Noblanks(J113:J610)","v":""}]
[null,null,null,null,null,null," ",null,null,null,null,null,null,null,null,null,null,null,null,null,null,null,null,null,null,null,null,null,{"$f":"Noblanks(J114:J611)","v":""}]
[null,null,null,null,null,null," ",null,null,null,null,null,null,null,null,null,null,null,null,null,null,null,null,null,null,null,null,null,{"$f":"Noblanks(J115:J612)","v":""}]
[null,null,null,null,null,null," ",null,null,null,null,null,null,null,null,null,null,null,null,null,null,null,null,null,null,null,null,null,{"$f":"Noblanks(J116:J613)","v":""}]
[null,null,null,null,null,null," ",null,null,null,null,null,null,null,null,null,null,null,null,null,null,null,null,null,null,null,null,null,{"$f":"Noblanks(J117:J614)","v":""}]
[null,null,null,null,null,null," ",null,null,null,null,null,null,null,null,null,null,null,null,null,null,null,null,null,null,null,null,null,{"$f":"Noblanks(J118:J615)","v":""}]
[null,null,null,null,null,null," ",null,null,null,null,null,null,null,null,null,null,null,null,null,null,null,null,null,null,null,null,null,{"$f":"Noblanks(J119:J616)","v":""}]
[null,null,null,null,null,null," ",null,null,null,null,null,null,null,null,null,null,null,null,null,null,null,null,null,null,null,null,null,{"$f":"Noblanks(J120:J617)","v":""}]
[null,null,null,null,null,null," ",null,null,null,null,null,null,null,null,null,null,null,null,null,null,null,null,null,null,null,null,null,{"$f":"Noblanks(J121:J618)","v":""}]
[null,null,null,null,null,null," ",null,null,null,null,null,null,null,null,null,null,null,null,null,null,null,null,null,null,null,null,null,{"$f":"Noblanks(J122:J619)","v":""}]
[null,null,null,null,null,null," ",null,null,null,null,null,null,null,null,null,null,null,null,null,null,null,null,null,null,null,null,null,{"$f":"Noblanks(J123:J620)","v":""}]
[null,null,null,null,null,null," ",null,null,null,null,null,null,null,null,null,null,null,null,null,null,null,null,null,null,null,null,null,{"$f":"Noblanks(J124:J621)","v":""}]
[null,null,null,null,null,null," ",null,null,null,null,null,null,null,null,null,null,null,null,null,null,null,null,null,null,null,null,null,{"$f":"Noblanks(J125:J622)","v":""}]
[null,null,null,null,null,null," ",null,null,null,null,null,null,null,null,null,null,null,null,null,null,null,null,null,null,null,null,null,{"$f":"Noblanks(J126:J623)","v":""}]
[null,null,null,null,null,null," ",null,null,null,null,null,null,null,null,null,null,null,null,null,null,null,null,null,null,null,null,null,{"$f":"Noblanks(J127:J624)","v":""}]
[null,null,null,null,null,null," ",null,null,null,null,null,null,null,null,null,null,null,null,null,null,null,null,null,null,null,null,null,{"$f":"Noblanks(J128:J625)","v":""}]
[null,null,null,null,null,null," ",null,null,null,null,null,null,null,null,null,null,null,null,null,null,null,null,null,null,null,null,null,{"$f":"Noblanks(J129:J626)","v":""}]
[null,null,null,null,null,null," ",null,null,null,null,null,null,null,null,null,null,null,null,null,null,null,null,null,null,null,null,null,{"$f":"Noblanks(J130:J627)","v":""}]
[null,null,null,null,null,null," ",null,null,null,null,null,null,null,null,null,null,null,null,null,null,null,null,null,null,null,null,null,{"$f":"Noblanks(J131:J628)","v":""}]
[null,null,null,null,null,null," ",null,null,null,null,null,null,null,null,null,null,null,null,null,null,null,null,null,null,null,null,null,{"$f":"Noblanks(J132:J629)","v":""}]
[null,null,null,null,null,null," ",null,null,null,null,null,null,null,null,null,null,null,null,null,null,null,null,null,null,null,null,null,{"$f":"Noblanks(J133:J630)","v":""}]
[null,null,null,null,null,null," ",null,null,null,null,null,null,null,null,null,null,null,null,null,null,null,null,null,null,null,null,null,{"$f":"Noblanks(J134:J631)","v":""}]
[null,null,null,null,null,null," ",null,null,null,null,null,null,null,null,null,null,null,null,null,null,null,null,null,null,null,null,null,{"$f":"Noblanks(J135:J632)","v":""}]
[null,null,null,null,null,null," ",null,null,null,null,null,null,null,null,null,null,null,null,null,null,null,null,null,null,null,null,null,{"$f":"Noblanks(J136:J633)","v":""}]
[null,null,null,null,null,null," ",null,null,null,null,null,null,null,null,null,null,null,null,null,null,null,null,null,null,null,null,null,{"$f":"Noblanks(J137:J634)","v":""}]
[null,null,null,null,null,null," ",null,null,null,null,null,null,null,null,null,null,null,null,null,null,null,null,null,null,null,null,null,{"$f":"Noblanks(J138:J635)","v":""}]
[null,null,null,null,null,null," ",null,null,null,null,null,null,null,null,null,null,null,null,null,null,null,null,null,null,null,null,null,{"$f":"Noblanks(J139:J636)","v":""}]
[null,null,null,null,null,null," ",null,null,null,null,null,null,null,null,null,null,null,null,null,null,null,null,null,null,null,null,null,{"$f":"Noblanks(J140:J637)","v":""}]
[null,null,null,null,null,null," ",null,null,null,null,null,null,null,null,null,null,null,null,null,null,null,null,null,null,null,null,null,{"$f":"Noblanks(J141:J638)","v":""}]
[null,null,null,null,null,null," ",null,null,null,null,null,null,null,null,null,null,null,null,null,null,null,null,null,null,null,null,null,{"$f":"Noblanks(J142:J639)","v":""}]
[null,null,null,null,null,null," ",null,null,null,null,null,null,null,null,null,null,null,null,null,null,null,null,null,null,null,null,null,{"$f":"Noblanks(J143:J640)","v":""}]
[null,null,null,null,null,null," ",null,null,null,null,null,null,null,null,null,null,null,null,null,null,null,null,null,null,null,null,null,{"$f":"Noblanks(J144:J641)","v":""}]
[null,null,null,null,null,null," ",null,null,null,null,null,null,null,null,null,null,null,null,null,null,null,null,null,null,null,null,null,{"$f":"Noblanks(J145:J642)","v":""}]
[null,null,null,null,null,null," ",null,null,null,null,null,null,null,null,null,null,null,null,null,null,null,null,null,null,null,null,null,{"$f":"Noblanks(J146:J643)","v":""}]
[null,null,null,null,null,null," ",null,null,null,null,null,null,null,null,null,null,null,null,null,null,null,null,null,null,null,null,null,{"$f":"Noblanks(J147:J644)","v":""}]
[null,null,null,null,null,null," ",null,null,null,null,null,null,null,null,null,null,null,null,null,null,null,null,null,null,null,null,null,{"$f":"Noblanks(J148:J645)","v":""}]
[null,null,null,null,null,null," ",null,null,null,null,null,null,null,null,null,null,null,null,null,null,null,null,null,null,null,null,null,{"$f":"Noblanks(J149:J646)","v":""}]
[null,null,null,null,null,null," ",null,null,null,null,null,null,null,null,null,null,null,null,null,null,null,null,null,null,null,null,null,{"$f":"Noblanks(J150:J647)","v":""}]
[null,null,null,null,null,null," ",null,null,null,null,null,null,null,null,null,null,null,null,null,null,null,null,null,null,null,null,null,{"$f":"Noblanks(J151:J648)","v":""}]
[null,null,null,null,null,null," ",null,null,null,null,null,null,null,null,null,null,null,null,null,null,null,null,null,null,null,null,null,{"$f":"Noblanks(J152:J649)","v":""}]
[null,null,null,null,null,null," ",null,null,null,null,null,null,null,null,null,null,null,null,null,null,null,null,null,null,null,null,null,{"$f":"Noblanks(J153:J650)","v":""}]
[null,null,null,null,null,null," ",null,null,null,null,null,null,null,null,null,null,null,null,null,null,null,null,null,null,null,null,null,{"$f":"Noblanks(J154:J651)","v":""}]
[null,null,null,null,null,null," ",null,null,null,null,null,null,null,null,null,null,null,null,null,null,null,null,null,null,null,null,null,{"$f":"Noblanks(J155:J652)","v":""}]
[null,null,null,null,null,null," ",null,null,null,null,null,null,null,null,null,null,null,null,null,null,null,null,null,null,null,null,null,{"$f":"Noblanks(J156:J653)","v":""}]
[null,null,null,null,null,null," ",null,null,null,null,null,null,null,null,null,null,null,null,null,null,null,null,null,null,null,null,null,{"$f":"Noblanks(J157:J654)","v":""}]
[null,null,null,null,null,null," ",null,null,null,null,null,null,null,null,null,null,null,null,null,null,null,null,null,null,null,null,null,{"$f":"Noblanks(J158:J655)","v":""}]
[null,null,null,null,null,null," ",null,null,null,null,null,null,null,null,null,null,null,null,null,null,null,null,null,null,null,null,null,{"$f":"Noblanks(J159:J656)","v":""}]
[null,null,null,null,null,null," ",null,null,null,null,null,null,null,null,null,null,null,null,null,null,null,null,null,null,null,null,null,{"$f":"Noblanks(J160:J657)","v":""}]
[null,null,null,null,null,null," ",null,null,null,null,null,null,null,null,null,null,null,null,null,null,null,null,null,null,null,null,null,{"$f":"Noblanks(J161:J658)","v":""}]
[null,null,null,null,null,null," ",null,null,null,null,null,null,null,null,null,null,null,null,null,null,null,null,null,null,null,null,null,{"$f":"Noblanks(J162:J659)","v":""}]
[null,null,null,null,null,null," ",null,null,null,null,null,null,null,null,null,null,null,null,null,null,null,null,null,null,null,null,null,{"$f":"Noblanks(J163:J660)","v":""}]
[null,null,null,null,null,null," ",null,null,null,null,null,null,null,null,null,null,null,null,null,null,null,null,null,null,null,null,null,{"$f":"Noblanks(J164:J661)","v":""}]
[null,null,null,null,null,null," ",null,null,null,null,null,null,null,null,null,null,null,null,null,null,null,null,null,null,null,null,null,{"$f":"Noblanks(J165:J662)","v":""}]
[null,null,null,null,null,null," ",null,null,null,null,null,null,null,null,null,null,null,null,null,null,null,null,null,null,null,null,null,{"$f":"Noblanks(J166:J663)","v":""}]
[null,null,null,null,null,null," ",null,null,null,null,null,null,null,null,null,null,null,null,null,null,null,null,null,null,null,null,null,{"$f":"Noblanks(J167:J664)","v":""}]
[null,null,null,null,null,null," ",null,null,null,null,null,null,null,null,null,null,null,null,null,null,null,null,null,null,null,null,null,{"$f":"Noblanks(J168:J665)","v":""}]
[null,null,null,null,null,null," ",null,null,null,null,null,null,null,null,null,null,null,null,null,null,null,null,null,null,null,null,null,{"$f":"Noblanks(J169:J666)","v":""}]
[null,null,null,null,null,null," ",null,null,null,null,null,null,null,null,null,null,null,null,null,null,null,null,null,null,null,null,null,{"$f":"Noblanks(J170:J667)","v":""}]
[null,null,null,null,null,null," ",null,null,null,null,null,null,null,null,null,null,null,null,null,null,null,null,null,null,null,null,null,{"$f":"Noblanks(J171:J668)","v":""}]
[null,null,null,null,null,null," ",null,null,null,null,null,null,null,null,null,null,null,null,null,null,null,null,null,null,null,null,null,{"$f":"Noblanks(J172:J669)","v":""}]
[null,null,null,null,null,null," ",null,null,null,null,null,null,null,null,null,null,null,null,null,null,null,null,null,null,null,null,null,{"$f":"Noblanks(J173:J670)","v":""}]
[null,null,null,null,null,null," ",null,null,null,null,null,null,null,null,null,null,null,null,null,null,null,null,null,null,null,null,null,{"$f":"Noblanks(J174:J671)","v":""}]
[null,null,null,null,null,null," ",null,null,null,null,null,null,null,null,null,null,null,null,null,null,null,null,null,null,null,null,null,{"$f":"Noblanks(J175:J672)","v":""}]
[null,null,null,null,null,null," ",null,null,null,null,null,null,null,null,null,null,null,null,null,null,null,null,null,null,null,null,null,{"$f":"Noblanks(J176:J673)","v":""}]
[null,null,null,null,null,null," ",null,null,null,null,null,null,null,null,null,null,null,null,null,null,null,null,null,null,null,null,null,{"$f":"Noblanks(J177:J674)","v":""}]
[null,null,null,null,null,null," ",null,null,null,null,null,null,null,null,null,null,null,null,null,null,null,null,null,null,null,null,null,{"$f":"Noblanks(J178:J675)","v":""}]
[null,null,null,null,null,null," ",null,null,null,null,null,null,null,null,null,null,null,null,null,null,null,null,null,null,null,null,null,{"$f":"Noblanks(J179:J676)","v":""}]
[null,null,null,null,null,null," ",null,null,null,null,null,null,null,null,null,null,null,null,null,null,null,null,null,null,null,null,null,{"$f":"Noblanks(J180:J677)","v":""}]
[null,null,null,null,null,null," ",null,null,null,null,null,null,null,null,null,null,null,null,null,null,null,null,null,null,null,null,null,{"$f":"Noblanks(J181:J678)","v":""}]
[null,null,null,null,null,null," ",null,null,null,null,null,null,null,null,null,null,null,null,null,null,null,null,null,null,null,null,null,{"$f":"Noblanks(J182:J679)","v":""}]
[null,null,null,null,null,null," ",null,null,null,null,null,null,null,null,null,null,null,null,null,null,null,null,null,null,null,null,null,{"$f":"Noblanks(J183:J680)","v":""}]
[null,null,null,null,null,null," ",null,null,null,null,null,null,null,null,null,null,null,null,null,null,null,null,null,null,null,null,null,{"$f":"Noblanks(J184:J681)","v":""}]
[null,null,null,null,null,null," ",null,null,null,null,null,null,null,null,null,null,null,null,null,null,null,null,null,null,null,null,null,{"$f":"Noblanks(J185:J682)","v":""}]
[null,null,null,null,null,null," ",null,null,null,null,null,null,null,null,null,null,null,null,null,null,null,null,null,null,null,null,null,{"$f":"Noblanks(J186:J683)","v":""}]
[null,null,null,null,null,null," ",null,null,null,null,null,null,null,null,null,null,null,null,null,null,null,null,null,null,null,null,null,{"$f":"Noblanks(J187:J684)","v":""}]
[null,null,null,null,null,null," ",null,null,null,null,null,null,null,null,null,null,null,null,null,null,null,null,null,null,null,null,null,{"$f":"Noblanks(J188:J685)","v":""}]
[null,null,null,null,null,null," ",null,null,null,null,null,null,null,null,null,null,null,null,null,null,null,null,null,null,null,null,null,{"$f":"Noblanks(J189:J686)","v":""}]
[null,null,null,null,null,null," ",null,null,null,null,null,null,null,null,null,null,null,null,null,null,null,null,null,null,null,null,null,{"$f":"Noblanks(J190:J687)","v":""}]
[null,null,null,null,null,null," ",null,null,null,null,null,null,null,null,null,null,null,null,null,null,null,null,null,null,null,null,null,{"$f":"Noblanks(J191:J688)","v":""}]
[null,null,null,null,null,null," ",null,null,null,null,null,null,null,null,null,null,null,null,null,null,null,null,null,null,null,null,null,{"$f":"Noblanks(J192:J689)","v":""}]
[null,null,null,null,null,null," ",null,null,null,null,null,null,null,null,null,null,null,null,null,null,null,null,null,null,null,null,null,{"$f":"Noblanks(J193:J690)","v":""}]
[null,null,null,null,null,null," ",null,null,null,null,null,null,null,null,null,null,null,null,null,null,null,null,null,null,null,null,null,{"$f":"Noblanks(J194:J691)","v":""}]
[null,null,null,null,null,null," ",null,null,null,null,null,null,null,null,null,null,null,null,null,null,null,null,null,null,null,null,null,{"$f":"Noblanks(J195:J692)","v":""}]
[null,null,null,null,null,null," ",null,null,null,null,null,null,null,null,null,null,null,null,null,null,null,null,null,null,null,null,null,{"$f":"Noblanks(J196:J693)","v":""}]
[null,null,null,null,null,null," ",null,null,null,null,null,null,null,null,null,null,null,null,null,null,null,null,null,null,null,null,null,{"$f":"Noblanks(J197:J694)","v":""}]
[null,null,null,null,null,null," "]
[null,null,null,null,null,null," "]
[null,null,null,null,null,null," "]
[null,null,null,null,null,null," "]
[null,null,null,null,null,null," "]
[null,null,null,null,null,null," "]
[null,null,null,null,null,null," "]
[null,null,null,null,null,null," "]
[null,null,null,null,null,null," "]
[null,null,null,null,null,null," "]
[null,null,null,null,null,null," "]
[null,null,null,null,null,null," "]
[null,null,null,null,null,null," "]
[null,null,null,null,null,null," "]
[null,null,null,null,null,null," "]
[null,null,null,null,null,null," "]
[null,null,null,null,null,null," "]
[null,null,null,null,null,null," "]
[null,null,null,null,null,null," "]
[null,null,null,null,null,null," "]
[null,null,null,null,null,null," "]
[null,null,null,null,null,null," "]
[null,null,null,null,null,null," "]
[null,null,null,null,null,null," "]
[null,null,null,null,null,null," "]
[null,null,null,null,null,null," "]
[null,null,null,null,null,null," "]
[null,null,null,null,null,null," "]
[null,null,null,null,null,null," "]
[null,null,null,null,null,null," "]
[null,null,null,null,null,null," "]
[null,null,null,null,null,null," "]
[null,null,null,null,null,null," "]
[null,null,null,null,null,null," "]
[null,null,null,null,null,null," "]
[null,null,null,null,null,null," "]
[null,null,null,null,null,null," "]
[null,null,null,null,null,null," "]
[null,null,null,null,null,null," "]
[null,null,null,null,null,null," "]
[null,null,null,null,null,null," "]
[null,null,null,null,null,null," "]
[null,null,null,null,null,null," "]
[null,null,null,null,null,null," "]
[null,null,null,null,null,null," "]
[null,null,null,null,null,null," "]
[null,null,null,null,null,null," "]
[null,null,null,null,null,null," "]
[null,null,null,null,null,null," "]
[null,null,null,null,null,null," "]
[null,null,null,null,null,null," "]
[null,null,null,null,null,null," "]
[null,null,null,null,null,null," "]
[null,null,null,null,null,null," "]
[null,null,null,null,null,null," "]
[null,null,null,null,null,null," "]
[null,null,null,null,null,null," "]
[null,null,null,null,null,null," "]
[null,null,null,null,null,null," "]
[null,null,null,null,null,null," "]
[null,null,null,null,null,null," "]
[null,null,null,null,null,null," "]
[null,null,null,null,null,null," "]
[null,null,null,null,null,null," "]
[null,null,null,null,null,null," "]
[null,null,null,null,null,null," "]
[null,null,null,null,null,null," "]
[null,null,null,null,null,null," "]
[null,null,null,null,null,null," "]
[null,null,null,null,null,null," "]
[null,null,null,null,null,null," "]
[null,null,null,null,null,null," "]
[null,null,null,null,null,null," "]
[null,null,null,null,null,null," "]
[null,null,null,null,null,null," "]
[null,null,null,null,null,null," "]
[null,null,null,null,null,null," "]
[null,null,null,null,null,null," "]
[null,null,null,null,null,null," "]
[null,null,null,null,null,null," "]
[null,null,null,null,null,null," "]
[null,null,null,null,null,null," "]
[null,null,null,null,null,null," "]
[null,null,null,null,null,null," "]
[null,null,null,null,null,null," "]
[null,null,null,null,null,null," "]
[null,null,null,null,null,null," "]
[null,null,null,null,null,null," "]
[null,null,null,null,null,null," "]
[null,null,null,null,null,null," "]
[null,null,null,null,null,null," "]
[null,null,null,null,null,null," "]
[null,null,null,null,null,null," "]
[null,null,null,null,null,null," "]
[null,null,null,null,null,null," "]
[null,null,null,null,null,null," "]
[null,null,null,null,null,null," "]
[null,null,null,null,null,null," "]
[null,null,null,null,null,null," "]
[null,null,null,null,null,null," "]
[null,null,null,null,null,null," "]
[null,null,null,null,null,null," "]
[null,null,null,null,null,null," "]
[null,null,null,null,null,null," "]
[null,null,null,null,null,null," "]
[null,null,null,null,null,null," "]
[null,null,null,null,null,null," "]
[null,null,null,null,null,null," "]
[null,null,null,null,null,null," "]
[null,null,null,null,null,null," "]
[null,null,null,null,null,null," "]
[null,null,null,null,null,null," "]
[null,null,null,null,null,null," "]
[null,null,null,null,null,null," "]
[null,null,null,null,null,null," "]
[null,null,null,null,null,null," "]
[null,null,null,null,null,null," "]
[null,null,null,null,null,null," "]
[null,null,null,null,null,null," "]
[null,null,null,null,null,null," "]
[null,null,null,null,null,null," "]
[null,null,null,null,null,null," "]
[null,null,null,null,null,null," "]
[null,null,null,null,null,null," "]
[null,null,null,null,null,null," "]
[null,null,null,null,null,null," "]
[null,null,null,null,null,null," "]
[null,null,null,null,null,null," "]
[null,null,null,null,null,null," "]
[null,null,null,null,null,null," "]
[null,null,null,null,null,null," "]
[null,null,null,null,null,null," "]
[null,null,null,null,null,null," "]
[null,null,null,null,null,null," "]
[null,null,null,null,null,null," "]
[null,null,null,null,null,null," "]
[null,null,null,null,null,null," "]
[null,null,null,null,null,null," "]
[null,null,null,null,null,null," "]
[null,null,null,null,null,null," "]
[null,null,null,null,null,null," "]
[null,null,null,null,null,null," "]
[null,null,null,null,null,null," "]
[null,null,null,null,null,null," "]
[null,null,null,null,null,null," "]
[null,null,null,null,null,null," "]
[null,null,null,null,null,null," "]
[null,null,null,null,null,null," "]
[null,null,null,null,null,null," "]
[null,null,null,null,null,null," "]
[null,null,null,null,null,null," "]
[null,null,null,null,null,null," "]
[null,null,null,null,null,null," "]
[null,null,null,null,null,null," "]
[null,null,null,null,null,null," "]
[null,null,null,null,null,null," "]
[null,null,null,null,null,null," "]
[null,null,null,null,null,null," "]
[null,null,null,null,null,null," "]
[null,null,null,null,null,null," "]
[null,null,null,null,null,null," "]
[null,null,null,null,null,null," "]
[null,null,null,null,null,null," "]
[null,null,null,null,null,null," "]
[null,null,null,null,null,null," "]
[null,null,null,null,null,null," "]
[null,null,null,null,null,null," "]
[null,null,null,null,null,null," "]
[null,null,null,null,null,null," "]
[null,null,null,null,null,null," "]
[null,null,null,null,null,null," "]
[null,null,null,null,null,null," "]
[null,null,null,null,null,null," "]
[null,null,null,null,null,null," "]
[null,null,null,null,null,null," "]
[null,null,null,null,null,null," "]
[null,null,null,null,null,null," "]
[null,null,null,null,null,null," "]
[null,null,null,null,null,null," "]
[null,null,null,null,null,null," "]
[null,null,null,null,null,null," "]
[null,null,null,null,null,null," "]
[null,null,null,null,null,null," "]
[null,null,null,null,null,null," "]
[null,null,null,null,null,null," "]
[null,null,null,null,null,null," "]
[null,null,null,null,null,null," "]
[null,null,null,null,null,null," "]
[null,null,null,null,null,null," "]
[null,null,null,null,null,null," "]
[null,null,null,null,null,null," "]
[null,null,null,null,null,null," "]
[null,null,null,null,null,null," "]
[null,null,null,null,null,null," "]
[null,null,null,null,null,null," "]
[null,null,null,null,null,null," "]
[null,null,null,null,null,null," "]
[null,null,null,null,null,null," "]
[null,null,null,null,null,null," "]
[null,null,null,null,null,null," "]
[null,null,null,null,null,null," "]
[null,null,null,null,null,null," "]
[null,null,null,null,null,null," "]
[null,null,null,null,null,null," "]
[null,null,null,null,null,null," "]
[null,null,null,null,null,null," "]
[null,null,null,null,null,null," "]
[null,null,null,null,null,null," "]
[null,null,null,null,null,null," "]
[null,null,null,null,null,null," "]
[null,null,null,null,null,null," "]
[null,null,null,null,null,null," "]
[null,null,null,null,null,null," "]
[null,null,null,null,null,null," "]
[null,null,null,null,null,null," "]
[null,null,null,null,null,null," "]
[null,null,null,null,null,null," "]
[null,null,null,null,null,null," "]
[null,null,null,null,null,null," "]
[null,null,null,null,null,null," "]
[null,null,null,null,null,null," "]
[null,null,null,null,null,null," "]
[null,null,null,null,null,null," "]
[null,null,null,null,null,null," "]
[null,null,null,null,null,null," "]
[null,null,null,null,null,null," "]
[null,null,null,null,null,null," "]
[null,null,null,null,null,null," "]
[null,null,null,null,null,null," "]
[null,null,null,null,null,null," "]
[null,null,null,null,null,null," "]
[null,null,null,null,null,null," "]
[null,null,null,null,null,null," "]
[null,null,null,null,null,null," "]
[null,null,null,null,null,null," "]
[null,null,null,null,null,null," "]
[null,null,null,null,null,null," "]
[null,null,null,null,null,null," "]
[null,null,null,null,null,null," "]
[null,null,null,null,null,null," "]
[null,null,null,null,null,null," "]
[null,null,null,null,null,null," "]
[null,null,null,null,null,null," "]
[null,null,null,null,null,null," "]
[null,null,null,null,null,null," "]
[null,null,null,null,null,null," "]
[null,null,null,null,null,null," "]
[null,null,null,null,null,null," "]
[null,null,null,null,null,null," "]
[null,null,null,null,null,null," "]
[null,null,null,null,null,null," "]
[null,null,null,null,null,null," "]
[null,null,null,null,null,null," "]
[null,null,null,null,null,null," "]
[null,null,null,null,null,null," "]
[null,null,null,null,null,null," "]
[null,null,null,null,null,null," "]
[null,null,null,null,null,null," "]
[null,null,null,null,null,null," "]
[null,null,null,null,null,null," "]
[null,null,null,null,null,null," "]
[null,null,null,null,null,null," "]
[null,null,null,null,null,null," "]
[null,null,null,null,null,null," "]
[null,null,null,null,null,null," "]
[null,null,null,null,null,null," "]
[null,null,null,null,null,null," "]
[null,null,null,null,null,null," "]
[null,null,null,null,null,null," "]
[null,null,null,null,null,null," "]
[null,null,null,null,null,null," "]
[null,null,null,null,null,null," "]
[null,null,null,null,null,null," "]
[null,null,null,null,null,null," "]
[null,null,null,null,null,null," "]
[null,null,null,null,null,null," "]
[null,null,null,null,null,null," "]
[null,null,null,null,null,null," "]
[null,null,null,null,null,null," "]
[null,null,null,null,null,null," "]
[null,null,null,null,null,null," "]
[null,null,null,null,null,null," "]
[null,null,null,null,null,null," "]
[null,null,null,null,null,null," "]
[null,null,null,null,null,null," "]
[null,null,null,null,null,null," "]
[null,null,null,null,null,null," "]
[null,null,null,null,null,null," "]
[null,null,null,null,null,null," "]
[null,null,null,null,null,null," "]
[null,null,null,null,null,null," "]
[null,null,null,null,null,null," "]
[null,null,null,null,null,null," "]
[null,null,null,null,null,null," "]
[null,null,null,null,null,null," "]

{"sheet":"01-08-2019","index":3,"n_rows":493,"n_cols":32,"rows_kept":493,"cut":false,"hidden":false,"merged":[[0,19,0,24]]}
["Other","App. Date","Name","Surname","Pasaport No.","Date of birth","Note of status","Price $","Paid $","Route","Unpaid $","GT","Case of appl","TG.Gov",null,"رجــــوع","رجــــوع",null,null,"TOTAL"]
[null,null,null,null,null,null,null,null,{"$f":"IF(J2<>\"\",\"\",H2)","v":0},null,{"$f":"IF(AND(I2=\"\",J2<>\"\"),H2,\"\")","v":""},{"$f":"IF(C2=\"\",\"\",25)","v":""},"Not extractor",{"$f":"IF(M2=\"Extractor\",62.5,0)","v":0}]
[null,null,null,null,null,null,null,null,0,null,"",{"$f":"IF(C3=\"\",\"\",25)","v":""},null,{"$f":"IF(M3=\"Extractor\",62.5,0)","v":0},null,null,null,"DONE",null,"Total amount",null,"Net profit",null,"Route","Coun of Rout",null,"Total Unpaid",null,{"$f":"Noblanks(J2:J499)","v":""},null,"Note of status","Count of Mistake"]
[null,null,null,null,null,null,null,null,0,null,"","",null,0,null,null,null,"CANCELLED",null,{"$f":"SUM(H2:H70)","v":0},null,{"$f":"T4-V14","v":0},null,{"$f":"IF(ISERROR(INDEX($AC$3:$AC$70,MATCH(0,COUNTIF($X$3:X3,$AC$3:$AC$69),0))),\"\",INDEX($AC$3:$AC$69,MATCH(0,COUNTIF($X$3:X3,$AC$3:$AC$69),0)))","v":""},{"$f":"IF(X4=\"\",\"\",COUNTIF(J2:J100,X4))","v":""},null,{"$f":"IF(X4<>\"\",SUMPRODUCT(--($J$2:$J$69=X4),$K$2:$K$69),\"\")","v":""},{"$f":"IF(K2=\"\",\"\",J2)","v":""},{"$f":"Noblanks(J3:J500)","v":""},null,"MISTAKE IN DOB",{"$f":"COUNTIF(C2:C70,\"Mistake\")","v":0}]
[null,null,null,null,null,null,null,null,0,null,"","",null,0,null,null,null,"REFUSED",null,null,null,null,null,{"$f":"IF(ISERROR(INDEX($AC$3:$AC$70,MATCH(0,COUNTIF($X$3:X4,$AC$3:$AC$69),0))),\"\",INDEX($AC$3:$AC$69,MATCH(0,COUNTIF($X$3:X4,$AC$3:$AC$69),0)))","v":""},"",null,"",{"$f":"IF(K3=\"\",\"\",J3)","v":""},{"$f":"Noblanks(J4:J501)","v":""}]
[null,null,null,null,null,null,null,null,0,null,"","",null,0,null,null,null,"MISTAKE",null,"Total Paid",null,"Difrent amount",null,{"$f":"IF(ISERROR(INDEX($AC$3:$AC$70,MATCH(0,COUNTIF($X$3:X5,$AC$3:$AC$69),0))),\"\",INDEX($AC$3:$AC$69,MATCH(0,COUNTIF($X$3:X5,$AC$3:$AC$69),0)))","v":""},"",{"$f":"IF(K2=\"\",\"\",J2)","v":""},{"$f":"IF(X6<>\"\",SUMPRODUCT(--($J$2:$J$69=X6),$K$2:$K$69),\"\")","v":""},"",{"$f":"Noblanks(J5:J502)","v":""}]
[null,null,null,null,null,null,null,null,0,null,"","",null,0,null,null,null,"GREEN PASS.",null,{"$f":"SUM(I2:I70)","v":0},null,{"$f":"T4-(T7+T10)","v":0},null,{"$f":"IF(ISERROR(INDEX($AC$3:$AC$70,MATCH(0,COUNTIF($X$3:X6,$AC$3:$AC$69),0))),\"\",INDEX($AC$3:$AC$69,MATCH(0,COUNTIF($X$3:X6,$AC$3:$AC$69),0)))","v":""},{"$f":"IF(X7=\"\",\"\",COUNTIF(J5:J103,X7))","v":""},"",{"$f":"IF(X7<>\"\",SUMPRODUCT(--($J$2:$J$69=X7),$K$2:$K$69),\"\")","v":""},"",{"$f":"Noblanks(J6:J503)","v":""}]
[null,null,null,null,null,null,null,null,0,null,"","",null,0,null,null,null,null,null,null,null,null,null,{"$f":"IF(ISERROR(INDEX($AC$3:$AC$70,MATCH(0,COUNTIF($X$3:X7,$AC$3:$AC$69),0))),\"\",INDEX($AC$3:$AC$69,MATCH(0,COUNTIF($X$3:X7,$AC$3:$AC$69),0)))","v":""},{"$f":"IF(X8=\"\",\"\",COUNTIF(J6:J104,X8))","v":""},"","","",{"$f":"Noblanks(J7:J504)","v":""}]
[null,null,null,null,null,null,null,null,0,null,"","",null,0,null,null,null,"official time",null,"Total UnPaid",null,"No. of applicants",null,{"$f":"IF(ISERROR(INDEX($AC$3:$AC$70,MATCH(0,COUNTIF($X$3:X8,$AC$3:$AC$69),0))),\"\",INDEX($AC$3:$AC$69,MATCH(0,COUNTIF($X$3:X8,$AC$3:$AC$69),0)))","v":""},"","","","",{"$f":"Noblanks(J8:J505)","v":""}]
[null,null,null,null,null,null,null,null,0,null,"","",null,0,null,null,null,"official holiday",null,{"$f":"SUM(K2:K70)","v":0},null,{"$f":"COUNT(B:B)","v":0},null,{"$f":"IF(ISERROR(INDEX($AC$3:$AC$70,MATCH(0,COUNTIF($X$3:X9,$AC$3:$AC$69),0))),\"\",INDEX($AC$3:$AC$69,MATCH(0,COUNTIF($X$3:X9,$AC$3:$AC$69),0)))","v":""},"","","","",{"$f":"Noblanks(J9:J506)","v":""}]
[null,null,null,null,null,null,null,null,0,null,"","",null,0,null,null,null,"other",null,null,null,null,null,{"$f":"IF(ISERROR(INDEX($AC$3:$AC$70,MATCH(0,COUNTIF($X$3:X10,$AC$3:$AC$69),0))),\"\",INDEX($AC$3:$AC$69,MATCH(0,COUNTIF($X$3:X10,$AC$3:$AC$69),0)))","v":""},"","","","",{"$f":"Noblanks(J10:J507)","v":""}]
[null,null,null,null,null,null,null,null,0,null,"","",null,0,null,null,null,null,null,"Total GT",null,null,null,{"$f":"IF(ISERROR(INDEX($AC$3:$AC$70,MATCH(0,COUNTIF($X$3:X11,$AC$3:$AC$69),0))),\"\",INDEX($AC$3:$AC$69,MATCH(0,COUNTIF($X$3:X11,$AC$3:$AC$69),0)))","v":""},"","","","",{"$f":"Noblanks(J11:J508)","v":""}]
[null,null,null,null,null,null,null,null,0,null,"","",null,0,null,null,null,null,null,{"$f":"SUM(L2:L70)","v":0},null,"Cost amount",null,{"$f":"IF(ISERROR(INDEX($AC$3:$AC$70,MATCH(0,COUNTIF($X$3:X12,$AC$3:$AC$69),0))),\"\",INDEX($AC$3:$AC$69,MATCH(0,COUNTIF($X$3:X12,$AC$3:$AC$69),0)))","v":""},"","","","",{"$f":"Noblanks(J12:J509)","v":""}]
[null,null,null,null,null,null,null,null,0,null,"","",null,0,null,null,null,null,null,null,null,{"$f":"IF(AND(T13<>\"\",T16<>\"\"),T13+T16,\"\")","v":0},null,{"$f":"IF(ISERROR(INDEX($AC$3:$AC$70,MATCH(0,COUNTIF($X$3:X13,$AC$3:$AC$69),0))),\"\",INDEX($AC$3:$AC$69,MATCH(0,COUNTIF($X$3:X13,$AC$3:$AC$69),0)))","v":""},"","","","",{"$f":"Noblanks(J13:J510)","v":""}]
[null,null,null,null,null,null,null,null,0,null,"","",null,0,null,null,null,null,null,"Total T.Gov",null,null,null,{"$f":"IF(ISERROR(INDEX($AC$3:$AC$70,MATCH(0,COUNTIF($X$3:X14,$AC$3:$AC$69),0))),\"\",INDEX($AC$3:$AC$69,MATCH(0,COUNTIF($X$3:X14,$AC$3:$AC$69),0)))","v":""},"","","","",{"$f":"Noblanks(J14:J511)","v":""}]
[null,null,null,null,null,null,null," "," ",null,"","",null,0,null,null,null,null,null,{"$f":"SUM(N2:N70)","v":0},null,null,null,{"$f":"IF(ISERROR(INDEX($AC$3:$AC$70,MATCH(0,COUNTIF($X$3:X15,$AC$3:$AC$69),0))),\"\",INDEX($AC$3:$AC$69,MATCH(0,COUNTIF($X$3:X15,$AC$3:$AC$69),0)))","v":""},"","","","",{"$f":"Noblanks(J15:J512)","v":""}]
[null,null,null,null,null,null,null," "," ",null,{"$f":"IF(AND(I17=\"\",J17<>\"\"),H17,\"\")","v":""},"",null,0,null,null,null,null,null,null,null,null,null,{"$f":"IF(ISERROR(INDEX($AC$3:$AC$70,MATCH(0,COUNTIF($X$3:X16,$AC$3:$AC$69),0))),\"\",INDEX($AC$3:$AC$69,MATCH(0,COUNTIF($X$3:X16,$AC$3:$AC$69),0)))","v":""},"","","","",{"$f":"Noblanks(J16:J513)","v":""}]
[null,null,null,null,null,null," "," "," ",null,{"$f":"IF(AND(I18=\"\",J18<>\"\"),H18,\"\")","v":""},"",null,0,null,null,null,null,null,null,null,null,null,{"$f":"IF(ISERROR(INDEX($AC$3:$AC$70,MATCH(0,COUNTIF($X$3:X17,$AC$3:$AC$69),0))),\"\",INDEX($AC$3:$AC$69,MATCH(0,COUNTIF($X$3:X17,$AC$3:$AC$69),0)))","v":""},"","","","",{"$f":"Noblanks(J17:J514)","v":""}]
[null,null,null,null,null,null," "," "," ",null,"","",null,0,null,null,null,null,null,null,null,null,null,{"$f":"IF(ISERROR(INDEX($AC$3:$AC$70,MATCH(0,COUNTIF($X$3:X18,$AC$3:$AC$69),0))),\"\",INDEX($AC$3:$AC$69,MATCH(0,COUNTIF($X$3:X18,$AC$3:$AC$69),0)))","v":""},"","","","",{"$f":"Noblanks(J18:J515)","v":""}]
[null,null,null,null,null,null," "," "," ",null,"","",null,0,null,null,null,null,null,null,null,null,null,{"$f":"IF(ISERROR(INDEX($AC$3:$AC$70,MATCH(0,COUNTIF($X$3:X19,$AC$3:$AC$69),0))),\"\",INDEX($AC$3:$AC$69,MATCH(0,COUNTIF($X$3:X19,$AC$3:$AC$69),0)))","v":""},"","","","",{"$f":"Noblanks(J19:J516)","v":""}]
[null,null,null,null,null,null," ",null,0,null,"","",null,0,null,null,null,null,null,null,null,null,null,{"$f":"IF(ISERROR(INDEX($AC$3:$AC$70,MATCH(0,COUNTIF($X$3:X20,$AC$3:$AC$69),0))),\"\",INDEX($AC$3:$AC$69,MATCH(0,COUNTIF($X$3:X20,$AC$3:$AC$69),0)))","v":""},"","","","",{"$f":"Noblanks(J20:J517)","v":""}]
[null,null,null,null,null,null," ",null,0,null,"","",null,0,null,null,null,null,null,null,null,null,null,{"$f":"IF(ISERROR(INDEX($AC$3:$AC$70,MATCH(0,COUNTIF($X$3:X21,$AC$3:$AC$69),0))),\"\",INDEX($AC$3:$AC$69,MATCH(0,COUNTIF($X$3:X21,$AC$3:$AC$69),0)))","v":""},"","","","",{"$f":"Noblanks(J21:J518)","v":""},null,null,{"$f":"IFERROR(INDEX($J$2:$J$492,SMALL(IF($J$2:$J$492<>\"\",ROW($J$1:$J$492)-ROW($J$2)+1,\"\"),ROWS(AF$21:$AJ22))),\"\")","v":""}]
[null,null,null,null,null,null," ",null,0,null,"","",null,0,null,null,null,null,null,null,null,"Done",null,null,{"$f":"Noblanks(Z25:Z518)","v":""},null,{"$f":"IFERROR(INDEX($J$2:$J$492,SMALL(IF($J$2:$J$492<>\"\",ROW($J$1:$J$492)-ROW($J$2)+1,\"\"),ROWS(AF$21:$AJ23))),\"\")","v":""},"",{"$f":"Noblanks(J22:J519)","v":""}]
[null,null,null,null,null,null," ",null,0,null,"","",null,0,null,null,null,null,null,null,null,"Cancelled",null,null,null,{"$f":"IF(K20=\"\",\"\",J20)","v":""},null,"",{"$f":"Noblanks(J23:J520)","v":""},null,null,{"$f":"IFERROR(INDEX($J$2:$J$492,SMALL(IF($J$2:$J$492<>\"\",ROW($J$1:$J$492)-ROW($J$2)+1,\"\"),ROWS(AF$21:$AJ24))),\"\")","v":""}]
[null,null,null,null,null,null," ",null,0,null,"","",null,0,null,null,null,null,null,null,null,"Refused",null,null,null,"",null,"",{"$f":"Noblanks(J24:J521)","v":""},null,null,{"$f":"IFERROR(INDEX($J$2:$J$492,SMALL(IF($J$2:$J$492<>\"\",ROW($J$1:$J$492)-ROW($J$2)+1,\"\"),ROWS(AF$21:$AJ25))),\"\")","v":""}]
[null,null,null,null,null,null," ",null,0,null,"","",null,0,null,null,null,null,null,null,null,"Green pass.",null,null,null,"",null,"",{"$f":"Noblanks(J25:J522)","v":""}]
[null,null,null,null,null,null," ",null,0,null,"","",null,0,null,null,null,null,null,null,null,"Mistake",null,null,null,"",null,"",{"$f":"Noblanks(J26:J523)","v":""}]
[null,null,null,null,null,null," ",null,0,null,"","",null,0,null,null,null,null,null,null,null,null,null,null,null,"",null,"",{"$f":"Noblanks(J27:J524)","v":""}]
[null,null,null,null,null,null," ",null,0,null,"","",null,0,null,null,null,null,null,null,null,null,null,null,null,"",null,"",{"$f":"Noblanks(J28:J525)","v":""}]
[null,null,null,null,null,null," ",null,0,null,"","",null,0,null,null,null,null,null,null,null,null,null,null,null,"",null,"",{"$f":"Noblanks(J29:J526)","v":""}]
[null,null,null,null,null,null," ",null,0,null,"","",null,0,null,null,null,null,null,null,null,null,null,null,null,"",null,"",{"$f":"Noblanks(J30:J527)","v":""}]
[null,null,null,null,null,null," ",null,0,null,"","",null,0,null,null,null,null,null,null,null,null,null,null,null,"",null,"",{"$f":"Noblanks(J31:J528)","v":""}]
[null,null,null,null,null,null," ",null,0,null,"","",null,0,null,null,null,null,null,null,null,null,null,null,null,"",null,"",{"$f":"Noblanks(J32:J529)","v":""}]
[null,null,null,null,null,null," ",null,0,null,"","",null,0,null,null,null,null,null,null,null,null,null,null,null,"",null,"",{"$f":"Noblanks(J33:J530)","v":""}]
[null,null,null,null,null,null," ",null,0,null,"","",null,0,null,null,null,null,null,null,null,null,null,null,null,"",null,"",{"$f":"Noblanks(J34:J531)","v":""}]
[null,null,null,null,null,null," ",null,0,null,"","",null,0,null,null,null,null,null,null,null,null,null,null,null,"",null,"",{"$f":"Noblanks(J35:J532)","v":""}]
[null,null,null,null,null,null," ",null,0,null,"","",null,0,null,null,null,null,null,null,null,null,null,null,null,"",null,"",{"$f":"Noblanks(J36:J533)","v":""}]
[null,null,null,null,null,null," ",null,0,null,"","",null,0,null,null,null,null,null,null,null,null,null,null,null,"",null,"",{"$f":"Noblanks(J37:J534)","v":""}]
[null,null,null,null,null,null," ",null,0,null,"","",null,0,null,null,null,null,null,null,null,null,null,null,null,"",null,"",{"$f":"Noblanks(J38:J535)","v":""}]
[null,null,null,null,null,null," ",null,0,null,"","",null,0,null,null,null,null,null,null,null,null,null,null,null,"",null,"",{"$f":"Noblanks(J39:J536)","v":""}]
[null,null,null,null,null,null," ",null,0,null,"","",null,0,null,null,null,null,null,null,null,null,null,null,null,"",null,"",{"$f":"Noblanks(J40:J537)","v":""}]
[null,null,null,null,null,null," ",null,0,null,"","",null,0,null,null,null,null,null,null,null,null,null,null,null,"",null,"",{"$f":"Noblanks(J41:J538)","v":""}]
[null,null,null,null,null,null," ",null,0,null,"","",null,0,null,null,null,null,null,null,null,null,null,null,null,"",null,"",{"$f":"Noblanks(J42:J539)","v":""}]
[null,null,null,null,null,null," ",null,0,null,"","",null,0,null,null,null,null,null,null,null,null,null,null,null,"",null,"",{"$f":"Noblanks(J43:J540)","v":""}]
[null,null,null,null,null,null," ",null,0,null,"","",null,0,null,null,null,null,null,null,null,null,null,null,null,"",null,"",{"$f":"Noblanks(J44:J541)","v":""}]
[null,null,null,null,null,null," ",null,0,null,"","",null,0,null,null,null,null,null,null,null,null,null,null,null,"",null,"",{"$f":"Noblanks(J45:J542)","v":""}]
[null,null,null,null,null,null," ",null,0,null,"","",null,0,null,null,null,null,null,null,null,null,null,null,null,"",null,"",{"$f":"Noblanks(J46:J543)","v":""}]
[null,null,null,null,null,null," ",null,0,null,"","",null,0,null,null,null,null,null,null,null,null,null,null,null,"",null,"",{"$f":"Noblanks(J47:J544)","v":""}]
[null,null,null,null,null,null," ",null,0,null,"","",null,0,null,null,null,null,null,null,null,null,null,null,null,"",null,"",{"$f":"Noblanks(J48:J545)","v":""}]
[null,null,null,null,null,null," ",null,0,null,"","",null,0,null,null,null,null,null,null,null,null,null,null,null,"",null,"",{"$f":"Noblanks(J49:J546)","v":""}]
[null,null,null,null,null,null," ",null,0,null,"","",null,0,null,null,null,null,null,null,null,null,null,null,null,"",null,"",{"$f":"Noblanks(J50:J547)","v":""}]
[null,null,null,null,null,null," ",null,0,null,"","",null,0,null,null,null,null,null,null,null,null,null,null,null,"",null,"",{"$f":"Noblanks(J51:J548)","v":""}]
[null,null,null,null,null,null," ",null,0,null,"","",null,0,null,null,null,null,null,null,null,null,null,null,null,"",null,"",{"$f":"Noblanks(J52:J549)","v":""}]
[null,null,null,null,null,null," ",null,0,null,"","",null,0,null,null,null,null,null,null,null,null,null,null,null,"",null,"",{"$f":"Noblanks(J53:J550)","v":""}]
[null,null,null,null,null,null," ",null,0,null,"","",null,0,null,null,null,null,null,null,null,null,null,null,null,"",null,"",{"$f":"Noblanks(J54:J551)","v":""}]
[null,null,null,null,null,null," ",null,0,null,"","",null,0,null,null,null,null,null,null,null,null,null,null,null,"",null,"",{"$f":"Noblanks(J55:J552)","v":""}]
[null,null,null,null,null,null," ",null,0,null,"","",null,0,null,null,null,null,null,null,null,null,null,null,null,"",null,"",{"$f":"Noblanks(J56:J553)","v":""}]
[null,null,null,null,null,null," ",null,0,null,"","",null,0,null,null,null,null,null,null,null,null,null,null,null,"",null,"",{"$f":"Noblanks(J57:J554)","v":""}]
[null,null,null,null,null,null," ",null,0,null,"","",null,0,null,null,null,null,null,null,null,null,null,null,null,"",null,"",{"$f":"Noblanks(J58:J555)","v":""}]
[null,null,null,null,null,null," ",null,0,null,"","",null,0,null,null,null,null,null,null,null,null,null,null,null,"",null,"",{"$f":"Noblanks(J59:J556)","v":""}]
[null,null,null,null,null,null," ",null,0,null,"","",null,0,null,null,null,null,null,null,null,null,null,null,null,"",null,"",{"$f":"Noblanks(J60:J557)","v":""}]
[null,null,null,null,null,null," ",null,0,null,"","",null,0,null,null,null,null,null,null,null,null,null,null,null,"",null,"",{"$f":"Noblanks(J61:J558)","v":""}]
[null,null,null,null,null,null," ",null,0,null,"","",null,0,null,null,null,null,null,null,null,null,null,null,null,"",null,"",{"$f":"Noblanks(J62:J559)","v":""}]
[null,null,null,null,null,null," ",null,0,null,{"$f":"IF(AND(I64=\"\",J64<>\"\"),H64,\"\")","v":""},"",null,0,null,null,null,null,null,null,null,null,null,null,null,"",null,"",{"$f":"Noblanks(J63:J560)","v":""}]
[null,null,null,null,null,null," ",null,0,null,{"$f":"IF(AND(I65=\"\",J65<>\"\"),H65,\"\")","v":""},"",null,0,null,null,null,null,null,null,null,null,null,null,null,"",null,"",{"$f":"Noblanks(J64:J561)","v":""}]
[null,null,null,null,null,null," ",null,{"$f":"IF(J66<>\"\",\"\",H66)","v":0},null,"","",null,0,null,null,null,null,null,null,null,null,null,null,null,"",null,"",{"$f":"Noblanks(J65:J562)","v":""}]
[null,null,null,null,null,null," ",null,0,null,"",{"$f":"IF(C67=\"\",\"\",25)","v":""},null,{"$f":"IF(M67=\"Extractor\",62.5,0)","v":0},null,null,null,null,null,null,null,null,null,null,null,"",null,"",{"$f":"Noblanks(J66:J563)","v":""}]
[null,null,null,null,null,null," ",null,0,null,"","",null,0,null,null,null,null,null,null,null,null,null,null,null,"",null,"",{"$f":"Noblanks(J67:J564)","v":""}]
[null,null,null,null,null,null," ",null,0,null,"","",null,0,null,null,null,null,null,null,null,null,null,null,null,"",null,{"$f":"IF(K67=\"\",\"\",J67)","v":""},{"$f":"Noblanks(J68:J565)","v":""}]
[null,null,null,null,null,null," ",null,0,null,"","",null,0,null,null,null,null,null,null,null,null,null,null,null,"",null,"",{"$f":"Noblanks(J69:J566)","v":""}]
[null,null,null,null,null,null," "," ",null,null,null,null,null,null,null,null,null,null,null,null,null,null,null,null,null,"",null,"",{"$f":"Noblanks(J70:J567)","v":""}]
[null,null,null,null,null,null," "," ",null,null,null,null,null,null,null,null,null,null,null,null,null,null,null,null,null,"",null,null,{"$f":"Noblanks(J71:J568)","v":""}]
[null,null,null,null,null,null," "," ",null,null,null,null,null,null,null,null,null,null,null,null,null,null,null,null,null,"",null,null,{"$f":"Noblanks(J72:J569)","v":""}]
[null,null,null,null,null,null," "," ",null,null,null,null,null,null,null,null,null,null,null,null,null,null,null,null,null,"",null,null,{"$f":"Noblanks(J73:J570)","v":""}]
[null,null,null,null,null,null," "," ",null,null,null,null,null,null,null,null,null,null,null,null,null,null,null,null,null,"",null,null,{"$f":"Noblanks(J74:J571)","v":""}]
[null,null,null,null,null,null," "," ",null,null,null,null,null,null,null,null,null,null,null,null,null,null,null,null,null,"",null,null,{"$f":"Noblanks(J75:J572)","v":""}]
[null,null,null,null,null,null," "," ",null,null,null,null,null,null,null,null,null,null,null,null,null,null,null,null,null,"",null,null,{"$f":"Noblanks(J76:J573)","v":""}]
[null,null,null,null,null,null," "," ",null,null,null,null,null,null,null,null,null,null,null,null,null,null,null,null,null,"",null,null,{"$f":"Noblanks(J77:J574)","v":""}]
[null,null,null,null,null,null," "," ",null,null,null,null,null,null,null,null,null,null,null,null,null,null,null,null,null,"",null,null,{"$f":"Noblanks(J78:J575)","v":""}]
[null,null,null,null,null,null," "," ",null,null,null,null,null,null,null,null,null,null,null,null,null,null,null,null,null,"",null,null,{"$f":"Noblanks(J79:J576)","v":""}]
[null,null,null,null,null,null," "," ",null,null,null,null,null,null,null,null,null,null,null,null,null,null,null,null,null,"",null,null,{"$f":"Noblanks(J80:J577)","v":""}]
[null,null,null,null,null,null," "," ",null,null,null,null,null,null,null,null,null,null,null,null,null,null,null,null,null,"",null,null,{"$f":"Noblanks(J81:J578)","v":""}]
[null,null,null,null,null,null," "," ",null,null,null,null,null,null,null,null,null,null,null,null,null,null,null,null,null,"",null,null,{"$f":"Noblanks(J82:J579)","v":""}]
[null,null,null,null,null,null," "," ",null,null,null,null,null,null,null,null,null,null,null,null,null,null,null,null,null,"",null,null,{"$f":"Noblanks(J83:J580)","v":""}]
[null,null,null,null,null,null," "," ",null,null,null,null,null,null,null,null,null,null,null,null,null,null,null,null,null,"",null,null,{"$f":"Noblanks(J84:J581)","v":""}]
[null,null,null,null,null,null," "," ",null,null,null,null,null,null,null,null,null,null,null,null,null,null,null,null,null,"",null,null,{"$f":"Noblanks(J85:J582)","v":""}]
[null,null,null,null,null,null," "," ",null,null,null,null,null,null,null,null,null,null,null,null,null,null,null,null,null,"",null,null,{"$f":"Noblanks(J86:J583)","v":""}]
[null,null,null,null,null,null," "," ",null,null,null,null,null,null,null,null,null,null,null,null,null,null,null,null,null,{"$f":"IF(K84=\"\",\"\",J84)","v":""},null,null,{"$f":"Noblanks(J87:J584)","v":""}]
[null,null,null,null,null,null," "," ",null,null,null,null,null,null,null,null,null,null,null,null,null,null,null,null,null,"",null,null,{"$f":"Noblanks(J88:J585)","v":""}]
[null,null,null,null,null,null," "," ",null,null,null,null,null,null,null,null,null,null,null,null,null,null,null,null,null,"",null,null,{"$f":"Noblanks(J89:J586)","v":""}]
[null,null,null,null,null,null," "," ",null,null,null,null,null,null,null,null,null,null,null,null,null,null,null,null,null,"",null,null,{"$f":"Noblanks(J90:J587)","v":""}]
[null,null,null,null,null,null," "," ",null,null,null,null,null,null,null,null,null,null,null,null,null,null,null,null,null,"",null,null,{"$f":"Noblanks(J91:J588)","v":""}]
[null,null,null,null,null,null," "," ",null,null,null,null,null,null,null,null,null,null,null,null,null,null,null,null,null,"",null,null,{"$f":"Noblanks(J92:J589)","v":""}]
[null,null,null,null,null,null," ",null,null,null,null,null,null,null,null,null,null,null,null,null,null,null,null,null,null,"",null,null,{"$f":"Noblanks(J93:J590)","v":""}]
[null,null,null,null,null,null," ",null,null,null,null,null,null,null,null,null,null,null,null,null,null,null,null,null,null,"",null,null,{"$f":"Noblanks(J94:J591)","v":""}]
[null,null,null,null,null,null," ",null,null,null,null,null,null,null,null,null,null,null,null,null,null,null,null,null,null,"",null,null,{"$f":"Noblanks(J95:J592)","v":""}]
[null,null,null,null,null,null," ",null,null,null,null,null,null,null,null,null,null,null,null,null,null,null,null,null,null,"",null,null,{"$f":"Noblanks(J96:J593)","v":""}]
[null,null,null,null,null,null," ",null,null,null,null,null,null,null,null,null,null,null,null,null,null,null,null,null,null,"",null,null,{"$f":"Noblanks(J97:J594)","v":""}]
[null,null,null,null,null,null," ",null,null,null,null,null,null,null,null,null,null,null,null,null,null,null,null,null,null,"",null,null,{"$f":"Noblanks(J98:J595)","v":""}]
[null,null,null,null,null,null," ",null,null,null,null,null,null,null,null,null,null,null,null,null,null,null,null,null,null,"",null,null,{"$f":"Noblanks(J99:J596)","v":""}]
[null,null,null,null,null,null," ",null,null,null,null,null,null,null,null,null,null,null,null,null,null,null,null,null,null,"",null,null,{"$f":"Noblanks(J100:J597)","v":""}]
[null,null,null,null,null,null," ",null,null,null,null,null,null,null,null,null,null,null,null,null,null,null,null,null,null,"",null,null,{"$f":"Noblanks(J101:J598)","v":""}]
[null,null,null,null,null,null," ",null,null,null,null,null,null,null,null,null,null,null,null,null,null,null,null,null,null,null,null,null,{"$f":"Noblanks(J102:J599)","v":""}]
[null,null,null,null,null,null," ",null,null,null,null,null,null,null,null,null,null,null,null,null,null,null,null,null,null,null,null,null,{"$f":"Noblanks(J103:J600)","v":""}]
[null,null,null,null,null,null," ",null,null,null,null,null,null,null,null,null,null,null,null,null,null,null,null,null,null,null,null,null,{"$f":"Noblanks(J104:J601)","v":""}]
[null,null,null,null,null,null," ",null,null,null,null,null,null,null,null,null,null,null,null,null,null,null,null,null,null,null,null,null,{"$f":"Noblanks(J105:J602)","v":""}]
[null,null,null,null,null,null," ",null,null,null,null,null,null,null,null,null,null,null,null,null,null,null,null,null,null,null,null,null,{"$f":"Noblanks(J106:J603)","v":""}]
[null,null,null,null,null,null," ",null,null,null,null,null,null,null,null,null,null,null,null,null,null,null,null,null,null,null,null,null,{"$f":"Noblanks(J107:J604)","v":""}]
[null,null,null,null,null,null," ",null,null,null,null,null,null,null,null,null,null,null,null,null,null,null,null,null,null,null,null,null,{"$f":"Noblanks(J108:J605)","v":""}]
[null,null,null,null,null,null," ",null,null,null,null,null,null,null,null,null,null,null,null,null,null,null,null,null,null,null,null,null,{"$f":"Noblanks(J109:J606)","v":""}]
[null,null,null,null,null,null," ",null,null,null,null,null,null,null,null,null,null,null,null,null,null,null,null,null,null,null,null,null,{"$f":"Noblanks(J110:J607)","v":""}]
[null,null,null,null,null,null," ",null,null,null,null,null,null,null,null,null,null,null,null,null,null,null,null,null,null,null,null,null,{"$f":"Noblanks(J111:J608)","v":""}]
[null,null,null,null,null,null," ",null,null,null,null,null,null,null,null,null,null,null,null,null,null,null,null,null,null,null,null,null,{"$f":"Noblanks(J112:J609)","v":""}]
[null,null,null,null,null,null," ",null,null,null,null,null,null,null,null,null,null,null,null,null,null,null,null,null,null,null,null,null,{"$f":"Noblanks(J113:J610)","v":""}]
[null,null,null,null,null,null," ",null,null,null,null,null,null,null,null,null,null,null,null,null,null,null,null,null,null,null,null,null,{"$f":"Noblanks(J114:J611)","v":""}]
[null,null,null,null,null,null," ",null,null,null,null,null,null,null,null,null,null,null,null,null,null,null,null,null,null,null,null,null,{"$f":"Noblanks(J115:J612)","v":""}]
[null,null,null,null,null,null," ",null,null,null,null,null,null,null,null,null,null,null,null,null,null,null,null,null,null,null,null,null,{"$f":"Noblanks(J116:J613)","v":""}]
[null,null,null,null,null,null," ",null,null,null,null,null,null,null,null,null,null,null,null,null,null,null,null,null,null,null,null,null,{"$f":"Noblanks(J117:J614)","v":""}]
[null,null,null,null,null,null," ",null,null,null,null,null,null,null,null,null,null,null,null,null,null,null,null,null,null,null,null,null,{"$f":"Noblanks(J118:J615)","v":""}]
[null,null,null,null,null,null," ",null,null,null,null,null,null,null,null,null,null,null,null,null,null,null,null,null,null,null,null,null,{"$f":"Noblanks(J119:J616)","v":""}]
[null,null,null,null,null,null," ",null,null,null,null,null,null,null,null,null,null,null,null,null,null,null,null,null,null,null,null,null,{"$f":"Noblanks(J120:J617)","v":""}]
[null,null,null,null,null,null," ",null,null,null,null,null,null,null,null,null,null,null,null,null,null,null,null,null,null,null,null,null,{"$f":"Noblanks(J121:J618)","v":""}]
[null,null,null,null,null,null," ",null,null,null,null,null,null,null,null,null,null,null,null,null,null,null,null,null,null,null,null,null,{"$f":"Noblanks(J122:J619)","v":""}]
[null,null,null,null,null,null," ",null,null,null,null,null,null,null,null,null,null,null,null,null,null,null,null,null,null,null,null,null,{"$f":"Noblanks(J123:J620)","v":""}]
[null,null,null,null,null,null," ",null,null,null,null,null,null,null,null,null,null,null,null,null,null,null,null,null,null,null,null,null,{"$f":"Noblanks(J124:J621)","v":""}]
[null,null,null,null,null,null," ",null,null,null,null,null,null,null,null,null,null,null,null,null,null,null,null,null,null,null,null,null,{"$f":"Noblanks(J125:J622)","v":""}]
[null,null,null,null,null,null," ",null,null,null,null,null,null,null,null,null,null,null,null,null,null,null,null,null,null,null,null,null,{"$f":"Noblanks(J126:J623)","v":""}]
[null,null,null,null,null,null," ",null,null,null,null,null,null,null,null,null,null,null,null,null,null,null,null,null,null,null,null,null,{"$f":"Noblanks(J127:J624)","v":""}]
[null,null,null,null,null,null," ",null,null,null,null,null,null,null,null,null,null,null,null,null,null,null,null,null,null,null,null,null,{"$f":"Noblanks(J128:J625)","v":""}]
[null,null,null,null,null,null," ",null,null,null,null,null,null,null,null,null,null,null,null,null,null,null,null,null,null,null,null,null,{"$f":"Noblanks(J129:J626)","v":""}]
[null,null,null,null,null,null," ",null,null,null,null,null,null,null,null,null,null,null,null,null,null,null,null,null,null,null,null,null,{"$f":"Noblanks(J130:J627)","v":""}]
[null,null,null,null,null,null," ",null,null,null,null,null,null,null,null,null,null,null,null,null,null,null,null,null,null,null,null,null,{"$f":"Noblanks(J131:J628)","v":""}]
[null,null,null,null,null,null," ",null,null,null,null,null,null,null,null,null,null,null,null,null,null,null,null,null,null,null,null,null,{"$f":"Noblanks(J132:J629)","v":""}]
[null,null,null,null,null,null," ",null,null,null,null,null,null,null,null,null,null,null,null,null,null,null,null,null,null,null,null,null,{"$f":"Noblanks(J133:J630)","v":""}]
[null,null,null,null,null,null," ",null,null,null,null,null,null,null,null,null,null,null,null,null,null,null,null,null,null,null,null,null,{"$f":"Noblanks(J134:J631)","v":""}]
[null,null,null,null,null,null," ",null,null,null,null,null,null,null,null,null,null,null,null,null,null,null,null,null,null,null,null,null,{"$f":"Noblanks(J135:J632)","v":""}]
[null,null,null,null,null,null," ",null,null,null,null,null,null,null,null,null,null,null,null,null,null,null,null,null,null,null,null,null,{"$f":"Noblanks(J136:J633)","v":""}]
[null,null,null,null,null,null," ",null,null,null,null,null,null,null,null,null,null,null,null,null,null,null,null,null,null,null,null,null,{"$f":"Noblanks(J137:J634)","v":""}]
[null,null,null,null,null,null," ",null,null,null,null,null,null,null,null,null,null,null,null,null,null,null,null,null,null,null,null,null,{"$f":"Noblanks(J138:J635)","v":""}]
[null,null,null,null,null,null," ",null,null,null,null,null,null,null,null,null,null,null,null,null,null,null,null,null,null,null,null,null,{"$f":"Noblanks(J139:J636)","v":""}]
[null,null,null,null,null,null," ",null,null,null,null,null,null,null,null,null,null,null,null,null,null,null,null,null,null,null,null,null,{"$f":"Noblanks(J140:J637)","v":""}]
[null,null,null,null,null,null," ",null,null,null,null,null,null,null,null,null,null,null,null,null,null,null,null,null,null,null,null,null,{"$f":"Noblanks(J141:J638)","v":""}]
[null,null,null,null,null,null," ",null,null,null,null,null,null,null,null,null,null,null,null,null,null,null,null,null,null,null,null,null,{"$f":"Noblanks(J142:J639)","v":""}]
[null,null,null,null,null,null," ",null,null,null,null,null,null,null,null,null,null,null,null,null,null,null,null,null,null,null,null,null,{"$f":"Noblanks(J143:J640)","v":""}]
[null,null,null,null,null,null," ",null,null,null,null,null,null,null,null,null,null,null,null,null,null,null,null,null,null,null,null,null,{"$f":"Noblanks(J144:J641)","v":""}]
[null,null,null,null,null,null," ",null,null,null,null,null,null,null,null,null,null,null,null,null,null,null,null,null,null,null,null,null,{"$f":"Noblanks(J145:J642)","v":""}]
[null,null,null,null,null,null," ",null,null,null,null,null,null,null,null,null,null,null,null,null,null,null,null,null,null,null,null,null,{"$f":"Noblanks(J146:J643)","v":""}]
[null,null,null,null,null,null," ",null,null,null,null,null,null,null,null,null,null,null,null,null,null,null,null,null,null,null,null,null,{"$f":"Noblanks(J147:J644)","v":""}]
[null,null,null,null,null,null," ",null,null,null,null,null,null,null,null,null,null,null,null,null,null,null,null,null,null,null,null,null,{"$f":"Noblanks(J148:J645)","v":""}]
[null,null,null,null,null,null," ",null,null,null,null,null,null,null,null,null,null,null,null,null,null,null,null,null,null,null,null,null,{"$f":"Noblanks(J149:J646)","v":""}]
[null,null,null,null,null,null," ",null,null,null,null,null,null,null,null,null,null,null,null,null,null,null,null,null,null,null,null,null,{"$f":"Noblanks(J150:J647)","v":""}]
[null,null,null,null,null,null," ",null,null,null,null,null,null,null,null,null,null,null,null,null,null,null,null,null,null,null,null,null,{"$f":"Noblanks(J151:J648)","v":""}]
[null,null,null,null,null,null," ",null,null,null,null,null,null,null,null,null,null,null,null,null,null,null,null,null,null,null,null,null,{"$f":"Noblanks(J152:J649)","v":""}]
[null,null,null,null,null,null," ",null,null,null,null,null,null,null,null,null,null,null,null,null,null,null,null,null,null,null,null,null,{"$f":"Noblanks(J153:J650)","v":""}]
[null,null,null,null,null,null," ",null,null,null,null,null,null,null,null,null,null,null,null,null,null,null,null,null,null,null,null,null,{"$f":"Noblanks(J154:J651)","v":""}]
[null,null,null,null,null,null," ",null,null,null,null,null,null,null,null,null,null,null,null,null,null,null,null,null,null,null,null,null,{"$f":"Noblanks(J155:J652)","v":""}]
[null,null,null,null,null,null," ",null,null,null,null,null,null,null,null,null,null,null,null,null,null,null,null,null,null,null,null,null,{"$f":"Noblanks(J156:J653)","v":""}]
[null,null,null,null,null,null," ",null,null,null,null,null,null,null,null,null,null,null,null,null,null,null,null,null,null,null,null,null,{"$f":"Noblanks(J157:J654)","v":""}]
[null,null,null,null,null,null," ",null,null,null,null,null,null,null,null,null,null,null,null,null,null,null,null,null,null,null,null,null,{"$f":"Noblanks(J158:J655)","v":""}]
[null,null,null,null,null,null," ",null,null,null,null,null,null,null,null,null,null,null,null,null,null,null,null,null,null,null,null,null,{"$f":"Noblanks(J159:J656)","v":""}]
[null,null,null,null,null,null," ",null,null,null,null,null,null,null,null,null,null,null,null,null,null,null,null,null,null,null,null,null,{"$f":"Noblanks(J160:J657)","v":""}]
[null,null,null,null,null,null," ",null,null,null,null,null,null,null,null,null,null,null,null,null,null,null,null,null,null,null,null,null,{"$f":"Noblanks(J161:J658)","v":""}]
[null,null,null,null,null,null," ",null,null,null,null,null,null,null,null,null,null,null,null,null,null,null,null,null,null,null,null,null,{"$f":"Noblanks(J162:J659)","v":""}]
[null,null,null,null,null,null," ",null,null,null,null,null,null,null,null,null,null,null,null,null,null,null,null,null,null,null,null,null,{"$f":"Noblanks(J163:J660)","v":""}]
[null,null,null,null,null,null," ",null,null,null,null,null,null,null,null,null,null,null,null,null,null,null,null,null,null,null,null,null,{"$f":"Noblanks(J164:J661)","v":""}]
[null,null,null,null,null,null," ",null,null,null,null,null,null,null,null,null,null,null,null,null,null,null,null,null,null,null,null,null,{"$f":"Noblanks(J165:J662)","v":""}]
[null,null,null,null,null,null," ",null,null,null,null,null,null,null,null,null,null,null,null,null,null,null,null,null,null,null,null,null,{"$f":"Noblanks(J166:J663)","v":""}]
[null,null,null,null,null,null," ",null,null,null,null,null,null,null,null,null,null,null,null,null,null,null,null,null,null,null,null,null,{"$f":"Noblanks(J167:J664)","v":""}]
[null,null,null,null,null,null," ",null,null,null,null,null,null,null,null,null,null,null,null,null,null,null,null,null,null,null,null,null,{"$f":"Noblanks(J168:J665)","v":""}]
[null,null,null,null,null,null," ",null,null,null,null,null,null,null,null,null,null,null,null,null,null,null,null,null,null,null,null,null,{"$f":"Noblanks(J169:J666)","v":""}]
[null,null,null,null,null,null," ",null,null,null,null,null,null,null,null,null,null,null,null,null,null,null,null,null,null,null,null,null,{"$f":"Noblanks(J170:J667)","v":""}]
[null,null,null,null,null,null," ",null,null,null,null,null,null,null,null,null,null,null,null,null,null,null,null,null,null,null,null,null,{"$f":"Noblanks(J171:J668)","v":""}]
[null,null,null,null,null,null," ",null,null,null,null,null,null,null,null,null,null,null,null,null,null,null,null,null,null,null,null,null,{"$f":"Noblanks(J172:J669)","v":""}]
[null,null,null,null,null,null," ",null,null,null,null,null,null,null,null,null,null,null,null,null,null,null,null,null,null,null,null,null,{"$f":"Noblanks(J173:J670)","v":""}]
[null,null,null,null,null,null," ",null,null,null,null,null,null,null,null,null,null,null,null,null,null,null,null,null,null,null,null,null,{"$f":"Noblanks(J174:J671)","v":""}]
[null,null,null,null,null,null," ",null,null,null,null,null,null,null,null,null,null,null,null,null,null,null,null,null,null,null,null,null,{"$f":"Noblanks(J175:J672)","v":""}]
[null,null,null,null,null,null," ",null,null,null,null,null,null,null,null,null,null,null,null,null,null,null,null,null,null,null,null,null,{"$f":"Noblanks(J176:J673)","v":""}]
[null,null,null,null,null,null," ",null,null,null,null,null,null,null,null,null,null,null,null,null,null,null,null,null,null,null,null,null,{"$f":"Noblanks(J177:J674)","v":""}]
[null,null,null,null,null,null," ",null,null,null,null,null,null,null,null,null,null,null,null,null,null,null,null,null,null,null,null,null,{"$f":"Noblanks(J178:J675)","v":""}]
[null,null,null,null,null,null," ",null,null,null,null,null,null,null,null,null,null,null,null,null,null,null,null,null,null,null,null,null,{"$f":"Noblanks(J179:J676)","v":""}]
[null,null,null,null,null,null," ",null,null,null,null,null,null,null,null,null,null,null,null,null,null,null,null,null,null,null,null,null,{"$f":"Noblanks(J180:J677)","v":""}]
[null,null,null,null,null,null," ",null,null,null,null,null,null,null,null,null,null,null,null,null,null,null,null,null,null,null,null,null,{"$f":"Noblanks(J181:J678)","v":""}]
[null,null,null,null,null,null," ",null,null,null,null,null,null,null,null,null,null,null,null,null,null,null,null,null,null,null,null,null,{"$f":"Noblanks(J182:J679)","v":""}]
[null,null,null,null,null,null," ",null,null,null,null,null,null,null,null,null,null,null,null,null,null,null,null,null,null,null,null,null,{"$f":"Noblanks(J183:J680)","v":""}]
[null,null,null,null,null,null," ",null,null,null,null,null,null,null,null,null,null,null,null,null,null,null,null,null,null,null,null,null,{"$f":"Noblanks(J184:J681)","v":""}]
[null,null,null,null,null,null," ",null,null,null,null,null,null,null,null,null,null,null,null,null,null,null,null,null,null,null,null,null,{"$f":"Noblanks(J185:J682)","v":""}]
[null,null,null,null,null,null," ",null,null,null,null,null,null,null,null,null,null,null,null,null,null,null,null,null,null,null,null,null,{"$f":"Noblanks(J186:J683)","v":""}]
[null,null,null,null,null,null," ",null,null,null,null,null,null,null,null,null,null,null,null,null,null,null,null,null,null,null,null,null,{"$f":"Noblanks(J187:J684)","v":""}]
[null,null,null,null,null,null," ",null,null,null,null,null,null,null,null,null,null,null,null,null,null,null,null,null,null,null,null,null,{"$f":"Noblanks(J188:J685)","v":""}]
[null,null,null,null,null,null," ",null,null,null,null,null,null,null,null,null,null,null,null,null,null,null,null,null,null,null,null,null,{"$f":"Noblanks(J189:J686)","v":""}]
[null,null,null,null,null,null," ",null,null,null,null,null,null,null,null,null,null,null,null,null,null,null,null,null,null,null,null,null,{"$f":"Noblanks(J190:J687)","v":""}]
[null,null,null,null,null,null," ",null,null,null,null,null,null,null,null,null,null,null,null,null,null,null,null,null,null,null,null,null,{"$f":"Noblanks(J191:J688)","v":""}]
[null,null,null,null,null,null," ",null,null,null,null,null,null,null,null,null,null,null,null,null,null,null,null,null,null,null,null,null,{"$f":"Noblanks(J192:J689)","v":""}]
[null,null,null,null,null,null," ",null,null,null,null,null,null,null,null,null,null,null,null,null,null,null,null,null,null,null,null,null,{"$f":"Noblanks(J193:J690)","v":""}]
[null,null,null,null,null,null," ",null,null,null,null,null,null,null,null,null,null,null,null,null,null,null,null,null,null,null,null,null,{"$f":"Noblanks(J194:J691)","v":""}]
[null,null,null,null,null,null," ",null,null,null,null,null,null,null,null,null,null,null,null,null,null,null,null,null,null,null,null,null,{"$f":"Noblanks(J195:J692)","v":""}]
[null,null,null,null,null,null," ",null,null,null,null,null,null,null,null,null,null,null,null,null,null,null,null,null,null,null,null,null,{"$f":"Noblanks(J196:J693)","v":""}]
[null,null,null,null,null,null," ",null,null,null,null,null,null,null,null,null,null,null,null,null,null,null,null,null,null,null,null,null,{"$f":"Noblanks(J197:J694)","v":""}]
[null,null,null,null,null,null," "]
[null,null,null,null,null,null," "]
[null,null,null,null,null,null," "]
[null,null,null,null,null,null," "]
[null,null,null,null,null,null," "]
[null,null,null,null,null,null," "]
[null,null,null,null,null,null," "]
[null,null,null,null,null,null," "]
[null,null,null,null,null,null," "]
[null,null,null,null,null,null," "]
[null,null,null,null,null,null," "]
[null,null,null,null,null,null," "]
[null,null,null,null,null,null," "]
[null,null,null,null,null,null," "]
[null,null,null,null,null,null," "]
[null,null,null,null,null,null," "]
[null,null,null,null,null,null," "]
[null,null,null,null,null,null," "]
[null,null,null,null,null,null," "]
[null,null,null,null,null,null," "]
[null,null,null,null,null,null," "]
[null,null,null,null,null,null," "]
[null,null,null,null,null,null," "]
[null,null,null,null,null,null," "]
[null,null,null,null,null,null," "]
[null,null,null,null,null,null," "]
[null,null,null,null,null,null," "]
[null,null,null,null,null,null," "]
[null,null,null,null,null,null," "]
[null,null,null,null,null,null," "]
[null,null,null,null,null,null," "]
[null,null,null,null,null,null," "]
[null,null,null,null,null,null," "]
[null,null,null,null,null,null," "]
[null,null,null,null,null,null," "]
[null,null,null,null,null,null," "]
[null,null,null,null,null,null," "]
[null,null,null,null,null,null," "]
[null,null,null,null,null,null," "]
[null,null,null,null,null,null," "]
[null,null,null,null,null,null," "]
[null,null,null,null,null,null," "]
[null,null,null,null,null,null," "]
[null,null,null,null,null,null," "]
[null,null,null,null,null,null," "]
[null,null,null,null,null,null," "]
[null,null,null,null,null,null," "]
[null,null,null,null,null,null," "]
[null,null,null,null,null,null," "]
[null,null,null,null,null,null," "]
[null,null,null,null,null,null," "]
[null,null,null,null,null,null," "]
[null,null,null,null,null,null," "]
[null,null,null,null,null,null," "]
[null,null,null,null,null,null," "]
[null,null,null,null,null,null," "]
[null,null,null,null,null,null," "]
[null,null,null,null,null,null," "]
[null,null,null,null,null,null," "]
[null,null,null,null,null,null," "]
[null,null,null,null,null,null," "]
[null,null,null,null,null,null," "]
[null,null,null,null,null,null," "]
[null,null,null,null,null,null," "]
[null,null,null,null,null,null," "]
[null,null,null,null,null,null," "]
[null,null,null,null,null,null," "]
[null,null,null,null,null,null," "]
[null,null,null,null,null,null," "]
[null,null,null,null,null,null," "]
[null,null,null,null,null,null," "]
[null,null,null,null,null,null," "]
[null,null,null,null,null,null," "]
[null,null,null,null,null,null," "]
[null,null,null,null,null,null," "]
[null,null,null,null,null,null," "]
[null,null,null,null,null,null," "]
[null,null,null,null,null,null," "]
[null,null,null,null,null,null," "]
[null,null,null,null,null,null," "]
[null,null,null,null,null,null," "]
[null,null,null,null,null,null," "]
[null,null,null,null,null,null," "]
[null,null,null,null,null,null," "]
[null,null,null,null,null,null," "]
[null,null,null,null,null,null," "]
[null,null,null,null,null,null," "]
[null,null,null,null,null,null," "]
[null,null,null,null,null,null," "]
[null,null,null,null,null,null," "]
[null,null,null,null,null,null," "]
[null,null,null,null,null,null," "]
[null,null,null,null,null,null," "]
[null,null,null,null,null,null," "]
[null,null,null,null,null,null," "]
[null,null,null,null,null,null," "]
[null,null,null,null,null,null," "]
[null,null,null,null,null,null," "]
[null,null,null,null,null,null," "]
[null,null,null,null,null,null," "]
[null,null,null,null,null,null," "]
[null,null,null,null,null,null," "]
[null,null,null,null,null,null," "]
[null,null,null,null,null,null," "]
[null,null,null,null,null,null," "]
[null,null,null,null,null,null," "]
[null,null,null,null,null,null," "]
[null,null,null,null,null,null," "]
[null,null,null,null,null,null," "]
[null,null,null,null,null,null," "]
[null,null,null,null,null,null," "]
[null,null,null,null,null,null," "]
[null,null,null,null,null,null," "]
[null,null,null,null,null,null," "]
[null,null,null,null,null,null," "]
[null,null,null,null,null,null," "]
[null,null,null,null,null,null," "]
[null,null,null,null,null,null," "]
[null,null,null,null,null,null," "]
[null,null,null,null,null,null," "]
[null,null,null,null,null,null," "]
[null,null,null,null,null,null," "]
[null,null,null,null,null,null," "]
[null,null,null,null,null,null," "]
[null,null,null,null,null,null," "]
[null,null,null,null,null,null," "]
[null,null,null,null,null,null," "]
[null,null,null,null,null,null," "]
[null,null,null,null,null,null," "]
[null,null,null,null,null,null," "]
[null,null,null,null,null,null," "]
[null,null,null,null,null,null," "]
[null,null,null,null,null,null," "]
[null,null,null,null,null,null," "]
[null,null,null,null,null,null," "]
[null,null,null,null,null,null," "]
[null,null,null,null,null,null," "]
[null,null,null,null,null,null," "]
[null,null,null,null,null,null," "]
[null,null,null,null,null,null," "]
[null,null,null,null,null,null," "]
[null,null,null,null,null,null," "]
[null,null,null,null,null,null," "]
[null,null,null,null,null,null," "]
[null,null,null,null,null,null," "]
[null,null,null,null,null,null," "]
[null,null,null,null,null,null," "]
[null,null,null,null,null,null," "]
[null,null,null,null,null,null," "]
[null,null,null,null,null,null," "]
[null,null,null,null,null,null," "]
[null,null,null,null,null,null," "]
[null,null,null,null,null,null," "]
[null,null,null,null,null,null," "]
[null,null,null,null,null,null," "]
[null,null,null,null,null,null," "]
[null,null,null,null,null,null," "]
[null,null,null,null,null,null," "]
[null,null,null,null,null,null," "]
[null,null,null,null,null,null," "]
[null,null,null,null,null,null," "]
[null,null,null,null,null,null," "]
[null,null,null,null,null,null," "]
[null,null,null,null,null,null," "]
[null,null,null,null,null,null," "]
[null,null,null,null,null,null," "]
[null,null,null,null,null,null," "]
[null,null,null,null,null,null," "]
[null,null,null,null,null,null," "]
[null,null,null,null,null,null," "]
[null,null,null,null,null,null," "]
[null,null,null,null,null,null," "]
[null,null,null,null,null,null," "]
[null,null,null,null,null,null," "]
[null,null,null,null,null,null," "]
[null,null,null,null,null,null," "]
[null,null,null,null,null,null," "]
[null,null,null,null,null,null," "]
[null,null,null,null,null,null," "]
[null,null,null,null,null,null," "]
[null,null,null,null,null,null," "]
[null,null,null,null,null,null," "]
[null,null,null,null,null,null," "]
[null,null,null,null,null,null," "]
[null,null,null,null,null,null," "]
[null,null,null,null,null,null," "]
[null,null,null,null,null,null," "]
[null,null,null,null,null,null," "]
[null,null,null,null,null,null," "]
[null,null,null,null,null,null," "]
[null,null,null,null,null,null," "]
[null,null,null,null,null,null," "]
[null,null,null,null,null,null," "]
[null,null,null,null,null,null," "]
[null,null,null,null,null,null," "]
[null,null,null,null,null,null," "]
[null,null,null,null,null,null," "]
[null,null,null,null,null,null," "]
[null,null,null,null,null,null," "]
[null,null,null,null,null,null," "]
[null,null,null,null,null,null," "]
[null,null,null,null,null,null," "]
[null,null,null,null,null,null," "]
[null,null,null,null,null,null," "]
[null,null,null,null,null,null," "]
[null,null,null,null,null,null," "]
[null,null,null,null,null,null," "]
[null,null,null,null,null,null," "]
[null,null,null,null,null,null," "]
[null,null,null,null,null,null," "]
[null,null,null,null,null,null," "]
[null,null,null,null,null,null," "]
[null,null,null,null,null,null," "]
[null,null,null,null,null,null," "]
[null,null,null,null,null,null," "]
[null,null,null,null,null,null," "]
[null,null,null,null,null,null," "]
[null,null,null,null,null,null," "]
[null,null,null,null,null,null," "]
[null,null,null,null,null,null," "]
[null,null,null,null,null,null," "]
[null,null,null,null,null,null," "]
[null,null,null,null,null,null," "]
[null,null,null,null,null,null," "]
[null,null,null,null,null,null," "]
[null,null,null,null,null,null," "]
[null,null,null,null,null,null," "]
[null,null,null,null,null,null," "]
[null,null,null,null,null,null," "]
[null,null,null,null,null,null," "]
[null,null,null,null,null,null," "]
[null,null,null,null,null,null," "]
[null,null,null,null,null,null," "]
[null,null,null,null,null,null," "]
[null,null,null,null,null,null," "]
[null,null,null,null,null,null," "]
[null,null,null,null,null,null," "]
[null,null,null,null,null,null," "]
[null,null,null,null,null,null," "]
[null,null,null,null,null,null," "]
[null,null,null,null,null,null," "]
[null,null,null,null,null,null," "]
[null,null,null,null,null,null," "]
[null,null,null,null,null,null," "]
[null,null,null,null,null,null," "]
[null,null,null,null,null,null," "]
[null,null,null,null,null,null," "]
[null,null,null,null,null,null," "]
[null,null,null,null,null,null," "]
[null,null,null,null,null,null," "]
[null,null,null,null,null,null," "]
[null,null,null,null,null,null," "]
[null,null,null,null,null,null," "]
[null,null,null,null,null,null," "]
[null,null,null,null,null,null," "]
[null,null,null,null,null,null," "]
[null,null,null,null,null,null," "]
[null,null,null,null,null,null," "]
[null,null,null,null,null,null," "]
[null,null,null,null,null,null," "]
[null,null,null,null,null,null," "]
[null,null,null,null,null,null," "]
[null,null,null,null,null,null," "]
[null,null,null,null,null,null," "]
[null,null,null,null,null,null," "]
[null,null,null,null,null,null," "]
[null,null,null,null,null,null," "]
[null,null,null,null,null,null," "]
[null,null,null,null,null,null," "]
[null,null,null,null,null,null," "]
[null,null,null,null,null,null," "]
[null,null,null,null,null,null," "]
[null,null,null,null,null,null," "]
[null,null,null,null,null,null," "]
[null,null,null,null,null,null," "]
[null,null,null,null,null,null," "]
[null,null,null,null,null,null," "]
[null,null,null,null,null,null," "]
[null,null,null,null,null,null," "]
[null,null,null,null,null,null," "]
[null,null,null,null,null,null," "]
[null,null,null,null,null,null," "]
[null,null,null,null,null,null," "]
[null,null,null,null,null,null," "]
[null,null,null,null,null,null," "]
[null,null,null,null,null,null," "]
[null,null,null,null,null,null," "]
[null,null,null,null,null,null," "]
[null,null,null,null,null,null," "]
[null,null,null,null,null,null," "]
[null,null,null,null,null,null," "]
[null,null,null,null,null,null," "]
[null,null,null,null,null,null," "]
[null,null,null,null,null,null," "]
[null,null,null,null,null,null," "]

{"sheet":"03-08-2019","index":4,"n_rows":493,"n_cols":32,"rows_kept":493,"cut":false,"hidden":false,"merged":[[0,19,0,24]]}
["Official holiday","App. Date","Name","Surname","Pasaport No.","Date of birth","Note of status","Price $","Paid $","Route","Unpaid $","GT","Case of appl","TG.Gov",null,"رجــــوع","رجــــوع",null,null,"TOTAL"]
[null,null,null,null,null,null,null," ",{"$f":"IF(J2<>\"\",\"\",H2)","v":" "},null,{"$f":"IF(AND(I2=\"\",J2<>\"\"),H2,\"\")","v":""},25,"Not extractor",{"$f":"IF(M2=\"Extractor\",62.5,0)","v":0}]
[null,"2019-08-03",null,null,null,null,null," "," ",null,"",25,null,{"$f":"IF(M3=\"Extractor\",62.5,0)","v":0},null,null,null,"DONE",null,"Total amount",null,"Net profit",null,"Route","Coun of Rout",null,"Total Unpaid",null,{"$f":"Noblanks(J2:J499)","v":""},null,"Note of status","Count of Mistake"]
[null,null,null,null,null,"2012-02-02",null," "," ",null,"",25,null,0,null,null,null,"CANCELLED",null,{"$f":"SUM(H2:H69)","v":0},null,{"$f":"T4-V14","v":-1725},null,{"$f":"IF(ISERROR(INDEX($AC$3:$AC$70,MATCH(0,COUNTIF($X$3:X3,$AC$3:$AC$69),0))),\"\",INDEX($AC$3:$AC$69,MATCH(0,COUNTIF($X$3:X3,$AC$3:$AC$69),0)))","v":""},{"$f":"IF(X4=\"\",\"\",COUNTIF(J2:J100,X4))","v":""},null,{"$f":"IF(X4<>\"\",SUMPRODUCT(--($J$2:$J$69=X4),$K$2:$K$69),\"\")","v":""},{"$f":"IF(K2=\"\",\"\",J2)","v":""},{"$f":"Noblanks(J3:J500)","v":""},null,"MISTAKE IN DOB",{"$f":"COUNTIF(C2:C70,\"Mistake\")","v":0}]
[null,null,null,null,null,null,null," "," ",null,"",25,null,0,null,null,null,"REFUSED",null,null,null,null,null,{"$f":"IF(ISERROR(INDEX($AC$3:$AC$70,MATCH(0,COUNTIF($X$3:X4,$AC$3:$AC$69),0))),\"\",INDEX($AC$3:$AC$69,MATCH(0,COUNTIF($X$3:X4,$AC$3:$AC$69),0)))","v":""},"",null,"",{"$f":"IF(K3=\"\",\"\",J3)","v":""},{"$f":"Noblanks(J4:J501)","v":""}]
[null,null,null,null,null,null,null," "," ",null,"",25,null,0,null,null,null,"MISTAKE",null,"Total Paid",null,"Difrent amount",null,{"$f":"IF(ISERROR(INDEX($AC$3:$AC$70,MATCH(0,COUNTIF($X$3:X5,$AC$3:$AC$69),0))),\"\",INDEX($AC$3:$AC$69,MATCH(0,COUNTIF($X$3:X5,$AC$3:$AC$69),0)))","v":""},"",{"$f":"IF(K2=\"\",\"\",J2)","v":""},{"$f":"IF(X6<>\"\",SUMPRODUCT(--($J$2:$J$69=X6),$K$2:$K$69),\"\")","v":""},"",{"$f":"Noblanks(J5:J502)","v":""}]
[null,null,null,null,null,null,null," "," ",null,"",25,null,0,null,null,null,"GREEN PASS.",null,{"$f":"SUM(I2:I67)","v":0},null,{"$f":"T4-(T7+T10)","v":0},null,{"$f":"IF(ISERROR(INDEX($AC$3:$AC$70,MATCH(0,COUNTIF($X$3:X6,$AC$3:$AC$69),0))),\"\",INDEX($AC$3:$AC$69,MATCH(0,COUNTIF($X$3:X6,$AC$3:$AC$69),0)))","v":""},{"$f":"IF(X7=\"\",\"\",COUNTIF(J5:J103,X7))","v":""},"",{"$f":"IF(X7<>\"\",SUMPRODUCT(--($J$2:$J$69=X7),$K$2:$K$69),\"\")","v":""},"",{"$f":"Noblanks(J6:J503)","v":""}]
[null,null,null,null,null,null,null," "," ",null,"",25,null,0,null,null,null,null,null,null,null,null,null,{"$f":"IF(ISERROR(INDEX($AC$3:$AC$70,MATCH(0,COUNTIF($X$3:X7,$AC$3:$AC$69),0))),\"\",INDEX($AC$3:$AC$69,MATCH(0,COUNTIF($X$3:X7,$AC$3:$AC$69),0)))","v":""},{"$f":"IF(X8=\"\",\"\",COUNTIF(J6:J104,X8))","v":""},"","","",{"$f":"Noblanks(J7:J504)","v":""}]
[null,null,null,null,null,null,null," "," ",null,"",25,null,0,null,null,null,"official time",null,"Total UnPaid",null,"No. of applicants",null,{"$f":"IF(ISERROR(INDEX($AC$3:$AC$70,MATCH(0,COUNTIF($X$3:X8,$AC$3:$AC$69),0))),\"\",INDEX($AC$3:$AC$69,MATCH(0,COUNTIF($X$3:X8,$AC$3:$AC$69),0)))","v":""},"","","","",{"$f":"Noblanks(J8:J505)","v":""}]
[null,null,null,null,null,null,null," "," ",null,"",25,null,0,null,null,null,"official holiday",null,{"$f":"SUM(K4:K15)","v":0},null,{"$f":"COUNT(B:B)","v":1},null,{"$f":"IF(ISERROR(INDEX($AC$3:$AC$70,MATCH(0,COUNTIF($X$3:X9,$AC$3:$AC$69),0))),\"\",INDEX($AC$3:$AC$69,MATCH(0,COUNTIF($X$3:X9,$AC$3:$AC$69),0)))","v":""},"","","","",{"$f":"Noblanks(J9:J506)","v":""}]
[null,null,null,null,null,null,null," "," ",null,"",25,null,0,null,null,null,"other",null,null,null,null,null,{"$f":"IF(ISERROR(INDEX($AC$3:$AC$70,MATCH(0,COUNTIF($X$3:X10,$AC$3:$AC$69),0))),\"\",INDEX($AC$3:$AC$69,MATCH(0,COUNTIF($X$3:X10,$AC$3:$AC$69),0)))","v":""},"","","","",{"$f":"Noblanks(J10:J507)","v":""}]
[null,null,null,null,null,null,null," "," ",null,"",25,null,0,null,null,null,null,null,"Total GT",null,null,null,{"$f":"IF(ISERROR(INDEX($AC$3:$AC$70,MATCH(0,COUNTIF($X$3:X11,$AC$3:$AC$69),0))),\"\",INDEX($AC$3:$AC$69,MATCH(0,COUNTIF($X$3:X11,$AC$3:$AC$69),0)))","v":""},"","","","",{"$f":"Noblanks(J11:J508)","v":""}]
[null,null,null,null,null,null,null," "," ",null,"",25,null,0,null,null,null,null,null,{"$f":"SUM(L2:L70)","v":1725},null,"Cost amount",null,{"$f":"IF(ISERROR(INDEX($AC$3:$AC$70,MATCH(0,COUNTIF($X$3:X12,$AC$3:$AC$69),0))),\"\",INDEX($AC$3:$AC$69,MATCH(0,COUNTIF($X$3:X12,$AC$3:$AC$69),0)))","v":""},"","","","",{"$f":"Noblanks(J12:J509)","v":""}]
[null,null,null,null,null,null,null," "," ",null,"",25,null,0,null,null,null,null,null,null,null,{"$f":"IF(AND(T13<>\"\",T16<>\"\"),T13+T16,\"\")","v":1725},null,{"$f":"IF(ISERROR(INDEX($AC$3:$AC$70,MATCH(0,COUNTIF($X$3:X13,$AC$3:$AC$69),0))),\"\",INDEX($AC$3:$AC$69,MATCH(0,COUNTIF($X$3:X13,$AC$3:$AC$69),0)))","v":""},"","","","",{"$f":"Noblanks(J13:J510)","v":""}]
[null,null,null,null,null,null,null," "," ",null,"",25,null,0,null,null,null,null,null,"Total T.Gov",null,null,null,{"$f":"IF(ISERROR(INDEX($AC$3:$AC$70,MATCH(0,COUNTIF($X$3:X14,$AC$3:$AC$69),0))),\"\",INDEX($AC$3:$AC$69,MATCH(0,COUNTIF($X$3:X14,$AC$3:$AC$69),0)))","v":""},"","","","",{"$f":"Noblanks(J14:J511)","v":""}]
[null,null,null,null,null,null,null," "," ",null,"",25,null,0,null,null,null,null,null,{"$f":"SUM(N5:N73)","v":0},null,null,null,{"$f":"IF(ISERROR(INDEX($AC$3:$AC$70,MATCH(0,COUNTIF($X$3:X15,$AC$3:$AC$69),0))),\"\",INDEX($AC$3:$AC$69,MATCH(0,COUNTIF($X$3:X15,$AC$3:$AC$69),0)))","v":""},"","","","",{"$f":"Noblanks(J15:J512)","v":""}]
[null,null,null,null,null,null,null," "," ",null,{"$f":"IF(AND(I17=\"\",J17<>\"\"),H17,\"\")","v":""},25,null,0,null,null,null,null,null,null,null,null,null,{"$f":"IF(ISERROR(INDEX($AC$3:$AC$70,MATCH(0,COUNTIF($X$3:X16,$AC$3:$AC$69),0))),\"\",INDEX($AC$3:$AC$69,MATCH(0,COUNTIF($X$3:X16,$AC$3:$AC$69),0)))","v":""},"","","","",{"$f":"Noblanks(J16:J513)","v":""}]
[null,null,null,null,null,null," "," "," ",null,{"$f":"IF(AND(I18=\"\",J18<>\"\"),H18,\"\")","v":""},25,null,0,null,null,null,null,null,null,null,null,null,{"$f":"IF(ISERROR(INDEX($AC$3:$AC$70,MATCH(0,COUNTIF($X$3:X17,$AC$3:$AC$69),0))),\"\",INDEX($AC$3:$AC$69,MATCH(0,COUNTIF($X$3:X17,$AC$3:$AC$69),0)))","v":""},"","","","",{"$f":"Noblanks(J17:J514)","v":""}]
[null,null,null,null,null,null," "," "," ",null,"",25,null,0,null,null,null,null,null,null,null,null,null,{"$f":"IF(ISERROR(INDEX($AC$3:$AC$70,MATCH(0,COUNTIF($X$3:X18,$AC$3:$AC$69),0))),\"\",INDEX($AC$3:$AC$69,MATCH(0,COUNTIF($X$3:X18,$AC$3:$AC$69),0)))","v":""},"","","","",{"$f":"Noblanks(J18:J515)","v":""}]
[null,null,null,null,null,null," "," "," ",null,"",25,null,0,null,null,null,null,null,null,null,null,null,{"$f":"IF(ISERROR(INDEX($AC$3:$AC$70,MATCH(0,COUNTIF($X$3:X19,$AC$3:$AC$69),0))),\"\",INDEX($AC$3:$AC$69,MATCH(0,COUNTIF($X$3:X19,$AC$3:$AC$69),0)))","v":""},"","","","",{"$f":"Noblanks(J19:J516)","v":""}]
[null,null,null,null,null,null," ",null,0,null,"",25,null,0,null,null,null,null,null,null,null,null,null,{"$f":"IF(ISERROR(INDEX($AC$3:$AC$70,MATCH(0,COUNTIF($X$3:X20,$AC$3:$AC$69),0))),\"\",INDEX($AC$3:$AC$69,MATCH(0,COUNTIF($X$3:X20,$AC$3:$AC$69),0)))","v":""},"","","","",{"$f":"Noblanks(J20:J517)","v":""}]
[null,null,null,null,null,null," ",null,0,null,"",25,null,0,null,null,null,null,null,null,null,null,null,{"$f":"IF(ISERROR(INDEX($AC$3:$AC$70,MATCH(0,COUNTIF($X$3:X21,$AC$3:$AC$69),0))),\"\",INDEX($AC$3:$AC$69,MATCH(0,COUNTIF($X$3:X21,$AC$3:$AC$69),0)))","v":""},"","","","",{"$f":"Noblanks(J21:J518)","v":""},null,null,{"$f":"IFERROR(INDEX($J$2:$J$492,SMALL(IF($J$2:$J$492<>\"\",ROW($J$1:$J$492)-ROW($J$2)+1,\"\"),ROWS(AF$21:$AJ22))),\"\")","v":""}]
[null,null,null,null,null,null," ",null,0,null,"",25,null,0,null,null,null,null,null,null,null,"Done",null,null,{"$f":"Noblanks(Z25:Z518)","v":""},null,{"$f":"IFERROR(INDEX($J$2:$J$492,SMALL(IF($J$2:$J$492<>\"\",ROW($J$1:$J$492)-ROW($J$2)+1,\"\"),ROWS(AF$21:$AJ23))),\"\")","v":""},"",{"$f":"Noblanks(J22:J519)","v":""}]
[null,null,null,null,null,null," ",null,0,null,"",25,null,0,null,null,null,null,null,null,null,"Cancelled",null,null,null,{"$f":"IF(K20=\"\",\"\",J20)","v":""},null,"",{"$f":"Noblanks(J23:J520)","v":""},null,null,{"$f":"IFERROR(INDEX($J$2:$J$492,SMALL(IF($J$2:$J$492<>\"\",ROW($J$1:$J$492)-ROW($J$2)+1,\"\"),ROWS(AF$21:$AJ24))),\"\")","v":""}]
[null,null,null,null,null,null," ",null,0,null,"",25,null,0,null,null,null,null,null,null,null,"Refused",null,null,null,"",null,"",{"$f":"Noblanks(J24:J521)","v":""},null,null,{"$f":"IFERROR(INDEX($J$2:$J$492,SMALL(IF($J$2:$J$492<>\"\",ROW($J$1:$J$492)-ROW($J$2)+1,\"\"),ROWS(AF$21:$AJ25))),\"\")","v":""}]
[null,null,null,null,null,null," ",null,0,null,"",25,null,0,null,null,null,null,null,null,null,"Green pass.",null,null,null,"",null,"",{"$f":"Noblanks(J25:J522)","v":""}]
[null,null,null,null,null,null," ",null,0,null,"",25,null,0,null,null,null,null,null,null,null,"Mistake",null,null,null,"",null,"",{"$f":"Noblanks(J26:J523)","v":""}]
[null,null,null,null,null,null," ",null,0,null,"",25,null,0,null,null,null,null,null,null,null,null,null,null,null,"",null,"",{"$f":"Noblanks(J27:J524)","v":""}]
[null,null,null,null,null,null," ",null,0,null,"",25,null,0,null,null,null,null,null,null,null,null,null,null,null,"",null,"",{"$f":"Noblanks(J28:J525)","v":""}]
[null,null,null,null,null,null," ",null,0,null,"",25,null,0,null,null,null,null,null,null,null,null,null,null,null,"",null,"",{"$f":"Noblanks(J29:J526)","v":""}]
[null,null,null,null,null,null," ",null,0,null,"",25,null,0,null,null,null,null,null,null,null,null,null,null,null,"",null,"",{"$f":"Noblanks(J30:J527)","v":""}]
[null,null,null,null,null,null," ",null,0,null,"",25,null,0,null,null,null,null,null,null,null,null,null,null,null,"",null,"",{"$f":"Noblanks(J31:J528)","v":""}]
[null,null,null,null,null,null," ",null,0,null,"",25,null,0,null,null,null,null,null,null,null,null,null,null,null,"",null,"",{"$f":"Noblanks(J32:J529)","v":""}]
[null,null,null,null,null,null," ",null,0,null,"",25,null,0,null,null,null,null,null,null,null,null,null,null,null,"",null,"",{"$f":"Noblanks(J33:J530)","v":""}]
[null,null,null,null,null,null," ",null,0,null,"",25,null,0,null,null,null,null,null,null,null,null,null,null,null,"",null,"",{"$f":"Noblanks(J34:J531)","v":""}]
[null,null,null,null,null,null," ",null,0,null,"",25,null,0,null,null,null,null,null,null,null,null,null,null,null,"",null,"",{"$f":"Noblanks(J35:J532)","v":""}]
[null,null,null,null,null,null," ",null,0,null,"",25,null,0,null,null,null,null,null,null,null,null,null,null,null,"",null,"",{"$f":"Noblanks(J36:J533)","v":""}]
[null,null,null,null,null,null," ",null,0,null,"",25,null,0,null,null,null,null,null,null,null,null,null,null,null,"",null,"",{"$f":"Noblanks(J37:J534)","v":""}]
[null,null,null,null,null,null," ",null,0,null,"",25,null,0,null,null,null,null,null,null,null,null,null,null,null,"",null,"",{"$f":"Noblanks(J38:J535)","v":""}]
[null,null,null,null,null,null," ",null,0,null,"",25,null,0,null,null,null,null,null,null,null,null,null,null,null,"",null,"",{"$f":"Noblanks(J39:J536)","v":""}]
[null,null,null,null,null,null," ",null,0,null,"",25,null,0,null,null,null,null,null,null,null,null,null,null,null,"",null,"",{"$f":"Noblanks(J40:J537)","v":""}]
[null,null,null,null,null,null," ",null,0,null,"",25,null,0,null,null,null,null,null,null,null,null,null,null,null,"",null,"",{"$f":"Noblanks(J41:J538)","v":""}]
[null,null,null,null,null,null," ",null,0,null,"",25,null,0,null,null,null,null,null,null,null,null,null,null,null,"",null,"",{"$f":"Noblanks(J42:J539)","v":""}]
[null,null,null,null,null,null," ",null,0,null,"",25,null,0,null,null,null,null,null,null,null,null,null,null,null,"",null,"",{"$f":"Noblanks(J43:J540)","v":""}]
[null,null,null,null,null,null," ",null,0,null,"",25,null,0,null,null,null,null,null,null,null,null,null,null,null,"",null,"",{"$f":"Noblanks(J44:J541)","v":""}]
[null,null,null,null,null,null," ",null,0,null,"",25,null,0,null,null,null,null,null,null,null,null,null,null,null,"",null,"",{"$f":"Noblanks(J45:J542)","v":""}]
[null,null,null,null,null,null," ",null,0,null,"",25,null,0,null,null,null,null,null,null,null,null,null,null,null,"",null,"",{"$f":"Noblanks(J46:J543)","v":""}]
[null,null,null,null,null,null," ",null,0,null,"",25,null,0,null,null,null,null,null,null,null,null,null,null,null,"",null,"",{"$f":"Noblanks(J47:J544)","v":""}]
[null,null,null,null,null,null," ",null,0,null,"",25,null,0,null,null,null,null,null,null,null,null,null,null,null,"",null,"",{"$f":"Noblanks(J48:J545)","v":""}]
[null,null,null,null,null,null," ",null,0,null,"",25,null,0,null,null,null,null,null,null,null,null,null,null,null,"",null,"",{"$f":"Noblanks(J49:J546)","v":""}]
[null,null,null,null,null,null," ",null,0,null,"",25,null,0,null,null,null,null,null,null,null,null,null,null,null,"",null,"",{"$f":"Noblanks(J50:J547)","v":""}]
[null,null,null,null,null,null," ",null,0,null,"",25,null,0,null,null,null,null,null,null,null,null,null,null,null,"",null,"",{"$f":"Noblanks(J51:J548)","v":""}]
[null,null,null,null,null,null," ",null,0,null,"",25,null,0,null,null,null,null,null,null,null,null,null,null,null,"",null,"",{"$f":"Noblanks(J52:J549)","v":""}]
[null,null,null,null,null,null," ",null,0,null,"",25,null,0,null,null,null,null,null,null,null,null,null,null,null,"",null,"",{"$f":"Noblanks(J53:J550)","v":""}]
[null,null,null,null,null,null," ",null,0,null,"",25,null,0,null,null,null,null,null,null,null,null,null,null,null,"",null,"",{"$f":"Noblanks(J54:J551)","v":""}]
[null,null,null,null,null,null," ",null,0,null,"",25,null,0,null,null,null,null,null,null,null,null,null,null,null,"",null,"",{"$f":"Noblanks(J55:J552)","v":""}]
[null,null,null,null,null,null," ",null,0,null,"",25,null,0,null,null,null,null,null,null,null,null,null,null,null,"",null,"",{"$f":"Noblanks(J56:J553)","v":""}]
[null,null,null,null,null,null," ",null,0,null,"",25,null,0,null,null,null,null,null,null,null,null,null,null,null,"",null,"",{"$f":"Noblanks(J57:J554)","v":""}]
[null,null,null,null,null,null," ",null,0,null,"",25,null,0,null,null,null,null,null,null,null,null,null,null,null,"",null,"",{"$f":"Noblanks(J58:J555)","v":""}]
[null,null,null,null,null,null," ",null,0,null,"",25,null,0,null,null,null,null,null,null,null,null,null,null,null,"",null,"",{"$f":"Noblanks(J59:J556)","v":""}]
[null,null,null,null,null,null," ",null,0,null,"",25,null,0,null,null,null,null,null,null,null,null,null,null,null,"",null,"",{"$f":"Noblanks(J60:J557)","v":""}]
[null,null,null,null,null,null," ",null,0,null,"",25,null,0,null,null,null,null,null,null,null,null,null,null,null,"",null,"",{"$f":"Noblanks(J61:J558)","v":""}]
[null,null,null,null,null,null," ",null,0,null,"",25,null,0,null,null,null,null,null,null,null,null,null,null,null,"",null,"",{"$f":"Noblanks(J62:J559)","v":""}]
[null,null,null,null,null,null," ",null,0,null,{"$f":"IF(AND(I64=\"\",J64<>\"\"),H64,\"\")","v":""},25,null,0,null,null,null,null,null,null,null,null,null,null,null,"",null,"",{"$f":"Noblanks(J63:J560)","v":""}]
[null,null,null,null,null,null," ",null,0,null,{"$f":"IF(AND(I65=\"\",J65<>\"\"),H65,\"\")","v":""},25,null,0,null,null,null,null,null,null,null,null,null,null,null,"",null,"",{"$f":"Noblanks(J64:J561)","v":""}]
[null,null,null,null,null,null," ",null,{"$f":"IF(J66<>\"\",\"\",H66)","v":0},null,"",25,null,0,null,null,null,null,null,null,null,null,null,null,null,"",null,"",{"$f":"Noblanks(J65:J562)","v":""}]
[null,null,null,null,null,null," ",null,0,null,"",25,null,{"$f":"IF(M67=\"Extractor\",62.5,0)","v":0},null,null,null,null,null,null,null,null,null,null,null,"",null,"",{"$f":"Noblanks(J66:J563)","v":""}]
[null,null,null,null,null,null," ",null,0,null,"",25,null,0,null,null,null,null,null,null,null,null,null,null,null,"",null,"",{"$f":"Noblanks(J67:J564)","v":""}]
[null,null,null,null,null,null," ",null,0,null,"",25,null,0,null,null,null,null,null,null,null,null,null,null,null,"",null,{"$f":"IF(K67=\"\",\"\",J67)","v":""},{"$f":"Noblanks(J68:J565)","v":""}]
[null,null,null,null,null,null," ",null,0,null,"",25,null,0,null,null,null,null,null,null,null,null,null,null,null,"",null,"",{"$f":"Noblanks(J69:J566)","v":""}]
[null,null,null,null,null,null," "," ",null,null,null,null,null,null,null,null,null,null,null,null,null,null,null,null,null,"",null,"",{"$f":"Noblanks(J70:J567)","v":""}]
[null,null,null,null,null,null," "," ",null,null,null,null,null,null,null,null,null,null,null,null,null,null,null,null,null,"",null,null,{"$f":"Noblanks(J71:J568)","v":""}]
[null,null,null,null,null,null," "," ",null,null,null,null,null,null,null,null,null,null,null,null,null,null,null,null,null,"",null,null,{"$f":"Noblanks(J72:J569)","v":""}]
[null,null,null,null,null,null," "," ",null,null,null,null,null,null,null,null,null,null,null,null,null,null,null,null,null,"",null,null,{"$f":"Noblanks(J73:J570)","v":""}]
[null,null,null,null,null,null," "," ",null,null,null,null,null,null,null,null,null,null,null,null,null,null,null,null,null,"",null,null,{"$f":"Noblanks(J74:J571)","v":""}]
[null,null,null,null,null,null," "," ",null,null,null,null,null,null,null,null,null,null,null,null,null,null,null,null,null,"",null,null,{"$f":"Noblanks(J75:J572)","v":""}]
[null,null,null,null,null,null," "," ",null,null,null,null,null,null,null,null,null,null,null,null,null,null,null,null,null,"",null,null,{"$f":"Noblanks(J76:J573)","v":""}]
[null,null,null,null,null,null," "," ",null,null,null,null,null,null,null,null,null,null,null,null,null,null,null,null,null,"",null,null,{"$f":"Noblanks(J77:J574)","v":""}]
[null,null,null,null,null,null," "," ",null,null,null,null,null,null,null,null,null,null,null,null,null,null,null,null,null,"",null,null,{"$f":"Noblanks(J78:J575)","v":""}]
[null,null,null,null,null,null," "," ",null,null,null,null,null,null,null,null,null,null,null,null,null,null,null,null,null,"",null,null,{"$f":"Noblanks(J79:J576)","v":""}]
[null,null,null,null,null,null," "," ",null,null,null,null,null,null,null,null,null,null,null,null,null,null,null,null,null,"",null,null,{"$f":"Noblanks(J80:J577)","v":""}]
[null,null,null,null,null,null," "," ",null,null,null,null,null,null,null,null,null,null,null,null,null,null,null,null,null,"",null,null,{"$f":"Noblanks(J81:J578)","v":""}]
[null,null,null,null,null,null," "," ",null,null,null,null,null,null,null,null,null,null,null,null,null,null,null,null,null,"",null,null,{"$f":"Noblanks(J82:J579)","v":""}]
[null,null,null,null,null,null," "," ",null,null,null,null,null,null,null,null,null,null,null,null,null,null,null,null,null,"",null,null,{"$f":"Noblanks(J83:J580)","v":""}]
[null,null,null,null,null,null," "," ",null,null,null,null,null,null,null,null,null,null,null,null,null,null,null,null,null,"",null,null,{"$f":"Noblanks(J84:J581)","v":""}]
[null,null,null,null,null,null," "," ",null,null,null,null,null,null,null,null,null,null,null,null,null,null,null,null,null,"",null,null,{"$f":"Noblanks(J85:J582)","v":""}]
[null,null,null,null,null,null," "," ",null,null,null,null,null,null,null,null,null,null,null,null,null,null,null,null,null,"",null,null,{"$f":"Noblanks(J86:J583)","v":""}]
[null,null,null,null,null,null," "," ",null,null,null,null,null,null,null,null,null,null,null,null,null,null,null,null,null,{"$f":"IF(K84=\"\",\"\",J84)","v":""},null,null,{"$f":"Noblanks(J87:J584)","v":""}]
[null,null,null,null,null,null," "," ",null,null,null,null,null,null,null,null,null,null,null,null,null,null,null,null,null,"",null,null,{"$f":"Noblanks(J88:J585)","v":""}]
[null,null,null,null,null,null," "," ",null,null,null,null,null,null,null,null,null,null,null,null,null,null,null,null,null,"",null,null,{"$f":"Noblanks(J89:J586)","v":""}]
[null,null,null,null,null,null," "," ",null,null,null,null,null,null,null,null,null,null,null,null,null,null,null,null,null,"",null,null,{"$f":"Noblanks(J90:J587)","v":""}]
[null,null,null,null,null,null," "," ",null,null,null,null,null,null,null,null,null,null,null,null,null,null,null,null,null,"",null,null,{"$f":"Noblanks(J91:J588)","v":""}]
[null,null,null,null,null,null," "," ",null,null,null,null,null,null,null,null,null,null,null,null,null,null,null,null,null,"",null,null,{"$f":"Noblanks(J92:J589)","v":""}]
[null,null,null,null,null,null," ",null,null,null,null,null,null,null,null,null,null,null,null,null,null,null,null,null,null,"",null,null,{"$f":"Noblanks(J93:J590)","v":""}]
[null,null,null,null,null,null," ",null,null,null,null,null,null,null,null,null,null,null,null,null,null,null,null,null,null,"",null,null,{"$f":"Noblanks(J94:J591)","v":""}]
[null,null,null,null,null,null," ",null,null,null,null,null,null,null,null,null,null,null,null,null,null,null,null,null,null,"",null,null,{"$f":"Noblanks(J95:J592)","v":""}]
[null,null,null,null,null,null," ",null,null,null,null,null,null,null,null,null,null,null,null,null,null,null,null,null,null,"",null,null,{"$f":"Noblanks(J96:J593)","v":""}]
[null,null,null,null,null,null," ",null,null,null,null,null,null,null,null,null,null,null,null,null,null,null,null,null,null,"",null,null,{"$f":"Noblanks(J97:J594)","v":""}]
[null,null,null,null,null,null," ",null,null,null,null,null,null,null,null,null,null,null,null,null,null,null,null,null,null,"",null,null,{"$f":"Noblanks(J98:J595)","v":""}]
[null,null,null,null,null,null," ",null,null,null,null,null,null,null,null,null,null,null,null,null,null,null,null,null,null,"",null,null,{"$f":"Noblanks(J99:J596)","v":""}]
[null,null,null,null,null,null," ",null,null,null,null,null,null,null,null,null,null,null,null,null,null,null,null,null,null,"",null,null,{"$f":"Noblanks(J100:J597)","v":""}]
[null,null,null,null,null,null," ",null,null,null,null,null,null,null,null,null,null,null,null,null,null,null,null,null,null,"",null,null,{"$f":"Noblanks(J101:J598)","v":""}]
[null,null,null,null,null,null," ",null,null,null,null,null,null,null,null,null,null,null,null,null,null,null,null,null,null,null,null,null,{"$f":"Noblanks(J102:J599)","v":""}]
[null,null,null,null,null,null," ",null,null,null,null,null,null,null,null,null,null,null,null,null,null,null,null,null,null,null,null,null,{"$f":"Noblanks(J103:J600)","v":""}]
[null,null,null,null,null,null," ",null,null,null,null,null,null,null,null,null,null,null,null,null,null,null,null,null,null,null,null,null,{"$f":"Noblanks(J104:J601)","v":""}]
[null,null,null,null,null,null," ",null,null,null,null,null,null,null,null,null,null,null,null,null,null,null,null,null,null,null,null,null,{"$f":"Noblanks(J105:J602)","v":""}]
[null,null,null,null,null,null," ",null,null,null,null,null,null,null,null,null,null,null,null,null,null,null,null,null,null,null,null,null,{"$f":"Noblanks(J106:J603)","v":""}]
[null,null,null,null,null,null," ",null,null,null,null,null,null,null,null,null,null,null,null,null,null,null,null,null,null,null,null,null,{"$f":"Noblanks(J107:J604)","v":""}]
[null,null,null,null,null,null," ",null,null,null,null,null,null,null,null,null,null,null,null,null,null,null,null,null,null,null,null,null,{"$f":"Noblanks(J108:J605)","v":""}]
[null,null,null,null,null,null," ",null,null,null,null,null,null,null,null,null,null,null,null,null,null,null,null,null,null,null,null,null,{"$f":"Noblanks(J109:J606)","v":""}]
[null,null,null,null,null,null," ",null,null,null,null,null,null,null,null,null,null,null,null,null,null,null,null,null,null,null,null,null,{"$f":"Noblanks(J110:J607)","v":""}]
[null,null,null,null,null,null," ",null,null,null,null,null,null,null,null,null,null,null,null,null,null,null,null,null,null,null,null,null,{"$f":"Noblanks(J111:J608)","v":""}]
[null,null,null,null,null,null," ",null,null,null,null,null,null,null,null,null,null,null,null,null,null,null,null,null,null,null,null,null,{"$f":"Noblanks(J112:J609)","v":""}]
[null,null,null,null,null,null," ",null,null,null,null,null,null,null,null,null,null,null,null,null,null,null,null,null,null,null,null,null,{"$f":"Noblanks(J113:J610)","v":""}]
[null,null,null,null,null,null," ",null,null,null,null,null,null,null,null,null,null,null,null,null,null,null,null,null,null,null,null,null,{"$f":"Noblanks(J114:J611)","v":""}]
[null,null,null,null,null,null," ",null,null,null,null,null,null,null,null,null,null,null,null,null,null,null,null,null,null,null,null,null,{"$f":"Noblanks(J115:J612)","v":""}]
[null,null,null,null,null,null," ",null,null,null,null,null,null,null,null,null,null,null,null,null,null,null,null,null,null,null,null,null,{"$f":"Noblanks(J116:J613)","v":""}]
[null,null,null,null,null,null," ",null,null,null,null,null,null,null,null,null,null,null,null,null,null,null,null,null,null,null,null,null,{"$f":"Noblanks(J117:J614)","v":""}]
[null,null,null,null,null,null," ",null,null,null,null,null,null,null,null,null,null,null,null,null,null,null,null,null,null,null,null,null,{"$f":"Noblanks(J118:J615)","v":""}]
[null,null,null,null,null,null," ",null,null,null,null,null,null,null,null,null,null,null,null,null,null,null,null,null,null,null,null,null,{"$f":"Noblanks(J119:J616)","v":""}]
[null,null,null,null,null,null," ",null,null,null,null,null,null,null,null,null,null,null,null,null,null,null,null,null,null,null,null,null,{"$f":"Noblanks(J120:J617)","v":""}]
[null,null,null,null,null,null," ",null,null,null,null,null,null,null,null,null,null,null,null,null,null,null,null,null,null,null,null,null,{"$f":"Noblanks(J121:J618)","v":""}]
[null,null,null,null,null,null," ",null,null,null,null,null,null,null,null,null,null,null,null,null,null,null,null,null,null,null,null,null,{"$f":"Noblanks(J122:J619)","v":""}]
[null,null,null,null,null,null," ",null,null,null,null,null,null,null,null,null,null,null,null,null,null,null,null,null,null,null,null,null,{"$f":"Noblanks(J123:J620)","v":""}]
[null,null,null,null,null,null," ",null,null,null,null,null,null,null,null,null,null,null,null,null,null,null,null,null,null,null,null,null,{"$f":"Noblanks(J124:J621)","v":""}]
[null,null,null,null,null,null," ",null,null,null,null,null,null,null,null,null,null,null,null,null,null,null,null,null,null,null,null,null,{"$f":"Noblanks(J125:J622)","v":""}]
[null,null,null,null,null,null," ",null,null,null,null,null,null,null,null,null,null,null,null,null,null,null,null,null,null,null,null,null,{"$f":"Noblanks(J126:J623)","v":""}]
[null,null,null,null,null,null," ",null,null,null,null,null,null,null,null,null,null,null,null,null,null,null,null,null,null,null,null,null,{"$f":"Noblanks(J127:J624)","v":""}]
[null,null,null,null,null,null," ",null,null,null,null,null,null,null,null,null,null,null,null,null,null,null,null,null,null,null,null,null,{"$f":"Noblanks(J128:J625)","v":""}]
[null,null,null,null,null,null," ",null,null,null,null,null,null,null,null,null,null,null,null,null,null,null,null,null,null,null,null,null,{"$f":"Noblanks(J129:J626)","v":""}]
[null,null,null,null,null,null," ",null,null,null,null,null,null,null,null,null,null,null,null,null,null,null,null,null,null,null,null,null,{"$f":"Noblanks(J130:J627)","v":""}]
[null,null,null,null,null,null," ",null,null,null,null,null,null,null,null,null,null,null,null,null,null,null,null,null,null,null,null,null,{"$f":"Noblanks(J131:J628)","v":""}]
[null,null,null,null,null,null," ",null,null,null,null,null,null,null,null,null,null,null,null,null,null,null,null,null,null,null,null,null,{"$f":"Noblanks(J132:J629)","v":""}]
[null,null,null,null,null,null," ",null,null,null,null,null,null,null,null,null,null,null,null,null,null,null,null,null,null,null,null,null,{"$f":"Noblanks(J133:J630)","v":""}]
[null,null,null,null,null,null," ",null,null,null,null,null,null,null,null,null,null,null,null,null,null,null,null,null,null,null,null,null,{"$f":"Noblanks(J134:J631)","v":""}]
[null,null,null,null,null,null," ",null,null,null,null,null,null,null,null,null,null,null,null,null,null,null,null,null,null,null,null,null,{"$f":"Noblanks(J135:J632)","v":""}]
[null,null,null,null,null,null," ",null,null,null,null,null,null,null,null,null,null,null,null,null,null,null,null,null,null,null,null,null,{"$f":"Noblanks(J136:J633)","v":""}]
[null,null,null,null,null,null," ",null,null,null,null,null,null,null,null,null,null,null,null,null,null,null,null,null,null,null,null,null,{"$f":"Noblanks(J137:J634)","v":""}]
[null,null,null,null,null,null," ",null,null,null,null,null,null,null,null,null,null,null,null,null,null,null,null,null,null,null,null,null,{"$f":"Noblanks(J138:J635)","v":""}]
[null,null,null,null,null,null," ",null,null,null,null,null,null,null,null,null,null,null,null,null,null,null,null,null,null,null,null,null,{"$f":"Noblanks(J139:J636)","v":""}]
[null,null,null,null,null,null," ",null,null,null,null,null,null,null,null,null,null,null,null,null,null,null,null,null,null,null,null,null,{"$f":"Noblanks(J140:J637)","v":""}]
[null,null,null,null,null,null," ",null,null,null,null,null,null,null,null,null,null,null,null,null,null,null,null,null,null,null,null,null,{"$f":"Noblanks(J141:J638)","v":""}]
[null,null,null,null,null,null," ",null,null,null,null,null,null,null,null,null,null,null,null,null,null,null,null,null,null,null,null,null,{"$f":"Noblanks(J142:J639)","v":""}]
[null,null,null,null,null,null," ",null,null,null,null,null,null,null,null,null,null,null,null,null,null,null,null,null,null,null,null,null,{"$f":"Noblanks(J143:J640)","v":""}]
[null,null,null,null,null,null," ",null,null,null,null,null,null,null,null,null,null,null,null,null,null,null,null,null,null,null,null,null,{"$f":"Noblanks(J144:J641)","v":""}]
[null,null,null,null,null,null," ",null,null,null,null,null,null,null,null,null,null,null,null,null,null,null,null,null,null,null,null,null,{"$f":"Noblanks(J145:J642)","v":""}]
[null,null,null,null,null,null," ",null,null,null,null,null,null,null,null,null,null,null,null,null,null,null,null,null,null,null,null,null,{"$f":"Noblanks(J146:J643)","v":""}]
[null,null,null,null,null,null," ",null,null,null,null,null,null,null,null,null,null,null,null,null,null,null,null,null,null,null,null,null,{"$f":"Noblanks(J147:J644)","v":""}]
[null,null,null,null,null,null," ",null,null,null,null,null,null,null,null,null,null,null,null,null,null,null,null,null,null,null,null,null,{"$f":"Noblanks(J148:J645)","v":""}]
[null,null,null,null,null,null," ",null,null,null,null,null,null,null,null,null,null,null,null,null,null,null,null,null,null,null,null,null,{"$f":"Noblanks(J149:J646)","v":""}]
[null,null,null,null,null,null," ",null,null,null,null,null,null,null,null,null,null,null,null,null,null,null,null,null,null,null,null,null,{"$f":"Noblanks(J150:J647)","v":""}]
[null,null,null,null,null,null," ",null,null,null,null,null,null,null,null,null,null,null,null,null,null,null,null,null,null,null,null,null,{"$f":"Noblanks(J151:J648)","v":""}]
[null,null,null,null,null,null," ",null,null,null,null,null,null,null,null,null,null,null,null,null,null,null,null,null,null,null,null,null,{"$f":"Noblanks(J152:J649)","v":""}]
[null,null,null,null,null,null," ",null,null,null,null,null,null,null,null,null,null,null,null,null,null,null,null,null,null,null,null,null,{"$f":"Noblanks(J153:J650)","v":""}]
[null,null,null,null,null,null," ",null,null,null,null,null,null,null,null,null,null,null,null,null,null,null,null,null,null,null,null,null,{"$f":"Noblanks(J154:J651)","v":""}]
[null,null,null,null,null,null," ",null,null,null,null,null,null,null,null,null,null,null,null,null,null,null,null,null,null,null,null,null,{"$f":"Noblanks(J155:J652)","v":""}]
[null,null,null,null,null,null," ",null,null,null,null,null,null,null,null,null,null,null,null,null,null,null,null,null,null,null,null,null,{"$f":"Noblanks(J156:J653)","v":""}]
[null,null,null,null,null,null," ",null,null,null,null,null,null,null,null,null,null,null,null,null,null,null,null,null,null,null,null,null,{"$f":"Noblanks(J157:J654)","v":""}]
[null,null,null,null,null,null," ",null,null,null,null,null,null,null,null,null,null,null,null,null,null,null,null,null,null,null,null,null,{"$f":"Noblanks(J158:J655)","v":""}]
[null,null,null,null,null,null," ",null,null,null,null,null,null,null,null,null,null,null,null,null,null,null,null,null,null,null,null,null,{"$f":"Noblanks(J159:J656)","v":""}]
[null,null,null,null,null,null," ",null,null,null,null,null,null,null,null,null,null,null,null,null,null,null,null,null,null,null,null,null,{"$f":"Noblanks(J160:J657)","v":""}]
[null,null,null,null,null,null," ",null,null,null,null,null,null,null,null,null,null,null,null,null,null,null,null,null,null,null,null,null,{"$f":"Noblanks(J161:J658)","v":""}]
[null,null,null,null,null,null," ",null,null,null,null,null,null,null,null,null,null,null,null,null,null,null,null,null,null,null,null,null,{"$f":"Noblanks(J162:J659)","v":""}]
[null,null,null,null,null,null," ",null,null,null,null,null,null,null,null,null,null,null,null,null,null,null,null,null,null,null,null,null,{"$f":"Noblanks(J163:J660)","v":""}]
[null,null,null,null,null,null," ",null,null,null,null,null,null,null,null,null,null,null,null,null,null,null,null,null,null,null,null,null,{"$f":"Noblanks(J164:J661)","v":""}]
[null,null,null,null,null,null," ",null,null,null,null,null,null,null,null,null,null,null,null,null,null,null,null,null,null,null,null,null,{"$f":"Noblanks(J165:J662)","v":""}]
[null,null,null,null,null,null," ",null,null,null,null,null,null,null,null,null,null,null,null,null,null,null,null,null,null,null,null,null,{"$f":"Noblanks(J166:J663)","v":""}]
[null,null,null,null,null,null," ",null,null,null,null,null,null,null,null,null,null,null,null,null,null,null,null,null,null,null,null,null,{"$f":"Noblanks(J167:J664)","v":""}]
[null,null,null,null,null,null," ",null,null,null,null,null,null,null,null,null,null,null,null,null,null,null,null,null,null,null,null,null,{"$f":"Noblanks(J168:J665)","v":""}]
[null,null,null,null,null,null," ",null,null,null,null,null,null,null,null,null,null,null,null,null,null,null,null,null,null,null,null,null,{"$f":"Noblanks(J169:J666)","v":""}]
[null,null,null,null,null,null," ",null,null,null,null,null,null,null,null,null,null,null,null,null,null,null,null,null,null,null,null,null,{"$f":"Noblanks(J170:J667)","v":""}]
[null,null,null,null,null,null," ",null,null,null,null,null,null,null,null,null,null,null,null,null,null,null,null,null,null,null,null,null,{"$f":"Noblanks(J171:J668)","v":""}]
[null,null,null,null,null,null," ",null,null,null,null,null,null,null,null,null,null,null,null,null,null,null,null,null,null,null,null,null,{"$f":"Noblanks(J172:J669)","v":""}]
[null,null,null,null,null,null," ",null,null,null,null,null,null,null,null,null,null,null,null,null,null,null,null,null,null,null,null,null,{"$f":"Noblanks(J173:J670)","v":""}]
[null,null,null,null,null,null," ",null,null,null,null,null,null,null,null,null,null,null,null,null,null,null,null,null,null,null,null,null,{"$f":"Noblanks(J174:J671)","v":""}]
[null,null,null,null,null,null," ",null,null,null,null,null,null,null,null,null,null,null,null,null,null,null,null,null,null,null,null,null,{"$f":"Noblanks(J175:J672)","v":""}]
[null,null,null,null,null,null," ",null,null,null,null,null,null,null,null,null,null,null,null,null,null,null,null,null,null,null,null,null,{"$f":"Noblanks(J176:J673)","v":""}]
[null,null,null,null,null,null," ",null,null,null,null,null,null,null,null,null,null,null,null,null,null,null,null,null,null,null,null,null,{"$f":"Noblanks(J177:J674)","v":""}]
[null,null,null,null,null,null," ",null,null,null,null,null,null,null,null,null,null,null,null,null,null,null,null,null,null,null,null,null,{"$f":"Noblanks(J178:J675)","v":""}]
[null,null,null,null,null,null," ",null,null,null,null,null,null,null,null,null,null,null,null,null,null,null,null,null,null,null,null,null,{"$f":"Noblanks(J179:J676)","v":""}]
[null,null,null,null,null,null," ",null,null,null,null,null,null,null,null,null,null,null,null,null,null,null,null,null,null,null,null,null,{"$f":"Noblanks(J180:J677)","v":""}]
[null,null,null,null,null,null," ",null,null,null,null,null,null,null,null,null,null,null,null,null,null,null,null,null,null,null,null,null,{"$f":"Noblanks(J181:J678)","v":""}]
[null,null,null,null,null,null," ",null,null,null,null,null,null,null,null,null,null,null,null,null,null,null,null,null,null,null,null,null,{"$f":"Noblanks(J182:J679)","v":""}]
[null,null,null,null,null,null," ",null,null,null,null,null,null,null,null,null,null,null,null,null,null,null,null,null,null,null,null,null,{"$f":"Noblanks(J183:J680)","v":""}]
[null,null,null,null,null,null," ",null,null,null,null,null,null,null,null,null,null,null,null,null,null,null,null,null,null,null,null,null,{"$f":"Noblanks(J184:J681)","v":""}]
[null,null,null,null,null,null," ",null,null,null,null,null,null,null,null,null,null,null,null,null,null,null,null,null,null,null,null,null,{"$f":"Noblanks(J185:J682)","v":""}]
[null,null,null,null,null,null," ",null,null,null,null,null,null,null,null,null,null,null,null,null,null,null,null,null,null,null,null,null,{"$f":"Noblanks(J186:J683)","v":""}]
[null,null,null,null,null,null," ",null,null,null,null,null,null,null,null,null,null,null,null,null,null,null,null,null,null,null,null,null,{"$f":"Noblanks(J187:J684)","v":""}]
[null,null,null,null,null,null," ",null,null,null,null,null,null,null,null,null,null,null,null,null,null,null,null,null,null,null,null,null,{"$f":"Noblanks(J188:J685)","v":""}]
[null,null,null,null,null,null," ",null,null,null,null,null,null,null,null,null,null,null,null,null,null,null,null,null,null,null,null,null,{"$f":"Noblanks(J189:J686)","v":""}]
[null,null,null,null,null,null," ",null,null,null,null,null,null,null,null,null,null,null,null,null,null,null,null,null,null,null,null,null,{"$f":"Noblanks(J190:J687)","v":""}]
[null,null,null,null,null,null," ",null,null,null,null,null,null,null,null,null,null,null,null,null,null,null,null,null,null,null,null,null,{"$f":"Noblanks(J191:J688)","v":""}]
[null,null,null,null,null,null," ",null,null,null,null,null,null,null,null,null,null,null,null,null,null,null,null,null,null,null,null,null,{"$f":"Noblanks(J192:J689)","v":""}]
[null,null,null,null,null,null," ",null,null,null,null,null,null,null,null,null,null,null,null,null,null,null,null,null,null,null,null,null,{"$f":"Noblanks(J193:J690)","v":""}]
[null,null,null,null,null,null," ",null,null,null,null,null,null,null,null,null,null,null,null,null,null,null,null,null,null,null,null,null,{"$f":"Noblanks(J194:J691)","v":""}]
[null,null,null,null,null,null," ",null,null,null,null,null,null,null,null,null,null,null,null,null,null,null,null,null,null,null,null,null,{"$f":"Noblanks(J195:J692)","v":""}]
[null,null,null,null,null,null," ",null,null,null,null,null,null,null,null,null,null,null,null,null,null,null,null,null,null,null,null,null,{"$f":"Noblanks(J196:J693)","v":""}]
[null,null,null,null,null,null," ",null,null,null,null,null,null,null,null,null,null,null,null,null,null,null,null,null,null,null,null,null,{"$f":"Noblanks(J197:J694)","v":""}]
[null,null,null,null,null,null," "]
[null,null,null,null,null,null," "]
[null,null,null,null,null,null," "]
[null,null,null,null,null,null," "]
[null,null,null,null,null,null," "]
[null,null,null,null,null,null," "]
[null,null,null,null,null,null," "]
[null,null,null,null,null,null," "]
[null,null,null,null,null,null," "]
[null,null,null,null,null,null," "]
[null,null,null,null,null,null," "]
[null,null,null,null,null,null," "]
[null,null,null,null,null,null," "]
[null,null,null,null,null,null," "]
[null,null,null,null,null,null," "]
[null,null,null,null,null,null," "]
[null,null,null,null,null,null," "]
[null,null,null,null,null,null," "]
[null,null,null,null,null,null," "]
[null,null,null,null,null,null," "]
[null,null,null,null,null,null," "]
[null,null,null,null,null,null," "]
[null,null,null,null,null,null," "]
[null,null,null,null,null,null," "]
[null,null,null,null,null,null," "]
[null,null,null,null,null,null," "]
[null,null,null,null,null,null," "]
[null,null,null,null,null,null," "]
[null,null,null,null,null,null," "]
[null,null,null,null,null,null," "]
[null,null,null,null,null,null," "]
[null,null,null,null,null,null," "]
[null,null,null,null,null,null," "]
[null,null,null,null,null,null," "]
[null,null,null,null,null,null," "]
[null,null,null,null,null,null," "]
[null,null,null,null,null,null," "]
[null,null,null,null,null,null," "]
[null,null,null,null,null,null," "]
[null,null,null,null,null,null," "]
[null,null,null,null,null,null," "]
[null,null,null,null,null,null," "]
[null,null,null,null,null,null," "]
[null,null,null,null,null,null," "]
[null,null,null,null,null,null," "]
[null,null,null,null,null,null," "]
[null,null,null,null,null,null," "]
[null,null,null,null,null,null," "]
[null,null,null,null,null,null," "]
[null,null,null,null,null,null," "]
[null,null,null,null,null,null," "]
[null,null,null,null,null,null," "]
[null,null,null,null,null,null," "]
[null,null,null,null,null,null," "]
[null,null,null,null,null,null," "]
[null,null,null,null,null,null," "]
[null,null,null,null,null,null," "]
[null,null,null,null,null,null," "]
[null,null,null,null,null,null," "]
[null,null,null,null,null,null," "]
[null,null,null,null,null,null," "]
[null,null,null,null,null,null," "]
[null,null,null,null,null,null," "]
[null,null,null,null,null,null," "]
[null,null,null,null,null,null," "]
[null,null,null,null,null,null," "]
[null,null,null,null,null,null," "]
[null,null,null,null,null,null," "]
[null,null,null,null,null,null," "]
[null,null,null,null,null,null," "]
[null,null,null,null,null,null," "]
[null,null,null,null,null,null," "]
[null,null,null,null,null,null," "]
[null,null,null,null,null,null," "]
[null,null,null,null,null,null," "]
[null,null,null,null,null,null," "]
[null,null,null,null,null,null," "]
[null,null,null,null,null,null," "]
[null,null,null,null,null,null," "]
[null,null,null,null,null,null," "]
[null,null,null,null,null,null," "]
[null,null,null,null,null,null," "]
[null,null,null,null,null,null," "]
[null,null,null,null,null,null," "]
[null,null,null,null,null,null," "]
[null,null,null,null,null,null," "]
[null,null,null,null,null,null," "]
[null,null,null,null,null,null," "]
[null,null,null,null,null,null," "]
[null,null,null,null,null,null," "]
[null,null,null,null,null,null," "]
[null,null,null,null,null,null," "]
[null,null,null,null,null,null," "]
[null,null,null,null,null,null," "]
[null,null,null,null,null,null," "]
[null,null,null,null,null,null," "]
[null,null,null,null,null,null," "]
[null,null,null,null,null,null," "]
[null,null,null,null,null,null," "]
[null,null,null,null,null,null," "]
[null,null,null,null,null,null," "]
[null,null,null,null,null,null," "]
[null,null,null,null,null,null," "]
[null,null,null,null,null,null," "]
[null,null,null,null,null,null," "]
[null,null,null,null,null,null," "]
[null,null,null,null,null,null," "]
[null,null,null,null,null,null," "]
[null,null,null,null,null,null," "]
[null,null,null,null,null,null," "]
[null,null,null,null,null,null," "]
[null,null,null,null,null,null," "]
[null,null,null,null,null,null," "]
[null,null,null,null,null,null," "]
[null,null,null,null,null,null," "]
[null,null,null,null,null,null," "]
[null,null,null,null,null,null," "]
[null,null,null,null,null,null," "]
[null,null,null,null,null,null," "]
[null,null,null,null,null,null," "]
[null,null,null,null,null,null," "]
[null,null,null,null,null,null," "]
[null,null,null,null,null,null," "]
[null,null,null,null,null,null," "]
[null,null,null,null,null,null," "]
[null,null,null,null,null,null," "]
[null,null,null,null,null,null," "]
[null,null,null,null,null,null," "]
[null,null,null,null,null,null," "]
[null,null,null,null,null,null," "]
[null,null,null,null,null,null," "]
[null,null,null,null,null,null," "]
[null,null,null,null,null,null," "]
[null,null,null,null,null,null," "]
[null,null,null,null,null,null," "]
[null,null,null,null,null,null," "]
[null,null,null,null,null,null," "]
[null,null,null,null,null,null," "]
[null,null,null,null,null,null," "]
[null,null,null,null,null,null," "]
[null,null,null,null,null,null," "]
[null,null,null,null,null,null," "]
[null,null,null,null,null,null," "]
[null,null,null,null,null,null," "]
[null,null,null,null,null,null," "]
[null,null,null,null,null,null," "]
[null,null,null,null,null,null," "]
[null,null,null,null,null,null," "]
[null,null,null,null,null,null," "]
[null,null,null,null,null,null," "]
[null,null,null,null,null,null," "]
[null,null,null,null,null,null," "]
[null,null,null,null,null,null," "]
[null,null,null,null,null,null," "]
[null,null,null,null,null,null," "]
[null,null,null,null,null,null," "]
[null,null,null,null,null,null," "]
[null,null,null,null,null,null," "]
[null,null,null,null,null,null," "]
[null,null,null,null,null,null," "]
[null,null,null,null,null,null," "]
[null,null,null,null,null,null," "]
[null,null,null,null,null,null," "]
[null,null,null,null,null,null," "]
[null,null,null,null,null,null," "]
[null,null,null,null,null,null," "]
[null,null,null,null,null,null," "]
[null,null,null,null,null,null," "]
[null,null,null,null,null,null," "]
[null,null,null,null,null,null," "]
[null,null,null,null,null,null," "]
[null,null,null,null,null,null," "]
[null,null,null,null,null,null," "]
[null,null,null,null,null,null," "]
[null,null,null,null,null,null," "]
[null,null,null,null,null,null," "]
[null,null,null,null,null,null," "]
[null,null,null,null,null,null," "]
[null,null,null,null,null,null," "]
[null,null,null,null,null,null," "]
[null,null,null,null,null,null," "]
[null,null,null,null,null,null," "]
[null,null,null,null,null,null," "]
[null,null,null,null,null,null," "]
[null,null,null,null,null,null," "]
[null,null,null,null,null,null," "]
[null,null,null,null,null,null," "]
[null,null,null,null,null,null," "]
[null,null,null,null,null,null," "]
[null,null,null,null,null,null," "]
[null,null,null,null,null,null," "]
[null,null,null,null,null,null," "]
[null,null,null,null,null,null," "]
[null,null,null,null,null,null," "]
[null,null,null,null,null,null," "]
[null,null,null,null,null,null," "]
[null,null,null,null,null,null," "]
[null,null,null,null,null,null," "]
[null,null,null,null,null,null," "]
[null,null,null,null,null,null," "]
[null,null,null,null,null,null," "]
[null,null,null,null,null,null," "]
[null,null,null,null,null,null," "]
[null,null,null,null,null,null," "]
[null,null,null,null,null,null," "]
[null,null,null,null,null,null," "]
[null,null,null,null,null,null," "]
[null,null,null,null,null,null," "]
[null,null,null,null,null,null," "]
[null,null,null,null,null,null," "]
[null,null,null,null,null,null," "]
[null,null,null,null,null,null," "]
[null,null,null,null,null,null," "]
[null,null,null,null,null,null," "]
[null,null,null,null,null,null," "]
[null,null,null,null,null,null," "]
[null,null,null,null,null,null," "]
[null,null,null,null,null,null," "]
[null,null,null,null,null,null," "]
[null,null,null,null,null,null," "]
[null,null,null,null,null,null," "]
[null,null,null,null,null,null," "]
[null,null,null,null,null,null," "]
[null,null,null,null,null,null," "]
[null,null,null,null,null,null," "]
[null,null,null,null,null,null," "]
[null,null,null,null,null,null," "]
[null,null,null,null,null,null," "]
[null,null,null,null,null,null," "]
[null,null,null,null,null,null," "]
[null,null,null,null,null,null," "]
[null,null,null,null,null,null," "]
[null,null,null,null,null,null," "]
[null,null,null,null,null,null," "]
[null,null,null,null,null,null," "]
[null,null,null,null,null,null," "]
[null,null,null,null,null,null," "]
[null,null,null,null,null,null," "]
[null,null,null,null,null,null," "]
[null,null,null,null,null,null," "]
[null,null,null,null,null,null," "]
[null,null,null,null,null,null," "]
[null,null,null,null,null,null," "]
[null,null,null,null,null,null," "]
[null,null,null,null,null,null," "]
[null,null,null,null,null,null," "]
[null,null,null,null,null,null," "]
[null,null,null,null,null,null," "]
[null,null,null,null,null,null," "]
[null,null,null,null,null,null," "]
[null,null,null,null,null,null," "]
[null,null,null,null,null,null," "]
[null,null,null,null,null,null," "]
[null,null,null,null,null,null," "]
[null,null,null,null,null,null," "]
[null,null,null,null,null,null," "]
[null,null,null,null,null,null," "]
[null,null,null,null,null,null," "]
[null,null,null,null,null,null," "]
[null,null,null,null,null,null," "]
[null,null,null,null,null,null," "]
[null,null,null,null,null,null," "]
[null,null,null,null,null,null," "]
[null,null,null,null,null,null," "]
[null,null,null,null,null,null," "]
[null,null,null,null,null,null," "]
[null,null,null,null,null,null," "]
[null,null,null,null,null,null," "]
[null,null,null,null,null,null," "]
[null,null,null,null,null,null," "]
[null,null,null,null,null,null," "]
[null,null,null,null,null,null," "]
[null,null,null,null,null,null," "]
[null,null,null,null,null,null," "]
[null,null,null,null,null,null," "]
[null,null,null,null,null,null," "]
[null,null,null,null,null,null," "]
[null,null,null,null,null,null," "]
[null,null,null,null,null,null," "]
[null,null,null,null,null,null," "]
[null,null,null,null,null,null," "]
[null,null,null,null,null,null," "]
[null,null,null,null,null,null," "]
[null,null,null,null,null,null," "]
[null,null,null,null,null,null," "]
[null,null,null,null,null,null," "]
[null,null,null,null,null,null," "]
[null,null,null,null,null,null," "]
[null,null,null,null,null,null," "]
[null,null,null,null,null,null," "]
[null,null,null,null,null,null," "]
[null,null,null,null,null,null," "]
[null,null,null,null,null,null," "]
[null,null,null,null,null,null," "]
[null,null,null,null,null,null," "]

{"sheet":"04-08-2019","index":5,"n_rows":493,"n_cols":32,"rows_kept":493,"cut":false,"hidden":false,"merged":[[0,19,0,24]]}
["Official time + work","App. Date","Name","Surname","Pasaport No.","Date of birth","Note of status","Price $","Paid $","Route","Unpaid $","GT","Case of appl","TG.Gov",null,"رجــــوع","رجــــوع",null,null,"TOTAL"]
[null,null,null,null,null,null,null,null,{"$f":"IF(J2<>\"\",\"\",H2)","v":0},null,{"$f":"IF(AND(I2=\"\",J2<>\"\"),H2,\"\")","v":""},{"$f":"IF(C2=\"\",\"\",25)","v":""},"Not extractor",{"$f":"IF(M2=\"Extractor\",62.5,0)","v":0}]
[null,null,null,null,null,null,null,null,0,null,"",{"$f":"IF(C3=\"\",\"\",25)","v":""},null,{"$f":"IF(M3=\"Extractor\",62.5,0)","v":0},null,null,null,"DONE",null,"Total amount",null,"Net profit",null,"Route","Coun of Rout",null,"Total Unpaid",null,{"$f":"Noblanks(J2:J499)","v":""},null,"Note of status","Count of Mistake"]
[null,null,null,null,null,null,null,null,0,null,"","",null,0,null,null,null,"CANCELLED",null,{"$f":"SUM(H2:H70)","v":0},null,{"$f":"T4-V14","v":0},null,{"$f":"IF(ISERROR(INDEX($AC$3:$AC$70,MATCH(0,COUNTIF($X$3:X3,$AC$3:$AC$69),0))),\"\",INDEX($AC$3:$AC$69,MATCH(0,COUNTIF($X$3:X3,$AC$3:$AC$69),0)))","v":""},{"$f":"IF(X4=\"\",\"\",COUNTIF(J2:J100,X4))","v":""},null,{"$f":"IF(X4<>\"\",SUMPRODUCT(--($J$2:$J$69=X4),$K$2:$K$69),\"\")","v":""},{"$f":"IF(K2=\"\",\"\",J2)","v":""},{"$f":"Noblanks(J3:J500)","v":""},null,"MISTAKE IN DOB",{"$f":"COUNTIF(C2:C70,\"Mistake\")","v":0}]
[null,null,null,null,null,null,null,null,0,null,"","",null,0,null,null,null,"REFUSED",null,null,null,null,null,{"$f":"IF(ISERROR(INDEX($AC$3:$AC$70,MATCH(0,COUNTIF($X$3:X4,$AC$3:$AC$69),0))),\"\",INDEX($AC$3:$AC$69,MATCH(0,COUNTIF($X$3:X4,$AC$3:$AC$69),0)))","v":""},"",null,"",{"$f":"IF(K3=\"\",\"\",J3)","v":""},{"$f":"Noblanks(J4:J501)","v":""}]
[null,null,null,null,null,null,null,null,0,null,"","",null,0,null,null,null,"MISTAKE",null,"Total Paid",null,"Difrent amount",null,{"$f":"IF(ISERROR(INDEX($AC$3:$AC$70,MATCH(0,COUNTIF($X$3:X5,$AC$3:$AC$69),0))),\"\",INDEX($AC$3:$AC$69,MATCH(0,COUNTIF($X$3:X5,$AC$3:$AC$69),0)))","v":""},"",{"$f":"IF(K2=\"\",\"\",J2)","v":""},{"$f":"IF(X6<>\"\",SUMPRODUCT(--($J$2:$J$69=X6),$K$2:$K$69),\"\")","v":""},"",{"$f":"Noblanks(J5:J502)","v":""}]
[null,null,null,null,null,null,null,null,0,null,"","",null,0,null,null,null,"GREEN PASS.",null,{"$f":"SUM(I2:I70)","v":0},null,{"$f":"T4-(T7+T10)","v":0},null,{"$f":"IF(ISERROR(INDEX($AC$3:$AC$70,MATCH(0,COUNTIF($X$3:X6,$AC$3:$AC$69),0))),\"\",INDEX($AC$3:$AC$69,MATCH(0,COUNTIF($X$3:X6,$AC$3:$AC$69),0)))","v":""},{"$f":"IF(X7=\"\",\"\",COUNTIF(J5:J103,X7))","v":""},"",{"$f":"IF(X7<>\"\",SUMPRODUCT(--($J$2:$J$69=X7),$K$2:$K$69),\"\")","v":""},"",{"$f":"Noblanks(J6:J503)","v":""}]
[null,null,null,null,null,null,null,null,0,null,"","",null,0,null,null,null,null,null,null,null,null,null,{"$f":"IF(ISERROR(INDEX($AC$3:$AC$70,MATCH(0,COUNTIF($X$3:X7,$AC$3:$AC$69),0))),\"\",INDEX($AC$3:$AC$69,MATCH(0,COUNTIF($X$3:X7,$AC$3:$AC$69),0)))","v":""},{"$f":"IF(X8=\"\",\"\",COUNTIF(J6:J104,X8))","v":""},"","","",{"$f":"Noblanks(J7:J504)","v":""}]
[null,null,null,null,null,null,null,null,0,null,"","",null,0,null,null,null,"official time",null,"Total UnPaid",null,"No. of applicants",null,{"$f":"IF(ISERROR(INDEX($AC$3:$AC$70,MATCH(0,COUNTIF($X$3:X8,$AC$3:$AC$69),0))),\"\",INDEX($AC$3:$AC$69,MATCH(0,COUNTIF($X$3:X8,$AC$3:$AC$69),0)))","v":""},"","","","",{"$f":"Noblanks(J8:J505)","v":""}]
[null,null,null,null,null,null,null,null,0,null,"","",null,0,null,null,null,"official holiday",null,{"$f":"SUM(K2:K70)","v":0},null,{"$f":"COUNT(B:B)","v":0},null,{"$f":"IF(ISERROR(INDEX($AC$3:$AC$70,MATCH(0,COUNTIF($X$3:X9,$AC$3:$AC$69),0))),\"\",INDEX($AC$3:$AC$69,MATCH(0,COUNTIF($X$3:X9,$AC$3:$AC$69),0)))","v":""},"","","","",{"$f":"Noblanks(J9:J506)","v":""}]
[null,null,null,null,null,null,null,null,0,null,"","",null,0,null,null,null,"other",null,null,null,null,null,{"$f":"IF(ISERROR(INDEX($AC$3:$AC$70,MATCH(0,COUNTIF($X$3:X10,$AC$3:$AC$69),0))),\"\",INDEX($AC$3:$AC$69,MATCH(0,COUNTIF($X$3:X10,$AC$3:$AC$69),0)))","v":""},"","","","",{"$f":"Noblanks(J10:J507)","v":""}]
[null,null,null,null,null,null,null,null,0,null,"","",null,0,null,null,null,null,null,"Total GT",null,null,null,{"$f":"IF(ISERROR(INDEX($AC$3:$AC$70,MATCH(0,COUNTIF($X$3:X11,$AC$3:$AC$69),0))),\"\",INDEX($AC$3:$AC$69,MATCH(0,COUNTIF($X$3:X11,$AC$3:$AC$69),0)))","v":""},"","","","",{"$f":"Noblanks(J11:J508)","v":""}]
[null,null,null,null,null,null,null,null,0,null,"","",null,0,null,null,null,null,null,{"$f":"SUM(L2:L70)","v":0},null,"Cost amount",null,{"$f":"IF(ISERROR(INDEX($AC$3:$AC$70,MATCH(0,COUNTIF($X$3:X12,$AC$3:$AC$69),0))),\"\",INDEX($AC$3:$AC$69,MATCH(0,COUNTIF($X$3:X12,$AC$3:$AC$69),0)))","v":""},"","","","",{"$f":"Noblanks(J12:J509)","v":""}]
[null,null,null,null,null,null,null,null,0,null,"","",null,0,null,null,null,null,null,null,null,{"$f":"IF(AND(T13<>\"\",T16<>\"\"),T13+T16,\"\")","v":0},null,{"$f":"IF(ISERROR(INDEX($AC$3:$AC$70,MATCH(0,COUNTIF($X$3:X13,$AC$3:$AC$69),0))),\"\",INDEX($AC$3:$AC$69,MATCH(0,COUNTIF($X$3:X13,$AC$3:$AC$69),0)))","v":""},"","","","",{"$f":"Noblanks(J13:J510)","v":""}]
[null,null,null,null,null,null,null,null,0,null,"","",null,0,null,null,null,null,null,"Total T.Gov",null,null,null,{"$f":"IF(ISERROR(INDEX($AC$3:$AC$70,MATCH(0,COUNTIF($X$3:X14,$AC$3:$AC$69),0))),\"\",INDEX($AC$3:$AC$69,MATCH(0,COUNTIF($X$3:X14,$AC$3:$AC$69),0)))","v":""},"","","","",{"$f":"Noblanks(J14:J511)","v":""}]
[null,null,null,null,null,null,null," "," ",null,"","",null,0,null,null,null,null,null,{"$f":"SUM(N2:N70)","v":0},null,null,null,{"$f":"IF(ISERROR(INDEX($AC$3:$AC$70,MATCH(0,COUNTIF($X$3:X15,$AC$3:$AC$69),0))),\"\",INDEX($AC$3:$AC$69,MATCH(0,COUNTIF($X$3:X15,$AC$3:$AC$69),0)))","v":""},"","","","",{"$f":"Noblanks(J15:J512)","v":""}]
[null,null,null,null,null,null,null," "," ",null,{"$f":"IF(AND(I17=\"\",J17<>\"\"),H17,\"\")","v":""},"",null,0,null,null,null,null,null,null,null,null,null,{"$f":"IF(ISERROR(INDEX($AC$3:$AC$70,MATCH(0,COUNTIF($X$3:X16,$AC$3:$AC$69),0))),\"\",INDEX($AC$3:$AC$69,MATCH(0,COUNTIF($X$3:X16,$AC$3:$AC$69),0)))","v":""},"","","","",{"$f":"Noblanks(J16:J513)","v":""}]
[null,null,null,null,null,null," "," "," ",null,{"$f":"IF(AND(I18=\"\",J18<>\"\"),H18,\"\")","v":""},"",null,0,null,null,null,null,null,null,null,null,null,{"$f":"IF(ISERROR(INDEX($AC$3:$AC$70,MATCH(0,COUNTIF($X$3:X17,$AC$3:$AC$69),0))),\"\",INDEX($AC$3:$AC$69,MATCH(0,COUNTIF($X$3:X17,$AC$3:$AC$69),0)))","v":""},"","","","",{"$f":"Noblanks(J17:J514)","v":""}]
[null,null,null,null,null,null," "," "," ",null,"","",null,0,null,null,null,null,null,null,null,null,null,{"$f":"IF(ISERROR(INDEX($AC$3:$AC$70,MATCH(0,COUNTIF($X$3:X18,$AC$3:$AC$69),0))),\"\",INDEX($AC$3:$AC$69,MATCH(0,COUNTIF($X$3:X18,$AC$3:$AC$69),0)))","v":""},"","","","",{"$f":"Noblanks(J18:J515)","v":""}]
[null,null,null,null,null,null," "," "," ",null,"","",null,0,null,null,null,null,null,null,null,null,null,{"$f":"IF(ISERROR(INDEX($AC$3:$AC$70,MATCH(0,COUNTIF($X$3:X19,$AC$3:$AC$69),0))),\"\",INDEX($AC$3:$AC$69,MATCH(0,COUNTIF($X$3:X19,$AC$3:$AC$69),0)))","v":""},"","","","",{"$f":"Noblanks(J19:J516)","v":""}]
[null,null,null,null,null,null," ",null,0,null,"","",null,0,null,null,null,null,null,null,null,null,null,{"$f":"IF(ISERROR(INDEX($AC$3:$AC$70,MATCH(0,COUNTIF($X$3:X20,$AC$3:$AC$69),0))),\"\",INDEX($AC$3:$AC$69,MATCH(0,COUNTIF($X$3:X20,$AC$3:$AC$69),0)))","v":""},"","","","",{"$f":"Noblanks(J20:J517)","v":""}]
[null,null,null,null,null,null," ",null,0,null,"","",null,0,null,null,null,null,null,null,null,null,null,{"$f":"IF(ISERROR(INDEX($AC$3:$AC$70,MATCH(0,COUNTIF($X$3:X21,$AC$3:$AC$69),0))),\"\",INDEX($AC$3:$AC$69,MATCH(0,COUNTIF($X$3:X21,$AC$3:$AC$69),0)))","v":""},"","","","",{"$f":"Noblanks(J21:J518)","v":""},null,null,{"$f":"IFERROR(INDEX($J$2:$J$492,SMALL(IF($J$2:$J$492<>\"\",ROW($J$1:$J$492)-ROW($J$2)+1,\"\"),ROWS(AF$21:$AJ22))),\"\")","v":""}]
[null,null,null,null,null,null," ",null,0,null,"","",null,0,null,null,null,null,null,null,null,"Done",null,null,{"$f":"Noblanks(Z25:Z518)","v":""},null,{"$f":"IFERROR(INDEX($J$2:$J$492,SMALL(IF($J$2:$J$492<>\"\",ROW($J$1:$J$492)-ROW($J$2)+1,\"\"),ROWS(AF$21:$AJ23))),\"\")","v":""},"",{"$f":"Noblanks(J22:J519)","v":""}]
[null,null,null,null,null,null," ",null,0,null,"","",null,0,null,null,null,null,null,null,null,"Cancelled",null,null,null,{"$f":"IF(K20=\"\",\"\",J20)","v":""},null,"",{"$f":"Noblanks(J23:J520)","v":""},null,null,{"$f":"IFERROR(INDEX($J$2:$J$492,SMALL(IF($J$2:$J$492<>\"\",ROW($J$1:$J$492)-ROW($J$2)+1,\"\"),ROWS(AF$21:$AJ24))),\"\")","v":""}]
[null,null,null,null,null,null," ",null,0,null,"","",null,0,null,null,null,null,null,null,null,"Refused",null,null,null,"",null,"",{"$f":"Noblanks(J24:J521)","v":""},null,null,{"$f":"IFERROR(INDEX($J$2:$J$492,SMALL(IF($J$2:$J$492<>\"\",ROW($J$1:$J$492)-ROW($J$2)+1,\"\"),ROWS(AF$21:$AJ25))),\"\")","v":""}]
[null,null,null,null,null,null," ",null,0,null,"","",null,0,null,null,null,null,null,null,null,"Green pass.",null,null,null,"",null,"",{"$f":"Noblanks(J25:J522)","v":""}]
[null,null,null,null,null,null," ",null,0,null,"","",null,0,null,null,null,null,null,null,null,"Mistake",null,null,null,"",null,"",{"$f":"Noblanks(J26:J523)","v":""}]
[null,null,null,null,null,null," ",null,0,null,"","",null,0,null,null,null,null,null,null,null,null,null,null,null,"",null,"",{"$f":"Noblanks(J27:J524)","v":""}]
[null,null,null,null,null,null," ",null,0,null,"","",null,0,null,null,null,null,null,null,null,null,null,null,null,"",null,"",{"$f":"Noblanks(J28:J525)","v":""}]
[null,null,null,null,null,null," ",null,0,null,"","",null,0,null,null,null,null,null,null,null,null,null,null,null,"",null,"",{"$f":"Noblanks(J29:J526)","v":""}]
[null,null,null,null,null,null," ",null,0,null,"","",null,0,null,null,null,null,null,null,null,null,null,null,null,"",null,"",{"$f":"Noblanks(J30:J527)","v":""}]
[null,null,null,null,null,null," ",null,0,null,"","",null,0,null,null,null,null,null,null,null,null,null,null,null,"",null,"",{"$f":"Noblanks(J31:J528)","v":""}]
[null,null,null,null,null,null," ",null,0,null,"","",null,0,null,null,null,null,null,null,null,null,null,null,null,"",null,"",{"$f":"Noblanks(J32:J529)","v":""}]
[null,null,null,null,null,null," ",null,0,null,"","",null,0,null,null,null,null,null,null,null,null,null,null,null,"",null,"",{"$f":"Noblanks(J33:J530)","v":""}]
[null,null,null,null,null,null," ",null,0,null,"","",null,0,null,null,null,null,null,null,null,null,null,null,null,"",null,"",{"$f":"Noblanks(J34:J531)","v":""}]
[null,null,null,null,null,null," ",null,0,null,"","",null,0,null,null,null,null,null,null,null,null,null,null,null,"",null,"",{"$f":"Noblanks(J35:J532)","v":""}]
[null,null,null,null,null,null," ",null,0,null,"","",null,0,null,null,null,null,null,null,null,null,null,null,null,"",null,"",{"$f":"Noblanks(J36:J533)","v":""}]
[null,null,null,null,null,null," ",null,0,null,"","",null,0,null,null,null,null,null,null,null,null,null,null,null,"",null,"",{"$f":"Noblanks(J37:J534)","v":""}]
[null,null,null,null,null,null," ",null,0,null,"","",null,0,null,null,null,null,null,null,null,null,null,null,null,"",null,"",{"$f":"Noblanks(J38:J535)","v":""}]
[null,null,null,null,null,null," ",null,0,null,"","",null,0,null,null,null,null,null,null,null,null,null,null,null,"",null,"",{"$f":"Noblanks(J39:J536)","v":""}]
[null,null,null,null,null,null," ",null,0,null,"","",null,0,null,null,null,null,null,null,null,null,null,null,null,"",null,"",{"$f":"Noblanks(J40:J537)","v":""}]
[null,null,null,null,null,null," ",null,0,null,"","",null,0,null,null,null,null,null,null,null,null,null,null,null,"",null,"",{"$f":"Noblanks(J41:J538)","v":""}]
[null,null,null,null,null,null," ",null,0,null,"","",null,0,null,null,null,null,null,null,null,null,null,null,null,"",null,"",{"$f":"Noblanks(J42:J539)","v":""}]
[null,null,null,null,null,null," ",null,0,null,"","",null,0,null,null,null,null,null,null,null,null,null,null,null,"",null,"",{"$f":"Noblanks(J43:J540)","v":""}]
[null,null,null,null,null,null," ",null,0,null,"","",null,0,null,null,null,null,null,null,null,null,null,null,null,"",null,"",{"$f":"Noblanks(J44:J541)","v":""}]
[null,null,null,null,null,null," ",null,0,null,"","",null,0,null,null,null,null,null,null,null,null,null,null,null,"",null,"",{"$f":"Noblanks(J45:J542)","v":""}]
[null,null,null,null,null,null," ",null,0,null,"","",null,0,null,null,null,null,null,null,null,null,null,null,null,"",null,"",{"$f":"Noblanks(J46:J543)","v":""}]
[null,null,null,null,null,null," ",null,0,null,"","",null,0,null,null,null,null,null,null,null,null,null,null,null,"",null,"",{"$f":"Noblanks(J47:J544)","v":""}]
[null,null,null,null,null,null," ",null,0,null,"","",null,0,null,null,null,null,null,null,null,null,null,null,null,"",null,"",{"$f":"Noblanks(J48:J545)","v":""}]
[null,null,null,null,null,null," ",null,0,null,"","",null,0,null,null,null,null,null,null,null,null,null,null,null,"",null,"",{"$f":"Noblanks(J49:J546)","v":""}]
[null,null,null,null,null,null," ",null,0,null,"","",null,0,null,null,null,null,null,null,null,null,null,null,null,"",null,"",{"$f":"Noblanks(J50:J547)","v":""}]
[null,null,null,null,null,null," ",null,0,null,"","",null,0,null,null,null,null,null,null,null,null,null,null,null,"",null,"",{"$f":"Noblanks(J51:J548)","v":""}]
[null,null,null,null,null,null," ",null,0,null,"","",null,0,null,null,null,null,null,null,null,null,null,null,null,"",null,"",{"$f":"Noblanks(J52:J549)","v":""}]
[null,null,null,null,null,null," ",null,0,null,"","",null,0,null,null,null,null,null,null,null,null,null,null,null,"",null,"",{"$f":"Noblanks(J53:J550)","v":""}]
[null,null,null,null,null,null," ",null,0,null,"","",null,0,null,null,null,null,null,null,null,null,null,null,null,"",null,"",{"$f":"Noblanks(J54:J551)","v":""}]
[null,null,null,null,null,null," ",null,0,null,"","",null,0,null,null,null,null,null,null,null,null,null,null,null,"",null,"",{"$f":"Noblanks(J55:J552)","v":""}]
[null,null,null,null,null,null," ",null,0,null,"","",null,0,null,null,null,null,null,null,null,null,null,null,null,"",null,"",{"$f":"Noblanks(J56:J553)","v":""}]
[null,null,null,null,null,null," ",null,0,null,"","",null,0,null,null,null,null,null,null,null,null,null,null,null,"",null,"",{"$f":"Noblanks(J57:J554)","v":""}]
[null,null,null,null,null,null," ",null,0,null,"","",null,0,null,null,null,null,null,null,null,null,null,null,null,"",null,"",{"$f":"Noblanks(J58:J555)","v":""}]
[null,null,null,null,null,null," ",null,0,null,"","",null,0,null,null,null,null,null,null,null,null,null,null,null,"",null,"",{"$f":"Noblanks(J59:J556)","v":""}]
[null,null,null,null,null,null," ",null,0,null,"","",null,0,null,null,null,null,null,null,null,null,null,null,null,"",null,"",{"$f":"Noblanks(J60:J557)","v":""}]
[null,null,null,null,null,null," ",null,0,null,"","",null,0,null,null,null,null,null,null,null,null,null,null,null,"",null,"",{"$f":"Noblanks(J61:J558)","v":""}]
[null,null,null,null,null,null," ",null,0,null,"","",null,0,null,null,null,null,null,null,null,null,null,null,null,"",null,"",{"$f":"Noblanks(J62:J559)","v":""}]
[null,null,null,null,null,null," ",null,0,null,{"$f":"IF(AND(I64=\"\",J64<>\"\"),H64,\"\")","v":""},"",null,0,null,null,null,null,null,null,null,null,null,null,null,"",null,"",{"$f":"Noblanks(J63:J560)","v":""}]
[null,null,null,null,null,null," ",null,0,null,{"$f":"IF(AND(I65=\"\",J65<>\"\"),H65,\"\")","v":""},"",null,0,null,null,null,null,null,null,null,null,null,null,null,"",null,"",{"$f":"Noblanks(J64:J561)","v":""}]
[null,null,null,null,null,null," ",null,{"$f":"IF(J66<>\"\",\"\",H66)","v":0},null,"","",null,0,null,null,null,null,null,null,null,null,null,null,null,"",null,"",{"$f":"Noblanks(J65:J562)","v":""}]
[null,null,null,null,null,null," ",null,0,null,"",{"$f":"IF(C67=\"\",\"\",25)","v":""},null,{"$f":"IF(M67=\"Extractor\",62.5,0)","v":0},null,null,null,null,null,null,null,null,null,null,null,"",null,"",{"$f":"Noblanks(J66:J563)","v":""}]
[null,null,null,null,null,null," ",null,0,null,"","",null,0,null,null,null,null,null,null,null,null,null,null,null,"",null,"",{"$f":"Noblanks(J67:J564)","v":""}]
[null,null,null,null,null,null," ",null,0,null,"","",null,0,null,null,null,null,null,null,null,null,null,null,null,"",null,{"$f":"IF(K67=\"\",\"\",J67)","v":""},{"$f":"Noblanks(J68:J565)","v":""}]
[null,null,null,null,null,null," ",null,0,null,"","",null,0,null,null,null,null,null,null,null,null,null,null,null,"",null,"",{"$f":"Noblanks(J69:J566)","v":""}]
[null,null,null,null,null,null," "," ",null,null,null,null,null,null,null,null,null,null,null,null,null,null,null,null,null,"",null,"",{"$f":"Noblanks(J70:J567)","v":""}]
[null,null,null,null,null,null," "," ",null,null,null,null,null,null,null,null,null,null,null,null,null,null,null,null,null,"",null,null,{"$f":"Noblanks(J71:J568)","v":""}]
[null,null,null,null,null,null," "," ",null,null,null,null,null,null,null,null,null,null,null,null,null,null,null,null,null,"",null,null,{"$f":"Noblanks(J72:J569)","v":""}]
[null,null,null,null,null,null," "," ",null,null,null,null,null,null,null,null,null,null,null,null,null,null,null,null,null,"",null,null,{"$f":"Noblanks(J73:J570)","v":""}]
[null,null,null,null,null,null," "," ",null,null,null,null,null,null,null,null,null,null,null,null,null,null,null,null,null,"",null,null,{"$f":"Noblanks(J74:J571)","v":""}]
[null,null,null,null,null,null," "," ",null,null,null,null,null,null,null,null,null,null,null,null,null,null,null,null,null,"",null,null,{"$f":"Noblanks(J75:J572)","v":""}]
[null,null,null,null,null,null," "," ",null,null,null,null,null,null,null,null,null,null,null,null,null,null,null,null,null,"",null,null,{"$f":"Noblanks(J76:J573)","v":""}]
[null,null,null,null,null,null," "," ",null,null,null,null,null,null,null,null,null,null,null,null,null,null,null,null,null,"",null,null,{"$f":"Noblanks(J77:J574)","v":""}]
[null,null,null,null,null,null," "," ",null,null,null,null,null,null,null,null,null,null,null,null,null,null,null,null,null,"",null,null,{"$f":"Noblanks(J78:J575)","v":""}]
[null,null,null,null,null,null," "," ",null,null,null,null,null,null,null,null,null,null,null,null,null,null,null,null,null,"",null,null,{"$f":"Noblanks(J79:J576)","v":""}]
[null,null,null,null,null,null," "," ",null,null,null,null,null,null,null,null,null,null,null,null,null,null,null,null,null,"",null,null,{"$f":"Noblanks(J80:J577)","v":""}]
[null,null,null,null,null,null," "," ",null,null,null,null,null,null,null,null,null,null,null,null,null,null,null,null,null,"",null,null,{"$f":"Noblanks(J81:J578)","v":""}]
[null,null,null,null,null,null," "," ",null,null,null,null,null,null,null,null,null,null,null,null,null,null,null,null,null,"",null,null,{"$f":"Noblanks(J82:J579)","v":""}]
[null,null,null,null,null,null," "," ",null,null,null,null,null,null,null,null,null,null,null,null,null,null,null,null,null,"",null,null,{"$f":"Noblanks(J83:J580)","v":""}]
[null,null,null,null,null,null," "," ",null,null,null,null,null,null,null,null,null,null,null,null,null,null,null,null,null,"",null,null,{"$f":"Noblanks(J84:J581)","v":""}]
[null,null,null,null,null,null," "," ",null,null,null,null,null,null,null,null,null,null,null,null,null,null,null,null,null,"",null,null,{"$f":"Noblanks(J85:J582)","v":""}]
[null,null,null,null,null,null," "," ",null,null,null,null,null,null,null,null,null,null,null,null,null,null,null,null,null,"",null,null,{"$f":"Noblanks(J86:J583)","v":""}]
[null,null,null,null,null,null," "," ",null,null,null,null,null,null,null,null,null,null,null,null,null,null,null,null,null,{"$f":"IF(K84=\"\",\"\",J84)","v":""},null,null,{"$f":"Noblanks(J87:J584)","v":""}]
[null,null,null,null,null,null," "," ",null,null,null,null,null,null,null,null,null,null,null,null,null,null,null,null,null,"",null,null,{"$f":"Noblanks(J88:J585)","v":""}]
[null,null,null,null,null,null," "," ",null,null,null,null,null,null,null,null,null,null,null,null,null,null,null,null,null,"",null,null,{"$f":"Noblanks(J89:J586)","v":""}]
[null,null,null,null,null,null," "," ",null,null,null,null,null,null,null,null,null,null,null,null,null,null,null,null,null,"",null,null,{"$f":"Noblanks(J90:J587)","v":""}]
[null,null,null,null,null,null," "," ",null,null,null,null,null,null,null,null,null,null,null,null,null,null,null,null,null,"",null,null,{"$f":"Noblanks(J91:J588)","v":""}]
[null,null,null,null,null,null," "," ",null,null,null,null,null,null,null,null,null,null,null,null,null,null,null,null,null,"",null,null,{"$f":"Noblanks(J92:J589)","v":""}]
[null,null,null,null,null,null," ",null,null,null,null,null,null,null,null,null,null,null,null,null,null,null,null,null,null,"",null,null,{"$f":"Noblanks(J93:J590)","v":""}]
[null,null,null,null,null,null," ",null,null,null,null,null,null,null,null,null,null,null,null,null,null,null,null,null,null,"",null,null,{"$f":"Noblanks(J94:J591)","v":""}]
[null,null,null,null,null,null," ",null,null,null,null,null,null,null,null,null,null,null,null,null,null,null,null,null,null,"",null,null,{"$f":"Noblanks(J95:J592)","v":""}]
[null,null,null,null,null,null," ",null,null,null,null,null,null,null,null,null,null,null,null,null,null,null,null,null,null,"",null,null,{"$f":"Noblanks(J96:J593)","v":""}]
[null,null,null,null,null,null," ",null,null,null,null,null,null,null,null,null,null,null,null,null,null,null,null,null,null,"",null,null,{"$f":"Noblanks(J97:J594)","v":""}]
[null,null,null,null,null,null," ",null,null,null,null,null,null,null,null,null,null,null,null,null,null,null,null,null,null,"",null,null,{"$f":"Noblanks(J98:J595)","v":""}]
[null,null,null,null,null,null," ",null,null,null,null,null,null,null,null,null,null,null,null,null,null,null,null,null,null,"",null,null,{"$f":"Noblanks(J99:J596)","v":""}]
[null,null,null,null,null,null," ",null,null,null,null,null,null,null,null,null,null,null,null,null,null,null,null,null,null,"",null,null,{"$f":"Noblanks(J100:J597)","v":""}]
[null,null,null,null,null,null," ",null,null,null,null,null,null,null,null,null,null,null,null,null,null,null,null,null,null,"",null,null,{"$f":"Noblanks(J101:J598)","v":""}]
[null,null,null,null,null,null," ",null,null,null,null,null,null,null,null,null,null,null,null,null,null,null,null,null,null,null,null,null,{"$f":"Noblanks(J102:J599)","v":""}]
[null,null,null,null,null,null," ",null,null,null,null,null,null,null,null,null,null,null,null,null,null,null,null,null,null,null,null,null,{"$f":"Noblanks(J103:J600)","v":""}]
[null,null,null,null,null,null," ",null,null,null,null,null,null,null,null,null,null,null,null,null,null,null,null,null,null,null,null,null,{"$f":"Noblanks(J104:J601)","v":""}]
[null,null,null,null,null,null," ",null,null,null,null,null,null,null,null,null,null,null,null,null,null,null,null,null,null,null,null,null,{"$f":"Noblanks(J105:J602)","v":""}]
[null,null,null,null,null,null," ",null,null,null,null,null,null,null,null,null,null,null,null,null,null,null,null,null,null,null,null,null,{"$f":"Noblanks(J106:J603)","v":""}]
[null,null,null,null,null,null," ",null,null,null,null,null,null,null,null,null,null,null,null,null,null,null,null,null,null,null,null,null,{"$f":"Noblanks(J107:J604)","v":""}]
[null,null,null,null,null,null," ",null,null,null,null,null,null,null,null,null,null,null,null,null,null,null,null,null,null,null,null,null,{"$f":"Noblanks(J108:J605)","v":""}]
[null,null,null,null,null,null," ",null,null,null,null,null,null,null,null,null,null,null,null,null,null,null,null,null,null,null,null,null,{"$f":"Noblanks(J109:J606)","v":""}]
[null,null,null,null,null,null," ",null,null,null,null,null,null,null,null,null,null,null,null,null,null,null,null,null,null,null,null,null,{"$f":"Noblanks(J110:J607)","v":""}]
[null,null,null,null,null,null," ",null,null,null,null,null,null,null,null,null,null,null,null,null,null,null,null,null,null,null,null,null,{"$f":"Noblanks(J111:J608)","v":""}]
[null,null,null,null,null,null," ",null,null,null,null,null,null,null,null,null,null,null,null,null,null,null,null,null,null,null,null,null,{"$f":"Noblanks(J112:J609)","v":""}]
[null,null,null,null,null,null," ",null,null,null,null,null,null,null,null,null,null,null,null,null,null,null,null,null,null,null,null,null,{"$f":"Noblanks(J113:J610)","v":""}]
[null,null,null,null,null,null," ",null,null,null,null,null,null,null,null,null,null,null,null,null,null,null,null,null,null,null,null,null,{"$f":"Noblanks(J114:J611)","v":""}]
[null,null,null,null,null,null," ",null,null,null,null,null,null,null,null,null,null,null,null,null,null,null,null,null,null,null,null,null,{"$f":"Noblanks(J115:J612)","v":""}]
[null,null,null,null,null,null," ",null,null,null,null,null,null,null,null,null,null,null,null,null,null,null,null,null,null,null,null,null,{"$f":"Noblanks(J116:J613)","v":""}]
[null,null,null,null,null,null," ",null,null,null,null,null,null,null,null,null,null,null,null,null,null,null,null,null,null,null,null,null,{"$f":"Noblanks(J117:J614)","v":""}]
[null,null,null,null,null,null," ",null,null,null,null,null,null,null,null,null,null,null,null,null,null,null,null,null,null,null,null,null,{"$f":"Noblanks(J118:J615)","v":""}]
[null,null,null,null,null,null," ",null,null,null,null,null,null,null,null,null,null,null,null,null,null,null,null,null,null,null,null,null,{"$f":"Noblanks(J119:J616)","v":""}]
[null,null,null,null,null,null," ",null,null,null,null,null,null,null,null,null,null,null,null,null,null,null,null,null,null,null,null,null,{"$f":"Noblanks(J120:J617)","v":""}]
[null,null,null,null,null,null," ",null,null,null,null,null,null,null,null,null,null,null,null,null,null,null,null,null,null,null,null,null,{"$f":"Noblanks(J121:J618)","v":""}]
[null,null,null,null,null,null," ",null,null,null,null,null,null,null,null,null,null,null,null,null,null,null,null,null,null,null,null,null,{"$f":"Noblanks(J122:J619)","v":""}]
[null,null,null,null,null,null," ",null,null,null,null,null,null,null,null,null,null,null,null,null,null,null,null,null,null,null,null,null,{"$f":"Noblanks(J123:J620)","v":""}]
[null,null,null,null,null,null," ",null,null,null,null,null,null,null,null,null,null,null,null,null,null,null,null,null,null,null,null,null,{"$f":"Noblanks(J124:J621)","v":""}]
[null,null,null,null,null,null," ",null,null,null,null,null,null,null,null,null,null,null,null,null,null,null,null,null,null,null,null,null,{"$f":"Noblanks(J125:J622)","v":""}]
[null,null,null,null,null,null," ",null,null,null,null,null,null,null,null,null,null,null,null,null,null,null,null,null,null,null,null,null,{"$f":"Noblanks(J126:J623)","v":""}]
[null,null,null,null,null,null," ",null,null,null,null,null,null,null,null,null,null,null,null,null,null,null,null,null,null,null,null,null,{"$f":"Noblanks(J127:J624)","v":""}]
[null,null,null,null,null,null," ",null,null,null,null,null,null,null,null,null,null,null,null,null,null,null,null,null,null,null,null,null,{"$f":"Noblanks(J128:J625)","v":""}]
[null,null,null,null,null,null," ",null,null,null,null,null,null,null,null,null,null,null,null,null,null,null,null,null,null,null,null,null,{"$f":"Noblanks(J129:J626)","v":""}]
[null,null,null,null,null,null," ",null,null,null,null,null,null,null,null,null,null,null,null,null,null,null,null,null,null,null,null,null,{"$f":"Noblanks(J130:J627)","v":""}]
[null,null,null,null,null,null," ",null,null,null,null,null,null,null,null,null,null,null,null,null,null,null,null,null,null,null,null,null,{"$f":"Noblanks(J131:J628)","v":""}]
[null,null,null,null,null,null," ",null,null,null,null,null,null,null,null,null,null,null,null,null,null,null,null,null,null,null,null,null,{"$f":"Noblanks(J132:J629)","v":""}]
[null,null,null,null,null,null," ",null,null,null,null,null,null,null,null,null,null,null,null,null,null,null,null,null,null,null,null,null,{"$f":"Noblanks(J133:J630)","v":""}]
[null,null,null,null,null,null," ",null,null,null,null,null,null,null,null,null,null,null,null,null,null,null,null,null,null,null,null,null,{"$f":"Noblanks(J134:J631)","v":""}]
[null,null,null,null,null,null," ",null,null,null,null,null,null,null,null,null,null,null,null,null,null,null,null,null,null,null,null,null,{"$f":"Noblanks(J135:J632)","v":""}]
[null,null,null,null,null,null," ",null,null,null,null,null,null,null,null,null,null,null,null,null,null,null,null,null,null,null,null,null,{"$f":"Noblanks(J136:J633)","v":""}]
[null,null,null,null,null,null," ",null,null,null,null,null,null,null,null,null,null,null,null,null,null,null,null,null,null,null,null,null,{"$f":"Noblanks(J137:J634)","v":""}]
[null,null,null,null,null,null," ",null,null,null,null,null,null,null,null,null,null,null,null,null,null,null,null,null,null,null,null,null,{"$f":"Noblanks(J138:J635)","v":""}]
[null,null,null,null,null,null," ",null,null,null,null,null,null,null,null,null,null,null,null,null,null,null,null,null,null,null,null,null,{"$f":"Noblanks(J139:J636)","v":""}]
[null,null,null,null,null,null," ",null,null,null,null,null,null,null,null,null,null,null,null,null,null,null,null,null,null,null,null,null,{"$f":"Noblanks(J140:J637)","v":""}]
[null,null,null,null,null,null," ",null,null,null,null,null,null,null,null,null,null,null,null,null,null,null,null,null,null,null,null,null,{"$f":"Noblanks(J141:J638)","v":""}]
[null,null,null,null,null,null," ",null,null,null,null,null,null,null,null,null,null,null,null,null,null,null,null,null,null,null,null,null,{"$f":"Noblanks(J142:J639)","v":""}]
[null,null,null,null,null,null," ",null,null,null,null,null,null,null,null,null,null,null,null,null,null,null,null,null,null,null,null,null,{"$f":"Noblanks(J143:J640)","v":""}]
[null,null,null,null,null,null," ",null,null,null,null,null,null,null,null,null,null,null,null,null,null,null,null,null,null,null,null,null,{"$f":"Noblanks(J144:J641)","v":""}]
[null,null,null,null,null,null," ",null,null,null,null,null,null,null,null,null,null,null,null,null,null,null,null,null,null,null,null,null,{"$f":"Noblanks(J145:J642)","v":""}]
[null,null,null,null,null,null," ",null,null,null,null,null,null,null,null,null,null,null,null,null,null,null,null,null,null,null,null,null,{"$f":"Noblanks(J146:J643)","v":""}]
[null,null,null,null,null,null," ",null,null,null,null,null,null,null,null,null,null,null,null,null,null,null,null,null,null,null,null,null,{"$f":"Noblanks(J147:J644)","v":""}]
[null,null,null,null,null,null," ",null,null,null,null,null,null,null,null,null,null,null,null,null,null,null,null,null,null,null,null,null,{"$f":"Noblanks(J148:J645)","v":""}]
[null,null,null,null,null,null," ",null,null,null,null,null,null,null,null,null,null,null,null,null,null,null,null,null,null,null,null,null,{"$f":"Noblanks(J149:J646)","v":""}]
[null,null,null,null,null,null," ",null,null,null,null,null,null,null,null,null,null,null,null,null,null,null,null,null,null,null,null,null,{"$f":"Noblanks(J150:J647)","v":""}]
[null,null,null,null,null,null," ",null,null,null,null,null,null,null,null,null,null,null,null,null,null,null,null,null,null,null,null,null,{"$f":"Noblanks(J151:J648)","v":""}]
[null,null,null,null,null,null," ",null,null,null,null,null,null,null,null,null,null,null,null,null,null,null,null,null,null,null,null,null,{"$f":"Noblanks(J152:J649)","v":""}]
[null,null,null,null,null,null," ",null,null,null,null,null,null,null,null,null,null,null,null,null,null,null,null,null,null,null,null,null,{"$f":"Noblanks(J153:J650)","v":""}]
[null,null,null,null,null,null," ",null,null,null,null,null,null,null,null,null,null,null,null,null,null,null,null,null,null,null,null,null,{"$f":"Noblanks(J154:J651)","v":""}]
[null,null,null,null,null,null," ",null,null,null,null,null,null,null,null,null,null,null,null,null,null,null,null,null,null,null,null,null,{"$f":"Noblanks(J155:J652)","v":""}]
[null,null,null,null,null,null," ",null,null,null,null,null,null,null,null,null,null,null,null,null,null,null,null,null,null,null,null,null,{"$f":"Noblanks(J156:J653)","v":""}]
[null,null,null,null,null,null," ",null,null,null,null,null,null,null,null,null,null,null,null,null,null,null,null,null,null,null,null,null,{"$f":"Noblanks(J157:J654)","v":""}]
[null,null,null,null,null,null," ",null,null,null,null,null,null,null,null,null,null,null,null,null,null,null,null,null,null,null,null,null,{"$f":"Noblanks(J158:J655)","v":""}]
[null,null,null,null,null,null," ",null,null,null,null,null,null,null,null,null,null,null,null,null,null,null,null,null,null,null,null,null,{"$f":"Noblanks(J159:J656)","v":""}]
[null,null,null,null,null,null," ",null,null,null,null,null,null,null,null,null,null,null,null,null,null,null,null,null,null,null,null,null,{"$f":"Noblanks(J160:J657)","v":""}]
[null,null,null,null,null,null," ",null,null,null,null,null,null,null,null,null,null,null,null,null,null,null,null,null,null,null,null,null,{"$f":"Noblanks(J161:J658)","v":""}]
[null,null,null,null,null,null," ",null,null,null,null,null,null,null,null,null,null,null,null,null,null,null,null,null,null,null,null,null,{"$f":"Noblanks(J162:J659)","v":""}]
[null,null,null,null,null,null," ",null,null,null,null,null,null,null,null,null,null,null,null,null,null,null,null,null,null,null,null,null,{"$f":"Noblanks(J163:J660)","v":""}]
[null,null,null,null,null,null," ",null,null,null,null,null,null,null,null,null,null,null,null,null,null,null,null,null,null,null,null,null,{"$f":"Noblanks(J164:J661)","v":""}]
[null,null,null,null,null,null," ",null,null,null,null,null,null,null,null,null,null,null,null,null,null,null,null,null,null,null,null,null,{"$f":"Noblanks(J165:J662)","v":""}]
[null,null,null,null,null,null," ",null,null,null,null,null,null,null,null,null,null,null,null,null,null,null,null,null,null,null,null,null,{"$f":"Noblanks(J166:J663)","v":""}]
[null,null,null,null,null,null," ",null,null,null,null,null,null,null,null,null,null,null,null,null,null,null,null,null,null,null,null,null,{"$f":"Noblanks(J167:J664)","v":""}]
[null,null,null,null,null,null," ",null,null,null,null,null,null,null,null,null,null,null,null,null,null,null,null,null,null,null,null,null,{"$f":"Noblanks(J168:J665)","v":""}]
[null,null,null,null,null,null," ",null,null,null,null,null,null,null,null,null,null,null,null,null,null,null,null,null,null,null,null,null,{"$f":"Noblanks(J169:J666)","v":""}]
[null,null,null,null,null,null," ",null,null,null,null,null,null,null,null,null,null,null,null,null,null,null,null,null,null,null,null,null,{"$f":"Noblanks(J170:J667)","v":""}]
[null,null,null,null,null,null," ",null,null,null,null,null,null,null,null,null,null,null,null,null,null,null,null,null,null,null,null,null,{"$f":"Noblanks(J171:J668)","v":""}]
[null,null,null,null,null,null," ",null,null,null,null,null,null,null,null,null,null,null,null,null,null,null,null,null,null,null,null,null,{"$f":"Noblanks(J172:J669)","v":""}]
[null,null,null,null,null,null," ",null,null,null,null,null,null,null,null,null,null,null,null,null,null,null,null,null,null,null,null,null,{"$f":"Noblanks(J173:J670)","v":""}]
[null,null,null,null,null,null," ",null,null,null,null,null,null,null,null,null,null,null,null,null,null,null,null,null,null,null,null,null,{"$f":"Noblanks(J174:J671)","v":""}]
[null,null,null,null,null,null," ",null,null,null,null,null,null,null,null,null,null,null,null,null,null,null,null,null,null,null,null,null,{"$f":"Noblanks(J175:J672)","v":""}]
[null,null,null,null,null,null," ",null,null,null,null,null,null,null,null,null,null,null,null,null,null,null,null,null,null,null,null,null,{"$f":"Noblanks(J176:J673)","v":""}]
[null,null,null,null,null,null," ",null,null,null,null,null,null,null,null,null,null,null,null,null,null,null,null,null,null,null,null,null,{"$f":"Noblanks(J177:J674)","v":""}]
[null,null,null,null,null,null," ",null,null,null,null,null,null,null,null,null,null,null,null,null,null,null,null,null,null,null,null,null,{"$f":"Noblanks(J178:J675)","v":""}]
[null,null,null,null,null,null," ",null,null,null,null,null,null,null,null,null,null,null,null,null,null,null,null,null,null,null,null,null,{"$f":"Noblanks(J179:J676)","v":""}]
[null,null,null,null,null,null," ",null,null,null,null,null,null,null,null,null,null,null,null,null,null,null,null,null,null,null,null,null,{"$f":"Noblanks(J180:J677)","v":""}]
[null,null,null,null,null,null," ",null,null,null,null,null,null,null,null,null,null,null,null,null,null,null,null,null,null,null,null,null,{"$f":"Noblanks(J181:J678)","v":""}]
[null,null,null,null,null,null," ",null,null,null,null,null,null,null,null,null,null,null,null,null,null,null,null,null,null,null,null,null,{"$f":"Noblanks(J182:J679)","v":""}]
[null,null,null,null,null,null," ",null,null,null,null,null,null,null,null,null,null,null,null,null,null,null,null,null,null,null,null,null,{"$f":"Noblanks(J183:J680)","v":""}]
[null,null,null,null,null,null," ",null,null,null,null,null,null,null,null,null,null,null,null,null,null,null,null,null,null,null,null,null,{"$f":"Noblanks(J184:J681)","v":""}]
[null,null,null,null,null,null," ",null,null,null,null,null,null,null,null,null,null,null,null,null,null,null,null,null,null,null,null,null,{"$f":"Noblanks(J185:J682)","v":""}]
[null,null,null,null,null,null," ",null,null,null,null,null,null,null,null,null,null,null,null,null,null,null,null,null,null,null,null,null,{"$f":"Noblanks(J186:J683)","v":""}]
[null,null,null,null,null,null," ",null,null,null,null,null,null,null,null,null,null,null,null,null,null,null,null,null,null,null,null,null,{"$f":"Noblanks(J187:J684)","v":""}]
[null,null,null,null,null,null," ",null,null,null,null,null,null,null,null,null,null,null,null,null,null,null,null,null,null,null,null,null,{"$f":"Noblanks(J188:J685)","v":""}]
[null,null,null,null,null,null," ",null,null,null,null,null,null,null,null,null,null,null,null,null,null,null,null,null,null,null,null,null,{"$f":"Noblanks(J189:J686)","v":""}]
[null,null,null,null,null,null," ",null,null,null,null,null,null,null,null,null,null,null,null,null,null,null,null,null,null,null,null,null,{"$f":"Noblanks(J190:J687)","v":""}]
[null,null,null,null,null,null," ",null,null,null,null,null,null,null,null,null,null,null,null,null,null,null,null,null,null,null,null,null,{"$f":"Noblanks(J191:J688)","v":""}]
[null,null,null,null,null,null," ",null,null,null,null,null,null,null,null,null,null,null,null,null,null,null,null,null,null,null,null,null,{"$f":"Noblanks(J192:J689)","v":""}]
[null,null,null,null,null,null," ",null,null,null,null,null,null,null,null,null,null,null,null,null,null,null,null,null,null,null,null,null,{"$f":"Noblanks(J193:J690)","v":""}]
[null,null,null,null,null,null," ",null,null,null,null,null,null,null,null,null,null,null,null,null,null,null,null,null,null,null,null,null,{"$f":"Noblanks(J194:J691)","v":""}]
[null,null,null,null,null,null," ",null,null,null,null,null,null,null,null,null,null,null,null,null,null,null,null,null,null,null,null,null,{"$f":"Noblanks(J195:J692)","v":""}]
[null,null,null,null,null,null," ",null,null,null,null,null,null,null,null,null,null,null,null,null,null,null,null,null,null,null,null,null,{"$f":"Noblanks(J196:J693)","v":""}]
[null,null,null,null,null,null," ",null,null,null,null,null,null,null,null,null,null,null,null,null,null,null,null,null,null,null,null,null,{"$f":"Noblanks(J197:J694)","v":""}]
[null,null,null,null,null,null," "]
[null,null,null,null,null,null," "]
[null,null,null,null,null,null," "]
[null,null,null,null,null,null," "]
[null,null,null,null,null,null," "]
[null,null,null,null,null,null," "]
[null,null,null,null,null,null," "]
[null,null,null,null,null,null," "]
[null,null,null,null,null,null," "]
[null,null,null,null,null,null," "]
[null,null,null,null,null,null," "]
[null,null,null,null,null,null," "]
[null,null,null,null,null,null," "]
[null,null,null,null,null,null," "]
[null,null,null,null,null,null," "]
[null,null,null,null,null,null," "]
[null,null,null,null,null,null," "]
[null,null,null,null,null,null," "]
[null,null,null,null,null,null," "]
[null,null,null,null,null,null," "]
[null,null,null,null,null,null," "]
[null,null,null,null,null,null," "]
[null,null,null,null,null,null," "]
[null,null,null,null,null,null," "]
[null,null,null,null,null,null," "]
[null,null,null,null,null,null," "]
[null,null,null,null,null,null," "]
[null,null,null,null,null,null," "]
[null,null,null,null,null,null," "]
[null,null,null,null,null,null," "]
[null,null,null,null,null,null," "]
[null,null,null,null,null,null," "]
[null,null,null,null,null,null," "]
[null,null,null,null,null,null," "]
[null,null,null,null,null,null," "]
[null,null,null,null,null,null," "]
[null,null,null,null,null,null," "]
[null,null,null,null,null,null," "]
[null,null,null,null,null,null," "]
[null,null,null,null,null,null," "]
[null,null,null,null,null,null," "]
[null,null,null,null,null,null," "]
[null,null,null,null,null,null," "]
[null,null,null,null,null,null," "]
[null,null,null,null,null,null," "]
[null,null,null,null,null,null," "]
[null,null,null,null,null,null," "]
[null,null,null,null,null,null," "]
[null,null,null,null,null,null," "]
[null,null,null,null,null,null," "]
[null,null,null,null,null,null," "]
[null,null,null,null,null,null," "]
[null,null,null,null,null,null," "]
[null,null,null,null,null,null," "]
[null,null,null,null,null,null," "]
[null,null,null,null,null,null," "]
[null,null,null,null,null,null," "]
[null,null,null,null,null,null," "]
[null,null,null,null,null,null," "]
[null,null,null,null,null,null," "]
[null,null,null,null,null,null," "]
[null,null,null,null,null,null," "]
[null,null,null,null,null,null," "]
[null,null,null,null,null,null," "]
[null,null,null,null,null,null," "]
[null,null,null,null,null,null," "]
[null,null,null,null,null,null," "]
[null,null,null,null,null,null," "]
[null,null,null,null,null,null," "]
[null,null,null,null,null,null," "]
[null,null,null,null,null,null," "]
[null,null,null,null,null,null," "]
[null,null,null,null,null,null," "]
[null,null,null,null,null,null," "]
[null,null,null,null,null,null," "]
[null,null,null,null,null,null," "]
[null,null,null,null,null,null," "]
[null,null,null,null,null,null," "]
[null,null,null,null,null,null," "]
[null,null,null,null,null,null," "]
[null,null,null,null,null,null," "]
[null,null,null,null,null,null," "]
[null,null,null,null,null,null," "]
[null,null,null,null,null,null," "]
[null,null,null,null,null,null," "]
[null,null,null,null,null,null," "]
[null,null,null,null,null,null," "]
[null,null,null,null,null,null," "]
[null,null,null,null,null,null," "]
[null,null,null,null,null,null," "]
[null,null,null,null,null,null," "]
[null,null,null,null,null,null," "]
[null,null,null,null,null,null," "]
[null,null,null,null,null,null," "]
[null,null,null,null,null,null," "]
[null,null,null,null,null,null," "]
[null,null,null,null,null,null," "]
[null,null,null,null,null,null," "]
[null,null,null,null,null,null," "]
[null,null,null,null,null,null," "]
[null,null,null,null,null,null," "]
[null,null,null,null,null,null," "]
[null,null,null,null,null,null," "]
[null,null,null,null,null,null," "]
[null,null,null,null,null,null," "]
[null,null,null,null,null,null," "]
[null,null,null,null,null,null," "]
[null,null,null,null,null,null," "]
[null,null,null,null,null,null," "]
[null,null,null,null,null,null," "]
[null,null,null,null,null,null," "]
[null,null,null,null,null,null," "]
[null,null,null,null,null,null," "]
[null,null,null,null,null,null," "]
[null,null,null,null,null,null," "]
[null,null,null,null,null,null," "]
[null,null,null,null,null,null," "]
[null,null,null,null,null,null," "]
[null,null,null,null,null,null," "]
[null,null,null,null,null,null," "]
[null,null,null,null,null,null," "]
[null,null,null,null,null,null," "]
[null,null,null,null,null,null," "]
[null,null,null,null,null,null," "]
[null,null,null,null,null,null," "]
[null,null,null,null,null,null," "]
[null,null,null,null,null,null," "]
[null,null,null,null,null,null," "]
[null,null,null,null,null,null," "]
[null,null,null,null,null,null," "]
[null,null,null,null,null,null," "]
[null,null,null,null,null,null," "]
[null,null,null,null,null,null," "]
[null,null,null,null,null,null," "]
[null,null,null,null,null,null," "]
[null,null,null,null,null,null," "]
[null,null,null,null,null,null," "]
[null,null,null,null,null,null," "]
[null,null,null,null,null,null," "]
[null,null,null,null,null,null," "]
[null,null,null,null,null,null," "]
[null,null,null,null,null,null," "]
[null,null,null,null,null,null," "]
[null,null,null,null,null,null," "]
[null,null,null,null,null,null," "]
[null,null,null,null,null,null," "]
[null,null,null,null,null,null," "]
[null,null,null,null,null,null," "]
[null,null,null,null,null,null," "]
[null,null,null,null,null,null," "]
[null,null,null,null,null,null," "]
[null,null,null,null,null,null," "]
[null,null,null,null,null,null," "]
[null,null,null,null,null,null," "]
[null,null,null,null,null,null," "]
[null,null,null,null,null,null," "]
[null,null,null,null,null,null," "]
[null,null,null,null,null,null," "]
[null,null,null,null,null,null," "]
[null,null,null,null,null,null," "]
[null,null,null,null,null,null," "]
[null,null,null,null,null,null," "]
[null,null,null,null,null,null," "]
[null,null,null,null,null,null," "]
[null,null,null,null,null,null," "]
[null,null,null,null,null,null," "]
[null,null,null,null,null,null," "]
[null,null,null,null,null,null," "]
[null,null,null,null,null,null," "]
[null,null,null,null,null,null," "]
[null,null,null,null,null,null," "]
[null,null,null,null,null,null," "]
[null,null,null,null,null,null," "]
[null,null,null,null,null,null," "]
[null,null,null,null,null,null," "]
[null,null,null,null,null,null," "]
[null,null,null,null,null,null," "]
[null,null,null,null,null,null," "]
[null,null,null,null,null,null," "]
[null,null,null,null,null,null," "]
[null,null,null,null,null,null," "]
[null,null,null,null,null,null," "]
[null,null,null,null,null,null," "]
[null,null,null,null,null,null," "]
[null,null,null,null,null,null," "]
[null,null,null,null,null,null," "]
[null,null,null,null,null,null," "]
[null,null,null,null,null,null," "]
[null,null,null,null,null,null," "]
[null,null,null,null,null,null," "]
[null,null,null,null,null,null," "]
[null,null,null,null,null,null," "]
[null,null,null,null,null,null," "]
[null,null,null,null,null,null," "]
[null,null,null,null,null,null," "]
[null,null,null,null,null,null," "]
[null,null,null,null,null,null," "]
[null,null,null,null,null,null," "]
[null,null,null,null,null,null," "]
[null,null,null,null,null,null," "]
[null,null,null,null,null,null," "]
[null,null,null,null,null,null," "]
[null,null,null,null,null,null," "]
[null,null,null,null,null,null," "]
[null,null,null,null,null,null," "]
[null,null,null,null,null,null," "]
[null,null,null,null,null,null," "]
[null,null,null,null,null,null," "]
[null,null,null,null,null,null," "]
[null,null,null,null,null,null," "]
[null,null,null,null,null,null," "]
[null,null,null,null,null,null," "]
[null,null,null,null,null,null," "]
[null,null,null,null,null,null," "]
[null,null,null,null,null,null," "]
[null,null,null,null,null,null," "]
[null,null,null,null,null,null," "]
[null,null,null,null,null,null," "]
[null,null,null,null,null,null," "]
[null,null,null,null,null,null," "]
[null,null,null,null,null,null," "]
[null,null,null,null,null,null," "]
[null,null,null,null,null,null," "]
[null,null,null,null,null,null," "]
[null,null,null,null,null,null," "]
[null,null,null,null,null,null," "]
[null,null,null,null,null,null," "]
[null,null,null,null,null,null," "]
[null,null,null,null,null,null," "]
[null,null,null,null,null,null," "]
[null,null,null,null,null,null," "]
[null,null,null,null,null,null," "]
[null,null,null,null,null,null," "]
[null,null,null,null,null,null," "]
[null,null,null,null,null,null," "]
[null,null,null,null,null,null," "]
[null,null,null,null,null,null," "]
[null,null,null,null,null,null," "]
[null,null,null,null,null,null," "]
[null,null,null,null,null,null," "]
[null,null,null,null,null,null," "]
[null,null,null,null,null,null," "]
[null,null,null,null,null,null," "]
[null,null,null,null,null,null," "]
[null,null,null,null,null,null," "]
[null,null,null,null,null,null," "]
[null,null,null,null,null,null," "]
[null,null,null,null,null,null," "]
[null,null,null,null,null,null," "]
[null,null,null,null,null,null," "]
[null,null,null,null,null,null," "]
[null,null,null,null,null,null," "]
[null,null,null,null,null,null," "]
[null,null,null,null,null,null," "]
[null,null,null,null,null,null," "]
[null,null,null,null,null,null," "]
[null,null,null,null,null,null," "]
[null,null,null,null,null,null," "]
[null,null,null,null,null,null," "]
[null,null,null,null,null,null," "]
[null,null,null,null,null,null," "]
[null,null,null,null,null,null," "]
[null,null,null,null,null,null," "]
[null,null,null,null,null,null," "]
[null,null,null,null,null,null," "]
[null,null,null,null,null,null," "]
[null,null,null,null,null,null," "]
[null,null,null,null,null,null," "]
[null,null,null,null,null,null," "]
[null,null,null,null,null,null," "]
[null,null,null,null,null,null," "]
[null,null,null,null,null,null," "]
[null,null,null,null,null,null," "]
[null,null,null,null,null,null," "]
[null,null,null,null,null,null," "]
[null,null,null,null,null,null," "]
[null,null,null,null,null,null," "]
[null,null,null,null,null,null," "]
[null,null,null,null,null,null," "]
[null,null,null,null,null,null," "]
[null,null,null,null,null,null," "]
[null,null,null,null,null,null," "]
[null,null,null,null,null,null," "]
[null,null,null,null,null,null," "]
[null,null,null,null,null,null," "]
[null,null,null,null,null,null," "]
[null,null,null,null,null,null," "]
[null,null,null,null,null,null," "]
[null,null,null,null,null,null," "]
[null,null,null,null,null,null," "]
[null,null,null,null,null,null," "]
[null,null,null,null,null,null," "]
[null,null,null,null,null,null," "]
[null,null,null,null,null,null," "]
[null,null,null,null,null,null," "]

{"sheet":"05-08-2019","index":6,"n_rows":493,"n_cols":32,"rows_kept":493,"cut":false,"hidden":false,"merged":[[0,19,0,24]]}
["Official time - work","App. Date","Name","Surname","Pasaport No.","Date of birth","Note of status","Price $","Paid $","Route","Unpaid $","GT","Case of appl","TG.Gov",null,"رجــــوع","رجــــوع",null,null,"TOTAL"]
[null,null,null,null,null,null,null,null,{"$f":"IF(J2<>\"\",\"\",H2)","v":0},null,{"$f":"IF(AND(I2=\"\",J2<>\"\"),H2,\"\")","v":""},{"$f":"IF(C2=\"\",\"\",25)","v":""},"Not extractor",{"$f":"IF(M2=\"Extractor\",62.5,0)","v":0}]
[null,null,null,null,null,null,null,null,0,null,"",{"$f":"IF(C3=\"\",\"\",25)","v":""},null,{"$f":"IF(M3=\"Extractor\",62.5,0)","v":0},null,null,null,"DONE",null,"Total amount",null,"Net profit",null,"Route","Coun of Rout",null,"Total Unpaid",null,{"$f":"Noblanks(J2:J499)","v":""},null,"Note of status","Count of Mistake"]
[null,null,null,null,null,null,null,null,0,null,"","",null,0,null,null,null,"CANCELLED",null,{"$f":"SUM(H2:H70)","v":0},null,{"$f":"T4-V14","v":0},null,{"$f":"IF(ISERROR(INDEX($AC$3:$AC$70,MATCH(0,COUNTIF($X$3:X3,$AC$3:$AC$69),0))),\"\",INDEX($AC$3:$AC$69,MATCH(0,COUNTIF($X$3:X3,$AC$3:$AC$69),0)))","v":""},{"$f":"IF(X4=\"\",\"\",COUNTIF(J2:J100,X4))","v":""},null,{"$f":"IF(X4<>\"\",SUMPRODUCT(--($J$2:$J$69=X4),$K$2:$K$69),\"\")","v":""},{"$f":"IF(K2=\"\",\"\",J2)","v":""},{"$f":"Noblanks(J3:J500)","v":""},null,"MISTAKE IN DOB",{"$f":"COUNTIF(C2:C70,\"Mistake\")","v":0}]
[null,null,null,null,null,null,null,null,0,null,"","",null,0,null,null,null,"REFUSED",null,null,null,null,null,{"$f":"IF(ISERROR(INDEX($AC$3:$AC$70,MATCH(0,COUNTIF($X$3:X4,$AC$3:$AC$69),0))),\"\",INDEX($AC$3:$AC$69,MATCH(0,COUNTIF($X$3:X4,$AC$3:$AC$69),0)))","v":""},"",null,"",{"$f":"IF(K3=\"\",\"\",J3)","v":""},{"$f":"Noblanks(J4:J501)","v":""}]
[null,null,null,null,null,null,null,null,0,null,"","",null,0,null,null,null,"MISTAKE",null,"Total Paid",null,"Difrent amount",null,{"$f":"IF(ISERROR(INDEX($AC$3:$AC$70,MATCH(0,COUNTIF($X$3:X5,$AC$3:$AC$69),0))),\"\",INDEX($AC$3:$AC$69,MATCH(0,COUNTIF($X$3:X5,$AC$3:$AC$69),0)))","v":""},"",{"$f":"IF(K2=\"\",\"\",J2)","v":""},{"$f":"IF(X6<>\"\",SUMPRODUCT(--($J$2:$J$69=X6),$K$2:$K$69),\"\")","v":""},"",{"$f":"Noblanks(J5:J502)","v":""}]
[null,null,null,null,null,null,null,null,0,null,"","",null,0,null,null,null,"GREEN PASS.",null,{"$f":"SUM(I2:I70)","v":0},null,{"$f":"T4-(T7+T10)","v":0},null,{"$f":"IF(ISERROR(INDEX($AC$3:$AC$70,MATCH(0,COUNTIF($X$3:X6,$AC$3:$AC$69),0))),\"\",INDEX($AC$3:$AC$69,MATCH(0,COUNTIF($X$3:X6,$AC$3:$AC$69),0)))","v":""},{"$f":"IF(X7=\"\",\"\",COUNTIF(J5:J103,X7))","v":""},"",{"$f":"IF(X7<>\"\",SUMPRODUCT(--($J$2:$J$69=X7),$K$2:$K$69),\"\")","v":""},"",{"$f":"Noblanks(J6:J503)","v":""}]
[null,null,null,null,null,null,null,null,0,null,"","",null,0,null,null,null,null,null,null,null,null,null,{"$f":"IF(ISERROR(INDEX($AC$3:$AC$70,MATCH(0,COUNTIF($X$3:X7,$AC$3:$AC$69),0))),\"\",INDEX($AC$3:$AC$69,MATCH(0,COUNTIF($X$3:X7,$AC$3:$AC$69),0)))","v":""},{"$f":"IF(X8=\"\",\"\",COUNTIF(J6:J104,X8))","v":""},"","","",{"$f":"Noblanks(J7:J504)","v":""}]
[null,null,null,null,null,null,null,null,0,null,"","",null,0,null,null,null,"official time",null,"Total UnPaid",null,"No. of applicants",null,{"$f":"IF(ISERROR(INDEX($AC$3:$AC$70,MATCH(0,COUNTIF($X$3:X8,$AC$3:$AC$69),0))),\"\",INDEX($AC$3:$AC$69,MATCH(0,COUNTIF($X$3:X8,$AC$3:$AC$69),0)))","v":""},"","","","",{"$f":"Noblanks(J8:J505)","v":""}]
[null,null,null,null,null,null,null,null,0,null,"","",null,0,null,null,null,"official holiday",null,{"$f":"SUM(K2:K70)","v":0},null,{"$f":"COUNT(B:B)","v":0},null,{"$f":"IF(ISERROR(INDEX($AC$3:$AC$70,MATCH(0,COUNTIF($X$3:X9,$AC$3:$AC$69),0))),\"\",INDEX($AC$3:$AC$69,MATCH(0,COUNTIF($X$3:X9,$AC$3:$AC$69),0)))","v":""},"","","","",{"$f":"Noblanks(J9:J506)","v":""}]
[null,null,null,null,null,null,null,null,0,null,"","",null,0,null,null,null,"other",null,null,null,null,null,{"$f":"IF(ISERROR(INDEX($AC$3:$AC$70,MATCH(0,COUNTIF($X$3:X10,$AC$3:$AC$69),0))),\"\",INDEX($AC$3:$AC$69,MATCH(0,COUNTIF($X$3:X10,$AC$3:$AC$69),0)))","v":""},"","","","",{"$f":"Noblanks(J10:J507)","v":""}]
[null,null,null,null,null,null,null,null,0,null,"","",null,0,null,null,null,null,null,"Total GT",null,null,null,{"$f":"IF(ISERROR(INDEX($AC$3:$AC$70,MATCH(0,COUNTIF($X$3:X11,$AC$3:$AC$69),0))),\"\",INDEX($AC$3:$AC$69,MATCH(0,COUNTIF($X$3:X11,$AC$3:$AC$69),0)))","v":""},"","","","",{"$f":"Noblanks(J11:J508)","v":""}]
[null,null,null,null,null,null,null,null,0,null,"","",null,0,null,null,null,null,null,{"$f":"SUM(L2:L70)","v":0},null,"Cost amount",null,{"$f":"IF(ISERROR(INDEX($AC$3:$AC$70,MATCH(0,COUNTIF($X$3:X12,$AC$3:$AC$69),0))),\"\",INDEX($AC$3:$AC$69,MATCH(0,COUNTIF($X$3:X12,$AC$3:$AC$69),0)))","v":""},"","","","",{"$f":"Noblanks(J12:J509)","v":""}]
[null,null,null,null,null,null,null,null,0,null,"","",null,0,null,null,null,null,null,null,null,{"$f":"IF(AND(T13<>\"\",T16<>\"\"),T13+T16,\"\")","v":0},null,{"$f":"IF(ISERROR(INDEX($AC$3:$AC$70,MATCH(0,COUNTIF($X$3:X13,$AC$3:$AC$69),0))),\"\",INDEX($AC$3:$AC$69,MATCH(0,COUNTIF($X$3:X13,$AC$3:$AC$69),0)))","v":""},"","","","",{"$f":"Noblanks(J13:J510)","v":""}]
[null,null,null,null,null,null,null,null,0,null,"","",null,0,null,null,null,null,null,"Total T.Gov",null,null,null,{"$f":"IF(ISERROR(INDEX($AC$3:$AC$70,MATCH(0,COUNTIF($X$3:X14,$AC$3:$AC$69),0))),\"\",INDEX($AC$3:$AC$69,MATCH(0,COUNTIF($X$3:X14,$AC$3:$AC$69),0)))","v":""},"","","","",{"$f":"Noblanks(J14:J511)","v":""}]
[null,null,null,null,null,null,null," "," ",null,"","",null,0,null,null,null,null,null,{"$f":"SUM(N2:N70)","v":0},null,null,null,{"$f":"IF(ISERROR(INDEX($AC$3:$AC$70,MATCH(0,COUNTIF($X$3:X15,$AC$3:$AC$69),0))),\"\",INDEX($AC$3:$AC$69,MATCH(0,COUNTIF($X$3:X15,$AC$3:$AC$69),0)))","v":""},"","","","",{"$f":"Noblanks(J15:J512)","v":""}]
[null,null,null,null,null,null,null," "," ",null,{"$f":"IF(AND(I17=\"\",J17<>\"\"),H17,\"\")","v":""},"",null,0,null,null,null,null,null,null,null,null,null,{"$f":"IF(ISERROR(INDEX($AC$3:$AC$70,MATCH(0,COUNTIF($X$3:X16,$AC$3:$AC$69),0))),\"\",INDEX($AC$3:$AC$69,MATCH(0,COUNTIF($X$3:X16,$AC$3:$AC$69),0)))","v":""},"","","","",{"$f":"Noblanks(J16:J513)","v":""}]
[null,null,null,null,null,null," "," "," ",null,{"$f":"IF(AND(I18=\"\",J18<>\"\"),H18,\"\")","v":""},"",null,0,null,null,null,null,null,null,null,null,null,{"$f":"IF(ISERROR(INDEX($AC$3:$AC$70,MATCH(0,COUNTIF($X$3:X17,$AC$3:$AC$69),0))),\"\",INDEX($AC$3:$AC$69,MATCH(0,COUNTIF($X$3:X17,$AC$3:$AC$69),0)))","v":""},"","","","",{"$f":"Noblanks(J17:J514)","v":""}]
[null,null,null,null,null,null," "," "," ",null,"","",null,0,null,null,null,null,null,null,null,null,null,{"$f":"IF(ISERROR(INDEX($AC$3:$AC$70,MATCH(0,COUNTIF($X$3:X18,$AC$3:$AC$69),0))),\"\",INDEX($AC$3:$AC$69,MATCH(0,COUNTIF($X$3:X18,$AC$3:$AC$69),0)))","v":""},"","","","",{"$f":"Noblanks(J18:J515)","v":""}]
[null,null,null,null,null,null," "," "," ",null,"","",null,0,null,null,null,null,null,null,null,null,null,{"$f":"IF(ISERROR(INDEX($AC$3:$AC$70,MATCH(0,COUNTIF($X$3:X19,$AC$3:$AC$69),0))),\"\",INDEX($AC$3:$AC$69,MATCH(0,COUNTIF($X$3:X19,$AC$3:$AC$69),0)))","v":""},"","","","",{"$f":"Noblanks(J19:J516)","v":""}]
[null,null,null,null,null,null," ",null,0,null,"","",null,0,null,null,null,null,null,null,null,null,null,{"$f":"IF(ISERROR(INDEX($AC$3:$AC$70,MATCH(0,COUNTIF($X$3:X20,$AC$3:$AC$69),0))),\"\",INDEX($AC$3:$AC$69,MATCH(0,COUNTIF($X$3:X20,$AC$3:$AC$69),0)))","v":""},"","","","",{"$f":"Noblanks(J20:J517)","v":""}]
[null,null,null,null,null,null," ",null,0,null,"","",null,0,null,null,null,null,null,null,null,null,null,{"$f":"IF(ISERROR(INDEX($AC$3:$AC$70,MATCH(0,COUNTIF($X$3:X21,$AC$3:$AC$69),0))),\"\",INDEX($AC$3:$AC$69,MATCH(0,COUNTIF($X$3:X21,$AC$3:$AC$69),0)))","v":""},"","","","",{"$f":"Noblanks(J21:J518)","v":""},null,null,{"$f":"IFERROR(INDEX($J$2:$J$492,SMALL(IF($J$2:$J$492<>\"\",ROW($J$1:$J$492)-ROW($J$2)+1,\"\"),ROWS(AF$21:$AJ22))),\"\")","v":""}]
[null,null,null,null,null,null," ",null,0,null,"","",null,0,null,null,null,null,null,null,null,"Done",null,null,{"$f":"Noblanks(Z25:Z518)","v":""},null,{"$f":"IFERROR(INDEX($J$2:$J$492,SMALL(IF($J$2:$J$492<>\"\",ROW($J$1:$J$492)-ROW($J$2)+1,\"\"),ROWS(AF$21:$AJ23))),\"\")","v":""},"",{"$f":"Noblanks(J22:J519)","v":""}]
[null,null,null,null,null,null," ",null,0,null,"","",null,0,null,null,null,null,null,null,null,"Cancelled",null,null,null,{"$f":"IF(K20=\"\",\"\",J20)","v":""},null,"",{"$f":"Noblanks(J23:J520)","v":""},null,null,{"$f":"IFERROR(INDEX($J$2:$J$492,SMALL(IF($J$2:$J$492<>\"\",ROW($J$1:$J$492)-ROW($J$2)+1,\"\"),ROWS(AF$21:$AJ24))),\"\")","v":""}]
[null,null,null,null,null,null," ",null,0,null,"","",null,0,null,null,null,null,null,null,null,"Refused",null,null,null,"",null,"",{"$f":"Noblanks(J24:J521)","v":""},null,null,{"$f":"IFERROR(INDEX($J$2:$J$492,SMALL(IF($J$2:$J$492<>\"\",ROW($J$1:$J$492)-ROW($J$2)+1,\"\"),ROWS(AF$21:$AJ25))),\"\")","v":""}]
[null,null,null,null,null,null," ",null,0,null,"","",null,0,null,null,null,null,null,null,null,"Green pass.",null,null,null,"",null,"",{"$f":"Noblanks(J25:J522)","v":""}]
[null,null,null,null,null,null," ",null,0,null,"","",null,0,null,null,null,null,null,null,null,"Mistake",null,null,null,"",null,"",{"$f":"Noblanks(J26:J523)","v":""}]
[null,null,null,null,null,null," ",null,0,null,"","",null,0,null,null,null,null,null,null,null,null,null,null,null,"",null,"",{"$f":"Noblanks(J27:J524)","v":""}]
[null,null,null,null,null,null," ",null,0,null,"","",null,0,null,null,null,null,null,null,null,null,null,null,null,"",null,"",{"$f":"Noblanks(J28:J525)","v":""}]
[null,null,null,null,null,null," ",null,0,null,"","",null,0,null,null,null,null,null,null,null,null,null,null,null,"",null,"",{"$f":"Noblanks(J29:J526)","v":""}]
[null,null,null,null,null,null," ",null,0,null,"","",null,0,null,null,null,null,null,null,null,null,null,null,null,"",null,"",{"$f":"Noblanks(J30:J527)","v":""}]
[null,null,null,null,null,null," ",null,0,null,"","",null,0,null,null,null,null,null,null,null,null,null,null,null,"",null,"",{"$f":"Noblanks(J31:J528)","v":""}]
[null,null,null,null,null,null," ",null,0,null,"","",null,0,null,null,null,null,null,null,null,null,null,null,null,"",null,"",{"$f":"Noblanks(J32:J529)","v":""}]
[null,null,null,null,null,null," ",null,0,null,"","",null,0,null,null,null,null,null,null,null,null,null,null,null,"",null,"",{"$f":"Noblanks(J33:J530)","v":""}]
[null,null,null,null,null,null," ",null,0,null,"","",null,0,null,null,null,null,null,null,null,null,null,null,null,"",null,"",{"$f":"Noblanks(J34:J531)","v":""}]
[null,null,null,null,null,null," ",null,0,null,"","",null,0,null,null,null,null,null,null,null,null,null,null,null,"",null,"",{"$f":"Noblanks(J35:J532)","v":""}]
[null,null,null,null,null,null," ",null,0,null,"","",null,0,null,null,null,null,null,null,null,null,null,null,null,"",null,"",{"$f":"Noblanks(J36:J533)","v":""}]
[null,null,null,null,null,null," ",null,0,null,"","",null,0,null,null,null,null,null,null,null,null,null,null,null,"",null,"",{"$f":"Noblanks(J37:J534)","v":""}]
[null,null,null,null,null,null," ",null,0,null,"","",null,0,null,null,null,null,null,null,null,null,null,null,null,"",null,"",{"$f":"Noblanks(J38:J535)","v":""}]
[null,null,null,null,null,null," ",null,0,null,"","",null,0,null,null,null,null,null,null,null,null,null,null,null,"",null,"",{"$f":"Noblanks(J39:J536)","v":""}]
[null,null,null,null,null,null," ",null,0,null,"","",null,0,null,null,null,null,null,null,null,null,null,null,null,"",null,"",{"$f":"Noblanks(J40:J537)","v":""}]
[null,null,null,null,null,null," ",null,0,null,"","",null,0,null,null,null,null,null,null,null,null,null,null,null,"",null,"",{"$f":"Noblanks(J41:J538)","v":""}]
[null,null,null,null,null,null," ",null,0,null,"","",null,0,null,null,null,null,null,null,null,null,null,null,null,"",null,"",{"$f":"Noblanks(J42:J539)","v":""}]
[null,null,null,null,null,null," ",null,0,null,"","",null,0,null,null,null,null,null,null,null,null,null,null,null,"",null,"",{"$f":"Noblanks(J43:J540)","v":""}]
[null,null,null,null,null,null," ",null,0,null,"","",null,0,null,null,null,null,null,null,null,null,null,null,null,"",null,"",{"$f":"Noblanks(J44:J541)","v":""}]
[null,null,null,null,null,null," ",null,0,null,"","",null,0,null,null,null,null,null,null,null,null,null,null,null,"",null,"",{"$f":"Noblanks(J45:J542)","v":""}]
[null,null,null,null,null,null," ",null,0,null,"","",null,0,null,null,null,null,null,null,null,null,null,null,null,"",null,"",{"$f":"Noblanks(J46:J543)","v":""}]
[null,null,null,null,null,null," ",null,0,null,"","",null,0,null,null,null,null,null,null,null,null,null,null,null,"",null,"",{"$f":"Noblanks(J47:J544)","v":""}]
[null,null,null,null,null,null," ",null,0,null,"","",null,0,null,null,null,null,null,null,null,null,null,null,null,"",null,"",{"$f":"Noblanks(J48:J545)","v":""}]
[null,null,null,null,null,null," ",null,0,null,"","",null,0,null,null,null,null,null,null,null,null,null,null,null,"",null,"",{"$f":"Noblanks(J49:J546)","v":""}]
[null,null,null,null,null,null," ",null,0,null,"","",null,0,null,null,null,null,null,null,null,null,null,null,null,"",null,"",{"$f":"Noblanks(J50:J547)","v":""}]
[null,null,null,null,null,null," ",null,0,null,"","",null,0,null,null,null,null,null,null,null,null,null,null,null,"",null,"",{"$f":"Noblanks(J51:J548)","v":""}]
[null,null,null,null,null,null," ",null,0,null,"","",null,0,null,null,null,null,null,null,null,null,null,null,null,"",null,"",{"$f":"Noblanks(J52:J549)","v":""}]
[null,null,null,null,null,null," ",null,0,null,"","",null,0,null,null,null,null,null,null,null,null,null,null,null,"",null,"",{"$f":"Noblanks(J53:J550)","v":""}]
[null,null,null,null,null,null," ",null,0,null,"","",null,0,null,null,null,null,null,null,null,null,null,null,null,"",null,"",{"$f":"Noblanks(J54:J551)","v":""}]
[null,null,null,null,null,null," ",null,0,null,"","",null,0,null,null,null,null,null,null,null,null,null,null,null,"",null,"",{"$f":"Noblanks(J55:J552)","v":""}]
[null,null,null,null,null,null," ",null,0,null,"","",null,0,null,null,null,null,null,null,null,null,null,null,null,"",null,"",{"$f":"Noblanks(J56:J553)","v":""}]
[null,null,null,null,null,null," ",null,0,null,"","",null,0,null,null,null,null,null,null,null,null,null,null,null,"",null,"",{"$f":"Noblanks(J57:J554)","v":""}]
[null,null,null,null,null,null," ",null,0,null,"","",null,0,null,null,null,null,null,null,null,null,null,null,null,"",null,"",{"$f":"Noblanks(J58:J555)","v":""}]
[null,null,null,null,null,null," ",null,0,null,"","",null,0,null,null,null,null,null,null,null,null,null,null,null,"",null,"",{"$f":"Noblanks(J59:J556)","v":""}]
[null,null,null,null,null,null," ",null,0,null,"","",null,0,null,null,null,null,null,null,null,null,null,null,null,"",null,"",{"$f":"Noblanks(J60:J557)","v":""}]
[null,null,null,null,null,null," ",null,0,null,"","",null,0,null,null,null,null,null,null,null,null,null,null,null,"",null,"",{"$f":"Noblanks(J61:J558)","v":""}]
[null,null,null,null,null,null," ",null,0,null,"","",null,0,null,null,null,null,null,null,null,null,null,null,null,"",null,"",{"$f":"Noblanks(J62:J559)","v":""}]
[null,null,null,null,null,null," ",null,0,null,{"$f":"IF(AND(I64=\"\",J64<>\"\"),H64,\"\")","v":""},"",null,0,null,null,null,null,null,null,null,null,null,null,null,"",null,"",{"$f":"Noblanks(J63:J560)","v":""}]
[null,null,null,null,null,null," ",null,0,null,{"$f":"IF(AND(I65=\"\",J65<>\"\"),H65,\"\")","v":""},"",null,0,null,null,null,null,null,null,null,null,null,null,null,"",null,"",{"$f":"Noblanks(J64:J561)","v":""}]
[null,null,null,null,null,null," ",null,{"$f":"IF(J66<>\"\",\"\",H66)","v":0},null,"","",null,0,null,null,null,null,null,null,null,null,null,null,null,"",null,"",{"$f":"Noblanks(J65:J562)","v":""}]
[null,null,null,null,null,null," ",null,0,null,"",{"$f":"IF(C67=\"\",\"\",25)","v":""},null,{"$f":"IF(M67=\"Extractor\",62.5,0)","v":0},null,null,null,null,null,null,null,null,null,null,null,"",null,"",{"$f":"Noblanks(J66:J563)","v":""}]
[null,null,null,null,null,null," ",null,0,null,"","",null,0,null,null,null,null,null,null,null,null,null,null,null,"",null,"",{"$f":"Noblanks(J67:J564)","v":""}]
[null,null,null,null,null,null," ",null,0,null,"","",null,0,null,null,null,null,null,null,null,null,null,null,null,"",null,{"$f":"IF(K67=\"\",\"\",J67)","v":""},{"$f":"Noblanks(J68:J565)","v":""}]
[null,null,null,null,null,null," ",null,0,null,"","",null,0,null,null,null,null,null,null,null,null,null,null,null,"",null,"",{"$f":"Noblanks(J69:J566)","v":""}]
[null,null,null,null,null,null," "," ",null,null,null,null,null,null,null,null,null,null,null,null,null,null,null,null,null,"",null,"",{"$f":"Noblanks(J70:J567)","v":""}]
[null,null,null,null,null,null," "," ",null,null,null,null,null,null,null,null,null,null,null,null,null,null,null,null,null,"",null,null,{"$f":"Noblanks(J71:J568)","v":""}]
[null,null,null,null,null,null," "," ",null,null,null,null,null,null,null,null,null,null,null,null,null,null,null,null,null,"",null,null,{"$f":"Noblanks(J72:J569)","v":""}]
[null,null,null,null,null,null," "," ",null,null,null,null,null,null,null,null,null,null,null,null,null,null,null,null,null,"",null,null,{"$f":"Noblanks(J73:J570)","v":""}]
[null,null,null,null,null,null," "," ",null,null,null,null,null,null,null,null,null,null,null,null,null,null,null,null,null,"",null,null,{"$f":"Noblanks(J74:J571)","v":""}]
[null,null,null,null,null,null," "," ",null,null,null,null,null,null,null,null,null,null,null,null,null,null,null,null,null,"",null,null,{"$f":"Noblanks(J75:J572)","v":""}]
[null,null,null,null,null,null," "," ",null,null,null,null,null,null,null,null,null,null,null,null,null,null,null,null,null,"",null,null,{"$f":"Noblanks(J76:J573)","v":""}]
[null,null,null,null,null,null," "," ",null,null,null,null,null,null,null,null,null,null,null,null,null,null,null,null,null,"",null,null,{"$f":"Noblanks(J77:J574)","v":""}]
[null,null,null,null,null,null," "," ",null,null,null,null,null,null,null,null,null,null,null,null,null,null,null,null,null,"",null,null,{"$f":"Noblanks(J78:J575)","v":""}]
[null,null,null,null,null,null," "," ",null,null,null,null,null,null,null,null,null,null,null,null,null,null,null,null,null,"",null,null,{"$f":"Noblanks(J79:J576)","v":""}]
[null,null,null,null,null,null," "," ",null,null,null,null,null,null,null,null,null,null,null,null,null,null,null,null,null,"",null,null,{"$f":"Noblanks(J80:J577)","v":""}]
[null,null,null,null,null,null," "," ",null,null,null,null,null,null,null,null,null,null,null,null,null,null,null,null,null,"",null,null,{"$f":"Noblanks(J81:J578)","v":""}]
[null,null,null,null,null,null," "," ",null,null,null,null,null,null,null,null,null,null,null,null,null,null,null,null,null,"",null,null,{"$f":"Noblanks(J82:J579)","v":""}]
[null,null,null,null,null,null," "," ",null,null,null,null,null,null,null,null,null,null,null,null,null,null,null,null,null,"",null,null,{"$f":"Noblanks(J83:J580)","v":""}]
[null,null,null,null,null,null," "," ",null,null,null,null,null,null,null,null,null,null,null,null,null,null,null,null,null,"",null,null,{"$f":"Noblanks(J84:J581)","v":""}]
[null,null,null,null,null,null," "," ",null,null,null,null,null,null,null,null,null,null,null,null,null,null,null,null,null,"",null,null,{"$f":"Noblanks(J85:J582)","v":""}]
[null,null,null,null,null,null," "," ",null,null,null,null,null,null,null,null,null,null,null,null,null,null,null,null,null,"",null,null,{"$f":"Noblanks(J86:J583)","v":""}]
[null,null,null,null,null,null," "," ",null,null,null,null,null,null,null,null,null,null,null,null,null,null,null,null,null,{"$f":"IF(K84=\"\",\"\",J84)","v":""},null,null,{"$f":"Noblanks(J87:J584)","v":""}]
[null,null,null,null,null,null," "," ",null,null,null,null,null,null,null,null,null,null,null,null,null,null,null,null,null,"",null,null,{"$f":"Noblanks(J88:J585)","v":""}]
[null,null,null,null,null,null," "," ",null,null,null,null,null,null,null,null,null,null,null,null,null,null,null,null,null,"",null,null,{"$f":"Noblanks(J89:J586)","v":""}]
[null,null,null,null,null,null," "," ",null,null,null,null,null,null,null,null,null,null,null,null,null,null,null,null,null,"",null,null,{"$f":"Noblanks(J90:J587)","v":""}]
[null,null,null,null,null,null," "," ",null,null,null,null,null,null,null,null,null,null,null,null,null,null,null,null,null,"",null,null,{"$f":"Noblanks(J91:J588)","v":""}]
[null,null,null,null,null,null," "," ",null,null,null,null,null,null,null,null,null,null,null,null,null,null,null,null,null,"",null,null,{"$f":"Noblanks(J92:J589)","v":""}]
[null,null,null,null,null,null," ",null,null,null,null,null,null,null,null,null,null,null,null,null,null,null,null,null,null,"",null,null,{"$f":"Noblanks(J93:J590)","v":""}]
[null,null,null,null,null,null," ",null,null,null,null,null,null,null,null,null,null,null,null,null,null,null,null,null,null,"",null,null,{"$f":"Noblanks(J94:J591)","v":""}]
[null,null,null,null,null,null," ",null,null,null,null,null,null,null,null,null,null,null,null,null,null,null,null,null,null,"",null,null,{"$f":"Noblanks(J95:J592)","v":""}]
[null,null,null,null,null,null," ",null,null,null,null,null,null,null,null,null,null,null,null,null,null,null,null,null,null,"",null,null,{"$f":"Noblanks(J96:J593)","v":""}]
[null,null,null,null,null,null," ",null,null,null,null,null,null,null,null,null,null,null,null,null,null,null,null,null,null,"",null,null,{"$f":"Noblanks(J97:J594)","v":""}]
[null,null,null,null,null,null," ",null,null,null,null,null,null,null,null,null,null,null,null,null,null,null,null,null,null,"",null,null,{"$f":"Noblanks(J98:J595)","v":""}]
[null,null,null,null,null,null," ",null,null,null,null,null,null,null,null,null,null,null,null,null,null,null,null,null,null,"",null,null,{"$f":"Noblanks(J99:J596)","v":""}]
[null,null,null,null,null,null," ",null,null,null,null,null,null,null,null,null,null,null,null,null,null,null,null,null,null,"",null,null,{"$f":"Noblanks(J100:J597)","v":""}]
[null,null,null,null,null,null," ",null,null,null,null,null,null,null,null,null,null,null,null,null,null,null,null,null,null,"",null,null,{"$f":"Noblanks(J101:J598)","v":""}]
[null,null,null,null,null,null," ",null,null,null,null,null,null,null,null,null,null,null,null,null,null,null,null,null,null,null,null,null,{"$f":"Noblanks(J102:J599)","v":""}]
[null,null,null,null,null,null," ",null,null,null,null,null,null,null,null,null,null,null,null,null,null,null,null,null,null,null,null,null,{"$f":"Noblanks(J103:J600)","v":""}]
[null,null,null,null,null,null," ",null,null,null,null,null,null,null,null,null,null,null,null,null,null,null,null,null,null,null,null,null,{"$f":"Noblanks(J104:J601)","v":""}]
[null,null,null,null,null,null," ",null,null,null,null,null,null,null,null,null,null,null,null,null,null,null,null,null,null,null,null,null,{"$f":"Noblanks(J105:J602)","v":""}]
[null,null,null,null,null,null," ",null,null,null,null,null,null,null,null,null,null,null,null,null,null,null,null,null,null,null,null,null,{"$f":"Noblanks(J106:J603)","v":""}]
[null,null,null,null,null,null," ",null,null,null,null,null,null,null,null,null,null,null,null,null,null,null,null,null,null,null,null,null,{"$f":"Noblanks(J107:J604)","v":""}]
[null,null,null,null,null,null," ",null,null,null,null,null,null,null,null,null,null,null,null,null,null,null,null,null,null,null,null,null,{"$f":"Noblanks(J108:J605)","v":""}]
[null,null,null,null,null,null," ",null,null,null,null,null,null,null,null,null,null,null,null,null,null,null,null,null,null,null,null,null,{"$f":"Noblanks(J109:J606)","v":""}]
[null,null,null,null,null,null," ",null,null,null,null,null,null,null,null,null,null,null,null,null,null,null,null,null,null,null,null,null,{"$f":"Noblanks(J110:J607)","v":""}]
[null,null,null,null,null,null," ",null,null,null,null,null,null,null,null,null,null,null,null,null,null,null,null,null,null,null,null,null,{"$f":"Noblanks(J111:J608)","v":""}]
[null,null,null,null,null,null," ",null,null,null,null,null,null,null,null,null,null,null,null,null,null,null,null,null,null,null,null,null,{"$f":"Noblanks(J112:J609)","v":""}]
[null,null,null,null,null,null," ",null,null,null,null,null,null,null,null,null,null,null,null,null,null,null,null,null,null,null,null,null,{"$f":"Noblanks(J113:J610)","v":""}]
[null,null,null,null,null,null," ",null,null,null,null,null,null,null,null,null,null,null,null,null,null,null,null,null,null,null,null,null,{"$f":"Noblanks(J114:J611)","v":""}]
[null,null,null,null,null,null," ",null,null,null,null,null,null,null,null,null,null,null,null,null,null,null,null,null,null,null,null,null,{"$f":"Noblanks(J115:J612)","v":""}]
[null,null,null,null,null,null," ",null,null,null,null,null,null,null,null,null,null,null,null,null,null,null,null,null,null,null,null,null,{"$f":"Noblanks(J116:J613)","v":""}]
[null,null,null,null,null,null," ",null,null,null,null,null,null,null,null,null,null,null,null,null,null,null,null,null,null,null,null,null,{"$f":"Noblanks(J117:J614)","v":""}]
[null,null,null,null,null,null," ",null,null,null,null,null,null,null,null,null,null,null,null,null,null,null,null,null,null,null,null,null,{"$f":"Noblanks(J118:J615)","v":""}]
[null,null,null,null,null,null," ",null,null,null,null,null,null,null,null,null,null,null,null,null,null,null,null,null,null,null,null,null,{"$f":"Noblanks(J119:J616)","v":""}]
[null,null,null,null,null,null," ",null,null,null,null,null,null,null,null,null,null,null,null,null,null,null,null,null,null,null,null,null,{"$f":"Noblanks(J120:J617)","v":""}]
[null,null,null,null,null,null," ",null,null,null,null,null,null,null,null,null,null,null,null,null,null,null,null,null,null,null,null,null,{"$f":"Noblanks(J121:J618)","v":""}]
[null,null,null,null,null,null," ",null,null,null,null,null,null,null,null,null,null,null,null,null,null,null,null,null,null,null,null,null,{"$f":"Noblanks(J122:J619)","v":""}]
[null,null,null,null,null,null," ",null,null,null,null,null,null,null,null,null,null,null,null,null,null,null,null,null,null,null,null,null,{"$f":"Noblanks(J123:J620)","v":""}]
[null,null,null,null,null,null," ",null,null,null,null,null,null,null,null,null,null,null,null,null,null,null,null,null,null,null,null,null,{"$f":"Noblanks(J124:J621)","v":""}]
[null,null,null,null,null,null," ",null,null,null,null,null,null,null,null,null,null,null,null,null,null,null,null,null,null,null,null,null,{"$f":"Noblanks(J125:J622)","v":""}]
[null,null,null,null,null,null," ",null,null,null,null,null,null,null,null,null,null,null,null,null,null,null,null,null,null,null,null,null,{"$f":"Noblanks(J126:J623)","v":""}]
[null,null,null,null,null,null," ",null,null,null,null,null,null,null,null,null,null,null,null,null,null,null,null,null,null,null,null,null,{"$f":"Noblanks(J127:J624)","v":""}]
[null,null,null,null,null,null," ",null,null,null,null,null,null,null,null,null,null,null,null,null,null,null,null,null,null,null,null,null,{"$f":"Noblanks(J128:J625)","v":""}]
[null,null,null,null,null,null," ",null,null,null,null,null,null,null,null,null,null,null,null,null,null,null,null,null,null,null,null,null,{"$f":"Noblanks(J129:J626)","v":""}]
[null,null,null,null,null,null," ",null,null,null,null,null,null,null,null,null,null,null,null,null,null,null,null,null,null,null,null,null,{"$f":"Noblanks(J130:J627)","v":""}]
[null,null,null,null,null,null," ",null,null,null,null,null,null,null,null,null,null,null,null,null,null,null,null,null,null,null,null,null,{"$f":"Noblanks(J131:J628)","v":""}]
[null,null,null,null,null,null," ",null,null,null,null,null,null,null,null,null,null,null,null,null,null,null,null,null,null,null,null,null,{"$f":"Noblanks(J132:J629)","v":""}]
[null,null,null,null,null,null," ",null,null,null,null,null,null,null,null,null,null,null,null,null,null,null,null,null,null,null,null,null,{"$f":"Noblanks(J133:J630)","v":""}]
[null,null,null,null,null,null," ",null,null,null,null,null,null,null,null,null,null,null,null,null,null,null,null,null,null,null,null,null,{"$f":"Noblanks(J134:J631)","v":""}]
[null,null,null,null,null,null," ",null,null,null,null,null,null,null,null,null,null,null,null,null,null,null,null,null,null,null,null,null,{"$f":"Noblanks(J135:J632)","v":""}]
[null,null,null,null,null,null," ",null,null,null,null,null,null,null,null,null,null,null,null,null,null,null,null,null,null,null,null,null,{"$f":"Noblanks(J136:J633)","v":""}]
[null,null,null,null,null,null," ",null,null,null,null,null,null,null,null,null,null,null,null,null,null,null,null,null,null,null,null,null,{"$f":"Noblanks(J137:J634)","v":""}]
[null,null,null,null,null,null," ",null,null,null,null,null,null,null,null,null,null,null,null,null,null,null,null,null,null,null,null,null,{"$f":"Noblanks(J138:J635)","v":""}]
[null,null,null,null,null,null," ",null,null,null,null,null,null,null,null,null,null,null,null,null,null,null,null,null,null,null,null,null,{"$f":"Noblanks(J139:J636)","v":""}]
[null,null,null,null,null,null," ",null,null,null,null,null,null,null,null,null,null,null,null,null,null,null,null,null,null,null,null,null,{"$f":"Noblanks(J140:J637)","v":""}]
[null,null,null,null,null,null," ",null,null,null,null,null,null,null,null,null,null,null,null,null,null,null,null,null,null,null,null,null,{"$f":"Noblanks(J141:J638)","v":""}]
[null,null,null,null,null,null," ",null,null,null,null,null,null,null,null,null,null,null,null,null,null,null,null,null,null,null,null,null,{"$f":"Noblanks(J142:J639)","v":""}]
[null,null,null,null,null,null," ",null,null,null,null,null,null,null,null,null,null,null,null,null,null,null,null,null,null,null,null,null,{"$f":"Noblanks(J143:J640)","v":""}]
[null,null,null,null,null,null," ",null,null,null,null,null,null,null,null,null,null,null,null,null,null,null,null,null,null,null,null,null,{"$f":"Noblanks(J144:J641)","v":""}]
[null,null,null,null,null,null," ",null,null,null,null,null,null,null,null,null,null,null,null,null,null,null,null,null,null,null,null,null,{"$f":"Noblanks(J145:J642)","v":""}]
[null,null,null,null,null,null," ",null,null,null,null,null,null,null,null,null,null,null,null,null,null,null,null,null,null,null,null,null,{"$f":"Noblanks(J146:J643)","v":""}]
[null,null,null,null,null,null," ",null,null,null,null,null,null,null,null,null,null,null,null,null,null,null,null,null,null,null,null,null,{"$f":"Noblanks(J147:J644)","v":""}]
[null,null,null,null,null,null," ",null,null,null,null,null,null,null,null,null,null,null,null,null,null,null,null,null,null,null,null,null,{"$f":"Noblanks(J148:J645)","v":""}]
[null,null,null,null,null,null," ",null,null,null,null,null,null,null,null,null,null,null,null,null,null,null,null,null,null,null,null,null,{"$f":"Noblanks(J149:J646)","v":""}]
[null,null,null,null,null,null," ",null,null,null,null,null,null,null,null,null,null,null,null,null,null,null,null,null,null,null,null,null,{"$f":"Noblanks(J150:J647)","v":""}]
[null,null,null,null,null,null," ",null,null,null,null,null,null,null,null,null,null,null,null,null,null,null,null,null,null,null,null,null,{"$f":"Noblanks(J151:J648)","v":""}]
[null,null,null,null,null,null," ",null,null,null,null,null,null,null,null,null,null,null,null,null,null,null,null,null,null,null,null,null,{"$f":"Noblanks(J152:J649)","v":""}]
[null,null,null,null,null,null," ",null,null,null,null,null,null,null,null,null,null,null,null,null,null,null,null,null,null,null,null,null,{"$f":"Noblanks(J153:J650)","v":""}]
[null,null,null,null,null,null," ",null,null,null,null,null,null,null,null,null,null,null,null,null,null,null,null,null,null,null,null,null,{"$f":"Noblanks(J154:J651)","v":""}]
[null,null,null,null,null,null," ",null,null,null,null,null,null,null,null,null,null,null,null,null,null,null,null,null,null,null,null,null,{"$f":"Noblanks(J155:J652)","v":""}]
[null,null,null,null,null,null," ",null,null,null,null,null,null,null,null,null,null,null,null,null,null,null,null,null,null,null,null,null,{"$f":"Noblanks(J156:J653)","v":""}]
[null,null,null,null,null,null," ",null,null,null,null,null,null,null,null,null,null,null,null,null,null,null,null,null,null,null,null,null,{"$f":"Noblanks(J157:J654)","v":""}]
[null,null,null,null,null,null," ",null,null,null,null,null,null,null,null,null,null,null,null,null,null,null,null,null,null,null,null,null,{"$f":"Noblanks(J158:J655)","v":""}]
[null,null,null,null,null,null," ",null,null,null,null,null,null,null,null,null,null,null,null,null,null,null,null,null,null,null,null,null,{"$f":"Noblanks(J159:J656)","v":""}]
[null,null,null,null,null,null," ",null,null,null,null,null,null,null,null,null,null,null,null,null,null,null,null,null,null,null,null,null,{"$f":"Noblanks(J160:J657)","v":""}]
[null,null,null,null,null,null," ",null,null,null,null,null,null,null,null,null,null,null,null,null,null,null,null,null,null,null,null,null,{"$f":"Noblanks(J161:J658)","v":""}]
[null,null,null,null,null,null," ",null,null,null,null,null,null,null,null,null,null,null,null,null,null,null,null,null,null,null,null,null,{"$f":"Noblanks(J162:J659)","v":""}]
[null,null,null,null,null,null," ",null,null,null,null,null,null,null,null,null,null,null,null,null,null,null,null,null,null,null,null,null,{"$f":"Noblanks(J163:J660)","v":""}]
[null,null,null,null,null,null," ",null,null,null,null,null,null,null,null,null,null,null,null,null,null,null,null,null,null,null,null,null,{"$f":"Noblanks(J164:J661)","v":""}]
[null,null,null,null,null,null," ",null,null,null,null,null,null,null,null,null,null,null,null,null,null,null,null,null,null,null,null,null,{"$f":"Noblanks(J165:J662)","v":""}]
[null,null,null,null,null,null," ",null,null,null,null,null,null,null,null,null,null,null,null,null,null,null,null,null,null,null,null,null,{"$f":"Noblanks(J166:J663)","v":""}]
[null,null,null,null,null,null," ",null,null,null,null,null,null,null,null,null,null,null,null,null,null,null,null,null,null,null,null,null,{"$f":"Noblanks(J167:J664)","v":""}]
[null,null,null,null,null,null," ",null,null,null,null,null,null,null,null,null,null,null,null,null,null,null,null,null,null,null,null,null,{"$f":"Noblanks(J168:J665)","v":""}]
[null,null,null,null,null,null," ",null,null,null,null,null,null,null,null,null,null,null,null,null,null,null,null,null,null,null,null,null,{"$f":"Noblanks(J169:J666)","v":""}]
[null,null,null,null,null,null," ",null,null,null,null,null,null,null,null,null,null,null,null,null,null,null,null,null,null,null,null,null,{"$f":"Noblanks(J170:J667)","v":""}]
[null,null,null,null,null,null," ",null,null,null,null,null,null,null,null,null,null,null,null,null,null,null,null,null,null,null,null,null,{"$f":"Noblanks(J171:J668)","v":""}]
[null,null,null,null,null,null," ",null,null,null,null,null,null,null,null,null,null,null,null,null,null,null,null,null,null,null,null,null,{"$f":"Noblanks(J172:J669)","v":""}]
[null,null,null,null,null,null," ",null,null,null,null,null,null,null,null,null,null,null,null,null,null,null,null,null,null,null,null,null,{"$f":"Noblanks(J173:J670)","v":""}]
[null,null,null,null,null,null," ",null,null,null,null,null,null,null,null,null,null,null,null,null,null,null,null,null,null,null,null,null,{"$f":"Noblanks(J174:J671)","v":""}]
[null,null,null,null,null,null," ",null,null,null,null,null,null,null,null,null,null,null,null,null,null,null,null,null,null,null,null,null,{"$f":"Noblanks(J175:J672)","v":""}]
[null,null,null,null,null,null," ",null,null,null,null,null,null,null,null,null,null,null,null,null,null,null,null,null,null,null,null,null,{"$f":"Noblanks(J176:J673)","v":""}]
[null,null,null,null,null,null," ",null,null,null,null,null,null,null,null,null,null,null,null,null,null,null,null,null,null,null,null,null,{"$f":"Noblanks(J177:J674)","v":""}]
[null,null,null,null,null,null," ",null,null,null,null,null,null,null,null,null,null,null,null,null,null,null,null,null,null,null,null,null,{"$f":"Noblanks(J178:J675)","v":""}]
[null,null,null,null,null,null," ",null,null,null,null,null,null,null,null,null,null,null,null,null,null,null,null,null,null,null,null,null,{"$f":"Noblanks(J179:J676)","v":""}]
[null,null,null,null,null,null," ",null,null,null,null,null,null,null,null,null,null,null,null,null,null,null,null,null,null,null,null,null,{"$f":"Noblanks(J180:J677)","v":""}]
[null,null,null,null,null,null," ",null,null,null,null,null,null,null,null,null,null,null,null,null,null,null,null,null,null,null,null,null,{"$f":"Noblanks(J181:J678)","v":""}]
[null,null,null,null,null,null," ",null,null,null,null,null,null,null,null,null,null,null,null,null,null,null,null,null,null,null,null,null,{"$f":"Noblanks(J182:J679)","v":""}]
[null,null,null,null,null,null," ",null,null,null,null,null,null,null,null,null,null,null,null,null,null,null,null,null,null,null,null,null,{"$f":"Noblanks(J183:J680)","v":""}]
[null,null,null,null,null,null," ",null,null,null,null,null,null,null,null,null,null,null,null,null,null,null,null,null,null,null,null,null,{"$f":"Noblanks(J184:J681)","v":""}]
[null,null,null,null,null,null," ",null,null,null,null,null,null,null,null,null,null,null,null,null,null,null,null,null,null,null,null,null,{"$f":"Noblanks(J185:J682)","v":""}]
[null,null,null,null,null,null," ",null,null,null,null,null,null,null,null,null,null,null,null,null,null,null,null,null,null,null,null,null,{"$f":"Noblanks(J186:J683)","v":""}]
[null,null,null,null,null,null," ",null,null,null,null,null,null,null,null,null,null,null,null,null,null,null,null,null,null,null,null,null,{"$f":"Noblanks(J187:J684)","v":""}]
[null,null,null,null,null,null," ",null,null,null,null,null,null,null,null,null,null,null,null,null,null,null,null,null,null,null,null,null,{"$f":"Noblanks(J188:J685)","v":""}]
[null,null,null,null,null,null," ",null,null,null,null,null,null,null,null,null,null,null,null,null,null,null,null,null,null,null,null,null,{"$f":"Noblanks(J189:J686)","v":""}]
[null,null,null,null,null,null," ",null,null,null,null,null,null,null,null,null,null,null,null,null,null,null,null,null,null,null,null,null,{"$f":"Noblanks(J190:J687)","v":""}]
[null,null,null,null,null,null," ",null,null,null,null,null,null,null,null,null,null,null,null,null,null,null,null,null,null,null,null,null,{"$f":"Noblanks(J191:J688)","v":""}]
[null,null,null,null,null,null," ",null,null,null,null,null,null,null,null,null,null,null,null,null,null,null,null,null,null,null,null,null,{"$f":"Noblanks(J192:J689)","v":""}]
[null,null,null,null,null,null," ",null,null,null,null,null,null,null,null,null,null,null,null,null,null,null,null,null,null,null,null,null,{"$f":"Noblanks(J193:J690)","v":""}]
[null,null,null,null,null,null," ",null,null,null,null,null,null,null,null,null,null,null,null,null,null,null,null,null,null,null,null,null,{"$f":"Noblanks(J194:J691)","v":""}]
[null,null,null,null,null,null," ",null,null,null,null,null,null,null,null,null,null,null,null,null,null,null,null,null,null,null,null,null,{"$f":"Noblanks(J195:J692)","v":""}]
[null,null,null,null,null,null," ",null,null,null,null,null,null,null,null,null,null,null,null,null,null,null,null,null,null,null,null,null,{"$f":"Noblanks(J196:J693)","v":""}]
[null,null,null,null,null,null," ",null,null,null,null,null,null,null,null,null,null,null,null,null,null,null,null,null,null,null,null,null,{"$f":"Noblanks(J197:J694)","v":""}]
[null,null,null,null,null,null," "]
[null,null,null,null,null,null," "]
[null,null,null,null,null,null," "]
[null,null,null,null,null,null," "]
[null,null,null,null,null,null," "]
[null,null,null,null,null,null," "]
[null,null,null,null,null,null," "]
[null,null,null,null,null,null," "]
[null,null,null,null,null,null," "]
[null,null,null,null,null,null," "]
[null,null,null,null,null,null," "]
[null,null,null,null,null,null," "]
[null,null,null,null,null,null," "]
[null,null,null,null,null,null," "]
[null,null,null,null,null,null," "]
[null,null,null,null,null,null," "]
[null,null,null,null,null,null," "]
[null,null,null,null,null,null," "]
[null,null,null,null,null,null," "]
[null,null,null,null,null,null," "]
[null,null,null,null,null,null," "]
[null,null,null,null,null,null," "]
[null,null,null,null,null,null," "]
[null,null,null,null,null,null," "]
[null,null,null,null,null,null," "]
[null,null,null,null,null,null," "]
[null,null,null,null,null,null," "]
[null,null,null,null,null,null," "]
[null,null,null,null,null,null," "]
[null,null,null,null,null,null," "]
[null,null,null,null,null,null," "]
[null,null,null,null,null,null," "]
[null,null,null,null,null,null," "]
[null,null,null,null,null,null," "]
[null,null,null,null,null,null," "]
[null,null,null,null,null,null," "]
[null,null,null,null,null,null," "]
[null,null,null,null,null,null," "]
[null,null,null,null,null,null," "]
[null,null,null,null,null,null," "]
[null,null,null,null,null,null," "]
[null,null,null,null,null,null," "]
[null,null,null,null,null,null," "]
[null,null,null,null,null,null," "]
[null,null,null,null,null,null," "]
[null,null,null,null,null,null," "]
[null,null,null,null,null,null," "]
[null,null,null,null,null,null," "]
[null,null,null,null,null,null," "]
[null,null,null,null,null,null," "]
[null,null,null,null,null,null," "]
[null,null,null,null,null,null," "]
[null,null,null,null,null,null," "]
[null,null,null,null,null,null," "]
[null,null,null,null,null,null," "]
[null,null,null,null,null,null," "]
[null,null,null,null,null,null," "]
[null,null,null,null,null,null," "]
[null,null,null,null,null,null," "]
[null,null,null,null,null,null," "]
[null,null,null,null,null,null," "]
[null,null,null,null,null,null," "]
[null,null,null,null,null,null," "]
[null,null,null,null,null,null," "]
[null,null,null,null,null,null," "]
[null,null,null,null,null,null," "]
[null,null,null,null,null,null," "]
[null,null,null,null,null,null," "]
[null,null,null,null,null,null," "]
[null,null,null,null,null,null," "]
[null,null,null,null,null,null," "]
[null,null,null,null,null,null," "]
[null,null,null,null,null,null," "]
[null,null,null,null,null,null," "]
[null,null,null,null,null,null," "]
[null,null,null,null,null,null," "]
[null,null,null,null,null,null," "]
[null,null,null,null,null,null," "]
[null,null,null,null,null,null," "]
[null,null,null,null,null,null," "]
[null,null,null,null,null,null," "]
[null,null,null,null,null,null," "]
[null,null,null,null,null,null," "]
[null,null,null,null,null,null," "]
[null,null,null,null,null,null," "]
[null,null,null,null,null,null," "]
[null,null,null,null,null,null," "]
[null,null,null,null,null,null," "]
[null,null,null,null,null,null," "]
[null,null,null,null,null,null," "]
[null,null,null,null,null,null," "]
[null,null,null,null,null,null," "]
[null,null,null,null,null,null," "]
[null,null,null,null,null,null," "]
[null,null,null,null,null,null," "]
[null,null,null,null,null,null," "]
[null,null,null,null,null,null," "]
[null,null,null,null,null,null," "]
[null,null,null,null,null,null," "]
[null,null,null,null,null,null," "]
[null,null,null,null,null,null," "]
[null,null,null,null,null,null," "]
[null,null,null,null,null,null," "]
[null,null,null,null,null,null," "]
[null,null,null,null,null,null," "]
[null,null,null,null,null,null," "]
[null,null,null,null,null,null," "]
[null,null,null,null,null,null," "]
[null,null,null,null,null,null," "]
[null,null,null,null,null,null," "]
[null,null,null,null,null,null," "]
[null,null,null,null,null,null," "]
[null,null,null,null,null,null," "]
[null,null,null,null,null,null," "]
[null,null,null,null,null,null," "]
[null,null,null,null,null,null," "]
[null,null,null,null,null,null," "]
[null,null,null,null,null,null," "]
[null,null,null,null,null,null," "]
[null,null,null,null,null,null," "]
[null,null,null,null,null,null," "]
[null,null,null,null,null,null," "]
[null,null,null,null,null,null," "]
[null,null,null,null,null,null," "]
[null,null,null,null,null,null," "]
[null,null,null,null,null,null," "]
[null,null,null,null,null,null," "]
[null,null,null,null,null,null," "]
[null,null,null,null,null,null," "]
[null,null,null,null,null,null," "]
[null,null,null,null,null,null," "]
[null,null,null,null,null,null," "]
[null,null,null,null,null,null," "]
[null,null,null,null,null,null," "]
[null,null,null,null,null,null," "]
[null,null,null,null,null,null," "]
[null,null,null,null,null,null," "]
[null,null,null,null,null,null," "]
[null,null,null,null,null,null," "]
[null,null,null,null,null,null," "]
[null,null,null,null,null,null," "]
[null,null,null,null,null,null," "]
[null,null,null,null,null,null," "]
[null,null,null,null,null,null," "]
[null,null,null,null,null,null," "]
[null,null,null,null,null,null," "]
[null,null,null,null,null,null," "]
[null,null,null,null,null,null," "]
[null,null,null,null,null,null," "]
[null,null,null,null,null,null," "]
[null,null,null,null,null,null," "]
[null,null,null,null,null,null," "]
[null,null,null,null,null,null," "]
[null,null,null,null,null,null," "]
[null,null,null,null,null,null," "]
[null,null,null,null,null,null," "]
[null,null,null,null,null,null," "]
[null,null,null,null,null,null," "]
[null,null,null,null,null,null," "]
[null,null,null,null,null,null," "]
[null,null,null,null,null,null," "]
[null,null,null,null,null,null," "]
[null,null,null,null,null,null," "]
[null,null,null,null,null,null," "]
[null,null,null,null,null,null," "]
[null,null,null,null,null,null," "]
[null,null,null,null,null,null," "]
[null,null,null,null,null,null," "]
[null,null,null,null,null,null," "]
[null,null,null,null,null,null," "]
[null,null,null,null,null,null," "]
[null,null,null,null,null,null," "]
[null,null,null,null,null,null," "]
[null,null,null,null,null,null," "]
[null,null,null,null,null,null," "]
[null,null,null,null,null,null," "]
[null,null,null,null,null,null," "]
[null,null,null,null,null,null," "]
[null,null,null,null,null,null," "]
[null,null,null,null,null,null," "]
[null,null,null,null,null,null," "]
[null,null,null,null,null,null," "]
[null,null,null,null,null,null," "]
[null,null,null,null,null,null," "]
[null,null,null,null,null,null," "]
[null,null,null,null,null,null," "]
[null,null,null,null,null,null," "]
[null,null,null,null,null,null," "]
[null,null,null,null,null,null," "]
[null,null,null,null,null,null," "]
[null,null,null,null,null,null," "]
[null,null,null,null,null,null," "]
[null,null,null,null,null,null," "]
[null,null,null,null,null,null," "]
[null,null,null,null,null,null," "]
[null,null,null,null,null,null," "]
[null,null,null,null,null,null," "]
[null,null,null,null,null,null," "]
[null,null,null,null,null,null," "]
[null,null,null,null,null,null," "]
[null,null,null,null,null,null," "]
[null,null,null,null,null,null," "]
[null,null,null,null,null,null," "]
[null,null,null,null,null,null," "]
[null,null,null,null,null,null," "]
[null,null,null,null,null,null," "]
[null,null,null,null,null,null," "]
[null,null,null,null,null,null," "]
[null,null,null,null,null,null," "]
[null,null,null,null,null,null," "]
[null,null,null,null,null,null," "]
[null,null,null,null,null,null," "]
[null,null,null,null,null,null," "]
[null,null,null,null,null,null," "]
[null,null,null,null,null,null," "]
[null,null,null,null,null,null," "]
[null,null,null,null,null,null," "]
[null,null,null,null,null,null," "]
[null,null,null,null,null,null," "]
[null,null,null,null,null,null," "]
[null,null,null,null,null,null," "]
[null,null,null,null,null,null," "]
[null,null,null,null,null,null," "]
[null,null,null,null,null,null," "]
[null,null,null,null,null,null," "]
[null,null,null,null,null,null," "]
[null,null,null,null,null,null," "]
[null,null,null,null,null,null," "]
[null,null,null,null,null,null," "]
[null,null,null,null,null,null," "]
[null,null,null,null,null,null," "]
[null,null,null,null,null,null," "]
[null,null,null,null,null,null," "]
[null,null,null,null,null,null," "]
[null,null,null,null,null,null," "]
[null,null,null,null,null,null," "]
[null,null,null,null,null,null," "]
[null,null,null,null,null,null," "]
[null,null,null,null,null,null," "]
[null,null,null,null,null,null," "]
[null,null,null,null,null,null," "]
[null,null,null,null,null,null," "]
[null,null,null,null,null,null," "]
[null,null,null,null,null,null," "]
[null,null,null,null,null,null," "]
[null,null,null,null,null,null," "]
[null,null,null,null,null,null," "]
[null,null,null,null,null,null," "]
[null,null,null,null,null,null," "]
[null,null,null,null,null,null," "]
[null,null,null,null,null,null," "]
[null,null,null,null,null,null," "]
[null,null,null,null,null,null," "]
[null,null,null,null,null,null," "]
[null,null,null,null,null,null," "]
[null,null,null,null,null,null," "]
[null,null,null,null,null,null," "]
[null,null,null,null,null,null," "]
[null,null,null,null,null,null," "]
[null,null,null,null,null,null," "]
[null,null,null,null,null,null," "]
[null,null,null,null,null,null," "]
[null,null,null,null,null,null," "]
[null,null,null,null,null,null," "]
[null,null,null,null,null,null," "]
[null,null,null,null,null,null," "]
[null,null,null,null,null,null," "]
[null,null,null,null,null,null," "]
[null,null,null,null,null,null," "]
[null,null,null,null,null,null," "]
[null,null,null,null,null,null," "]
[null,null,null,null,null,null," "]
[null,null,null,null,null,null," "]
[null,null,null,null,null,null," "]
[null,null,null,null,null,null," "]
[null,null,null,null,null,null," "]
[null,null,null,null,null,null," "]
[null,null,null,null,null,null," "]
[null,null,null,null,null,null," "]
[null,null,null,null,null,null," "]
[null,null,null,null,null,null," "]
[null,null,null,null,null,null," "]
[null,null,null,null,null,null," "]
[null,null,null,null,null,null," "]
[null,null,null,null,null,null," "]
[null,null,null,null,null,null," "]
[null,null,null,null,null,null," "]
[null,null,null,null,null,null," "]
[null,null,null,null,null,null," "]
[null,null,null,null,null,null," "]
[null,null,null,null,null,null," "]
[null,null,null,null,null,null," "]
[null,null,null,null,null,null," "]
[null,null,null,null,null,null," "]
[null,null,null,null,null,null," "]

{"sheet":"06-08-2019","index":7,"n_rows":493,"n_cols":32,"rows_kept":493,"cut":false,"hidden":false,"merged":[[0,19,0,24]]}
["Official time + work","App. Date","Name","Surname","Pasaport No.","Date of birth","Note of status","Price $","Paid $","Route","Unpaid $","GT","Case of appl","TG.Gov",null,"رجــــوع","رجــــوع",null,null,"TOTAL"]
[null,null,null,null,null,null,null," ",{"$f":"IF(J2<>\"\",\"\",H2)","v":" "},null,{"$f":"IF(AND(I2=\"\",J2<>\"\"),H2,\"\")","v":""},{"$f":"IF(C2=\"\",\"\",25)","v":""},"Not extractor",{"$f":"IF(M2=\"Extractor\",62.5,0)","v":0}]
[null,null,null,null,null,null,null," "," ",null,"",{"$f":"IF(C3=\"\",\"\",25)","v":""},null,{"$f":"IF(M3=\"Extractor\",62.5,0)","v":0},null,null,null,"DONE",null,"Total amount",null,"Net profit",null,"Route","Coun of Rout",null,"Total Unpaid",null,{"$f":"Noblanks(J2:J499)","v":""},null,"Note of status","Count of Mistake"]
[null,null,null,null,null,null,null," "," ",null,"","",null,0,null,null,null,"CANCELLED",null,{"$f":"SUM(H2:H70)","v":0},null,{"$f":"T4-V14","v":0},null,{"$f":"IF(ISERROR(INDEX($AC$3:$AC$70,MATCH(0,COUNTIF($X$3:X3,$AC$3:$AC$69),0))),\"\",INDEX($AC$3:$AC$69,MATCH(0,COUNTIF($X$3:X3,$AC$3:$AC$69),0)))","v":""},{"$f":"IF(X4=\"\",\"\",COUNTIF(J2:J100,X4))","v":""},null,{"$f":"IF(X4<>\"\",SUMPRODUCT(--($J$2:$J$69=X4),$K$2:$K$69),\"\")","v":""},{"$f":"IF(K2=\"\",\"\",J2)","v":""},{"$f":"Noblanks(J3:J500)","v":""},null,"MISTAKE IN DOB",{"$f":"COUNTIF(C2:C70,\"Mistake\")","v":0}]
[null,null,null,null,null,null,null," "," ",null,"","",null,0,null,null,null,"REFUSED",null,null,null,null,null,{"$f":"IF(ISERROR(INDEX($AC$3:$AC$70,MATCH(0,COUNTIF($X$3:X4,$AC$3:$AC$69),0))),\"\",INDEX($AC$3:$AC$69,MATCH(0,COUNTIF($X$3:X4,$AC$3:$AC$69),0)))","v":""},"",null,"",{"$f":"IF(K3=\"\",\"\",J3)","v":""},{"$f":"Noblanks(J4:J501)","v":""}]
[null,null,null,null,null,null,null," "," ",null,"","",null,0,null,null,null,"MISTAKE",null,"Total Paid",null,"Difrent amount",null,{"$f":"IF(ISERROR(INDEX($AC$3:$AC$70,MATCH(0,COUNTIF($X$3:X5,$AC$3:$AC$69),0))),\"\",INDEX($AC$3:$AC$69,MATCH(0,COUNTIF($X$3:X5,$AC$3:$AC$69),0)))","v":""},"",{"$f":"IF(K2=\"\",\"\",J2)","v":""},{"$f":"IF(X6<>\"\",SUMPRODUCT(--($J$2:$J$69=X6),$K$2:$K$69),\"\")","v":""},"",{"$f":"Noblanks(J5:J502)","v":""}]
[null,null,null,null,null,null,null," "," ",null,"","",null,0,null,null,null,"GREEN PASS.",null,{"$f":"SUM(I2:I70)","v":0},null,{"$f":"T4-(T7+T10)","v":0},null,{"$f":"IF(ISERROR(INDEX($AC$3:$AC$70,MATCH(0,COUNTIF($X$3:X6,$AC$3:$AC$69),0))),\"\",INDEX($AC$3:$AC$69,MATCH(0,COUNTIF($X$3:X6,$AC$3:$AC$69),0)))","v":""},{"$f":"IF(X7=\"\",\"\",COUNTIF(J5:J103,X7))","v":""},"",{"$f":"IF(X7<>\"\",SUMPRODUCT(--($J$2:$J$69=X7),$K$2:$K$69),\"\")","v":""},"",{"$f":"Noblanks(J6:J503)","v":""}]
[null,null,null,null,null,null,null," "," ",null,"","",null,0,null,null,null,null,null,null,null,null,null,{"$f":"IF(ISERROR(INDEX($AC$3:$AC$70,MATCH(0,COUNTIF($X$3:X7,$AC$3:$AC$69),0))),\"\",INDEX($AC$3:$AC$69,MATCH(0,COUNTIF($X$3:X7,$AC$3:$AC$69),0)))","v":""},{"$f":"IF(X8=\"\",\"\",COUNTIF(J6:J104,X8))","v":""},"","","",{"$f":"Noblanks(J7:J504)","v":""}]
[null,null,null,null,null,null,null," "," ",null,"","",null,0,null,null,null,"official time",null,"Total UnPaid",null,"No. of applicants",null,{"$f":"IF(ISERROR(INDEX($AC$3:$AC$70,MATCH(0,COUNTIF($X$3:X8,$AC$3:$AC$69),0))),\"\",INDEX($AC$3:$AC$69,MATCH(0,COUNTIF($X$3:X8,$AC$3:$AC$69),0)))","v":""},"","","","",{"$f":"Noblanks(J8:J505)","v":""}]
[null,null,null,null,null,null,null," "," ",null,"","",null,0,null,null,null,"official holiday",null,{"$f":"SUM(K2:K70)","v":0},null,{"$f":"COUNT(B:B)","v":0},null,{"$f":"IF(ISERROR(INDEX($AC$3:$AC$70,MATCH(0,COUNTIF($X$3:X9,$AC$3:$AC$69),0))),\"\",INDEX($AC$3:$AC$69,MATCH(0,COUNTIF($X$3:X9,$AC$3:$AC$69),0)))","v":""},"","","","",{"$f":"Noblanks(J9:J506)","v":""}]
[null,null,null,null,null,null,null," "," ",null,"","",null,0,null,null,null,"other",null,null,null,null,null,{"$f":"IF(ISERROR(INDEX($AC$3:$AC$70,MATCH(0,COUNTIF($X$3:X10,$AC$3:$AC$69),0))),\"\",INDEX($AC$3:$AC$69,MATCH(0,COUNTIF($X$3:X10,$AC$3:$AC$69),0)))","v":""},"","","","",{"$f":"Noblanks(J10:J507)","v":""}]
[null,null,null,null,null,null,null," "," ",null,"","",null,0,null,null,null,null,null,"Total GT",null,null,null,{"$f":"IF(ISERROR(INDEX($AC$3:$AC$70,MATCH(0,COUNTIF($X$3:X11,$AC$3:$AC$69),0))),\"\",INDEX($AC$3:$AC$69,MATCH(0,COUNTIF($X$3:X11,$AC$3:$AC$69),0)))","v":""},"","","","",{"$f":"Noblanks(J11:J508)","v":""}]
[null,null,null,null,null,null,null," "," ",null,"","",null,0,null,null,null,null,null,{"$f":"SUM(L2:L70)","v":0},null,"Cost amount",null,{"$f":"IF(ISERROR(INDEX($AC$3:$AC$70,MATCH(0,COUNTIF($X$3:X12,$AC$3:$AC$69),0))),\"\",INDEX($AC$3:$AC$69,MATCH(0,COUNTIF($X$3:X12,$AC$3:$AC$69),0)))","v":""},"","","","",{"$f":"Noblanks(J12:J509)","v":""}]
[null,null,null,null,null,null,null," "," ",null,"","",null,0,null,null,null,null,null,null,null,{"$f":"IF(AND(T13<>\"\",T16<>\"\"),T13+T16,\"\")","v":0},null,{"$f":"IF(ISERROR(INDEX($AC$3:$AC$70,MATCH(0,COUNTIF($X$3:X13,$AC$3:$AC$69),0))),\"\",INDEX($AC$3:$AC$69,MATCH(0,COUNTIF($X$3:X13,$AC$3:$AC$69),0)))","v":""},"","","","",{"$f":"Noblanks(J13:J510)","v":""}]
[null,null,null,null,null,null,null," "," ",null,"","",null,0,null,null,null,null,null,"Total T.Gov",null,null,null,{"$f":"IF(ISERROR(INDEX($AC$3:$AC$70,MATCH(0,COUNTIF($X$3:X14,$AC$3:$AC$69),0))),\"\",INDEX($AC$3:$AC$69,MATCH(0,COUNTIF($X$3:X14,$AC$3:$AC$69),0)))","v":""},"","","","",{"$f":"Noblanks(J14:J511)","v":""}]
[null,null,null,null,null,null,null," "," ",null,"","",null,0,null,null,null,null,null,{"$f":"SUM(N2:N70)","v":0},null,null,null,{"$f":"IF(ISERROR(INDEX($AC$3:$AC$70,MATCH(0,COUNTIF($X$3:X15,$AC$3:$AC$69),0))),\"\",INDEX($AC$3:$AC$69,MATCH(0,COUNTIF($X$3:X15,$AC$3:$AC$69),0)))","v":""},"","","","",{"$f":"Noblanks(J15:J512)","v":""}]
[null,null,null,null,null,null,null," "," ",null,{"$f":"IF(AND(I17=\"\",J17<>\"\"),H17,\"\")","v":""},"",null,0,null,null,null,null,null,null,null,null,null,{"$f":"IF(ISERROR(INDEX($AC$3:$AC$70,MATCH(0,COUNTIF($X$3:X16,$AC$3:$AC$69),0))),\"\",INDEX($AC$3:$AC$69,MATCH(0,COUNTIF($X$3:X16,$AC$3:$AC$69),0)))","v":""},"","","","",{"$f":"Noblanks(J16:J513)","v":""}]
[null,null,null,null,null,null," "," "," ",null,{"$f":"IF(AND(I18=\"\",J18<>\"\"),H18,\"\")","v":""},"",null,0,null,null,null,null,null,null,null,null,null,{"$f":"IF(ISERROR(INDEX($AC$3:$AC$70,MATCH(0,COUNTIF($X$3:X17,$AC$3:$AC$69),0))),\"\",INDEX($AC$3:$AC$69,MATCH(0,COUNTIF($X$3:X17,$AC$3:$AC$69),0)))","v":""},"","","","",{"$f":"Noblanks(J17:J514)","v":""}]
[null,null,null,null,null,null," "," "," ",null,"","",null,0,null,null,null,null,null,null,null,null,null,{"$f":"IF(ISERROR(INDEX($AC$3:$AC$70,MATCH(0,COUNTIF($X$3:X18,$AC$3:$AC$69),0))),\"\",INDEX($AC$3:$AC$69,MATCH(0,COUNTIF($X$3:X18,$AC$3:$AC$69),0)))","v":""},"","","","",{"$f":"Noblanks(J18:J515)","v":""}]
[null,null,null,null,null,null," "," "," ",null,"","",null,0,null,null,null,null,null,null,null,null,null,{"$f":"IF(ISERROR(INDEX($AC$3:$AC$70,MATCH(0,COUNTIF($X$3:X19,$AC$3:$AC$69),0))),\"\",INDEX($AC$3:$AC$69,MATCH(0,COUNTIF($X$3:X19,$AC$3:$AC$69),0)))","v":""},"","","","",{"$f":"Noblanks(J19:J516)","v":""}]
[null,null,null,null,null,null," ",null,0,null,"","",null,0,null,null,null,null,null,null,null,null,null,{"$f":"IF(ISERROR(INDEX($AC$3:$AC$70,MATCH(0,COUNTIF($X$3:X20,$AC$3:$AC$69),0))),\"\",INDEX($AC$3:$AC$69,MATCH(0,COUNTIF($X$3:X20,$AC$3:$AC$69),0)))","v":""},"","","","",{"$f":"Noblanks(J20:J517)","v":""}]
[null,null,null,null,null,null," ",null,0,null,"","",null,0,null,null,null,null,null,null,null,null,null,{"$f":"IF(ISERROR(INDEX($AC$3:$AC$70,MATCH(0,COUNTIF($X$3:X21,$AC$3:$AC$69),0))),\"\",INDEX($AC$3:$AC$69,MATCH(0,COUNTIF($X$3:X21,$AC$3:$AC$69),0)))","v":""},"","","","",{"$f":"Noblanks(J21:J518)","v":""},null,null,{"$f":"IFERROR(INDEX($J$2:$J$492,SMALL(IF($J$2:$J$492<>\"\",ROW($J$1:$J$492)-ROW($J$2)+1,\"\"),ROWS(AF$21:$AJ22))),\"\")","v":""}]
[null,null,null,null,null,null," ",null,0,null,"","",null,0,null,null,null,null,null,null,null,"Done",null,null,{"$f":"Noblanks(Z25:Z518)","v":""},null,{"$f":"IFERROR(INDEX($J$2:$J$492,SMALL(IF($J$2:$J$492<>\"\",ROW($J$1:$J$492)-ROW($J$2)+1,\"\"),ROWS(AF$21:$AJ23))),\"\")","v":""},"",{"$f":"Noblanks(J22:J519)","v":""}]
[null,null,null,null,null,null," ",null,0,null,"","",null,0,null,null,null,null,null,null,null,"Cancelled",null,null,null,{"$f":"IF(K20=\"\",\"\",J20)","v":""},null,"",{"$f":"Noblanks(J23:J520)","v":""},null,null,{"$f":"IFERROR(INDEX($J$2:$J$492,SMALL(IF($J$2:$J$492<>\"\",ROW($J$1:$J$492)-ROW($J$2)+1,\"\"),ROWS(AF$21:$AJ24))),\"\")","v":""}]
[null,null,null,null,null,null," ",null,0,null,"","",null,0,null,null,null,null,null,null,null,"Refused",null,null,null,"",null,"",{"$f":"Noblanks(J24:J521)","v":""},null,null,{"$f":"IFERROR(INDEX($J$2:$J$492,SMALL(IF($J$2:$J$492<>\"\",ROW($J$1:$J$492)-ROW($J$2)+1,\"\"),ROWS(AF$21:$AJ25))),\"\")","v":""}]
[null,null,null,null,null,null," ",null,0,null,"","",null,0,null,null,null,null,null,null,null,"Green pass.",null,null,null,"",null,"",{"$f":"Noblanks(J25:J522)","v":""}]
[null,null,null,null,null,null," ",null,0,null,"","",null,0,null,null,null,null,null,null,null,"Mistake",null,null,null,"",null,"",{"$f":"Noblanks(J26:J523)","v":""}]
[null,null,null,null,null,null," ",null,0,null,"","",null,0,null,null,null,null,null,null,null,null,null,null,null,"",null,"",{"$f":"Noblanks(J27:J524)","v":""}]
[null,null,null,null,null,null," ",null,0,null,"","",null,0,null,null,null,null,null,null,null,null,null,null,null,"",null,"",{"$f":"Noblanks(J28:J525)","v":""}]
[null,null,null,null,null,null," ",null,0,null,"","",null,0,null,null,null,null,null,null,null,null,null,null,null,"",null,"",{"$f":"Noblanks(J29:J526)","v":""}]
[null,null,null,null,null,null," ",null,0,null,"","",null,0,null,null,null,null,null,null,null,null,null,null,null,"",null,"",{"$f":"Noblanks(J30:J527)","v":""}]
[null,null,null,null,null,null," ",null,0,null,"","",null,0,null,null,null,null,null,null,null,null,null,null,null,"",null,"",{"$f":"Noblanks(J31:J528)","v":""}]
[null,null,null,null,null,null," ",null,0,null,"","",null,0,null,null,null,null,null,null,null,null,null,null,null,"",null,"",{"$f":"Noblanks(J32:J529)","v":""}]
[null,null,null,null,null,null," ",null,0,null,"","",null,0,null,null,null,null,null,null,null,null,null,null,null,"",null,"",{"$f":"Noblanks(J33:J530)","v":""}]
[null,null,null,null,null,null," ",null,0,null,"","",null,0,null,null,null,null,null,null,null,null,null,null,null,"",null,"",{"$f":"Noblanks(J34:J531)","v":""}]
[null,null,null,null,null,null," ",null,0,null,"","",null,0,null,null,null,null,null,null,null,null,null,null,null,"",null,"",{"$f":"Noblanks(J35:J532)","v":""}]
[null,null,null,null,null,null," ",null,0,null,"","",null,0,null,null,null,null,null,null,null,null,null,null,null,"",null,"",{"$f":"Noblanks(J36:J533)","v":""}]
[null,null,null,null,null,null," ",null,0,null,"","",null,0,null,null,null,null,null,null,null,null,null,null,null,"",null,"",{"$f":"Noblanks(J37:J534)","v":""}]
[null,null,null,null,null,null," ",null,0,null,"","",null,0,null,null,null,null,null,null,null,null,null,null,null,"",null,"",{"$f":"Noblanks(J38:J535)","v":""}]
[null,null,null,null,null,null," ",null,0,null,"","",null,0,null,null,null,null,null,null,null,null,null,null,null,"",null,"",{"$f":"Noblanks(J39:J536)","v":""}]
[null,null,null,null,null,null," ",null,0,null,"","",null,0,null,null,null,null,null,null,null,null,null,null,null,"",null,"",{"$f":"Noblanks(J40:J537)","v":""}]
[null,null,null,null,null,null," ",null,0,null,"","",null,0,null,null,null,null,null,null,null,null,null,null,null,"",null,"",{"$f":"Noblanks(J41:J538)","v":""}]
[null,null,null,null,null,null," ",null,0,null,"","",null,0,null,null,null,null,null,null,null,null,null,null,null,"",null,"",{"$f":"Noblanks(J42:J539)","v":""}]
[null,null,null,null,null,null," ",null,0,null,"","",null,0,null,null,null,null,null,null,null,null,null,null,null,"",null,"",{"$f":"Noblanks(J43:J540)","v":""}]
[null,null,null,null,null,null," ",null,0,null,"","",null,0,null,null,null,null,null,null,null,null,null,null,null,"",null,"",{"$f":"Noblanks(J44:J541)","v":""}]
[null,null,null,null,null,null," ",null,0,null,"","",null,0,null,null,null,null,null,null,null,null,null,null,null,"",null,"",{"$f":"Noblanks(J45:J542)","v":""}]
[null,null,null,null,null,null," ",null,0,null,"","",null,0,null,null,null,null,null,null,null,null,null,null,null,"",null,"",{"$f":"Noblanks(J46:J543)","v":""}]
[null,null,null,null,null,null," ",null,0,null,"","",null,0,null,null,null,null,null,null,null,null,null,null,null,"",null,"",{"$f":"Noblanks(J47:J544)","v":""}]
[null,null,null,null,null,null," ",null,0,null,"","",null,0,null,null,null,null,null,null,null,null,null,null,null,"",null,"",{"$f":"Noblanks(J48:J545)","v":""}]
[null,null,null,null,null,null," ",null,0,null,"","",null,0,null,null,null,null,null,null,null,null,null,null,null,"",null,"",{"$f":"Noblanks(J49:J546)","v":""}]
[null,null,null,null,null,null," ",null,0,null,"","",null,0,null,null,null,null,null,null,null,null,null,null,null,"",null,"",{"$f":"Noblanks(J50:J547)","v":""}]
[null,null,null,null,null,null," ",null,0,null,"","",null,0,null,null,null,null,null,null,null,null,null,null,null,"",null,"",{"$f":"Noblanks(J51:J548)","v":""}]
[null,null,null,null,null,null," ",null,0,null,"","",null,0,null,null,null,null,null,null,null,null,null,null,null,"",null,"",{"$f":"Noblanks(J52:J549)","v":""}]
[null,null,null,null,null,null," ",null,0,null,"","",null,0,null,null,null,null,null,null,null,null,null,null,null,"",null,"",{"$f":"Noblanks(J53:J550)","v":""}]
[null,null,null,null,null,null," ",null,0,null,"","",null,0,null,null,null,null,null,null,null,null,null,null,null,"",null,"",{"$f":"Noblanks(J54:J551)","v":""}]
[null,null,null,null,null,null," ",null,0,null,"","",null,0,null,null,null,null,null,null,null,null,null,null,null,"",null,"",{"$f":"Noblanks(J55:J552)","v":""}]
[null,null,null,null,null,null," ",null,0,null,"","",null,0,null,null,null,null,null,null,null,null,null,null,null,"",null,"",{"$f":"Noblanks(J56:J553)","v":""}]
[null,null,null,null,null,null," ",null,0,null,"","",null,0,null,null,null,null,null,null,null,null,null,null,null,"",null,"",{"$f":"Noblanks(J57:J554)","v":""}]
[null,null,null,null,null,null," ",null,0,null,"","",null,0,null,null,null,null,null,null,null,null,null,null,null,"",null,"",{"$f":"Noblanks(J58:J555)","v":""}]
[null,null,null,null,null,null," ",null,0,null,"","",null,0,null,null,null,null,null,null,null,null,null,null,null,"",null,"",{"$f":"Noblanks(J59:J556)","v":""}]
[null,null,null,null,null,null," ",null,0,null,"","",null,0,null,null,null,null,null,null,null,null,null,null,null,"",null,"",{"$f":"Noblanks(J60:J557)","v":""}]
[null,null,null,null,null,null," ",null,0,null,"","",null,0,null,null,null,null,null,null,null,null,null,null,null,"",null,"",{"$f":"Noblanks(J61:J558)","v":""}]
[null,null,null,null,null,null," ",null,0,null,"","",null,0,null,null,null,null,null,null,null,null,null,null,null,"",null,"",{"$f":"Noblanks(J62:J559)","v":""}]
[null,null,null,null,null,null," ",null,0,null,{"$f":"IF(AND(I64=\"\",J64<>\"\"),H64,\"\")","v":""},"",null,0,null,null,null,null,null,null,null,null,null,null,null,"",null,"",{"$f":"Noblanks(J63:J560)","v":""}]
[null,null,null,null,null,null," ",null,0,null,{"$f":"IF(AND(I65=\"\",J65<>\"\"),H65,\"\")","v":""},"",null,0,null,null,null,null,null,null,null,null,null,null,null,"",null,"",{"$f":"Noblanks(J64:J561)","v":""}]
[null,null,null,null,null,null," ",null,{"$f":"IF(J66<>\"\",\"\",H66)","v":0},null,"","",null,0,null,null,null,null,null,null,null,null,null,null,null,"",null,"",{"$f":"Noblanks(J65:J562)","v":""}]
[null,null,null,null,null,null," ",null,0,null,"",{"$f":"IF(C67=\"\",\"\",25)","v":""},null,{"$f":"IF(M67=\"Extractor\",62.5,0)","v":0},null,null,null,null,null,null,null,null,null,null,null,"",null,"",{"$f":"Noblanks(J66:J563)","v":""}]
[null,null,null,null,null,null," ",null,0,null,"","",null,0,null,null,null,null,null,null,null,null,null,null,null,"",null,"",{"$f":"Noblanks(J67:J564)","v":""}]
[null,null,null,null,null,null," ",null,0,null,"","",null,0,null,null,null,null,null,null,null,null,null,null,null,"",null,{"$f":"IF(K67=\"\",\"\",J67)","v":""},{"$f":"Noblanks(J68:J565)","v":""}]
[null,null,null,null,null,null," ",null,0,null,"","",null,0,null,null,null,null,null,null,null,null,null,null,null,"",null,"",{"$f":"Noblanks(J69:J566)","v":""}]
[null,null,null,null,null,null," "," ",null,null,null,null,null,null,null,null,null,null,null,null,null,null,null,null,null,"",null,"",{"$f":"Noblanks(J70:J567)","v":""}]
[null,null,null,null,null,null," "," ",null,null,null,null,null,null,null,null,null,null,null,null,null,null,null,null,null,"",null,null,{"$f":"Noblanks(J71:J568)","v":""}]
[null,null,null,null,null,null," "," ",null,null,null,null,null,null,null,null,null,null,null,null,null,null,null,null,null,"",null,null,{"$f":"Noblanks(J72:J569)","v":""}]
[null,null,null,null,null,null," "," ",null,null,null,null,null,null,null,null,null,null,null,null,null,null,null,null,null,"",null,null,{"$f":"Noblanks(J73:J570)","v":""}]
[null,null,null,null,null,null," "," ",null,null,null,null,null,null,null,null,null,null,null,null,null,null,null,null,null,"",null,null,{"$f":"Noblanks(J74:J571)","v":""}]
[null,null,null,null,null,null," "," ",null,null,null,null,null,null,null,null,null,null,null,null,null,null,null,null,null,"",null,null,{"$f":"Noblanks(J75:J572)","v":""}]
[null,null,null,null,null,null," "," ",null,null,null,null,null,null,null,null,null,null,null,null,null,null,null,null,null,"",null,null,{"$f":"Noblanks(J76:J573)","v":""}]
[null,null,null,null,null,null," "," ",null,null,null,null,null,null,null,null,null,null,null,null,null,null,null,null,null,"",null,null,{"$f":"Noblanks(J77:J574)","v":""}]
[null,null,null,null,null,null," "," ",null,null,null,null,null,null,null,null,null,null,null,null,null,null,null,null,null,"",null,null,{"$f":"Noblanks(J78:J575)","v":""}]
[null,null,null,null,null,null," "," ",null,null,null,null,null,null,null,null,null,null,null,null,null,null,null,null,null,"",null,null,{"$f":"Noblanks(J79:J576)","v":""}]
[null,null,null,null,null,null," "," ",null,null,null,null,null,null,null,null,null,null,null,null,null,null,null,null,null,"",null,null,{"$f":"Noblanks(J80:J577)","v":""}]
[null,null,null,null,null,null," "," ",null,null,null,null,null,null,null,null,null,null,null,null,null,null,null,null,null,"",null,null,{"$f":"Noblanks(J81:J578)","v":""}]
[null,null,null,null,null,null," "," ",null,null,null,null,null,null,null,null,null,null,null,null,null,null,null,null,null,"",null,null,{"$f":"Noblanks(J82:J579)","v":""}]
[null,null,null,null,null,null," "," ",null,null,null,null,null,null,null,null,null,null,null,null,null,null,null,null,null,"",null,null,{"$f":"Noblanks(J83:J580)","v":""}]
[null,null,null,null,null,null," "," ",null,null,null,null,null,null,null,null,null,null,null,null,null,null,null,null,null,"",null,null,{"$f":"Noblanks(J84:J581)","v":""}]
[null,null,null,null,null,null," "," ",null,null,null,null,null,null,null,null,null,null,null,null,null,null,null,null,null,"",null,null,{"$f":"Noblanks(J85:J582)","v":""}]
[null,null,null,null,null,null," "," ",null,null,null,null,null,null,null,null,null,null,null,null,null,null,null,null,null,"",null,null,{"$f":"Noblanks(J86:J583)","v":""}]
[null,null,null,null,null,null," "," ",null,null,null,null,null,null,null,null,null,null,null,null,null,null,null,null,null,{"$f":"IF(K84=\"\",\"\",J84)","v":""},null,null,{"$f":"Noblanks(J87:J584)","v":""}]
[null,null,null,null,null,null," "," ",null,null,null,null,null,null,null,null,null,null,null,null,null,null,null,null,null,"",null,null,{"$f":"Noblanks(J88:J585)","v":""}]
[null,null,null,null,null,null," "," ",null,null,null,null,null,null,null,null,null,null,null,null,null,null,null,null,null,"",null,null,{"$f":"Noblanks(J89:J586)","v":""}]
[null,null,null,null,null,null," "," ",null,null,null,null,null,null,null,null,null,null,null,null,null,null,null,null,null,"",null,null,{"$f":"Noblanks(J90:J587)","v":""}]
[null,null,null,null,null,null," "," ",null,null,null,null,null,null,null,null,null,null,null,null,null,null,null,null,null,"",null,null,{"$f":"Noblanks(J91:J588)","v":""}]
[null,null,null,null,null,null," "," ",null,null,null,null,null,null,null,null,null,null,null,null,null,null,null,null,null,"",null,null,{"$f":"Noblanks(J92:J589)","v":""}]
[null,null,null,null,null,null," ",null,null,null,null,null,null,null,null,null,null,null,null,null,null,null,null,null,null,"",null,null,{"$f":"Noblanks(J93:J590)","v":""}]
[null,null,null,null,null,null," ",null,null,null,null,null,null,null,null,null,null,null,null,null,null,null,null,null,null,"",null,null,{"$f":"Noblanks(J94:J591)","v":""}]
[null,null,null,null,null,null," ",null,null,null,null,null,null,null,null,null,null,null,null,null,null,null,null,null,null,"",null,null,{"$f":"Noblanks(J95:J592)","v":""}]
[null,null,null,null,null,null," ",null,null,null,null,null,null,null,null,null,null,null,null,null,null,null,null,null,null,"",null,null,{"$f":"Noblanks(J96:J593)","v":""}]
[null,null,null,null,null,null," ",null,null,null,null,null,null,null,null,null,null,null,null,null,null,null,null,null,null,"",null,null,{"$f":"Noblanks(J97:J594)","v":""}]
[null,null,null,null,null,null," ",null,null,null,null,null,null,null,null,null,null,null,null,null,null,null,null,null,null,"",null,null,{"$f":"Noblanks(J98:J595)","v":""}]
[null,null,null,null,null,null," ",null,null,null,null,null,null,null,null,null,null,null,null,null,null,null,null,null,null,"",null,null,{"$f":"Noblanks(J99:J596)","v":""}]
[null,null,null,null,null,null," ",null,null,null,null,null,null,null,null,null,null,null,null,null,null,null,null,null,null,"",null,null,{"$f":"Noblanks(J100:J597)","v":""}]
[null,null,null,null,null,null," ",null,null,null,null,null,null,null,null,null,null,null,null,null,null,null,null,null,null,"",null,null,{"$f":"Noblanks(J101:J598)","v":""}]
[null,null,null,null,null,null," ",null,null,null,null,null,null,null,null,null,null,null,null,null,null,null,null,null,null,null,null,null,{"$f":"Noblanks(J102:J599)","v":""}]
[null,null,null,null,null,null," ",null,null,null,null,null,null,null,null,null,null,null,null,null,null,null,null,null,null,null,null,null,{"$f":"Noblanks(J103:J600)","v":""}]
[null,null,null,null,null,null," ",null,null,null,null,null,null,null,null,null,null,null,null,null,null,null,null,null,null,null,null,null,{"$f":"Noblanks(J104:J601)","v":""}]
[null,null,null,null,null,null," ",null,null,null,null,null,null,null,null,null,null,null,null,null,null,null,null,null,null,null,null,null,{"$f":"Noblanks(J105:J602)","v":""}]
[null,null,null,null,null,null," ",null,null,null,null,null,null,null,null,null,null,null,null,null,null,null,null,null,null,null,null,null,{"$f":"Noblanks(J106:J603)","v":""}]
[null,null,null,null,null,null," ",null,null,null,null,null,null,null,null,null,null,null,null,null,null,null,null,null,null,null,null,null,{"$f":"Noblanks(J107:J604)","v":""}]
[null,null,null,null,null,null," ",null,null,null,null,null,null,null,null,null,null,null,null,null,null,null,null,null,null,null,null,null,{"$f":"Noblanks(J108:J605)","v":""}]
[null,null,null,null,null,null," ",null,null,null,null,null,null,null,null,null,null,null,null,null,null,null,null,null,null,null,null,null,{"$f":"Noblanks(J109:J606)","v":""}]
[null,null,null,null,null,null," ",null,null,null,null,null,null,null,null,null,null,null,null,null,null,null,null,null,null,null,null,null,{"$f":"Noblanks(J110:J607)","v":""}]
[null,null,null,null,null,null," ",null,null,null,null,null,null,null,null,null,null,null,null,null,null,null,null,null,null,null,null,null,{"$f":"Noblanks(J111:J608)","v":""}]
[null,null,null,null,null,null," ",null,null,null,null,null,null,null,null,null,null,null,null,null,null,null,null,null,null,null,null,null,{"$f":"Noblanks(J112:J609)","v":""}]
[null,null,null,null,null,null," ",null,null,null,null,null,null,null,null,null,null,null,null,null,null,null,null,null,null,null,null,null,{"$f":"Noblanks(J113:J610)","v":""}]
[null,null,null,null,null,null," ",null,null,null,null,null,null,null,null,null,null,null,null,null,null,null,null,null,null,null,null,null,{"$f":"Noblanks(J114:J611)","v":""}]
[null,null,null,null,null,null," ",null,null,null,null,null,null,null,null,null,null,null,null,null,null,null,null,null,null,null,null,null,{"$f":"Noblanks(J115:J612)","v":""}]
[null,null,null,null,null,null," ",null,null,null,null,null,null,null,null,null,null,null,null,null,null,null,null,null,null,null,null,null,{"$f":"Noblanks(J116:J613)","v":""}]
[null,null,null,null,null,null," ",null,null,null,null,null,null,null,null,null,null,null,null,null,null,null,null,null,null,null,null,null,{"$f":"Noblanks(J117:J614)","v":""}]
[null,null,null,null,null,null," ",null,null,null,null,null,null,null,null,null,null,null,null,null,null,null,null,null,null,null,null,null,{"$f":"Noblanks(J118:J615)","v":""}]
[null,null,null,null,null,null," ",null,null,null,null,null,null,null,null,null,null,null,null,null,null,null,null,null,null,null,null,null,{"$f":"Noblanks(J119:J616)","v":""}]
[null,null,null,null,null,null," ",null,null,null,null,null,null,null,null,null,null,null,null,null,null,null,null,null,null,null,null,null,{"$f":"Noblanks(J120:J617)","v":""}]
[null,null,null,null,null,null," ",null,null,null,null,null,null,null,null,null,null,null,null,null,null,null,null,null,null,null,null,null,{"$f":"Noblanks(J121:J618)","v":""}]
[null,null,null,null,null,null," ",null,null,null,null,null,null,null,null,null,null,null,null,null,null,null,null,null,null,null,null,null,{"$f":"Noblanks(J122:J619)","v":""}]
[null,null,null,null,null,null," ",null,null,null,null,null,null,null,null,null,null,null,null,null,null,null,null,null,null,null,null,null,{"$f":"Noblanks(J123:J620)","v":""}]
[null,null,null,null,null,null," ",null,null,null,null,null,null,null,null,null,null,null,null,null,null,null,null,null,null,null,null,null,{"$f":"Noblanks(J124:J621)","v":""}]
[null,null,null,null,null,null," ",null,null,null,null,null,null,null,null,null,null,null,null,null,null,null,null,null,null,null,null,null,{"$f":"Noblanks(J125:J622)","v":""}]
[null,null,null,null,null,null," ",null,null,null,null,null,null,null,null,null,null,null,null,null,null,null,null,null,null,null,null,null,{"$f":"Noblanks(J126:J623)","v":""}]
[null,null,null,null,null,null," ",null,null,null,null,null,null,null,null,null,null,null,null,null,null,null,null,null,null,null,null,null,{"$f":"Noblanks(J127:J624)","v":""}]
[null,null,null,null,null,null," ",null,null,null,null,null,null,null,null,null,null,null,null,null,null,null,null,null,null,null,null,null,{"$f":"Noblanks(J128:J625)","v":""}]
[null,null,null,null,null,null," ",null,null,null,null,null,null,null,null,null,null,null,null,null,null,null,null,null,null,null,null,null,{"$f":"Noblanks(J129:J626)","v":""}]
[null,null,null,null,null,null," ",null,null,null,null,null,null,null,null,null,null,null,null,null,null,null,null,null,null,null,null,null,{"$f":"Noblanks(J130:J627)","v":""}]
[null,null,null,null,null,null," ",null,null,null,null,null,null,null,null,null,null,null,null,null,null,null,null,null,null,null,null,null,{"$f":"Noblanks(J131:J628)","v":""}]
[null,null,null,null,null,null," ",null,null,null,null,null,null,null,null,null,null,null,null,null,null,null,null,null,null,null,null,null,{"$f":"Noblanks(J132:J629)","v":""}]
[null,null,null,null,null,null," ",null,null,null,null,null,null,null,null,null,null,null,null,null,null,null,null,null,null,null,null,null,{"$f":"Noblanks(J133:J630)","v":""}]
[null,null,null,null,null,null," ",null,null,null,null,null,null,null,null,null,null,null,null,null,null,null,null,null,null,null,null,null,{"$f":"Noblanks(J134:J631)","v":""}]
[null,null,null,null,null,null," ",null,null,null,null,null,null,null,null,null,null,null,null,null,null,null,null,null,null,null,null,null,{"$f":"Noblanks(J135:J632)","v":""}]
[null,null,null,null,null,null," ",null,null,null,null,null,null,null,null,null,null,null,null,null,null,null,null,null,null,null,null,null,{"$f":"Noblanks(J136:J633)","v":""}]
[null,null,null,null,null,null," ",null,null,null,null,null,null,null,null,null,null,null,null,null,null,null,null,null,null,null,null,null,{"$f":"Noblanks(J137:J634)","v":""}]
[null,null,null,null,null,null," ",null,null,null,null,null,null,null,null,null,null,null,null,null,null,null,null,null,null,null,null,null,{"$f":"Noblanks(J138:J635)","v":""}]
[null,null,null,null,null,null," ",null,null,null,null,null,null,null,null,null,null,null,null,null,null,null,null,null,null,null,null,null,{"$f":"Noblanks(J139:J636)","v":""}]
[null,null,null,null,null,null," ",null,null,null,null,null,null,null,null,null,null,null,null,null,null,null,null,null,null,null,null,null,{"$f":"Noblanks(J140:J637)","v":""}]
[null,null,null,null,null,null," ",null,null,null,null,null,null,null,null,null,null,null,null,null,null,null,null,null,null,null,null,null,{"$f":"Noblanks(J141:J638)","v":""}]
[null,null,null,null,null,null," ",null,null,null,null,null,null,null,null,null,null,null,null,null,null,null,null,null,null,null,null,null,{"$f":"Noblanks(J142:J639)","v":""}]
[null,null,null,null,null,null," ",null,null,null,null,null,null,null,null,null,null,null,null,null,null,null,null,null,null,null,null,null,{"$f":"Noblanks(J143:J640)","v":""}]
[null,null,null,null,null,null," ",null,null,null,null,null,null,null,null,null,null,null,null,null,null,null,null,null,null,null,null,null,{"$f":"Noblanks(J144:J641)","v":""}]
[null,null,null,null,null,null," ",null,null,null,null,null,null,null,null,null,null,null,null,null,null,null,null,null,null,null,null,null,{"$f":"Noblanks(J145:J642)","v":""}]
[null,null,null,null,null,null," ",null,null,null,null,null,null,null,null,null,null,null,null,null,null,null,null,null,null,null,null,null,{"$f":"Noblanks(J146:J643)","v":""}]
[null,null,null,null,null,null," ",null,null,null,null,null,null,null,null,null,null,null,null,null,null,null,null,null,null,null,null,null,{"$f":"Noblanks(J147:J644)","v":""}]
[null,null,null,null,null,null," ",null,null,null,null,null,null,null,null,null,null,null,null,null,null,null,null,null,null,null,null,null,{"$f":"Noblanks(J148:J645)","v":""}]
[null,null,null,null,null,null," ",null,null,null,null,null,null,null,null,null,null,null,null,null,null,null,null,null,null,null,null,null,{"$f":"Noblanks(J149:J646)","v":""}]
[null,null,null,null,null,null," ",null,null,null,null,null,null,null,null,null,null,null,null,null,null,null,null,null,null,null,null,null,{"$f":"Noblanks(J150:J647)","v":""}]
[null,null,null,null,null,null," ",null,null,null,null,null,null,null,null,null,null,null,null,null,null,null,null,null,null,null,null,null,{"$f":"Noblanks(J151:J648)","v":""}]
[null,null,null,null,null,null," ",null,null,null,null,null,null,null,null,null,null,null,null,null,null,null,null,null,null,null,null,null,{"$f":"Noblanks(J152:J649)","v":""}]
[null,null,null,null,null,null," ",null,null,null,null,null,null,null,null,null,null,null,null,null,null,null,null,null,null,null,null,null,{"$f":"Noblanks(J153:J650)","v":""}]
[null,null,null,null,null,null," ",null,null,null,null,null,null,null,null,null,null,null,null,null,null,null,null,null,null,null,null,null,{"$f":"Noblanks(J154:J651)","v":""}]
[null,null,null,null,null,null," ",null,null,null,null,null,null,null,null,null,null,null,null,null,null,null,null,null,null,null,null,null,{"$f":"Noblanks(J155:J652)","v":""}]
[null,null,null,null,null,null," ",null,null,null,null,null,null,null,null,null,null,null,null,null,null,null,null,null,null,null,null,null,{"$f":"Noblanks(J156:J653)","v":""}]
[null,null,null,null,null,null," ",null,null,null,null,null,null,null,null,null,null,null,null,null,null,null,null,null,null,null,null,null,{"$f":"Noblanks(J157:J654)","v":""}]
[null,null,null,null,null,null," ",null,null,null,null,null,null,null,null,null,null,null,null,null,null,null,null,null,null,null,null,null,{"$f":"Noblanks(J158:J655)","v":""}]
[null,null,null,null,null,null," ",null,null,null,null,null,null,null,null,null,null,null,null,null,null,null,null,null,null,null,null,null,{"$f":"Noblanks(J159:J656)","v":""}]
[null,null,null,null,null,null," ",null,null,null,null,null,null,null,null,null,null,null,null,null,null,null,null,null,null,null,null,null,{"$f":"Noblanks(J160:J657)","v":""}]
[null,null,null,null,null,null," ",null,null,null,null,null,null,null,null,null,null,null,null,null,null,null,null,null,null,null,null,null,{"$f":"Noblanks(J161:J658)","v":""}]
[null,null,null,null,null,null," ",null,null,null,null,null,null,null,null,null,null,null,null,null,null,null,null,null,null,null,null,null,{"$f":"Noblanks(J162:J659)","v":""}]
[null,null,null,null,null,null," ",null,null,null,null,null,null,null,null,null,null,null,null,null,null,null,null,null,null,null,null,null,{"$f":"Noblanks(J163:J660)","v":""}]
[null,null,null,null,null,null," ",null,null,null,null,null,null,null,null,null,null,null,null,null,null,null,null,null,null,null,null,null,{"$f":"Noblanks(J164:J661)","v":""}]
[null,null,null,null,null,null," ",null,null,null,null,null,null,null,null,null,null,null,null,null,null,null,null,null,null,null,null,null,{"$f":"Noblanks(J165:J662)","v":""}]
[null,null,null,null,null,null," ",null,null,null,null,null,null,null,null,null,null,null,null,null,null,null,null,null,null,null,null,null,{"$f":"Noblanks(J166:J663)","v":""}]
[null,null,null,null,null,null," ",null,null,null,null,null,null,null,null,null,null,null,null,null,null,null,null,null,null,null,null,null,{"$f":"Noblanks(J167:J664)","v":""}]
[null,null,null,null,null,null," ",null,null,null,null,null,null,null,null,null,null,null,null,null,null,null,null,null,null,null,null,null,{"$f":"Noblanks(J168:J665)","v":""}]
[null,null,null,null,null,null," ",null,null,null,null,null,null,null,null,null,null,null,null,null,null,null,null,null,null,null,null,null,{"$f":"Noblanks(J169:J666)","v":""}]
[null,null,null,null,null,null," ",null,null,null,null,null,null,null,null,null,null,null,null,null,null,null,null,null,null,null,null,null,{"$f":"Noblanks(J170:J667)","v":""}]
[null,null,null,null,null,null," ",null,null,null,null,null,null,null,null,null,null,null,null,null,null,null,null,null,null,null,null,null,{"$f":"Noblanks(J171:J668)","v":""}]
[null,null,null,null,null,null," ",null,null,null,null,null,null,null,null,null,null,null,null,null,null,null,null,null,null,null,null,null,{"$f":"Noblanks(J172:J669)","v":""}]
[null,null,null,null,null,null," ",null,null,null,null,null,null,null,null,null,null,null,null,null,null,null,null,null,null,null,null,null,{"$f":"Noblanks(J173:J670)","v":""}]
[null,null,null,null,null,null," ",null,null,null,null,null,null,null,null,null,null,null,null,null,null,null,null,null,null,null,null,null,{"$f":"Noblanks(J174:J671)","v":""}]
[null,null,null,null,null,null," ",null,null,null,null,null,null,null,null,null,null,null,null,null,null,null,null,null,null,null,null,null,{"$f":"Noblanks(J175:J672)","v":""}]
[null,null,null,null,null,null," ",null,null,null,null,null,null,null,null,null,null,null,null,null,null,null,null,null,null,null,null,null,{"$f":"Noblanks(J176:J673)","v":""}]
[null,null,null,null,null,null," ",null,null,null,null,null,null,null,null,null,null,null,null,null,null,null,null,null,null,null,null,null,{"$f":"Noblanks(J177:J674)","v":""}]
[null,null,null,null,null,null," ",null,null,null,null,null,null,null,null,null,null,null,null,null,null,null,null,null,null,null,null,null,{"$f":"Noblanks(J178:J675)","v":""}]
[null,null,null,null,null,null," ",null,null,null,null,null,null,null,null,null,null,null,null,null,null,null,null,null,null,null,null,null,{"$f":"Noblanks(J179:J676)","v":""}]
[null,null,null,null,null,null," ",null,null,null,null,null,null,null,null,null,null,null,null,null,null,null,null,null,null,null,null,null,{"$f":"Noblanks(J180:J677)","v":""}]
[null,null,null,null,null,null," ",null,null,null,null,null,null,null,null,null,null,null,null,null,null,null,null,null,null,null,null,null,{"$f":"Noblanks(J181:J678)","v":""}]
[null,null,null,null,null,null," ",null,null,null,null,null,null,null,null,null,null,null,null,null,null,null,null,null,null,null,null,null,{"$f":"Noblanks(J182:J679)","v":""}]
[null,null,null,null,null,null," ",null,null,null,null,null,null,null,null,null,null,null,null,null,null,null,null,null,null,null,null,null,{"$f":"Noblanks(J183:J680)","v":""}]
[null,null,null,null,null,null," ",null,null,null,null,null,null,null,null,null,null,null,null,null,null,null,null,null,null,null,null,null,{"$f":"Noblanks(J184:J681)","v":""}]
[null,null,null,null,null,null," ",null,null,null,null,null,null,null,null,null,null,null,null,null,null,null,null,null,null,null,null,null,{"$f":"Noblanks(J185:J682)","v":""}]
[null,null,null,null,null,null," ",null,null,null,null,null,null,null,null,null,null,null,null,null,null,null,null,null,null,null,null,null,{"$f":"Noblanks(J186:J683)","v":""}]
[null,null,null,null,null,null," ",null,null,null,null,null,null,null,null,null,null,null,null,null,null,null,null,null,null,null,null,null,{"$f":"Noblanks(J187:J684)","v":""}]
[null,null,null,null,null,null," ",null,null,null,null,null,null,null,null,null,null,null,null,null,null,null,null,null,null,null,null,null,{"$f":"Noblanks(J188:J685)","v":""}]
[null,null,null,null,null,null," ",null,null,null,null,null,null,null,null,null,null,null,null,null,null,null,null,null,null,null,null,null,{"$f":"Noblanks(J189:J686)","v":""}]
[null,null,null,null,null,null," ",null,null,null,null,null,null,null,null,null,null,null,null,null,null,null,null,null,null,null,null,null,{"$f":"Noblanks(J190:J687)","v":""}]
[null,null,null,null,null,null," ",null,null,null,null,null,null,null,null,null,null,null,null,null,null,null,null,null,null,null,null,null,{"$f":"Noblanks(J191:J688)","v":""}]
[null,null,null,null,null,null," ",null,null,null,null,null,null,null,null,null,null,null,null,null,null,null,null,null,null,null,null,null,{"$f":"Noblanks(J192:J689)","v":""}]
[null,null,null,null,null,null," ",null,null,null,null,null,null,null,null,null,null,null,null,null,null,null,null,null,null,null,null,null,{"$f":"Noblanks(J193:J690)","v":""}]
[null,null,null,null,null,null," ",null,null,null,null,null,null,null,null,null,null,null,null,null,null,null,null,null,null,null,null,null,{"$f":"Noblanks(J194:J691)","v":""}]
[null,null,null,null,null,null," ",null,null,null,null,null,null,null,null,null,null,null,null,null,null,null,null,null,null,null,null,null,{"$f":"Noblanks(J195:J692)","v":""}]
[null,null,null,null,null,null," ",null,null,null,null,null,null,null,null,null,null,null,null,null,null,null,null,null,null,null,null,null,{"$f":"Noblanks(J196:J693)","v":""}]
[null,null,null,null,null,null," ",null,null,null,null,null,null,null,null,null,null,null,null,null,null,null,null,null,null,null,null,null,{"$f":"Noblanks(J197:J694)","v":""}]
[null,null,null,null,null,null," "]
[null,null,null,null,null,null," "]
[null,null,null,null,null,null," "]
[null,null,null,null,null,null," "]
[null,null,null,null,null,null," "]
[null,null,null,null,null,null," "]
[null,null,null,null,null,null," "]
[null,null,null,null,null,null," "]
[null,null,null,null,null,null," "]
[null,null,null,null,null,null," "]
[null,null,null,null,null,null," "]
[null,null,null,null,null,null," "]
[null,null,null,null,null,null," "]
[null,null,null,null,null,null," "]
[null,null,null,null,null,null," "]
[null,null,null,null,null,null," "]
[null,null,null,null,null,null," "]
[null,null,null,null,null,null," "]
[null,null,null,null,null,null," "]
[null,null,null,null,null,null," "]
[null,null,null,null,null,null," "]
[null,null,null,null,null,null," "]
[null,null,null,null,null,null," "]
[null,null,null,null,null,null," "]
[null,null,null,null,null,null," "]
[null,null,null,null,null,null," "]
[null,null,null,null,null,null," "]
[null,null,null,null,null,null," "]
[null,null,null,null,null,null," "]
[null,null,null,null,null,null," "]
[null,null,null,null,null,null," "]
[null,null,null,null,null,null," "]
[null,null,null,null,null,null," "]
[null,null,null,null,null,null," "]
[null,null,null,null,null,null," "]
[null,null,null,null,null,null," "]
[null,null,null,null,null,null," "]
[null,null,null,null,null,null," "]
[null,null,null,null,null,null," "]
[null,null,null,null,null,null," "]
[null,null,null,null,null,null," "]
[null,null,null,null,null,null," "]
[null,null,null,null,null,null," "]
[null,null,null,null,null,null," "]
[null,null,null,null,null,null," "]
[null,null,null,null,null,null," "]
[null,null,null,null,null,null," "]
[null,null,null,null,null,null," "]
[null,null,null,null,null,null," "]
[null,null,null,null,null,null," "]
[null,null,null,null,null,null," "]
[null,null,null,null,null,null," "]
[null,null,null,null,null,null," "]
[null,null,null,null,null,null," "]
[null,null,null,null,null,null," "]
[null,null,null,null,null,null," "]
[null,null,null,null,null,null," "]
[null,null,null,null,null,null," "]
[null,null,null,null,null,null," "]
[null,null,null,null,null,null," "]
[null,null,null,null,null,null," "]
[null,null,null,null,null,null," "]
[null,null,null,null,null,null," "]
[null,null,null,null,null,null," "]
[null,null,null,null,null,null," "]
[null,null,null,null,null,null," "]
[null,null,null,null,null,null," "]
[null,null,null,null,null,null," "]
[null,null,null,null,null,null," "]
[null,null,null,null,null,null," "]
[null,null,null,null,null,null," "]
[null,null,null,null,null,null," "]
[null,null,null,null,null,null," "]
[null,null,null,null,null,null," "]
[null,null,null,null,null,null," "]
[null,null,null,null,null,null," "]
[null,null,null,null,null,null," "]
[null,null,null,null,null,null," "]
[null,null,null,null,null,null," "]
[null,null,null,null,null,null," "]
[null,null,null,null,null,null," "]
[null,null,null,null,null,null," "]
[null,null,null,null,null,null," "]
[null,null,null,null,null,null," "]
[null,null,null,null,null,null," "]
[null,null,null,null,null,null," "]
[null,null,null,null,null,null," "]
[null,null,null,null,null,null," "]
[null,null,null,null,null,null," "]
[null,null,null,null,null,null," "]
[null,null,null,null,null,null," "]
[null,null,null,null,null,null," "]
[null,null,null,null,null,null," "]
[null,null,null,null,null,null," "]
[null,null,null,null,null,null," "]
[null,null,null,null,null,null," "]
[null,null,null,null,null,null," "]
[null,null,null,null,null,null," "]
[null,null,null,null,null,null," "]
[null,null,null,null,null,null," "]
[null,null,null,null,null,null," "]
[null,null,null,null,null,null," "]
[null,null,null,null,null,null," "]
[null,null,null,null,null,null," "]
[null,null,null,null,null,null," "]
[null,null,null,null,null,null," "]
[null,null,null,null,null,null," "]
[null,null,null,null,null,null," "]
[null,null,null,null,null,null," "]
[null,null,null,null,null,null," "]
[null,null,null,null,null,null," "]
[null,null,null,null,null,null," "]
[null,null,null,null,null,null," "]
[null,null,null,null,null,null," "]
[null,null,null,null,null,null," "]
[null,null,null,null,null,null," "]
[null,null,null,null,null,null," "]
[null,null,null,null,null,null," "]
[null,null,null,null,null,null," "]
[null,null,null,null,null,null," "]
[null,null,null,null,null,null," "]
[null,null,null,null,null,null," "]
[null,null,null,null,null,null," "]
[null,null,null,null,null,null," "]
[null,null,null,null,null,null," "]
[null,null,null,null,null,null," "]
[null,null,null,null,null,null," "]
[null,null,null,null,null,null," "]
[null,null,null,null,null,null," "]
[null,null,null,null,null,null," "]
[null,null,null,null,null,null," "]
[null,null,null,null,null,null," "]
[null,null,null,null,null,null," "]
[null,null,null,null,null,null," "]
[null,null,null,null,null,null," "]
[null,null,null,null,null,null," "]
[null,null,null,null,null,null," "]
[null,null,null,null,null,null," "]
[null,null,null,null,null,null," "]
[null,null,null,null,null,null," "]
[null,null,null,null,null,null," "]
[null,null,null,null,null,null," "]
[null,null,null,null,null,null," "]
[null,null,null,null,null,null," "]
[null,null,null,null,null,null," "]
[null,null,null,null,null,null," "]
[null,null,null,null,null,null," "]
[null,null,null,null,null,null," "]
[null,null,null,null,null,null," "]
[null,null,null,null,null,null," "]
[null,null,null,null,null,null," "]
[null,null,null,null,null,null," "]
[null,null,null,null,null,null," "]
[null,null,null,null,null,null," "]
[null,null,null,null,null,null," "]
[null,null,null,null,null,null," "]
[null,null,null,null,null,null," "]
[null,null,null,null,null,null," "]
[null,null,null,null,null,null," "]
[null,null,null,null,null,null," "]
[null,null,null,null,null,null," "]
[null,null,null,null,null,null," "]
[null,null,null,null,null,null," "]
[null,null,null,null,null,null," "]
[null,null,null,null,null,null," "]
[null,null,null,null,null,null," "]
[null,null,null,null,null,null," "]
[null,null,null,null,null,null," "]
[null,null,null,null,null,null," "]
[null,null,null,null,null,null," "]
[null,null,null,null,null,null," "]
[null,null,null,null,null,null," "]
[null,null,null,null,null,null," "]
[null,null,null,null,null,null," "]
[null,null,null,null,null,null," "]
[null,null,null,null,null,null," "]
[null,null,null,null,null,null," "]
[null,null,null,null,null,null," "]
[null,null,null,null,null,null," "]
[null,null,null,null,null,null," "]
[null,null,null,null,null,null," "]
[null,null,null,null,null,null," "]
[null,null,null,null,null,null," "]
[null,null,null,null,null,null," "]
[null,null,null,null,null,null," "]
[null,null,null,null,null,null," "]
[null,null,null,null,null,null," "]
[null,null,null,null,null,null," "]
[null,null,null,null,null,null," "]
[null,null,null,null,null,null," "]
[null,null,null,null,null,null," "]
[null,null,null,null,null,null," "]
[null,null,null,null,null,null," "]
[null,null,null,null,null,null," "]
[null,null,null,null,null,null," "]
[null,null,null,null,null,null," "]
[null,null,null,null,null,null," "]
[null,null,null,null,null,null," "]
[null,null,null,null,null,null," "]
[null,null,null,null,null,null," "]
[null,null,null,null,null,null," "]
[null,null,null,null,null,null," "]
[null,null,null,null,null,null," "]
[null,null,null,null,null,null," "]
[null,null,null,null,null,null," "]
[null,null,null,null,null,null," "]
[null,null,null,null,null,null," "]
[null,null,null,null,null,null," "]
[null,null,null,null,null,null," "]
[null,null,null,null,null,null," "]
[null,null,null,null,null,null," "]
[null,null,null,null,null,null," "]
[null,null,null,null,null,null," "]
[null,null,null,null,null,null," "]
[null,null,null,null,null,null," "]
[null,null,null,null,null,null," "]
[null,null,null,null,null,null," "]
[null,null,null,null,null,null," "]
[null,null,null,null,null,null," "]
[null,null,null,null,null,null," "]
[null,null,null,null,null,null," "]
[null,null,null,null,null,null," "]
[null,null,null,null,null,null," "]
[null,null,null,null,null,null," "]
[null,null,null,null,null,null," "]
[null,null,null,null,null,null," "]
[null,null,null,null,null,null," "]
[null,null,null,null,null,null," "]
[null,null,null,null,null,null," "]
[null,null,null,null,null,null," "]
[null,null,null,null,null,null," "]
[null,null,null,null,null,null," "]
[null,null,null,null,null,null," "]
[null,null,null,null,null,null," "]
[null,null,null,null,null,null," "]
[null,null,null,null,null,null," "]
[null,null,null,null,null,null," "]
[null,null,null,null,null,null," "]
[null,null,null,null,null,null," "]
[null,null,null,null,null,null," "]
[null,null,null,null,null,null," "]
[null,null,null,null,null,null," "]
[null,null,null,null,null,null," "]
[null,null,null,null,null,null," "]
[null,null,null,null,null,null," "]
[null,null,null,null,null,null," "]
[null,null,null,null,null,null," "]
[null,null,null,null,null,null," "]
[null,null,null,null,null,null," "]
[null,null,null,null,null,null," "]
[null,null,null,null,null,null," "]
[null,null,null,null,null,null," "]
[null,null,null,null,null,null," "]
[null,null,null,null,null,null," "]
[null,null,null,null,null,null," "]
[null,null,null,null,null,null," "]
[null,null,null,null,null,null," "]
[null,null,null,null,null,null," "]
[null,null,null,null,null,null," "]
[null,null,null,null,null,null," "]
[null,null,null,null,null,null," "]
[null,null,null,null,null,null," "]
[null,null,null,null,null,null," "]
[null,null,null,null,null,null," "]
[null,null,null,null,null,null," "]
[null,null,null,null,null,null," "]
[null,null,null,null,null,null," "]
[null,null,null,null,null,null," "]
[null,null,null,null,null,null," "]
[null,null,null,null,null,null," "]
[null,null,null,null,null,null," "]
[null,null,null,null,null,null," "]
[null,null,null,null,null,null," "]
[null,null,null,null,null,null," "]
[null,null,null,null,null,null," "]
[null,null,null,null,null,null," "]
[null,null,null,null,null,null," "]
[null,null,null,null,null,null," "]
[null,null,null,null,null,null," "]
[null,null,null,null,null,null," "]
[null,null,null,null,null,null," "]
[null,null,null,null,null,null," "]
[null,null,null,null,null,null," "]
[null,null,null,null,null,null," "]
[null,null,null,null,null,null," "]
[null,null,null,null,null,null," "]
[null,null,null,null,null,null," "]
[null,null,null,null,null,null," "]
[null,null,null,null,null,null," "]
[null,null,null,null,null,null," "]
[null,null,null,null,null,null," "]
[null,null,null,null,null,null," "]
[null,null,null,null,null,null," "]
[null,null,null,null,null,null," "]
[null,null,null,null,null,null," "]

{"sheet":"31-08-2019","index":8,"n_rows":493,"n_cols":32,"rows_kept":493,"cut":false,"hidden":false,"merged":[]}
[null,null,null,null,null,null,null,null,null,null,null,null,null,null,null,"رجــــوع"]
["#","App. Date","Name","Surname","Pasaport No.","Date of birth","Note of status"," ","Paid $","Route","Unpaid $","GT","Case of appl","TG.Gov",null,"رجــــوع","رجــــوع",null,null,"TOTAL"]
[null,null,null,null,null,null,null," ",{"$f":"IF(J3<>\"\",\"\",H3)","v":" "},null,{"$f":"IF(AND(I3=\"\",J3<>\"\"),H3,\"\")","v":""},{"$f":"IF(C3=\"\",\"\",25)","v":""},null,{"$f":"IF(M3=\"Extractor\",62.5,0)","v":0},null,null,null,"DONE",null,"Total amount",null,"Net profit",null,"Route","Coun of Rout",null,"Total Unpaid",null,{"$f":"Noblanks(J2:J499)","v":"Route"},null,"Note of status","Count of Mistake"]
[null,null,null,null,null,null,null," "," ",null,"","",null,0,null,null,null,"CANCELLED",null,{"$f":"SUM(H2:H70)","v":0},null,{"$f":"T4-V14","v":0},null,{"$f":"IF(ISERROR(INDEX($AC$3:$AC$70,MATCH(0,COUNTIF($X$3:X3,$AC$3:$AC$69),0))),\"\",INDEX($AC$3:$AC$69,MATCH(0,COUNTIF($X$3:X3,$AC$3:$AC$69),0)))","v":""},{"$f":"IF(X4=\"\",\"\",COUNTIF(J2:J100,X4))","v":""},null,{"$f":"IF(X4<>\"\",SUMPRODUCT(--($J$2:$J$69=X4),$K$2:$K$69),\"\")","v":""},{"$f":"IF(K2=\"\",\"\",J2)","v":"Route"},{"$f":"Noblanks(J3:J500)","v":""},null,"MISTAKE IN DOB",{"$f":"COUNTIF(C2:C70,\"Mistake\")","v":0}]
[null,null,null,null,null,null,null," "," ",null,"","",null,0,null,null,null,"REFUSED",null,null,null,null,null,{"$f":"IF(ISERROR(INDEX($AC$3:$AC$70,MATCH(0,COUNTIF($X$3:X4,$AC$3:$AC$69),0))),\"\",INDEX($AC$3:$AC$69,MATCH(0,COUNTIF($X$3:X4,$AC$3:$AC$69),0)))","v":""},"",null,"",{"$f":"IF(K3=\"\",\"\",J3)","v":""},{"$f":"Noblanks(J4:J501)","v":""}]
[null,null,null,null,null,null,null," "," ",null,"","",null,0,null,null,null,"MISTAKE",null,"Total Paid",null,"Difrent amount",null,{"$f":"IF(ISERROR(INDEX($AC$3:$AC$70,MATCH(0,COUNTIF($X$3:X5,$AC$3:$AC$69),0))),\"\",INDEX($AC$3:$AC$69,MATCH(0,COUNTIF($X$3:X5,$AC$3:$AC$69),0)))","v":""},"",{"$f":"IF(K2=\"\",\"\",J2)","v":"Route"},{"$f":"IF(X6<>\"\",SUMPRODUCT(--($J$2:$J$69=X6),$K$2:$K$69),\"\")","v":""},"",{"$f":"Noblanks(J5:J502)","v":""}]
[null,null,null,null,null,null,null," "," ",null,"","",null,0,null,null,null,"GREEN PASS.",null,{"$f":"SUM(I2:I70)","v":0},null,{"$f":"T4-(T7+T10)","v":0},null,{"$f":"IF(ISERROR(INDEX($AC$3:$AC$70,MATCH(0,COUNTIF($X$3:X6,$AC$3:$AC$69),0))),\"\",INDEX($AC$3:$AC$69,MATCH(0,COUNTIF($X$3:X6,$AC$3:$AC$69),0)))","v":""},{"$f":"IF(X7=\"\",\"\",COUNTIF(J5:J103,X7))","v":""},"",{"$f":"IF(X7<>\"\",SUMPRODUCT(--($J$2:$J$69=X7),$K$2:$K$69),\"\")","v":""},"",{"$f":"Noblanks(J6:J503)","v":""}]
[null,null,null,null,null,null,null," "," ",null,"","",null,0,null,null,null,null,null,null,null,null,null,{"$f":"IF(ISERROR(INDEX($AC$3:$AC$70,MATCH(0,COUNTIF($X$3:X7,$AC$3:$AC$69),0))),\"\",INDEX($AC$3:$AC$69,MATCH(0,COUNTIF($X$3:X7,$AC$3:$AC$69),0)))","v":""},{"$f":"IF(X8=\"\",\"\",COUNTIF(J6:J104,X8))","v":""},"","","",{"$f":"Noblanks(J7:J504)","v":""}]
[null,null,null,null,null,null,null," "," ",null,"","",null,0,null,null,null,"official time",null,"Total UnPaid",null,"No. of applicants",null,{"$f":"IF(ISERROR(INDEX($AC$3:$AC$70,MATCH(0,COUNTIF($X$3:X8,$AC$3:$AC$69),0))),\"\",INDEX($AC$3:$AC$69,MATCH(0,COUNTIF($X$3:X8,$AC$3:$AC$69),0)))","v":""},"","","","",{"$f":"Noblanks(J8:J505)","v":""}]
[null,null,null,null,null,null,null," "," ",null,"","",null,0,null,null,null,"official holiday",null,{"$f":"SUM(K2:K70)","v":0},null,{"$f":"COUNT(B:B)","v":0},null,{"$f":"IF(ISERROR(INDEX($AC$3:$AC$70,MATCH(0,COUNTIF($X$3:X9,$AC$3:$AC$69),0))),\"\",INDEX($AC$3:$AC$69,MATCH(0,COUNTIF($X$3:X9,$AC$3:$AC$69),0)))","v":""},"","","","",{"$f":"Noblanks(J9:J506)","v":""}]
[null,null,null,null,null,null,null," "," ",null,"","",null,0,null,null,null,"other",null,null,null,null,null,{"$f":"IF(ISERROR(INDEX($AC$3:$AC$70,MATCH(0,COUNTIF($X$3:X10,$AC$3:$AC$69),0))),\"\",INDEX($AC$3:$AC$69,MATCH(0,COUNTIF($X$3:X10,$AC$3:$AC$69),0)))","v":""},"","","","",{"$f":"Noblanks(J10:J507)","v":""}]
[null,null,null,null,null,null,null," "," ",null,"","",null,0,null,null,null,null,null,"Total GT",null,null,null,{"$f":"IF(ISERROR(INDEX($AC$3:$AC$70,MATCH(0,COUNTIF($X$3:X11,$AC$3:$AC$69),0))),\"\",INDEX($AC$3:$AC$69,MATCH(0,COUNTIF($X$3:X11,$AC$3:$AC$69),0)))","v":""},"","","","",{"$f":"Noblanks(J11:J508)","v":""}]
[null,null,null,null,null,null,null," "," ",null,"","",null,0,null,null,null,null,null,{"$f":"SUM(L2:L70)","v":0},null,"Cost amount",null,{"$f":"IF(ISERROR(INDEX($AC$3:$AC$70,MATCH(0,COUNTIF($X$3:X12,$AC$3:$AC$69),0))),\"\",INDEX($AC$3:$AC$69,MATCH(0,COUNTIF($X$3:X12,$AC$3:$AC$69),0)))","v":""},"","","","",{"$f":"Noblanks(J12:J509)","v":""}]
[null,null,null,null,null,null,null," "," ",null,"","",null,0,null,null,null,null,null,null,null,{"$f":"IF(AND(T13<>\"\",T16<>\"\"),T13+T16,\"\")","v":0},null,{"$f":"IF(ISERROR(INDEX($AC$3:$AC$70,MATCH(0,COUNTIF($X$3:X13,$AC$3:$AC$69),0))),\"\",INDEX($AC$3:$AC$69,MATCH(0,COUNTIF($X$3:X13,$AC$3:$AC$69),0)))","v":""},"","","","",{"$f":"Noblanks(J13:J510)","v":""}]
[null,null,null,null,null,null,null," "," ",null,"","",null,0,null,null,null,null,null,"Total T.Gov",null,null,null,{"$f":"IF(ISERROR(INDEX($AC$3:$AC$70,MATCH(0,COUNTIF($X$3:X14,$AC$3:$AC$69),0))),\"\",INDEX($AC$3:$AC$69,MATCH(0,COUNTIF($X$3:X14,$AC$3:$AC$69),0)))","v":""},"","","","",{"$f":"Noblanks(J14:J511)","v":""}]
[null,null,null,null,null,null,null," "," ",null,"","",null,0,null,null,null,null,null,{"$f":"SUM(N2:N70)","v":0},null,null,null,{"$f":"IF(ISERROR(INDEX($AC$3:$AC$70,MATCH(0,COUNTIF($X$3:X15,$AC$3:$AC$69),0))),\"\",INDEX($AC$3:$AC$69,MATCH(0,COUNTIF($X$3:X15,$AC$3:$AC$69),0)))","v":""},"","","","",{"$f":"Noblanks(J15:J512)","v":""}]
[null,null,null,null,null,null,null," "," ",null,{"$f":"IF(AND(I17=\"\",J17<>\"\"),H17,\"\")","v":""},"",null,0,null,null,null,null,null,null,null,null,null,{"$f":"IF(ISERROR(INDEX($AC$3:$AC$70,MATCH(0,COUNTIF($X$3:X16,$AC$3:$AC$69),0))),\"\",INDEX($AC$3:$AC$69,MATCH(0,COUNTIF($X$3:X16,$AC$3:$AC$69),0)))","v":""},"","","","",{"$f":"Noblanks(J16:J513)","v":""}]
[null,null,null,null,null,null," "," "," ",null,{"$f":"IF(AND(I18=\"\",J18<>\"\"),H18,\"\")","v":""},"",null,0,null,null,null,null,null,null,null,null,null,{"$f":"IF(ISERROR(INDEX($AC$3:$AC$70,MATCH(0,COUNTIF($X$3:X17,$AC$3:$AC$69),0))),\"\",INDEX($AC$3:$AC$69,MATCH(0,COUNTIF($X$3:X17,$AC$3:$AC$69),0)))","v":""},"","","","",{"$f":"Noblanks(J17:J514)","v":""}]
[null,null,null,null,null,null," "," "," ",null,"","",null,0,null,null,null,null,null,null,null,null,null,{"$f":"IF(ISERROR(INDEX($AC$3:$AC$70,MATCH(0,COUNTIF($X$3:X18,$AC$3:$AC$69),0))),\"\",INDEX($AC$3:$AC$69,MATCH(0,COUNTIF($X$3:X18,$AC$3:$AC$69),0)))","v":""},"","","","",{"$f":"Noblanks(J18:J515)","v":""}]
[null,null,null,null,null,null," "," "," ",null,"","",null,0,null,null,null,null,null,null,null,null,null,{"$f":"IF(ISERROR(INDEX($AC$3:$AC$70,MATCH(0,COUNTIF($X$3:X19,$AC$3:$AC$69),0))),\"\",INDEX($AC$3:$AC$69,MATCH(0,COUNTIF($X$3:X19,$AC$3:$AC$69),0)))","v":""},"","","","",{"$f":"Noblanks(J19:J516)","v":""}]
[null,null,null,null,null,null," ",null,0,null,"","",null,0,null,null,null,null,null,null,null,null,null,{"$f":"IF(ISERROR(INDEX($AC$3:$AC$70,MATCH(0,COUNTIF($X$3:X20,$AC$3:$AC$69),0))),\"\",INDEX($AC$3:$AC$69,MATCH(0,COUNTIF($X$3:X20,$AC$3:$AC$69),0)))","v":""},"","","","",{"$f":"Noblanks(J20:J517)","v":""}]
[null,null,null,null,null,null," ",null,0,null,"","",null,0,null,null,null,null,null,null,null,null,null,{"$f":"IF(ISERROR(INDEX($AC$3:$AC$70,MATCH(0,COUNTIF($X$3:X21,$AC$3:$AC$69),0))),\"\",INDEX($AC$3:$AC$69,MATCH(0,COUNTIF($X$3:X21,$AC$3:$AC$69),0)))","v":""},"","","","",{"$f":"Noblanks(J21:J518)","v":""},null,null,{"$f":"IFERROR(INDEX($J$2:$J$492,SMALL(IF($J$2:$J$492<>\"\",ROW($J$1:$J$492)-ROW($J$2)+1,\"\"),ROWS(AF$21:$AJ22))),\"\")","v":""}]
[null,null,null,null,null,null," ",null,0,null,"","",null,0,null,null,null,null,null,null,null,"Done",null,null,{"$f":"Noblanks(Z25:Z518)","v":""},null,{"$f":"IFERROR(INDEX($J$2:$J$492,SMALL(IF($J$2:$J$492<>\"\",ROW($J$1:$J$492)-ROW($J$2)+1,\"\"),ROWS(AF$21:$AJ23))),\"\")","v":""},"",{"$f":"Noblanks(J22:J519)","v":""}]
[null,null,null,null,null,null," ",null,0,null,"","",null,0,null,null,null,null,null,null,null,"Cancelled",null,null,null,{"$f":"IF(K20=\"\",\"\",J20)","v":""},null,"",{"$f":"Noblanks(J23:J520)","v":""},null,null,{"$f":"IFERROR(INDEX($J$2:$J$492,SMALL(IF($J$2:$J$492<>\"\",ROW($J$1:$J$492)-ROW($J$2)+1,\"\"),ROWS(AF$21:$AJ24))),\"\")","v":""}]
[null,null,null,null,null,null," ",null,0,null,"","",null,0,null,null,null,null,null,null,null,"Refused",null,null,null,"",null,"",{"$f":"Noblanks(J24:J521)","v":""},null,null,{"$f":"IFERROR(INDEX($J$2:$J$492,SMALL(IF($J$2:$J$492<>\"\",ROW($J$1:$J$492)-ROW($J$2)+1,\"\"),ROWS(AF$21:$AJ25))),\"\")","v":""}]
[null,null,null,null,null,null," ",null,0,null,"","",null,0,null,null,null,null,null,null,null,"Green pass.",null,null,null,"",null,"",{"$f":"Noblanks(J25:J522)","v":""}]
[null,null,null,null,null,null," ",null,0,null,"","",null,0,null,null,null,null,null,null,null,"Mistake",null,null,null,"",null,"",{"$f":"Noblanks(J26:J523)","v":""}]
[null,null,null,null,null,null," ",null,0,null,"","",null,0,null,null,null,null,null,null,null,null,null,null,null,"",null,"",{"$f":"Noblanks(J27:J524)","v":""}]
[null,null,null,null,null,null," ",null,0,null,"","",null,0,null,null,null,null,null,null,null,null,null,null,null,"",null,"",{"$f":"Noblanks(J28:J525)","v":""}]
[null,null,null,null,null,null," ",null,0,null,"","",null,0,null,null,null,null,null,null,null,null,null,null,null,"",null,"",{"$f":"Noblanks(J29:J526)","v":""}]
[null,null,null,null,null,null," ",null,0,null,"","",null,0,null,null,null,null,null,null,null,null,null,null,null,"",null,"",{"$f":"Noblanks(J30:J527)","v":""}]
[null,null,null,null,null,null," ",null,0,null,"","",null,0,null,null,null,null,null,null,null,null,null,null,null,"",null,"",{"$f":"Noblanks(J31:J528)","v":""}]
[null,null,null,null,null,null," ",null,0,null,"","",null,0,null,null,null,null,null,null,null,null,null,null,null,"",null,"",{"$f":"Noblanks(J32:J529)","v":""}]
[null,null,null,null,null,null," ",null,0,null,"","",null,0,null,null,null,null,null,null,null,null,null,null,null,"",null,"",{"$f":"Noblanks(J33:J530)","v":""}]
[null,null,null,null,null,null," ",null,0,null,"","",null,0,null,null,null,null,null,null,null,null,null,null,null,"",null,"",{"$f":"Noblanks(J34:J531)","v":""}]
[null,null,null,null,null,null," ",null,0,null,"","",null,0,null,null,null,null,null,null,null,null,null,null,null,"",null,"",{"$f":"Noblanks(J35:J532)","v":""}]
[null,null,null,null,null,null," ",null,0,null,"","",null,0,null,null,null,null,null,null,null,null,null,null,null,"",null,"",{"$f":"Noblanks(J36:J533)","v":""}]
[null,null,null,null,null,null," ",null,0,null,"","",null,0,null,null,null,null,null,null,null,null,null,null,null,"",null,"",{"$f":"Noblanks(J37:J534)","v":""}]
[null,null,null,null,null,null," ",null,0,null,"","",null,0,null,null,null,null,null,null,null,null,null,null,null,"",null,"",{"$f":"Noblanks(J38:J535)","v":""}]
[null,null,null,null,null,null," ",null,0,null,"","",null,0,null,null,null,null,null,null,null,null,null,null,null,"",null,"",{"$f":"Noblanks(J39:J536)","v":""}]
[null,null,null,null,null,null," ",null,0,null,"","",null,0,null,null,null,null,null,null,null,null,null,null,null,"",null,"",{"$f":"Noblanks(J40:J537)","v":""}]
[null,null,null,null,null,null," ",null,0,null,"","",null,0,null,null,null,null,null,null,null,null,null,null,null,"",null,"",{"$f":"Noblanks(J41:J538)","v":""}]
[null,null,null,null,null,null," ",null,0,null,"","",null,0,null,null,null,null,null,null,null,null,null,null,null,"",null,"",{"$f":"Noblanks(J42:J539)","v":""}]
[null,null,null,null,null,null," ",null,0,null,"","",null,0,null,null,null,null,null,null,null,null,null,null,null,"",null,"",{"$f":"Noblanks(J43:J540)","v":""}]
[null,null,null,null,null,null," ",null,0,null,"","",null,0,null,null,null,null,null,null,null,null,null,null,null,"",null,"",{"$f":"Noblanks(J44:J541)","v":""}]
[null,null,null,null,null,null," ",null,0,null,"","",null,0,null,null,null,null,null,null,null,null,null,null,null,"",null,"",{"$f":"Noblanks(J45:J542)","v":""}]
[null,null,null,null,null,null," ",null,0,null,"","",null,0,null,null,null,null,null,null,null,null,null,null,null,"",null,"",{"$f":"Noblanks(J46:J543)","v":""}]
[null,null,null,null,null,null," ",null,0,null,"","",null,0,null,null,null,null,null,null,null,null,null,null,null,"",null,"",{"$f":"Noblanks(J47:J544)","v":""}]
[null,null,null,null,null,null," ",null,0,null,"","",null,0,null,null,null,null,null,null,null,null,null,null,null,"",null,"",{"$f":"Noblanks(J48:J545)","v":""}]
[null,null,null,null,null,null," ",null,0,null,"","",null,0,null,null,null,null,null,null,null,null,null,null,null,"",null,"",{"$f":"Noblanks(J49:J546)","v":""}]
[null,null,null,null,null,null," ",null,0,null,"","",null,0,null,null,null,null,null,null,null,null,null,null,null,"",null,"",{"$f":"Noblanks(J50:J547)","v":""}]
[null,null,null,null,null,null," ",null,0,null,"","",null,0,null,null,null,null,null,null,null,null,null,null,null,"",null,"",{"$f":"Noblanks(J51:J548)","v":""}]
[null,null,null,null,null,null," ",null,0,null,"","",null,0,null,null,null,null,null,null,null,null,null,null,null,"",null,"",{"$f":"Noblanks(J52:J549)","v":""}]
[null,null,null,null,null,null," ",null,0,null,"","",null,0,null,null,null,null,null,null,null,null,null,null,null,"",null,"",{"$f":"Noblanks(J53:J550)","v":""}]
[null,null,null,null,null,null," ",null,0,null,"","",null,0,null,null,null,null,null,null,null,null,null,null,null,"",null,"",{"$f":"Noblanks(J54:J551)","v":""}]
[null,null,null,null,null,null," ",null,0,null,"","",null,0,null,null,null,null,null,null,null,null,null,null,null,"",null,"",{"$f":"Noblanks(J55:J552)","v":""}]
[null,null,null,null,null,null," ",null,0,null,"","",null,0,null,null,null,null,null,null,null,null,null,null,null,"",null,"",{"$f":"Noblanks(J56:J553)","v":""}]
[null,null,null,null,null,null," ",null,0,null,"","",null,0,null,null,null,null,null,null,null,null,null,null,null,"",null,"",{"$f":"Noblanks(J57:J554)","v":""}]
[null,null,null,null,null,null," ",null,0,null,"","",null,0,null,null,null,null,null,null,null,null,null,null,null,"",null,"",{"$f":"Noblanks(J58:J555)","v":""}]
[null,null,null,null,null,null," ",null,0,null,"","",null,0,null,null,null,null,null,null,null,null,null,null,null,"",null,"",{"$f":"Noblanks(J59:J556)","v":""}]
[null,null,null,null,null,null," ",null,0,null,"","",null,0,null,null,null,null,null,null,null,null,null,null,null,"",null,"",{"$f":"Noblanks(J60:J557)","v":""}]
[null,null,null,null,null,null," ",null,0,null,"","",null,0,null,null,null,null,null,null,null,null,null,null,null,"",null,"",{"$f":"Noblanks(J61:J558)","v":""}]
[null,null,null,null,null,null," ",null,0,null,"","",null,0,null,null,null,null,null,null,null,null,null,null,null,"",null,"",{"$f":"Noblanks(J62:J559)","v":""}]
[null,null,null,null,null,null," ",null,0,null,{"$f":"IF(AND(I64=\"\",J64<>\"\"),H64,\"\")","v":""},"",null,0,null,null,null,null,null,null,null,null,null,null,null,"",null,"",{"$f":"Noblanks(J63:J560)","v":""}]
[null,null,null,null,null,null," ",null,0,null,{"$f":"IF(AND(I65=\"\",J65<>\"\"),H65,\"\")","v":""},"",null,0,null,null,null,null,null,null,null,null,null,null,null,"",null,"",{"$f":"Noblanks(J64:J561)","v":""}]
[null,null,null,null,null,null," ",null,0,null,"","",null,0,null,null,null,null,null,null,null,null,null,null,null,"",null,"",{"$f":"Noblanks(J65:J562)","v":""}]
[null,null,null,null,null,null," ",null,{"$f":"IF(J67<>\"\",\"\",H67)","v":0},null,"",{"$f":"IF(C67=\"\",\"\",25)","v":""},null,{"$f":"IF(M67=\"Extractor\",62.5,0)","v":0},null,null,null,null,null,null,null,null,null,null,null,"",null,"",{"$f":"Noblanks(J66:J563)","v":""}]
[null,null,null,null,null,null," ",null,0,null,"","",null,0,null,null,null,null,null,null,null,null,null,null,null,"",null,"",{"$f":"Noblanks(J67:J564)","v":""}]
[null,null,null,null,null,null," ",null,0,null,"","",null,0,null,null,null,null,null,null,null,null,null,null,null,"",null,{"$f":"IF(K67=\"\",\"\",J67)","v":""},{"$f":"Noblanks(J68:J565)","v":""}]
[null,null,null,null,null,null," ",null,0,null,"","",null,0,null,null,null,null,null,null,null,null,null,null,null,"",null,"",{"$f":"Noblanks(J69:J566)","v":""}]
[null,null,null,null,null,null," "," ",null,null,null,null,null,null,null,null,null,null,null,null,null,null,null,null,null,"",null,"",{"$f":"Noblanks(J70:J567)","v":""}]
[null,null,null,null,null,null," "," ",null,null,null,null,null,null,null,null,null,null,null,null,null,null,null,null,null,"",null,null,{"$f":"Noblanks(J71:J568)","v":""}]
[null,null,null,null,null,null," "," ",null,null,null,null,null,null,null,null,null,null,null,null,null,null,null,null,null,"",null,null,{"$f":"Noblanks(J72:J569)","v":""}]
[null,null,null,null,null,null," "," ",null,null,null,null,null,null,null,null,null,null,null,null,null,null,null,null,null,"",null,null,{"$f":"Noblanks(J73:J570)","v":""}]
[null,null,null,null,null,null," "," ",null,null,null,null,null,null,null,null,null,null,null,null,null,null,null,null,null,"",null,null,{"$f":"Noblanks(J74:J571)","v":""}]
[null,null,null,null,null,null," "," ",null,null,null,null,null,null,null,null,null,null,null,null,null,null,null,null,null,"",null,null,{"$f":"Noblanks(J75:J572)","v":""}]
[null,null,null,null,null,null," "," ",null,null,null,null,null,null,null,null,null,null,null,null,null,null,null,null,null,"",null,null,{"$f":"Noblanks(J76:J573)","v":""}]
[null,null,null,null,null,null," "," ",null,null,null,null,null,null,null,null,null,null,null,null,null,null,null,null,null,"",null,null,{"$f":"Noblanks(J77:J574)","v":""}]
[null,null,null,null,null,null," "," ",null,null,null,null,null,null,null,null,null,null,null,null,null,null,null,null,null,"",null,null,{"$f":"Noblanks(J78:J575)","v":""}]
[null,null,null,null,null,null," "," ",null,null,null,null,null,null,null,null,null,null,null,null,null,null,null,null,null,"",null,null,{"$f":"Noblanks(J79:J576)","v":""}]
[null,null,null,null,null,null," "," ",null,null,null,null,null,null,null,null,null,null,null,null,null,null,null,null,null,"",null,null,{"$f":"Noblanks(J80:J577)","v":""}]
[null,null,null,null,null,null," "," ",null,null,null,null,null,null,null,null,null,null,null,null,null,null,null,null,null,"",null,null,{"$f":"Noblanks(J81:J578)","v":""}]
[null,null,null,null,null,null," "," ",null,null,null,null,null,null,null,null,null,null,null,null,null,null,null,null,null,"",null,null,{"$f":"Noblanks(J82:J579)","v":""}]
[null,null,null,null,null,null," "," ",null,null,null,null,null,null,null,null,null,null,null,null,null,null,null,null,null,"",null,null,{"$f":"Noblanks(J83:J580)","v":""}]
[null,null,null,null,null,null," "," ",null,null,null,null,null,null,null,null,null,null,null,null,null,null,null,null,null,"",null,null,{"$f":"Noblanks(J84:J581)","v":""}]
[null,null,null,null,null,null," "," ",null,null,null,null,null,null,null,null,null,null,null,null,null,null,null,null,null,"",null,null,{"$f":"Noblanks(J85:J582)","v":""}]
[null,null,null,null,null,null," "," ",null,null,null,null,null,null,null,null,null,null,null,null,null,null,null,null,null,"",null,null,{"$f":"Noblanks(J86:J583)","v":""}]
[null,null,null,null,null,null," "," ",null,null,null,null,null,null,null,null,null,null,null,null,null,null,null,null,null,{"$f":"IF(K84=\"\",\"\",J84)","v":""},null,null,{"$f":"Noblanks(J87:J584)","v":""}]
[null,null,null,null,null,null," "," ",null,null,null,null,null,null,null,null,null,null,null,null,null,null,null,null,null,"",null,null,{"$f":"Noblanks(J88:J585)","v":""}]
[null,null,null,null,null,null," "," ",null,null,null,null,null,null,null,null,null,null,null,null,null,null,null,null,null,"",null,null,{"$f":"Noblanks(J89:J586)","v":""}]
[null,null,null,null,null,null," "," ",null,null,null,null,null,null,null,null,null,null,null,null,null,null,null,null,null,"",null,null,{"$f":"Noblanks(J90:J587)","v":""}]
[null,null,null,null,null,null," "," ",null,null,null,null,null,null,null,null,null,null,null,null,null,null,null,null,null,"",null,null,{"$f":"Noblanks(J91:J588)","v":""}]
[null,null,null,null,null,null," "," ",null,null,null,null,null,null,null,null,null,null,null,null,null,null,null,null,null,"",null,null,{"$f":"Noblanks(J92:J589)","v":""}]
[null,null,null,null,null,null," ",null,null,null,null,null,null,null,null,null,null,null,null,null,null,null,null,null,null,"",null,null,{"$f":"Noblanks(J93:J590)","v":""}]
[null,null,null,null,null,null," ",null,null,null,null,null,null,null,null,null,null,null,null,null,null,null,null,null,null,"",null,null,{"$f":"Noblanks(J94:J591)","v":""}]
[null,null,null,null,null,null," ",null,null,null,null,null,null,null,null,null,null,null,null,null,null,null,null,null,null,"",null,null,{"$f":"Noblanks(J95:J592)","v":""}]
[null,null,null,null,null,null," ",null,null,null,null,null,null,null,null,null,null,null,null,null,null,null,null,null,null,"",null,null,{"$f":"Noblanks(J96:J593)","v":""}]
[null,null,null,null,null,null," ",null,null,null,null,null,null,null,null,null,null,null,null,null,null,null,null,null,null,"",null,null,{"$f":"Noblanks(J97:J594)","v":""}]
[null,null,null,null,null,null," ",null,null,null,null,null,null,null,null,null,null,null,null,null,null,null,null,null,null,"",null,null,{"$f":"Noblanks(J98:J595)","v":""}]
[null,null,null,null,null,null," ",null,null,null,null,null,null,null,null,null,null,null,null,null,null,null,null,null,null,"",null,null,{"$f":"Noblanks(J99:J596)","v":""}]
[null,null,null,null,null,null," ",null,null,null,null,null,null,null,null,null,null,null,null,null,null,null,null,null,null,"",null,null,{"$f":"Noblanks(J100:J597)","v":""}]
[null,null,null,null,null,null," ",null,null,null,null,null,null,null,null,null,null,null,null,null,null,null,null,null,null,"",null,null,{"$f":"Noblanks(J101:J598)","v":""}]
[null,null,null,null,null,null," ",null,null,null,null,null,null,null,null,null,null,null,null,null,null,null,null,null,null,null,null,null,{"$f":"Noblanks(J102:J599)","v":""}]
[null,null,null,null,null,null," ",null,null,null,null,null,null,null,null,null,null,null,null,null,null,null,null,null,null,null,null,null,{"$f":"Noblanks(J103:J600)","v":""}]
[null,null,null,null,null,null," ",null,null,null,null,null,null,null,null,null,null,null,null,null,null,null,null,null,null,null,null,null,{"$f":"Noblanks(J104:J601)","v":""}]
[null,null,null,null,null,null," ",null,null,null,null,null,null,null,null,null,null,null,null,null,null,null,null,null,null,null,null,null,{"$f":"Noblanks(J105:J602)","v":""}]
[null,null,null,null,null,null," ",null,null,null,null,null,null,null,null,null,null,null,null,null,null,null,null,null,null,null,null,null,{"$f":"Noblanks(J106:J603)","v":""}]
[null,null,null,null,null,null," ",null,null,null,null,null,null,null,null,null,null,null,null,null,null,null,null,null,null,null,null,null,{"$f":"Noblanks(J107:J604)","v":""}]
[null,null,null,null,null,null," ",null,null,null,null,null,null,null,null,null,null,null,null,null,null,null,null,null,null,null,null,null,{"$f":"Noblanks(J108:J605)","v":""}]
[null,null,null,null,null,null," ",null,null,null,null,null,null,null,null,null,null,null,null,null,null,null,null,null,null,null,null,null,{"$f":"Noblanks(J109:J606)","v":""}]
[null,null,null,null,null,null," ",null,null,null,null,null,null,null,null,null,null,null,null,null,null,null,null,null,null,null,null,null,{"$f":"Noblanks(J110:J607)","v":""}]
[null,null,null,null,null,null," ",null,null,null,null,null,null,null,null,null,null,null,null,null,null,null,null,null,null,null,null,null,{"$f":"Noblanks(J111:J608)","v":""}]
[null,null,null,null,null,null," ",null,null,null,null,null,null,null,null,null,null,null,null,null,null,null,null,null,null,null,null,null,{"$f":"Noblanks(J112:J609)","v":""}]
[null,null,null,null,null,null," ",null,null,null,null,null,null,null,null,null,null,null,null,null,null,null,null,null,null,null,null,null,{"$f":"Noblanks(J113:J610)","v":""}]
[null,null,null,null,null,null," ",null,null,null,null,null,null,null,null,null,null,null,null,null,null,null,null,null,null,null,null,null,{"$f":"Noblanks(J114:J611)","v":""}]
[null,null,null,null,null,null," ",null,null,null,null,null,null,null,null,null,null,null,null,null,null,null,null,null,null,null,null,null,{"$f":"Noblanks(J115:J612)","v":""}]
[null,null,null,null,null,null," ",null,null,null,null,null,null,null,null,null,null,null,null,null,null,null,null,null,null,null,null,null,{"$f":"Noblanks(J116:J613)","v":""}]
[null,null,null,null,null,null," ",null,null,null,null,null,null,null,null,null,null,null,null,null,null,null,null,null,null,null,null,null,{"$f":"Noblanks(J117:J614)","v":""}]
[null,null,null,null,null,null," ",null,null,null,null,null,null,null,null,null,null,null,null,null,null,null,null,null,null,null,null,null,{"$f":"Noblanks(J118:J615)","v":""}]
[null,null,null,null,null,null," ",null,null,null,null,null,null,null,null,null,null,null,null,null,null,null,null,null,null,null,null,null,{"$f":"Noblanks(J119:J616)","v":""}]
[null,null,null,null,null,null," ",null,null,null,null,null,null,null,null,null,null,null,null,null,null,null,null,null,null,null,null,null,{"$f":"Noblanks(J120:J617)","v":""}]
[null,null,null,null,null,null," ",null,null,null,null,null,null,null,null,null,null,null,null,null,null,null,null,null,null,null,null,null,{"$f":"Noblanks(J121:J618)","v":""}]
[null,null,null,null,null,null," ",null,null,null,null,null,null,null,null,null,null,null,null,null,null,null,null,null,null,null,null,null,{"$f":"Noblanks(J122:J619)","v":""}]
[null,null,null,null,null,null," ",null,null,null,null,null,null,null,null,null,null,null,null,null,null,null,null,null,null,null,null,null,{"$f":"Noblanks(J123:J620)","v":""}]
[null,null,null,null,null,null," ",null,null,null,null,null,null,null,null,null,null,null,null,null,null,null,null,null,null,null,null,null,{"$f":"Noblanks(J124:J621)","v":""}]
[null,null,null,null,null,null," ",null,null,null,null,null,null,null,null,null,null,null,null,null,null,null,null,null,null,null,null,null,{"$f":"Noblanks(J125:J622)","v":""}]
[null,null,null,null,null,null," ",null,null,null,null,null,null,null,null,null,null,null,null,null,null,null,null,null,null,null,null,null,{"$f":"Noblanks(J126:J623)","v":""}]
[null,null,null,null,null,null," ",null,null,null,null,null,null,null,null,null,null,null,null,null,null,null,null,null,null,null,null,null,{"$f":"Noblanks(J127:J624)","v":""}]
[null,null,null,null,null,null," ",null,null,null,null,null,null,null,null,null,null,null,null,null,null,null,null,null,null,null,null,null,{"$f":"Noblanks(J128:J625)","v":""}]
[null,null,null,null,null,null," ",null,null,null,null,null,null,null,null,null,null,null,null,null,null,null,null,null,null,null,null,null,{"$f":"Noblanks(J129:J626)","v":""}]
[null,null,null,null,null,null," ",null,null,null,null,null,null,null,null,null,null,null,null,null,null,null,null,null,null,null,null,null,{"$f":"Noblanks(J130:J627)","v":""}]
[null,null,null,null,null,null," ",null,null,null,null,null,null,null,null,null,null,null,null,null,null,null,null,null,null,null,null,null,{"$f":"Noblanks(J131:J628)","v":""}]
[null,null,null,null,null,null," ",null,null,null,null,null,null,null,null,null,null,null,null,null,null,null,null,null,null,null,null,null,{"$f":"Noblanks(J132:J629)","v":""}]
[null,null,null,null,null,null," ",null,null,null,null,null,null,null,null,null,null,null,null,null,null,null,null,null,null,null,null,null,{"$f":"Noblanks(J133:J630)","v":""}]
[null,null,null,null,null,null," ",null,null,null,null,null,null,null,null,null,null,null,null,null,null,null,null,null,null,null,null,null,{"$f":"Noblanks(J134:J631)","v":""}]
[null,null,null,null,null,null," ",null,null,null,null,null,null,null,null,null,null,null,null,null,null,null,null,null,null,null,null,null,{"$f":"Noblanks(J135:J632)","v":""}]
[null,null,null,null,null,null," ",null,null,null,null,null,null,null,null,null,null,null,null,null,null,null,null,null,null,null,null,null,{"$f":"Noblanks(J136:J633)","v":""}]
[null,null,null,null,null,null," ",null,null,null,null,null,null,null,null,null,null,null,null,null,null,null,null,null,null,null,null,null,{"$f":"Noblanks(J137:J634)","v":""}]
[null,null,null,null,null,null," ",null,null,null,null,null,null,null,null,null,null,null,null,null,null,null,null,null,null,null,null,null,{"$f":"Noblanks(J138:J635)","v":""}]
[null,null,null,null,null,null," ",null,null,null,null,null,null,null,null,null,null,null,null,null,null,null,null,null,null,null,null,null,{"$f":"Noblanks(J139:J636)","v":""}]
[null,null,null,null,null,null," ",null,null,null,null,null,null,null,null,null,null,null,null,null,null,null,null,null,null,null,null,null,{"$f":"Noblanks(J140:J637)","v":""}]
[null,null,null,null,null,null," ",null,null,null,null,null,null,null,null,null,null,null,null,null,null,null,null,null,null,null,null,null,{"$f":"Noblanks(J141:J638)","v":""}]
[null,null,null,null,null,null," ",null,null,null,null,null,null,null,null,null,null,null,null,null,null,null,null,null,null,null,null,null,{"$f":"Noblanks(J142:J639)","v":""}]
[null,null,null,null,null,null," ",null,null,null,null,null,null,null,null,null,null,null,null,null,null,null,null,null,null,null,null,null,{"$f":"Noblanks(J143:J640)","v":""}]
[null,null,null,null,null,null," ",null,null,null,null,null,null,null,null,null,null,null,null,null,null,null,null,null,null,null,null,null,{"$f":"Noblanks(J144:J641)","v":""}]
[null,null,null,null,null,null," ",null,null,null,null,null,null,null,null,null,null,null,null,null,null,null,null,null,null,null,null,null,{"$f":"Noblanks(J145:J642)","v":""}]
[null,null,null,null,null,null," ",null,null,null,null,null,null,null,null,null,null,null,null,null,null,null,null,null,null,null,null,null,{"$f":"Noblanks(J146:J643)","v":""}]
[null,null,null,null,null,null," ",null,null,null,null,null,null,null,null,null,null,null,null,null,null,null,null,null,null,null,null,null,{"$f":"Noblanks(J147:J644)","v":""}]
[null,null,null,null,null,null," ",null,null,null,null,null,null,null,null,null,null,null,null,null,null,null,null,null,null,null,null,null,{"$f":"Noblanks(J148:J645)","v":""}]
[null,null,null,null,null,null," ",null,null,null,null,null,null,null,null,null,null,null,null,null,null,null,null,null,null,null,null,null,{"$f":"Noblanks(J149:J646)","v":""}]
[null,null,null,null,null,null," ",null,null,null,null,null,null,null,null,null,null,null,null,null,null,null,null,null,null,null,null,null,{"$f":"Noblanks(J150:J647)","v":""}]
[null,null,null,null,null,null," ",null,null,null,null,null,null,null,null,null,null,null,null,null,null,null,null,null,null,null,null,null,{"$f":"Noblanks(J151:J648)","v":""}]
[null,null,null,null,null,null," ",null,null,null,null,null,null,null,null,null,null,null,null,null,null,null,null,null,null,null,null,null,{"$f":"Noblanks(J152:J649)","v":""}]
[null,null,null,null,null,null," ",null,null,null,null,null,null,null,null,null,null,null,null,null,null,null,null,null,null,null,null,null,{"$f":"Noblanks(J153:J650)","v":""}]
[null,null,null,null,null,null," ",null,null,null,null,null,null,null,null,null,null,null,null,null,null,null,null,null,null,null,null,null,{"$f":"Noblanks(J154:J651)","v":""}]
[null,null,null,null,null,null," ",null,null,null,null,null,null,null,null,null,null,null,null,null,null,null,null,null,null,null,null,null,{"$f":"Noblanks(J155:J652)","v":""}]
[null,null,null,null,null,null," ",null,null,null,null,null,null,null,null,null,null,null,null,null,null,null,null,null,null,null,null,null,{"$f":"Noblanks(J156:J653)","v":""}]
[null,null,null,null,null,null," ",null,null,null,null,null,null,null,null,null,null,null,null,null,null,null,null,null,null,null,null,null,{"$f":"Noblanks(J157:J654)","v":""}]
[null,null,null,null,null,null," ",null,null,null,null,null,null,null,null,null,null,null,null,null,null,null,null,null,null,null,null,null,{"$f":"Noblanks(J158:J655)","v":""}]
[null,null,null,null,null,null," ",null,null,null,null,null,null,null,null,null,null,null,null,null,null,null,null,null,null,null,null,null,{"$f":"Noblanks(J159:J656)","v":""}]
[null,null,null,null,null,null," ",null,null,null,null,null,null,null,null,null,null,null,null,null,null,null,null,null,null,null,null,null,{"$f":"Noblanks(J160:J657)","v":""}]
[null,null,null,null,null,null," ",null,null,null,null,null,null,null,null,null,null,null,null,null,null,null,null,null,null,null,null,null,{"$f":"Noblanks(J161:J658)","v":""}]
[null,null,null,null,null,null," ",null,null,null,null,null,null,null,null,null,null,null,null,null,null,null,null,null,null,null,null,null,{"$f":"Noblanks(J162:J659)","v":""}]
[null,null,null,null,null,null," ",null,null,null,null,null,null,null,null,null,null,null,null,null,null,null,null,null,null,null,null,null,{"$f":"Noblanks(J163:J660)","v":""}]
[null,null,null,null,null,null," ",null,null,null,null,null,null,null,null,null,null,null,null,null,null,null,null,null,null,null,null,null,{"$f":"Noblanks(J164:J661)","v":""}]
[null,null,null,null,null,null," ",null,null,null,null,null,null,null,null,null,null,null,null,null,null,null,null,null,null,null,null,null,{"$f":"Noblanks(J165:J662)","v":""}]
[null,null,null,null,null,null," ",null,null,null,null,null,null,null,null,null,null,null,null,null,null,null,null,null,null,null,null,null,{"$f":"Noblanks(J166:J663)","v":""}]
[null,null,null,null,null,null," ",null,null,null,null,null,null,null,null,null,null,null,null,null,null,null,null,null,null,null,null,null,{"$f":"Noblanks(J167:J664)","v":""}]
[null,null,null,null,null,null," ",null,null,null,null,null,null,null,null,null,null,null,null,null,null,null,null,null,null,null,null,null,{"$f":"Noblanks(J168:J665)","v":""}]
[null,null,null,null,null,null," ",null,null,null,null,null,null,null,null,null,null,null,null,null,null,null,null,null,null,null,null,null,{"$f":"Noblanks(J169:J666)","v":""}]
[null,null,null,null,null,null," ",null,null,null,null,null,null,null,null,null,null,null,null,null,null,null,null,null,null,null,null,null,{"$f":"Noblanks(J170:J667)","v":""}]
[null,null,null,null,null,null," ",null,null,null,null,null,null,null,null,null,null,null,null,null,null,null,null,null,null,null,null,null,{"$f":"Noblanks(J171:J668)","v":""}]
[null,null,null,null,null,null," ",null,null,null,null,null,null,null,null,null,null,null,null,null,null,null,null,null,null,null,null,null,{"$f":"Noblanks(J172:J669)","v":""}]
[null,null,null,null,null,null," ",null,null,null,null,null,null,null,null,null,null,null,null,null,null,null,null,null,null,null,null,null,{"$f":"Noblanks(J173:J670)","v":""}]
[null,null,null,null,null,null," ",null,null,null,null,null,null,null,null,null,null,null,null,null,null,null,null,null,null,null,null,null,{"$f":"Noblanks(J174:J671)","v":""}]
[null,null,null,null,null,null," ",null,null,null,null,null,null,null,null,null,null,null,null,null,null,null,null,null,null,null,null,null,{"$f":"Noblanks(J175:J672)","v":""}]
[null,null,null,null,null,null," ",null,null,null,null,null,null,null,null,null,null,null,null,null,null,null,null,null,null,null,null,null,{"$f":"Noblanks(J176:J673)","v":""}]
[null,null,null,null,null,null," ",null,null,null,null,null,null,null,null,null,null,null,null,null,null,null,null,null,null,null,null,null,{"$f":"Noblanks(J177:J674)","v":""}]
[null,null,null,null,null,null," ",null,null,null,null,null,null,null,null,null,null,null,null,null,null,null,null,null,null,null,null,null,{"$f":"Noblanks(J178:J675)","v":""}]
[null,null,null,null,null,null," ",null,null,null,null,null,null,null,null,null,null,null,null,null,null,null,null,null,null,null,null,null,{"$f":"Noblanks(J179:J676)","v":""}]
[null,null,null,null,null,null," ",null,null,null,null,null,null,null,null,null,null,null,null,null,null,null,null,null,null,null,null,null,{"$f":"Noblanks(J180:J677)","v":""}]
[null,null,null,null,null,null," ",null,null,null,null,null,null,null,null,null,null,null,null,null,null,null,null,null,null,null,null,null,{"$f":"Noblanks(J181:J678)","v":""}]
[null,null,null,null,null,null," ",null,null,null,null,null,null,null,null,null,null,null,null,null,null,null,null,null,null,null,null,null,{"$f":"Noblanks(J182:J679)","v":""}]
[null,null,null,null,null,null," ",null,null,null,null,null,null,null,null,null,null,null,null,null,null,null,null,null,null,null,null,null,{"$f":"Noblanks(J183:J680)","v":""}]
[null,null,null,null,null,null," ",null,null,null,null,null,null,null,null,null,null,null,null,null,null,null,null,null,null,null,null,null,{"$f":"Noblanks(J184:J681)","v":""}]
[null,null,null,null,null,null," ",null,null,null,null,null,null,null,null,null,null,null,null,null,null,null,null,null,null,null,null,null,{"$f":"Noblanks(J185:J682)","v":""}]
[null,null,null,null,null,null," ",null,null,null,null,null,null,null,null,null,null,null,null,null,null,null,null,null,null,null,null,null,{"$f":"Noblanks(J186:J683)","v":""}]
[null,null,null,null,null,null," ",null,null,null,null,null,null,null,null,null,null,null,null,null,null,null,null,null,null,null,null,null,{"$f":"Noblanks(J187:J684)","v":""}]
[null,null,null,null,null,null," ",null,null,null,null,null,null,null,null,null,null,null,null,null,null,null,null,null,null,null,null,null,{"$f":"Noblanks(J188:J685)","v":""}]
[null,null,null,null,null,null," ",null,null,null,null,null,null,null,null,null,null,null,null,null,null,null,null,null,null,null,null,null,{"$f":"Noblanks(J189:J686)","v":""}]
[null,null,null,null,null,null," ",null,null,null,null,null,null,null,null,null,null,null,null,null,null,null,null,null,null,null,null,null,{"$f":"Noblanks(J190:J687)","v":""}]
[null,null,null,null,null,null," ",null,null,null,null,null,null,null,null,null,null,null,null,null,null,null,null,null,null,null,null,null,{"$f":"Noblanks(J191:J688)","v":""}]
[null,null,null,null,null,null," ",null,null,null,null,null,null,null,null,null,null,null,null,null,null,null,null,null,null,null,null,null,{"$f":"Noblanks(J192:J689)","v":""}]
[null,null,null,null,null,null," ",null,null,null,null,null,null,null,null,null,null,null,null,null,null,null,null,null,null,null,null,null,{"$f":"Noblanks(J193:J690)","v":""}]
[null,null,null,null,null,null," ",null,null,null,null,null,null,null,null,null,null,null,null,null,null,null,null,null,null,null,null,null,{"$f":"Noblanks(J194:J691)","v":""}]
[null,null,null,null,null,null," ",null,null,null,null,null,null,null,null,null,null,null,null,null,null,null,null,null,null,null,null,null,{"$f":"Noblanks(J195:J692)","v":""}]
[null,null,null,null,null,null," ",null,null,null,null,null,null,null,null,null,null,null,null,null,null,null,null,null,null,null,null,null,{"$f":"Noblanks(J196:J693)","v":""}]
[null,null,null,null,null,null," ",null,null,null,null,null,null,null,null,null,null,null,null,null,null,null,null,null,null,null,null,null,{"$f":"Noblanks(J197:J694)","v":""}]
[null,null,null,null,null,null," "]
[null,null,null,null,null,null," "]
[null,null,null,null,null,null," "]
[null,null,null,null,null,null," "]
[null,null,null,null,null,null," "]
[null,null,null,null,null,null," "]
[null,null,null,null,null,null," "]
[null,null,null,null,null,null," "]
[null,null,null,null,null,null," "]
[null,null,null,null,null,null," "]
[null,null,null,null,null,null," "]
[null,null,null,null,null,null," "]
[null,null,null,null,null,null," "]
[null,null,null,null,null,null," "]
[null,null,null,null,null,null," "]
[null,null,null,null,null,null," "]
[null,null,null,null,null,null," "]
[null,null,null,null,null,null," "]
[null,null,null,null,null,null," "]
[null,null,null,null,null,null," "]
[null,null,null,null,null,null," "]
[null,null,null,null,null,null," "]
[null,null,null,null,null,null," "]
[null,null,null,null,null,null," "]
[null,null,null,null,null,null," "]
[null,null,null,null,null,null," "]
[null,null,null,null,null,null," "]
[null,null,null,null,null,null," "]
[null,null,null,null,null,null," "]
[null,null,null,null,null,null," "]
[null,null,null,null,null,null," "]
[null,null,null,null,null,null," "]
[null,null,null,null,null,null," "]
[null,null,null,null,null,null," "]
[null,null,null,null,null,null," "]
[null,null,null,null,null,null," "]
[null,null,null,null,null,null," "]
[null,null,null,null,null,null," "]
[null,null,null,null,null,null," "]
[null,null,null,null,null,null," "]
[null,null,null,null,null,null," "]
[null,null,null,null,null,null," "]
[null,null,null,null,null,null," "]
[null,null,null,null,null,null," "]
[null,null,null,null,null,null," "]
[null,null,null,null,null,null," "]
[null,null,null,null,null,null," "]
[null,null,null,null,null,null," "]
[null,null,null,null,null,null," "]
[null,null,null,null,null,null," "]
[null,null,null,null,null,null," "]
[null,null,null,null,null,null," "]
[null,null,null,null,null,null," "]
[null,null,null,null,null,null," "]
[null,null,null,null,null,null," "]
[null,null,null,null,null,null," "]
[null,null,null,null,null,null," "]
[null,null,null,null,null,null," "]
[null,null,null,null,null,null," "]
[null,null,null,null,null,null," "]
[null,null,null,null,null,null," "]
[null,null,null,null,null,null," "]
[null,null,null,null,null,null," "]
[null,null,null,null,null,null," "]
[null,null,null,null,null,null," "]
[null,null,null,null,null,null," "]
[null,null,null,null,null,null," "]
[null,null,null,null,null,null," "]
[null,null,null,null,null,null," "]
[null,null,null,null,null,null," "]
[null,null,null,null,null,null," "]
[null,null,null,null,null,null," "]
[null,null,null,null,null,null," "]
[null,null,null,null,null,null," "]
[null,null,null,null,null,null," "]
[null,null,null,null,null,null," "]
[null,null,null,null,null,null," "]
[null,null,null,null,null,null," "]
[null,null,null,null,null,null," "]
[null,null,null,null,null,null," "]
[null,null,null,null,null,null," "]
[null,null,null,null,null,null," "]
[null,null,null,null,null,null," "]
[null,null,null,null,null,null," "]
[null,null,null,null,null,null," "]
[null,null,null,null,null,null," "]
[null,null,null,null,null,null," "]
[null,null,null,null,null,null," "]
[null,null,null,null,null,null," "]
[null,null,null,null,null,null," "]
[null,null,null,null,null,null," "]
[null,null,null,null,null,null," "]
[null,null,null,null,null,null," "]
[null,null,null,null,null,null," "]
[null,null,null,null,null,null," "]
[null,null,null,null,null,null," "]
[null,null,null,null,null,null," "]
[null,null,null,null,null,null," "]
[null,null,null,null,null,null," "]
[null,null,null,null,null,null," "]
[null,null,null,null,null,null," "]
[null,null,null,null,null,null," "]
[null,null,null,null,null,null," "]
[null,null,null,null,null,null," "]
[null,null,null,null,null,null," "]
[null,null,null,null,null,null," "]
[null,null,null,null,null,null," "]
[null,null,null,null,null,null," "]
[null,null,null,null,null,null," "]
[null,null,null,null,null,null," "]
[null,null,null,null,null,null," "]
[null,null,null,null,null,null," "]
[null,null,null,null,null,null," "]
[null,null,null,null,null,null," "]
[null,null,null,null,null,null," "]
[null,null,null,null,null,null," "]
[null,null,null,null,null,null," "]
[null,null,null,null,null,null," "]
[null,null,null,null,null,null," "]
[null,null,null,null,null,null," "]
[null,null,null,null,null,null," "]
[null,null,null,null,null,null," "]
[null,null,null,null,null,null," "]
[null,null,null,null,null,null," "]
[null,null,null,null,null,null," "]
[null,null,null,null,null,null," "]
[null,null,null,null,null,null," "]
[null,null,null,null,null,null," "]
[null,null,null,null,null,null," "]
[null,null,null,null,null,null," "]
[null,null,null,null,null,null," "]
[null,null,null,null,null,null," "]
[null,null,null,null,null,null," "]
[null,null,null,null,null,null," "]
[null,null,null,null,null,null," "]
[null,null,null,null,null,null," "]
[null,null,null,null,null,null," "]
[null,null,null,null,null,null," "]
[null,null,null,null,null,null," "]
[null,null,null,null,null,null," "]
[null,null,null,null,null,null," "]
[null,null,null,null,null,null," "]
[null,null,null,null,null,null," "]
[null,null,null,null,null,null," "]
[null,null,null,null,null,null," "]
[null,null,null,null,null,null," "]
[null,null,null,null,null,null," "]
[null,null,null,null,null,null," "]
[null,null,null,null,null,null," "]
[null,null,null,null,null,null," "]
[null,null,null,null,null,null," "]
[null,null,null,null,null,null," "]
[null,null,null,null,null,null," "]
[null,null,null,null,null,null," "]
[null,null,null,null,null,null," "]
[null,null,null,null,null,null," "]
[null,null,null,null,null,null," "]
[null,null,null,null,null,null," "]
[null,null,null,null,null,null," "]
[null,null,null,null,null,null," "]
[null,null,null,null,null,null," "]
[null,null,null,null,null,null," "]
[null,null,null,null,null,null," "]
[null,null,null,null,null,null," "]
[null,null,null,null,null,null," "]
[null,null,null,null,null,null," "]
[null,null,null,null,null,null," "]
[null,null,null,null,null,null," "]
[null,null,null,null,null,null," "]
[null,null,null,null,null,null," "]
[null,null,null,null,null,null," "]
[null,null,null,null,null,null," "]
[null,null,null,null,null,null," "]
[null,null,null,null,null,null," "]
[null,null,null,null,null,null," "]
[null,null,null,null,null,null," "]
[null,null,null,null,null,null," "]
[null,null,null,null,null,null," "]
[null,null,null,null,null,null," "]
[null,null,null,null,null,null," "]
[null,null,null,null,null,null," "]
[null,null,null,null,null,null," "]
[null,null,null,null,null,null," "]
[null,null,null,null,null,null," "]
[null,null,null,null,null,null," "]
[null,null,null,null,null,null," "]
[null,null,null,null,null,null," "]
[null,null,null,null,null,null," "]
[null,null,null,null,null,null," "]
[null,null,null,null,null,null," "]
[null,null,null,null,null,null," "]
[null,null,null,null,null,null," "]
[null,null,null,null,null,null," "]
[null,null,null,null,null,null," "]
[null,null,null,null,null,null," "]
[null,null,null,null,null,null," "]
[null,null,null,null,null,null," "]
[null,null,null,null,null,null," "]
[null,null,null,null,null,null," "]
[null,null,null,null,null,null," "]
[null,null,null,null,null,null," "]
[null,null,null,null,null,null," "]
[null,null,null,null,null,null," "]
[null,null,null,null,null,null," "]
[null,null,null,null,null,null," "]
[null,null,null,null,null,null," "]
[null,null,null,null,null,null," "]
[null,null,null,null,null,null," "]
[null,null,null,null,null,null," "]
[null,null,null,null,null,null," "]
[null,null,null,null,null,null," "]
[null,null,null,null,null,null," "]
[null,null,null,null,null,null," "]
[null,null,null,null,null,null," "]
[null,null,null,null,null,null," "]
[null,null,null,null,null,null," "]
[null,null,null,null,null,null," "]
[null,null,null,null,null,null," "]
[null,null,null,null,null,null," "]
[null,null,null,null,null,null," "]
[null,null,null,null,null,null," "]
[null,null,null,null,null,null," "]
[null,null,null,null,null,null," "]
[null,null,null,null,null,null," "]
[null,null,null,null,null,null," "]
[null,null,null,null,null,null," "]
[null,null,null,null,null,null," "]
[null,null,null,null,null,null," "]
[null,null,null,null,null,null," "]
[null,null,null,null,null,null," "]
[null,null,null,null,null,null," "]
[null,null,null,null,null,null," "]
[null,null,null,null,null,null," "]
[null,null,null,null,null,null," "]
[null,null,null,null,null,null," "]
[null,null,null,null,null,null," "]
[null,null,null,null,null,null," "]
[null,null,null,null,null,null," "]
[null,null,null,null,null,null," "]
[null,null,null,null,null,null," "]
[null,null,null,null,null,null," "]
[null,null,null,null,null,null," "]
[null,null,null,null,null,null," "]
[null,null,null,null,null,null," "]
[null,null,null,null,null,null," "]
[null,null,null,null,null,null," "]
[null,null,null,null,null,null," "]
[null,null,null,null,null,null," "]
[null,null,null,null,null,null," "]
[null,null,null,null,null,null," "]
[null,null,null,null,null,null," "]
[null,null,null,null,null,null," "]
[null,null,null,null,null,null," "]
[null,null,null,null,null,null," "]
[null,null,null,null,null,null," "]
[null,null,null,null,null,null," "]
[null,null,null,null,null,null," "]
[null,null,null,null,null,null," "]
[null,null,null,null,null,null," "]
[null,null,null,null,null,null," "]
[null,null,null,null,null,null," "]
[null,null,null,null,null,null," "]
[null,null,null,null,null,null," "]
[null,null,null,null,null,null," "]
[null,null,null,null,null,null," "]
[null,null,null,null,null,null," "]
[null,null,null,null,null,null," "]
[null,null,null,null,null,null," "]
[null,null,null,null,null,null," "]
[null,null,null,null,null,null," "]
[null,null,null,null,null,null," "]
[null,null,null,null,null,null," "]
[null,null,null,null,null,null," "]
[null,null,null,null,null,null," "]
[null,null,null,null,null,null," "]
[null,null,null,null,null,null," "]
[null,null,null,null,null,null," "]
[null,null,null,null,null,null," "]
[null,null,null,null,null,null," "]
[null,null,null,null,null,null," "]
[null,null,null,null,null,null," "]
[null,null,null,null,null,null," "]
[null,null,null,null,null,null," "]
[null,null,null,null,null,null," "]
[null,null,null,null,null,null," "]
[null,null,null,null,null,null," "]
[null,null,null,null,null,null," "]
[null,null,null,null,null,null," "]
[null,null,null,null,null,null," "]
[null,null,null,null,null,null," "]
[null,null,null,null,null,null," "]
[null,null,null,null,null,null," "]
[null,null,null,null,null,null," "]
[null,null,null,null,null,null," "]
[null,null,null,null,null,null," "]