{"text_format":"1","workbook":"xlsx","n_sheets":4,"sheets":["Stock","in&out","items","Source Data"],"not_rendered":{"charts":0,"images":0,"macros":1,"external_links":0,"defined_names":2,"comments":0,"pivot_tables":1},"unopened":[],"bounds":{"document_bytes":16777216,"sheet_cells":100000,"rows_first":2000,"rows_last":500,"rows_between":2000,"halvings":0,"cell_chars":16384,"cell_head_chars":4096},"cells_cut":0,"cells_raw":0,"read":"whole","date_system":"1900"}

{"sheet":"Stock","index":0,"n_rows":74,"n_cols":2,"rows_kept":74,"cut":false,"hidden":false,"merged":[]}
[]
["مخزن الاثاث"]
["Row Labels","Sum of Qty "]
["(blank)"]
["ترابيزه"]
["ترابيزه حدائق دائريه",4]
["ترابيزه VIP 150*150",1]
["ترابيزه كافيتريا مربعه",1]
["ترابيزه قهوه احجام مختلفه",5]
["ترابيزه اجتماعات مربعه خاص بجامعه",1]
["ترابيزه قهوه وارد ( الزمالك )",2]
["ترابيزه ديكور صغيره",1]
["ترابيزه شاسيه قرصه خشب بالموكيت دائره المونيوم",12]
["ترابيزه اجتماعات خاص بالجامعه ",1]
["ترابيزه مقاس 80*80*75سم",8]
["ترابيزه كافيتريا دائرريه ",6]
["كرسى "]
["كرسى بامبو حدائق",16]
["كرسى كافيتريا لون بيج",19]
["كرسى كافيتريا لون اخضر",23]
["كرسى معمل اخضر بعجل ظهر",6]
["كرسى معمل اخضر بدون ظهر متحرك",1]
["كرسى مدير بقاعده خشبيه",3]
["كرسى ثابت امام مدير",6]
["كرسى جنيف لون ابيض",0]
["كرسى شبك بعجل ",14]
["كرسى متحرك جلد اسود",1]
["كرسى ثابت جلد ثابت",1]
["كرسى  شبك بادرع متحرك اسود",6]
[" طقم فوتيه"]
["كرسى 2 + كنبه بلاستيك",2]
["دولاب"]
["دولاب مفكوك ",12]
["مكتب"]
["شاسيه مكتب",1]
["مكتب مقاس 140سم + وحده ادرج",3]
["مكتب مقاس 160 سم + وحده ادرج",9]
["مكتب خاص بالجامعه 160سم ",3]
["مكتب مقاس 140 سم خاص بالجامعه ",1]
["مكتب خاص بالجامعه مقاس 120سم",1]
["كريسماس"]
["شجره كريسماس مفكوكه",1]
["شمسيه"]
["شمسيه بيضاء",5]
["شمسيه خضراء",1]
["وحده انتظار"]
["وحده انتظار تلاته مقعد لون ازرق",2]
["كنبه معدنى 3 مقعد ",25]
["شانون "]
["شانون كبير بعجل لون بنى",3]
["شانون صغير بعجل لون بنى",3]
["باسكت"]
["باسكت مكتب معدنى",0]
["وحده ادرج"]
["وحده ادرج تلاته درج متحرك",1]
["وحده ادرج تلاته درج متحرك خاص بالجامعه ",5]
["هدايا الجامعه "]
["ماكينه فرم ورق هديه للجامعه",0]
["مجله خاص بالجامعه",19]
["شاشه ساموسينج"]
["02MJ3K6J300021K",1]
["02MJ3K6J200047A",1]
["خاص بالجامعه"]
["ترابيزه بطاوله زجاجيه ",9]
["حماله شمسيه بعجل",7]
["حماله شمسيه بدون عجل",1]
["كرسى شبك لون ابيض تالف",7]
["كرسى شبك لون ابيض ",35]
["شاسيه ترابيزه تالف",1]
["شمسيه كبيره تالف",6]
["شمسيه صغيره تالف",10]
["بارتيشن كامل ",1]
["لوحه حديديه دائريه بشعار الجامعه",1]
["Grand Total",315]

{"sheet":"in&out","index":1,"n_rows":82,"n_cols":7,"rows_kept":82,"cut":false,"hidden":false,"merged":[[0,5,0,6],[0,2,0,4],[0,0,0,1]]}
[null,null," مخزن الاثـــــــــــــــــــــــــــاث"]
["Date","Vendor","Code item","item","Qty ","Price","NO INV"]
["2019-01-20",null,"ترابيزه","ترابيزه حدائق دائريه",4,null,"اثنين بدون زجاج"]
["2019-01-20",null,"كرسى ","كرسى بامبو حدائق",16]
["2019-01-20",null," طقم حدائق بلاستيك","C3",2]
["2019-01-20",null,"ترابيزه","ترابيزه VIP 150*150",1]
["2019-01-20",null,"كرسى ","كرسى كافيتريا لون بيج",19]
["2019-01-20",null,"كرسى ","كرسى كافيتريا لون اخضر",23]
[null,null,"ترابيزه","ترابيزه قهوه احجام مختلفه"]
["2019-01-20",null,"ترابيزه","ترابيزه كافيتريا مربعه",1]
["2019-01-20",null,"دولاب","دولاب مفكوك ",12]
["2019-01-20",null,"مكتب","شاسيه مكتب",1]
["2019-01-20",null,"كرسى ","كرسى معمل اخضر بعجل ظهر",6]
["2019-01-20",null,"كرسى ","كرسى معمل اخضر بدون ظهر متحرك",1]
["2019-01-20",null,"كريسماس","شجره كريسماس مفكوكه",1]
["2019-01-20",null,"ترابيزه","ترابيزه قهوه احجام مختلفه",5]
["2019-01-20",null,"ترابيزه","ترابيزه اجتماعات مربعه خاص بجامعه",1]
["2019-01-20",null,"كرسى ","كرسى مدير بقاعده خشبيه",3]
["2019-01-20",null,"كرسى ","كرسى ثابت امام مدير",6]
["2019-01-20",null,"شمسيه","شمسيه بيضاء",5]
["2019-01-20",null,"شمسيه","شمسيه خضراء",1]
["2019-01-20",null,"وحده انتظار","وحده انتظار تلاته مقعد لون ازرق",2]
["2019-01-20",null,"شانون ","شانون كبير بعجل لون بنى",3]
["2019-01-20",null,"شانون ","شانون صغير بعجل لون بنى",3]
["2019-01-20",null,"ترابيزه","ترابيزه قهوه وارد ( الزمالك )",2]
["2019-01-20",null,"ترابيزه","ترابيزه ديكور صغيره",1]
["2019-02-03","الهلال والنجمه","كرسى ","كرسى جنيف لون ابيض",6]
["2019-02-03","الهلال والنجمه","باسكت","باسكت مكتب معدنى",7]
[]
["2019-02-21","بلو استار","وحده ادرج","وحده ادرج تلاته درج متحرك",25]
["2019-02-21","بلو استار","وحده ادرج","وحده ادرج تلاته درج متحرك",-25]
["2019-02-03","الهلال والنجمه","كرسى ","كرسى جنيف لون ابيض",-6]
[]
["2019-03-16","الشبراوى","ترابيزه","ترابيزه شاسيه قرصه خشب بالموكيت دائره المونيوم",12]
["2019-03-24","الاشراف","هدايا الجامعه ","ماكينه فرم ورق هديه للجامعه",2]
["2019-03-31","بلو استار","مكتب","مكتب مقاس 140سم + وحده ادرج",30,null,2988]
["2019-02-28","بلو استار","وحده انتظار","كنبه معدنى 3 مقعد ",25,null,2970]
["2019-03-03","بلو استار","كرسى ","كرسى شبك بعجل ",70,null,2971]
["2019-02-28","بلو استار","وحده انتظار","كنبه معدنى 3 مقعد ",17,null,2965]
["2019-03-24","الاشراف","هدايا الجامعه ","ماكينه فرم ورق هديه للجامعه",-2]
["2019-03-31","بلو استار","مكتب","مكتب مقاس 140سم + وحده ادرج",-27,null,2988]
["2019-03-03","بلو استار","كرسى ","كرسى شبك بعجل ",-70,null,2971]
["2019-02-28","بلو استار","وحده انتظار","كنبه معدنى 3 مقعد ",-17,null,2965]
["2019-04-16","الهلال والنجمه","باسكت","باسكت مكتب معدنى",-6]
["2019-05-07","بلو استار","كرسى ","كرسى شبك بعجل ",34,null,"2994&2993"]
["2019-05-07","بلو استار","كرسى ","كرسى شبك بعجل ",-14,null,"2994&2993"]
["2019-05-07","بلو استار","كرسى ","كرسى شبك بعجل ",-1,null,"2994&2993"]
["2019-05-13","بلو استار","كرسى ","كرسى شبك بعجل ",-5,null,"2994&2993"]
["2019-06-12","بلو استار","مكتب","مكتب مقاس 160 سم + وحده ادرج",10,27360,3020]
["2019-06-18","NGU","خاص بالجامعه","لوحه حديديه دائريه بشعار الجامعه",1]
["2019-06-16","مخزن ارضى","خاص بالجامعه","ترابيزه بطاوله زجاجيه ",9]
["2019-06-16","مخزن ارضى","خاص بالجامعه","حماله شمسيه بعجل",7]
["2019-06-16","مخزن ارضى","خاص بالجامعه","حماله شمسيه بدون عجل",1]
["2019-06-16","مخزن ارضى","خاص بالجامعه","كرسى شبك لون ابيض تالف",7]
["2019-06-16","مخزن ارضى","خاص بالجامعه","شاسيه ترابيزه تالف",1]
["2019-06-16","مخزن ارضى","خاص بالجامعه","شمسيه كبيره تالف",6]
["2019-06-16","مخزن ارضى","خاص بالجامعه","شمسيه صغيره تالف",10]
["2019-06-16","مخزن ارضى","خاص بالجامعه","كرسى شبك لون ابيض ",35]
["2019-11-07"]
["21/2/2019","NGU","مكتب","مكتب مقاس 140سم + وحده ادرج",25,67800,2958]
["21/2/2019","NGU","مكتب","مكتب مقاس 140سم + وحده ادرج",-25]
["15/7/2019","مخزن ارضى","مكتب","مكتب خاص بالجامعه 160سم ",3]
["15/7/2019","مخزن ارضى","وحده ادرج","وحده ادرج تلاته درج متحرك خاص بالجامعه ",5]
[]
[]
["18/7/2019","NGU","شاشه ساموسينج","02MJ3K6J300021K",1]
["2019-07-18","NGU","شاشه ساموسينج","02MJ3K6J200047A",1]
["18/7/2019","NGU","ترابيزه","ترابيزه اجتماعات خاص بالجامعه ",1]
["18/7/2019","NGU","كرسى ","كرسى متحرك جلد اسود",1]
["18/7/2019","NGU","كرسى ","كرسى ثابت جلد ثابت",1]
["18/7/2019","NGU","مكتب","مكتب خاص بالجامعه مقاس 120سم",1]
["18/7/2019","الهلال والنجمه","باسكت","باسكت مكتب معدنى",-1]
["18/7/2019","NGU","وحده ادرج","وحده ادرج تلاته درج متحرك",1]
["18/7/2019","NGU","كرسى ","كرسى  شبك بادرع متحرك اسود",6]
["21/7/2019","مخزن ارضى","خاص بالجامعه","بارتيشن كامل ",1]
["2019-07-22","اتقان","ترابيزه","ترابيزه مقاس 80*80*75سم",14,18200,2]
["2019-07-22","NGU","ترابيزه","ترابيزه مقاس 80*80*75سم",-6]
["28/7/2019","NGU","هدايا الجامعه ","مجله خاص بالجامعه",20]
["28/7/2019","NGU","هدايا الجامعه ","مجله خاص بالجامعه",-1]
["2019-07-29","NGU","ترابيزه","ترابيزه كافيتريا دائرريه ",6]
["30/7/2019","NGU","مكتب","مكتب مقاس 160 سم + وحده ادرج",-1]
["2019-07-31","NGU","مكتب","مكتب مقاس 140 سم خاص بالجامعه ",1]

{"sheet":"items","index":2,"n_rows":4097,"n_cols":59,"rows_kept":4097,"cut":false,"hidden":false,"merged":[]}
["ترابيزه","كرسى "," طقم حدائق بلاستيك","دولاب","مكتب","كريسماس","شمسيه","وحده انتظار","شانون ","لوح زجاجى","باسكت","وحده ادرج","هدايا الجامعه ","خاص بالجامعه","شاشه ساموسينج"]
["ترابيزه حدائق دائريه ","كرسى بامبو حدائق","كرسى 4 + 2 كنبه بلاستيك + 2لوح زجاجى","دولاب مفكوك ","شاسيه مكتب","شجره كريسماس مفكوكه","شمسيه بيضاء ","وحده انتظار تلاته مقعد لون ازرق","شانون كبير بعجل لون بنى","لوح زجاج","باسكت مكتب معدنى","وحده ادرج تلاته درج متحرك","ماكينه فرم ورق هديه للجامعه","ترابيزه بطاوله زجاجيه ","02MJ3K6J300021K"]
["ترابيزه VIP 150*150","كرسى كافيتريا لون بيج","C2","D2","مكتب مقاس 140 سم خاص بالجامعه ",null,"شمسيه خضراء","كنبه معدنى 3 مقعد ","شانون صغير بعجل لون بنى",null,null,"وحده ادرج تلاته درج متحرك خاص بالجامعه ","مجله خاص بالجامعه","حماله شمسيه بعجل","02MJ3K6J200047A"]
["ترابيزه كافيتريا دائرريه ","كرسى كافيتريا لون اخضر","C3","D3","مكتب مقاس 140سم + وحده ادرج",null,null,null,null,null,null,null,null,"حماله شمسيه بدون عجل"]
["ترابيزه كافيتريا مربعه","كرسى معمل اخضر بعجل ظهر","C4","D4","مكتب مقاس 160 سم + وحده ادرج",null,null,null,null,null,null,null,null,"كرسى شبك لون ابيض تالف"]
["ترابيزه قهوه احجام مختلفه","كرسى معمل اخضر بدون ظهر متحرك","C5","D5","مكتب خاص بالجامعه 160سم ",null,null,null,null,null,null,null,null,"شاسيه ترابيزه تالف"]
["ترابيزه  مربعه خاص بجامعه 140سم","كرسى مدير بقاعده خشبيه","C6","D6","مكتب خاص بالجامعه مقاس 120سم",null,null,null,null,null,null,null,null,"شمسيه كبيره تالف"]
["ترابيزه قهوه وارد ( الزمالك )","كرسى ثابت امام مدير",null,null,null,null,null,null,null,null,null,null,null,"شمسيه صغيره تالف"]
["ترابيزه ديكور زجاجيه صغيره","كرسى جنيف لون ابيض",null,null,null,null,null,null,null,null,null,null,null,"كرسى شبك لون ابيض "]
["ترابيزه شاسيه قرصه خشب بالموكيت دائره المونيوم","كرسى شبك بعجل اسود",null,null,null,null,null,null,null,null,null,null,null,"بارتيشن كامل "]
["ترابيزه اجتماعات خاص بالجامعه ","كرسى متحرك جلد اسود",null,null,null,null,null,null,null,null,null,null,null,"لوحه حديديه دائريه بشعار الجامعه"]
["ترابيزه مقاس 80*80*75سم","كرسى ثابت جلد ثابت"]
[null,"كرسى  شبك بادرع متحرك اسود"]
[]
[]
[]
[]
[]
[]
[]
[]
[]
[]
[]
[]
[]
[]
[]
[]
[]
[]
[]
[]
[]
[]
[]
[]
[]
[]
[]
[]
[]
[]
[]
[]
[]
[]
[]
[]
[]
[]
[]
[]
[]
[]
[]
[]
[]
[]
[]
[]
[]
[]
[]
[]
[]
[]
[]
[]
[]
[]
[]
[]
[]
[]
[]
[]
[]
[]
[]
[]
[]
[]
[]
[]
[]
[]
[]
[]
[]
[]
[]
[]
[]
[]
[]
[]
[]
[]
[]
[]
[]
[]
[]
[]
[]
[]
[]
[]
[]
[]
[]
[]
[]
[]
[]
[]
[]
[]
[]
[]
[]
[]
[]
[]
[]
[]
[]
[]
[]
[]
[]
[]
[]
[]
[]
[]
[]
[]
[]
[]
[]
[]
[]
[]
[]
[]
[]
[]
[]
[]
[]
[]
[]
[]
[]
[]
[]
[]
[]
[]
[]
[]
[]
[]
[]
[]
[]
[]
[]
[]
[]
[]
[]
[]
[]
[]
[]
[]
[]
[]
[]
[]
[]
[]
[]
[]
[]
[]
[]
[]
[]
[]
[]
[]
[]
[]
[]
[]
[]
[]
[]
[]
[]
[]
[]
[]
[]
[]
[]
[]
[]
[]
[]
[]
[]
[]
[]
[]
[]
[]
[]
[]
[]
[]
[]
[]
[]
[]
[]
[]
[]
[]
[]
[]
[]
[]
[]
[]
[]
[]
[]
[]
[]
[]
[]
[]
[]
[]
[]
[]
[]
[]
[]
[]
[]
[]
[]
[]
[]
[]
[]
[]
[]
[]
[]
[]
[]
[]
[]
[]
[]
[]
[]
[]
[]
[]
[]
[]
[]
[]
[]
[]
[]
[]
[]
[]
[]
[]
[]
[]
[]
[]
[]
[]
[]
[]
[]
[]
[]
[]
[]
[]
[]
[]
[]
[]
[]
[]
[]
[]
[]
[]
[]
[]
[]
[]
[]
[]
[]
[]
[]
[]
[]
[]
[]
[]
[]
[]
[]
[]
[]
[]
[]
[]
[]
[]
[]
[]
[]
[]
[]
[]
[]
[]
[]
[]
[]
[]
[]
[]
[]
[]
[]
[]
[]
[]
[]
[]
[]
[]
[]
[]
[]
[]
[]
[]
[]
[]
[]
[]
[]
[]
[]
[]
[]
[]
[]
[]
[]
[]
[]
[]
[]
[]
[]
[]
[]
[]
[]
[]
[]
[]
[]
[]
[]
[]
[]
[]
[]
{"$rows_left_out":3698}
{"sheet":"Source Data","index":3,"n_rows":124,"n_cols":2,"rows_kept":124,"cut":false,"hidden":false,"merged":[]}
[" Vendor/Company"]
["NGU",{"$f":"IFERROR(INDEX(items!$A$1:$BD$1,MATCH(0,COUNTIF($B$1:$B1,items!$A$1:$BD$1),0)),\"\")","v":"ترابيزه"}]
["الهلال والنجمه",{"$f":"IFERROR(INDEX(items!$A$1:$BD$1,MATCH(0,COUNTIF($B$1:$B2,items!$A$1:$BD$1),0)),\"\")","v":"كرسى "}]
["بلو استار",{"$f":"IFERROR(INDEX(items!$A$1:$BD$1,MATCH(0,COUNTIF($B$1:$B3,items!$A$1:$BD$1),0)),\"\")","v":" طقم حدائق بلاستيك"}]
["الشبراوى",{"$f":"IFERROR(INDEX(items!$A$1:$BD$1,MATCH(0,COUNTIF($B$1:$B4,items!$A$1:$BD$1),0)),\"\")","v":"دولاب"}]
["الاشراف",{"$f":"IFERROR(INDEX(items!$A$1:$BD$1,MATCH(0,COUNTIF($B$1:$B5,items!$A$1:$BD$1),0)),\"\")","v":"مكتب"}]
["مخزن ارضى",{"$f":"IFERROR(INDEX(items!$A$1:$BD$1,MATCH(0,COUNTIF($B$1:$B6,items!$A$1:$BD$1),0)),\"\")","v":"كريسماس"}]
["اتقان",{"$f":"IFERROR(INDEX(items!$A$1:$BD$1,MATCH(0,COUNTIF($B$1:$B7,items!$A$1:$BD$1),0)),\"\")","v":"شمسيه"}]
[null,{"$f":"IFERROR(INDEX(items!$A$1:$BD$1,MATCH(0,COUNTIF($B$1:$B8,items!$A$1:$BD$1),0)),\"\")","v":"وحده انتظار"}]
[null,{"$f":"IFERROR(INDEX(items!$A$1:$BD$1,MATCH(0,COUNTIF($B$1:$B9,items!$A$1:$BD$1),0)),\"\")","v":"شانون "}]
[null,{"$f":"IFERROR(INDEX(items!$A$1:$BD$1,MATCH(0,COUNTIF($B$1:$B10,items!$A$1:$BD$1),0)),\"\")","v":"لوح زجاجى"}]
[null,{"$f":"IFERROR(INDEX(items!$A$1:$BD$1,MATCH(0,COUNTIF($B$1:$B11,items!$A$1:$BD$1),0)),\"\")","v":"باسكت"}]
[null,{"$f":"IFERROR(INDEX(items!$A$1:$BD$1,MATCH(0,COUNTIF($B$1:$B12,items!$A$1:$BD$1),0)),\"\")","v":"وحده ادرج"}]
[null,{"$f":"IFERROR(INDEX(items!$A$1:$BD$1,MATCH(0,COUNTIF($B$1:$B13,items!$A$1:$BD$1),0)),\"\")","v":"هدايا الجامعه "}]
[null,{"$f":"IFERROR(INDEX(items!$A$1:$BD$1,MATCH(0,COUNTIF($B$1:$B14,items!$A$1:$BD$1),0)),\"\")","v":"خاص بالجامعه"}]
[null,{"$f":"IFERROR(INDEX(items!$A$1:$BD$1,MATCH(0,COUNTIF($B$1:$B15,items!$A$1:$BD$1),0)),\"\")","v":"شاشه ساموسينج"}]
[null,{"$f":"IFERROR(INDEX(items!$A$1:$BD$1,MATCH(0,COUNTIF($B$1:$B16,items!$A$1:$BD$1),0)),\"\")","v":0}]
[null,{"$f":"IFERROR(INDEX(items!$A$1:$BD$1,MATCH(0,COUNTIF($B$1:$B17,items!$A$1:$BD$1),0)),\"\")","v":""}]
[null,{"$f":"IFERROR(INDEX(items!$A$1:$BD$1,MATCH(0,COUNTIF($B$1:$B18,items!$A$1:$BD$1),0)),\"\")","v":""}]
[null,{"$f":"IFERROR(INDEX(items!$A$1:$BD$1,MATCH(0,COUNTIF($B$1:$B19,items!$A$1:$BD$1),0)),\"\")","v":""}]
[null,{"$f":"IFERROR(INDEX(items!$A$1:$BD$1,MATCH(0,COUNTIF($B$1:$B20,items!$A$1:$BD$1),0)),\"\")","v":""}]
[null,{"$f":"IFERROR(INDEX(items!$A$1:$BD$1,MATCH(0,COUNTIF($B$1:$B21,items!$A$1:$BD$1),0)),\"\")","v":""}]
[null,{"$f":"IFERROR(INDEX(items!$A$1:$BD$1,MATCH(0,COUNTIF($B$1:$B22,items!$A$1:$BD$1),0)),\"\")","v":""}]
[null,{"$f":"IFERROR(INDEX(items!$A$1:$BD$1,MATCH(0,COUNTIF($B$1:$B23,items!$A$1:$BD$1),0)),\"\")","v":""}]
[null,{"$f":"IFERROR(INDEX(items!$A$1:$BD$1,MATCH(0,COUNTIF($B$1:$B24,items!$A$1:$BD$1),0)),\"\")","v":""}]
[null,{"$f":"IFERROR(INDEX(items!$A$1:$BD$1,MATCH(0,COUNTIF($B$1:$B25,items!$A$1:$BD$1),0)),\"\")","v":""}]
[null,{"$f":"IFERROR(INDEX(items!$A$1:$BD$1,MATCH(0,COUNTIF($B$1:$B26,items!$A$1:$BD$1),0)),\"\")","v":""}]
[null,{"$f":"IFERROR(INDEX(items!$A$1:$BD$1,MATCH(0,COUNTIF($B$1:$B27,items!$A$1:$BD$1),0)),\"\")","v":""}]
[null,{"$f":"IFERROR(INDEX(items!$A$1:$BD$1,MATCH(0,COUNTIF($B$1:$B28,items!$A$1:$BD$1),0)),\"\")","v":""}]
[null,{"$f":"IFERROR(INDEX(items!$A$1:$BD$1,MATCH(0,COUNTIF($B$1:$B29,items!$A$1:$BD$1),0)),\"\")","v":""}]
[null,{"$f":"IFERROR(INDEX(items!$A$1:$BD$1,MATCH(0,COUNTIF($B$1:$B30,items!$A$1:$BD$1),0)),\"\")","v":""}]
[null,{"$f":"IFERROR(INDEX(items!$A$1:$BD$1,MATCH(0,COUNTIF($B$1:$B31,items!$A$1:$BD$1),0)),\"\")","v":""}]
[null,{"$f":"IFERROR(INDEX(items!$A$1:$BD$1,MATCH(0,COUNTIF($B$1:$B32,items!$A$1:$BD$1),0)),\"\")","v":""}]
[null,{"$f":"IFERROR(INDEX(items!$A$1:$BD$1,MATCH(0,COUNTIF($B$1:$B33,items!$A$1:$BD$1),0)),\"\")","v":""}]
[null,{"$f":"IFERROR(INDEX(items!$A$1:$BD$1,MATCH(0,COUNTIF($B$1:$B34,items!$A$1:$BD$1),0)),\"\")","v":""}]
[null,{"$f":"IFERROR(INDEX(items!$A$1:$BD$1,MATCH(0,COUNTIF($B$1:$B35,items!$A$1:$BD$1),0)),\"\")","v":""}]
[null,{"$f":"IFERROR(INDEX(items!$A$1:$BD$1,MATCH(0,COUNTIF($B$1:$B36,items!$A$1:$BD$1),0)),\"\")","v":""}]
[null,{"$f":"IFERROR(INDEX(items!$A$1:$BD$1,MATCH(0,COUNTIF($B$1:$B37,items!$A$1:$BD$1),0)),\"\")","v":""}]
[null,{"$f":"IFERROR(INDEX(items!$A$1:$BD$1,MATCH(0,COUNTIF($B$1:$B38,items!$A$1:$BD$1),0)),\"\")","v":""}]
[null,{"$f":"IFERROR(INDEX(items!$A$1:$BD$1,MATCH(0,COUNTIF($B$1:$B39,items!$A$1:$BD$1),0)),\"\")","v":""}]
[null,{"$f":"IFERROR(INDEX(items!$A$1:$BD$1,MATCH(0,COUNTIF($B$1:$B40,items!$A$1:$BD$1),0)),\"\")","v":""}]
[null,{"$f":"IFERROR(INDEX(items!$A$1:$BD$1,MATCH(0,COUNTIF($B$1:$B41,items!$A$1:$BD$1),0)),\"\")","v":""}]
[null,{"$f":"IFERROR(INDEX(items!$A$1:$BD$1,MATCH(0,COUNTIF($B$1:$B42,items!$A$1:$BD$1),0)),\"\")","v":""}]
[null,{"$f":"IFERROR(INDEX(items!$A$1:$BD$1,MATCH(0,COUNTIF($B$1:$B43,items!$A$1:$BD$1),0)),\"\")","v":""}]
[null,{"$f":"IFERROR(INDEX(items!$A$1:$BD$1,MATCH(0,COUNTIF($B$1:$B44,items!$A$1:$BD$1),0)),\"\")","v":""}]
[null,{"$f":"IFERROR(INDEX(items!$A$1:$BD$1,MATCH(0,COUNTIF($B$1:$B45,items!$A$1:$BD$1),0)),\"\")","v":""}]
[null,{"$f":"IFERROR(INDEX(items!$A$1:$BD$1,MATCH(0,COUNTIF($B$1:$B46,items!$A$1:$BD$1),0)),\"\")","v":""}]
[null,{"$f":"IFERROR(INDEX(items!$A$1:$BD$1,MATCH(0,COUNTIF($B$1:$B47,items!$A$1:$BD$1),0)),\"\")","v":""}]
[null,{"$f":"IFERROR(INDEX(items!$A$1:$BD$1,MATCH(0,COUNTIF($B$1:$B48,items!$A$1:$BD$1),0)),\"\")","v":""}]
[null,{"$f":"IFERROR(INDEX(items!$A$1:$BD$1,MATCH(0,COUNTIF($B$1:$B49,items!$A$1:$BD$1),0)),\"\")","v":""}]
[null,{"$f":"IFERROR(INDEX(items!$A$1:$BD$1,MATCH(0,COUNTIF($B$1:$B50,items!$A$1:$BD$1),0)),\"\")","v":""}]
[null,{"$f":"IFERROR(INDEX(items!$A$1:$BD$1,MATCH(0,COUNTIF($B$1:$B51,items!$A$1:$BD$1),0)),\"\")","v":""}]
[null,{"$f":"IFERROR(INDEX(items!$A$1:$BD$1,MATCH(0,COUNTIF($B$1:$B52,items!$A$1:$BD$1),0)),\"\")","v":""}]
[null,{"$f":"IFERROR(INDEX(items!$A$1:$BD$1,MATCH(0,COUNTIF($B$1:$B53,items!$A$1:$BD$1),0)),\"\")","v":""}]
[null,{"$f":"IFERROR(INDEX(items!$A$1:$BD$1,MATCH(0,COUNTIF($B$1:$B54,items!$A$1:$BD$1),0)),\"\")","v":""}]
[null,{"$f":"IFERROR(INDEX(items!$A$1:$BD$1,MATCH(0,COUNTIF($B$1:$B55,items!$A$1:$BD$1),0)),\"\")","v":""}]
[null,{"$f":"IFERROR(INDEX(items!$A$1:$BD$1,MATCH(0,COUNTIF($B$1:$B56,items!$A$1:$BD$1),0)),\"\")","v":""}]
[null,{"$f":"IFERROR(INDEX(items!$A$1:$BD$1,MATCH(0,COUNTIF($B$1:$B57,items!$A$1:$BD$1),0)),\"\")","v":""}]
[null,{"$f":"IFERROR(INDEX(items!$A$1:$BD$1,MATCH(0,COUNTIF($B$1:$B58,items!$A$1:$BD$1),0)),\"\")","v":""}]
[null,{"$f":"IFERROR(INDEX(items!$A$1:$BD$1,MATCH(0,COUNTIF($B$1:$B59,items!$A$1:$BD$1),0)),\"\")","v":""}]
[null,{"$f":"IFERROR(INDEX(items!$A$1:$BD$1,MATCH(0,COUNTIF($B$1:$B60,items!$A$1:$BD$1),0)),\"\")","v":""}]
[null,{"$f":"IFERROR(INDEX(items!$A$1:$BD$1,MATCH(0,COUNTIF($B$1:$B61,items!$A$1:$BD$1),0)),\"\")","v":""}]
[null,{"$f":"IFERROR(INDEX(items!$A$1:$BD$1,MATCH(0,COUNTIF($B$1:$B62,items!$A$1:$BD$1),0)),\"\")","v":""}]
[null,{"$f":"IFERROR(INDEX(items!$A$1:$BD$1,MATCH(0,COUNTIF($B$1:$B63,items!$A$1:$BD$1),0)),\"\")","v":""}]
[null,{"$f":"IFERROR(INDEX(items!$A$1:$BD$1,MATCH(0,COUNTIF($B$1:$B64,items!$A$1:$BD$1),0)),\"\")","v":""}]
[null,{"$f":"IFERROR(INDEX(items!$A$1:$BD$1,MATCH(0,COUNTIF($B$1:$B65,items!$A$1:$BD$1),0)),\"\")","v":""}]
[null,{"$f":"IFERROR(INDEX(items!$A$1:$BD$1,MATCH(0,COUNTIF($B$1:$B66,items!$A$1:$BD$1),0)),\"\")","v":""}]
[null,{"$f":"IFERROR(INDEX(items!$A$1:$BD$1,MATCH(0,COUNTIF($B$1:$B67,items!$A$1:$BD$1),0)),\"\")","v":""}]
[null,{"$f":"IFERROR(INDEX(items!$A$1:$BD$1,MATCH(0,COUNTIF($B$1:$B68,items!$A$1:$BD$1),0)),\"\")","v":""}]
[null,{"$f":"IFERROR(INDEX(items!$A$1:$BD$1,MATCH(0,COUNTIF($B$1:$B69,items!$A$1:$BD$1),0)),\"\")","v":""}]
[null,{"$f":"IFERROR(INDEX(items!$A$1:$BD$1,MATCH(0,COUNTIF($B$1:$B70,items!$A$1:$BD$1),0)),\"\")","v":""}]
[null,{"$f":"IFERROR(INDEX(items!$A$1:$BD$1,MATCH(0,COUNTIF($B$1:$B71,items!$A$1:$BD$1),0)),\"\")","v":""}]
[null,{"$f":"IFERROR(INDEX(items!$A$1:$BD$1,MATCH(0,COUNTIF($B$1:$B72,items!$A$1:$BD$1),0)),\"\")","v":""}]
[null,{"$f":"IFERROR(INDEX(items!$A$1:$BD$1,MATCH(0,COUNTIF($B$1:$B73,items!$A$1:$BD$1),0)),\"\")","v":""}]
[null,{"$f":"IFERROR(INDEX(items!$A$1:$BD$1,MATCH(0,COUNTIF($B$1:$B74,items!$A$1:$BD$1),0)),\"\")","v":""}]
[null,{"$f":"IFERROR(INDEX(items!$A$1:$BD$1,MATCH(0,COUNTIF($B$1:$B75,items!$A$1:$BD$1),0)),\"\")","v":""}]
[null,{"$f":"IFERROR(INDEX(items!$A$1:$BD$1,MATCH(0,COUNTIF($B$1:$B76,items!$A$1:$BD$1),0)),\"\")","v":""}]
[null,{"$f":"IFERROR(INDEX(items!$A$1:$BD$1,MATCH(0,COUNTIF($B$1:$B77,items!$A$1:$BD$1),0)),\"\")","v":""}]
[null,{"$f":"IFERROR(INDEX(items!$A$1:$BD$1,MATCH(0,COUNTIF($B$1:$B78,items!$A$1:$BD$1),0)),\"\")","v":""}]
[null,{"$f":"IFERROR(INDEX(items!$A$1:$BD$1,MATCH(0,COUNTIF($B$1:$B79,items!$A$1:$BD$1),0)),\"\")","v":""}]
[null,{"$f":"IFERROR(INDEX(items!$A$1:$BD$1,MATCH(0,COUNTIF($B$1:$B80,items!$A$1:$BD$1),0)),\"\")","v":""}]
[null,{"$f":"IFERROR(INDEX(items!$A$1:$BD$1,MATCH(0,COUNTIF($B$1:$B81,items!$A$1:$BD$1),0)),\"\")","v":""}]
[null,{"$f":"IFERROR(INDEX(items!$A$1:$BD$1,MATCH(0,COUNTIF($B$1:$B82,items!$A$1:$BD$1),0)),\"\")","v":""}]
[null,{"$f":"IFERROR(INDEX(items!$A$1:$BD$1,MATCH(0,COUNTIF($B$1:$B83,items!$A$1:$BD$1),0)),\"\")","v":""}]
[null,{"$f":"IFERROR(INDEX(items!$A$1:$BD$1,MATCH(0,COUNTIF($B$1:$B84,items!$A$1:$BD$1),0)),\"\")","v":""}]
[null,{"$f":"IFERROR(INDEX(items!$A$1:$BD$1,MATCH(0,COUNTIF($B$1:$B85,items!$A$1:$BD$1),0)),\"\")","v":""}]
[null,{"$f":"IFERROR(INDEX(items!$A$1:$BD$1,MATCH(0,COUNTIF($B$1:$B86,items!$A$1:$BD$1),0)),\"\")","v":""}]
[null,{"$f":"IFERROR(INDEX(items!$A$1:$BD$1,MATCH(0,COUNTIF($B$1:$B87,items!$A$1:$BD$1),0)),\"\")","v":""}]
[null,{"$f":"IFERROR(INDEX(items!$A$1:$BD$1,MATCH(0,COUNTIF($B$1:$B88,items!$A$1:$BD$1),0)),\"\")","v":""}]
[null,{"$f":"IFERROR(INDEX(items!$A$1:$BD$1,MATCH(0,COUNTIF($B$1:$B89,items!$A$1:$BD$1),0)),\"\")","v":""}]
[null,{"$f":"IFERROR(INDEX(items!$A$1:$BD$1,MATCH(0,COUNTIF($B$1:$B90,items!$A$1:$BD$1),0)),\"\")","v":""}]
[null,{"$f":"IFERROR(INDEX(items!$A$1:$BD$1,MATCH(0,COUNTIF($B$1:$B91,items!$A$1:$BD$1),0)),\"\")","v":""}]
[null,{"$f":"IFERROR(INDEX(items!$A$1:$BD$1,MATCH(0,COUNTIF($B$1:$B92,items!$A$1:$BD$1),0)),\"\")","v":""}]
[null,{"$f":"IFERROR(INDEX(items!$A$1:$BD$1,MATCH(0,COUNTIF($B$1:$B93,items!$A$1:$BD$1),0)),\"\")","v":""}]
[null,{"$f":"IFERROR(INDEX(items!$A$1:$BD$1,MATCH(0,COUNTIF($B$1:$B94,items!$A$1:$BD$1),0)),\"\")","v":""}]
[null,{"$f":"IFERROR(INDEX(items!$A$1:$BD$1,MATCH(0,COUNTIF($B$1:$B95,items!$A$1:$BD$1),0)),\"\")","v":""}]
[null,{"$f":"IFERROR(INDEX(items!$A$1:$BD$1,MATCH(0,COUNTIF($B$1:$B96,items!$A$1:$BD$1),0)),\"\")","v":""}]
[null,{"$f":"IFERROR(INDEX(items!$A$1:$BD$1,MATCH(0,COUNTIF($B$1:$B97,items!$A$1:$BD$1),0)),\"\")","v":""}]
[null,{"$f":"IFERROR(INDEX(items!$A$1:$BD$1,MATCH(0,COUNTIF($B$1:$B98,items!$A$1:$BD$1),0)),\"\")","v":""}]
[null,{"$f":"IFERROR(INDEX(items!$A$1:$BD$1,MATCH(0,COUNTIF($B$1:$B99,items!$A$1:$BD$1),0)),\"\")","v":""}]
[null,{"$f":"IFERROR(INDEX(items!$A$1:$BD$1,MATCH(0,COUNTIF($B$1:$B100,items!$A$1:$BD$1),0)),\"\")","v":""}]
[null,{"$f":"IFERROR(INDEX(items!$A$1:$BD$1,MATCH(0,COUNTIF($B$1:$B101,items!$A$1:$BD$1),0)),\"\")","v":""}]
[null,{"$f":"IFERROR(INDEX(items!$A$1:$BD$1,MATCH(0,COUNTIF($B$1:$B102,items!$A$1:$BD$1),0)),\"\")","v":""}]
[null,{"$f":"IFERROR(INDEX(items!$A$1:$BD$1,MATCH(0,COUNTIF($B$1:$B103,items!$A$1:$BD$1),0)),\"\")","v":""}]
[null,{"$f":"IFERROR(INDEX(items!$A$1:$BD$1,MATCH(0,COUNTIF($B$1:$B104,items!$A$1:$BD$1),0)),\"\")","v":""}]
[null,{"$f":"IFERROR(INDEX(items!$A$1:$BD$1,MATCH(0,COUNTIF($B$1:$B105,items!$A$1:$BD$1),0)),\"\")","v":""}]
[null,{"$f":"IFERROR(INDEX(items!$A$1:$BD$1,MATCH(0,COUNTIF($B$1:$B106,items!$A$1:$BD$1),0)),\"\")","v":""}]
[null,{"$f":"IFERROR(INDEX(items!$A$1:$BD$1,MATCH(0,COUNTIF($B$1:$B107,items!$A$1:$BD$1),0)),\"\")","v":""}]
[null,{"$f":"IFERROR(INDEX(items!$A$1:$BD$1,MATCH(0,COUNTIF($B$1:$B108,items!$A$1:$BD$1),0)),\"\")","v":""}]
[null,{"$f":"IFERROR(INDEX(items!$A$1:$BD$1,MATCH(0,COUNTIF($B$1:$B109,items!$A$1:$BD$1),0)),\"\")","v":""}]
[null,{"$f":"IFERROR(INDEX(items!$A$1:$BD$1,MATCH(0,COUNTIF($B$1:$B110,items!$A$1:$BD$1),0)),\"\")","v":""}]
[null,{"$f":"IFERROR(INDEX(items!$A$1:$BD$1,MATCH(0,COUNTIF($B$1:$B111,items!$A$1:$BD$1),0)),\"\")","v":""}]
[null,{"$f":"IFERROR(INDEX(items!$A$1:$BD$1,MATCH(0,COUNTIF($B$1:$B112,items!$A$1:$BD$1),0)),\"\")","v":""}]
[null,{"$f":"IFERROR(INDEX(items!$A$1:$BD$1,MATCH(0,COUNTIF($B$1:$B113,items!$A$1:$BD$1),0)),\"\")","v":""}]
[null,{"$f":"IFERROR(INDEX(items!$A$1:$BD$1,MATCH(0,COUNTIF($B$1:$B114,items!$A$1:$BD$1),0)),\"\")","v":""}]
[null,{"$f":"IFERROR(INDEX(items!$A$1:$BD$1,MATCH(0,COUNTIF($B$1:$B115,items!$A$1:$BD$1),0)),\"\")","v":""}]
[null,{"$f":"IFERROR(INDEX(items!$A$1:$BD$1,MATCH(0,COUNTIF($B$1:$B116,items!$A$1:$BD$1),0)),\"\")","v":""}]
[null,{"$f":"IFERROR(INDEX(items!$A$1:$BD$1,MATCH(0,COUNTIF($B$1:$B117,items!$A$1:$BD$1),0)),\"\")","v":""}]
[null,{"$f":"IFERROR(INDEX(items!$A$1:$BD$1,MATCH(0,COUNTIF($B$1:$B118,items!$A$1:$BD$1),0)),\"\")","v":""}]
[null,{"$f":"IFERROR(INDEX(items!$A$1:$BD$1,MATCH(0,COUNTIF($B$1:$B119,items!$A$1:$BD$1),0)),\"\")","v":""}]
[null,{"$f":"IFERROR(INDEX(items!$A$1:$BD$1,MATCH(0,COUNTIF($B$1:$B120,items!$A$1:$BD$1),0)),\"\")","v":""}]
[null,{"$f":"IFERROR(INDEX(items!$A$1:$BD$1,MATCH(0,COUNTIF($B$1:$B121,items!$A$1:$BD$1),0)),\"\")","v":""}]
[null,{"$f":"IFERROR(INDEX(items!$A$1:$BD$1,MATCH(0,COUNTIF($B$1:$B122,items!$A$1:$BD$1),0)),\"\")","v":""}]
[null,{"$f":"IFERROR(INDEX(items!$A$1:$BD$1,MATCH(0,COUNTIF($B$1:$B123,items!$A$1:$BD$1),0)),\"\")","v":""}]