{"text_format":"1","workbook":"xlsx","n_sheets":6,"sheets":["Form","Main of Month","01-08-2019","03-08-2019","23-08-2019","24-08-2019"],"not_rendered":{"charts":0,"images":0,"macros":1,"external_links":1,"defined_names":97,"comments":0,"pivot_tables":0},"unopened":[],"bounds":{"document_bytes":16777216,"sheet_cells":100000,"rows_first":2000,"rows_last":500,"rows_between":2000,"halvings":0,"cell_chars":16384,"cell_head_chars":4096},"cells_cut":0,"cells_raw":0,"read":"whole","date_system":"1900"}

{"sheet":"Form","index":0,"n_rows":493,"n_cols":31,"rows_kept":493,"cut":false,"hidden":false,"merged":[[1,19,1,21]]}
["Official time - work",null,null,null,null,null,null,null,null,null,null,null,null,null,null,"رجــــوع"]
["#","App. Date","Name","Surname","Pasaport No.","Date of birth","Note of status","Price $","Paid $","Route","Unpaid $","GT","Case of appl","TG.Gov",null,"رجــــوع","رجــــوع",null,null,"TOTAL"]
[null,null,null,null,null,null,null,null,{"$f":"IF(J3<>\"\",\"\",H3)","v":0},null,{"$f":"IF(AND(I3=\"\",J3<>\"\"),H3,\"\")","v":""},{"$f":"IF(C3=\"\",\"\",25)","v":""},null,{"$f":"IF(M3=\"Extractor\",62.5,0)","v":0},null,null,null,"DONE",null,"Total amount",null,"Net profit",null,"Route","Coun of Rout","Total Unpaid",null,{"$f":"NoBlanks(J3:J100)","v":""},null,"Note of status","Count of Mistake"]
[null,null,null,null,null,null,null,null,0,null,"","",null,0,null,null,null,"CANCELLED",null,{"$f":"SUM(H2:H70)","v":0},null,{"$f":"T4-V14","v":0},null,{"$f":"IF(ISERROR(INDEX($AB$3:$AB$70,MATCH(0,COUNTIF($X$3:X3,$AB$3:$AB$69),0))),\"\",INDEX($AB$3:$AB$69,MATCH(0,COUNTIF($X$3:X3,$AB$3:$AB$69),0)))","v":""},{"$f":"IF(X4=\"\",\"\",COUNTIF(J2:J100,X4))","v":""},{"$f":"IF(X4<>\"\",SUMPRODUCT(--($J$2:$J$69=X4),$K$2:$K$69),\"\")","v":""},null,{"$f":"NoBlanks(J3:J500)","v":""},null,"DONE",{"$f":"COUNTIF(C2:C70,\"Done\")","v":0}]
[null,null,null,null,null,null,null,null,0,null,"","",null,0,null,null,null,"REFUSED",null,null,null,null,null,{"$f":"IF(ISERROR(INDEX($AB$3:$AB$70,MATCH(0,COUNTIF($X$3:X4,$AB$3:$AB$69),0))),\"\",INDEX($AB$3:$AB$69,MATCH(0,COUNTIF($X$3:X4,$AB$3:$AB$69),0)))","v":""},"","",null,{"$f":"NoBlanks(J4:J501)","v":""},null,"CANCELLED",{"$f":"COUNTIF(C3:C71,\"Cancelled\")","v":0}]
[null,null,null,null,null,null,null,null,0,null,"","",null,0,null,null,null,"MISTAKE",null,"Total Paid",null,"Difrent amount",null,{"$f":"IF(ISERROR(INDEX($AB$3:$AB$70,MATCH(0,COUNTIF($X$3:X5,$AB$3:$AB$69),0))),\"\",INDEX($AB$3:$AB$69,MATCH(0,COUNTIF($X$3:X5,$AB$3:$AB$69),0)))","v":""},"","",null,{"$f":"NoBlanks(J5:J502)","v":""},null,"REFUSED",{"$f":"COUNTIF(C4:C72,\"Refused\")","v":0}]
{"$rows_left_out":488}
{"sheet":"Main of Month","index":1,"n_rows":452,"n_cols":179,"rows_kept":452,"cut":false,"hidden":false,"merged":[[1,30,1,31]]}
[null,null,null,{"$f":"EOMONTH(NOW(),0)","v":"2019-08-31"},null,null,null,null,null,null,null,null,null,null,null,"Main of Month","Main of Month",null,null,null,null,null,null,null,null,null,{"$f":"IF(ISERROR(INDEX($AB$3:$AB$70,MATCH(0,COUNTIF(#REF!,$AB$3:$AB$69),0))),\"\",INDEX($AB$3:$AB$69,MATCH(0,COUNTIF(#REF!,$AB$3:$AB$69),0)))","v":""},{"$f":"IF(AA1=\"\",\"\",COUNTIF(#REF!,AA1))","v":""},{"$f":"IF(AA1<>\"\",SUMPRODUCT(--($J$2:$J$69=AA1),$K$2:$K$69),\"\")","v":""}]
[null,"App. Date","Name","Surname","Pasaport No.","Date of birth",null,"Index","Sheet Name","No. of App.","Go To sheet","Total of Paid $","Total of Unpaid $",null,"Official time + work","Form","Form","Total amount","Total GT","Total TG.Gov",null,"Cost amount","Net profit",null,"Total amount of Month",null,"Route","Count","Total of Unpaid (Rout)",null,"Count of Sheets Color",null,null,"Official Activity"]
[null,"","","","","","",3,{"$f":"INDEX(SheetNames,H3)","v":"01-08-2019"},{"$f":"IF(I3=\"\",\"\",INDIRECT(\"'\"&$I3&\"'!$V10\"))","v":0},{"$f":"HYPERLINK(\"#'\"&I3&\"'!H3\",\"Go To Sheet\")","v":"Go To Sheet"},{"$f":"IF(I3=\"\",\"\",INDIRECT(\"'\"&$I3&\"'!$T7\"))","v":0},{"$f":"IF(I3=\"\",\"\",INDIRECT(\"'\"&$I3&\"'!$T10\"))","v":790},null,"hamza","2019-08-01","2019-07-31",{"$f":"IF(I2=\"\",\"\",INDIRECT(\"'\"&$I2&\"'!$T4\"))","v":{"$error":"#REF!"}},{"$f":"IF(I2=\"\",\"\",INDIRECT(\"'\"&$I2&\"'!$T13\"))","v":{"$error":"#REF!"}},{"$f":"IF(I2=\"\",\"\",INDIRECT(\"'\"&$I2&\"'!$T16\"))","v":{"$error":"#REF!"}},null,{"$f":"IF(I2=\"\",\"\",INDIRECT(\"'\"&$I2&\"'!$V14\"))","v":{"$error":"#REF!"}},{"$f":"IF(#REF!=\"\",\"\",INDIRECT(\"'\"&#REF!&\"'!$V4\"))","v":{"$error":"#REF!"}},null,{"$f":"SUM(R3:R70)","v":{"$error":"#REF!"}},"",null,null,null,"",0,null,{"$f":"Module5.WhatColor(AF3)","v":5},{"$f":"IF(AG3=1,\"other\",IF(AG3=4,\"official time + work\",IF(AG3=5,\"official time - work\",IF(AG3=3,\"official holiday\",\"\"))))","v":"official time - work"},null,null,null,null,null,null,null,null,null,null,null,null,null,null,null,null,null,null,null,null,null,null,null,null,null,null,"","","",null,null,null,null,null,null,null,null,null,null,null,null,null,null,null,null,null,null,null,null,null,null,null,null,null,null,null,null,null,null,null,null,null,null,null,null,null,null,null,null,null,null,null,null,null,null,null,null,null,null,null,null,null,null,null,null,null,null,null,null,null,null,null,null,null,null,null,null,null,null,null,null,null,null,null,null,null,null,null,null,null,null,null,null,null,null,null,null,null,null,null,null,null,null,null,null,null,null,null,null,null,null,null,null,null,null,null,null,null,null,null,null,null,"","",""]
[null,null,null,null,null,null,null,4,{"$f":"INDEX(SheetNames,H4)","v":"03-08-2019"},{"$f":"IF(I4=\"\",\"\",INDIRECT(\"'\"&$I4&\"'!$V10\"))","v":1},{"$f":"HYPERLINK(\"#'\"&I4&\"'!H3\",\"Go To Sheet\")","v":"Go To Sheet"},{"$f":"IF(I4=\"\",\"\",INDIRECT(\"'\"&$I4&\"'!$T7\"))","v":0},{"$f":"IF(I4=\"\",\"\",INDIRECT(\"'\"&$I4&\"'!$T10\"))","v":120},null,"salah","2019-08-03","2019-08-03",{"$f":"IF(I3=\"\",\"\",INDIRECT(\"'\"&$I3&\"'!$T4\"))","v":790},{"$f":"IF(I3=\"\",\"\",INDIRECT(\"'\"&$I3&\"'!$T13\"))","v":0},{"$f":"IF(I3=\"\",\"\",INDIRECT(\"'\"&$I3&\"'!$T16\"))","v":0},null,{"$f":"IF(I3=\"\",\"\",INDIRECT(\"'\"&$I3&\"'!$V14\"))","v":0},{"$f":"IF(I3=\"\",\"\",INDIRECT(\"'\"&$I3&\"'!$V4\"))","v":790},null,null,"",null,null,null,null,3,null,{"$f":"Module5.WhatColor(AF4)","v":4},{"$f":"IF(AG4=1,\"other\",IF(AG4=4,\"official time + work\",IF(AG4=5,\"official time - work\",IF(AG4=3,\"official holiday\",\"\"))))","v":"official time + work"},null,null,null,null,null,null,null,null,null,null,null,null,null,null,null,null,null,null,null,null,null,null,null,null,null,null,"","","",null,null,null,null,null,null,null,null,null,null,null,null,null,null,null,null,null,null,null,null,null,null,null,null,null,null,null,null,null,null,null,null,null,null,null,null,null,null,null,null,null,null,null,null,null,null,null,null,null,null,null,null,null,null,null,null,null,null,null,null,null,null,null,null,null,null,null,null,null,null,null,null,null,null,null,null,null,null,null,null,null,null,null,null,"","","",null,null,null,null,null,null,null,null,null,null,null,null,null,null,null,null,null,null,null,null,null,null,null,null,null,null,"","",""]
[null,"","","","","","",5,{"$f":"INDEX(SheetNames,H5)","v":"23-08-2019"},{"$f":"IF(I5=\"\",\"\",INDIRECT(\"'\"&$I5&\"'!$V10\"))","v":0},{"$f":"HYPERLINK(\"#'\"&I5&\"'!H3\",\"Go To Sheet\")","v":"Go To Sheet"},{"$f":"IF(I5=\"\",\"\",INDIRECT(\"'\"&$I5&\"'!$T7\"))","v":0},{"$f":"IF(I5=\"\",\"\",INDIRECT(\"'\"&$I5&\"'!$T10\"))","v":0},null,"ihab","2019-08-23",null,{"$f":"IF(I4=\"\",\"\",INDIRECT(\"'\"&$I4&\"'!$T4\"))","v":330},{"$f":"IF(I4=\"\",\"\",INDIRECT(\"'\"&$I4&\"'!$T13\"))","v":1725},{"$f":"IF(I4=\"\",\"\",INDIRECT(\"'\"&$I4&\"'!$T16\"))","v":0},null,{"$f":"IF(I4=\"\",\"\",INDIRECT(\"'\"&$I4&\"'!$V14\"))","v":1725},{"$f":"IF(I4=\"\",\"\",INDIRECT(\"'\"&$I4&\"'!$V4\"))","v":-1395},null,"Cost amount of Month","",null,null,null,null,0,null,3,"official holiday",null,null,null,null,null,null,null,null,null,null,null,null,null,null,null,null,null,null,null,null,null,null,null,null,null,null,"","","",null,null,null,null,null,null,null,null,null,null,null,null,null,null,null,null,null,null,null,null,null,null,null,null,null,null,null,null,null,null,null,null,null,null,null,null,null,null,null,null,null,null,null,null,null,null,null,null,null,null,null,null,null,null,null,null,null,null,null,null,null,null,null,null,null,null,null,null,null,null,null,null,null,null,null,null,null,null,null,null,null,null,null,null,"","","",null,null,null,null,null,null,null,null,null,null,null,null,null,null,null,null,null,null,null,null,null,null,null,null,null,null,"","",""]
[null,null,null,null,null,null,null,6,{"$f":"INDEX(SheetNames,H6)","v":"24-08-2019"},{"$f":"IF(I6=\"\",\"\",INDIRECT(\"'\"&$I6&\"'!$V10\"))","v":0},{"$f":"HYPERLINK(\"#'\"&I6&\"'!H3\",\"Go To Sheet\")","v":"Go To Sheet"},{"$f":"IF(I6=\"\",\"\",INDIRECT(\"'\"&$I6&\"'!$T7\"))","v":0},{"$f":"IF(I6=\"\",\"\",INDIRECT(\"'\"&$I6&\"'!$T10\"))","v":0},null,"","2019-08-24",null,{"$f":"IF(I5=\"\",\"\",INDIRECT(\"'\"&$I5&\"'!$T4\"))","v":0},{"$f":"IF(I5=\"\",\"\",INDIRECT(\"'\"&$I5&\"'!$T13\"))","v":0},{"$f":"IF(I5=\"\",\"\",INDIRECT(\"'\"&$I5&\"'!$T16\"))","v":0},null,{"$f":"IF(I5=\"\",\"\",INDIRECT(\"'\"&$I5&\"'!$V14\"))","v":0},{"$f":"IF(I5=\"\",\"\",INDIRECT(\"'\"&$I5&\"'!$V4\"))","v":0},null,{"$f":"SUM(V3:V70)","v":{"$error":"#REF!"}},"",null,null,null,null,0,null,1,"other",null,null,null,null,null,null,null,null,null,null,null,null,null,null,null,null,null,null,null,null,null,null,null,null,null,null,"","","",null,null,null,null,null,null,null,null,null,null,null,null,null,null,null,null,null,null,null,null,null,null,null,null,null,null,null,null,null,null,null,null,null,null,null,null,null,null,null,null,null,null,null,null,null,null,null,null,null,null,null,null,null,null,null,null,null,null,null,null,null,null,null,null,null,null,null,null,null,null,null,null,null,null,null,null,null,null,null,null,null,null,null,null,"","","",null,null,null,null,null,null,null,null,null,null,null,null,null,null,null,null,null,null,null,null,null,null,null,null,null,null,"","",""]
{"$rows_left_out":447}
{"sheet":"01-08-2019","index":2,"n_rows":494,"n_cols":31,"rows_kept":494,"cut":false,"hidden":false,"merged":[[1,19,1,21]]}
["Official time - work",null,null,null,null,null,null,null,null,null,null,null,null,null,null,"رجــــوع"]
["#","App. Date","Name","Surname","Pasaport No.","Date of birth","Note of status","Price $","Paid $","Route","Unpaid $","GT","Case of appl","TG.Gov",null,"رجــــوع","رجــــوع",null,null,"TOTAL"]
[null,null,null,null,null,null,null,100,{"$f":"IF(J3<>\"\",\"\",H3)","v":""},"hamza",{"$f":"IF(AND(I3=\"\",J3<>\"\"),H3,\"\")","v":100},{"$f":"IF(C3=\"\",\"\",25)","v":""},"Not extractor",{"$f":"IF(M3=\"Extractor\",62.5,0)","v":0},null,"رجــــوع",null,"DONE",null,"Total amount",null,"Net profit",null,"Route","Coun of Rout","Total Unpaid",null,{"$f":"NoBlanks(J3:J100)","v":"hamza"},null,"Note of status","Count of Mistake"]
[null,null,null,null,null,null,null,120,"","abdo",120,{"$f":"IF(C4=\"\",\"\",25)","v":""},null,{"$f":"IF(M4=\"Extractor\",62.5,0)","v":0},null,null,null,"CANCELLED",null,{"$f":"SUM(H3:H71)","v":790},null,{"$f":"T4-V14","v":790},null,{"$f":"IF(ISERROR(INDEX($AB$3:$AB$70,MATCH(0,COUNTIF($X$3:X3,$AB$3:$AB$69),0))),\"\",INDEX($AB$3:$AB$69,MATCH(0,COUNTIF($X$3:X3,$AB$3:$AB$69),0)))","v":"hamza"},{"$f":"IF(X4=\"\",\"\",COUNTIF(J2:J100,X4))","v":1},{"$f":"IF(X4<>\"\",SUMPRODUCT(--($J$2:$J$69=X4),$K$2:$K$69),\"\")","v":100},null,{"$f":"NoBlanks(J3:J500)","v":"hamza"},null,"DONE",{"$f":"COUNTIF(C1:C69,\"Done\")","v":0}]
[null,null,null,null,null,null,null,100,"","akram",100,"",null,0,null,null,null,"REFUSED",null,null,null,null,null,{"$f":"IF(ISERROR(INDEX($AB$3:$AB$70,MATCH(0,COUNTIF($X$3:X4,$AB$3:$AB$69),0))),\"\",INDEX($AB$3:$AB$69,MATCH(0,COUNTIF($X$3:X4,$AB$3:$AB$69),0)))","v":"abdo"},2,230,null,{"$f":"NoBlanks(J4:J501)","v":"abdo"},null,"CANCELLED",{"$f":"COUNTIF(C2:C70,\"Cancelled\")","v":0}]
[null,null,null,null,null,null,null,120,"","akram",120,"",null,0,null,null,null,"MISTAKE",null,"Total Paid",null,"Difrent amount",null,{"$f":"IF(ISERROR(INDEX($AB$3:$AB$70,MATCH(0,COUNTIF($X$3:X5,$AB$3:$AB$69),0))),\"\",INDEX($AB$3:$AB$69,MATCH(0,COUNTIF($X$3:X5,$AB$3:$AB$69),0)))","v":"akram"},2,220,null,{"$f":"NoBlanks(J5:J502)","v":"akram"},null,"REFUSED",{"$f":"COUNTIF(C3:C71,\"Refused\")","v":0}]
{"$rows_left_out":489}
{"sheet":"03-08-2019","index":3,"n_rows":494,"n_cols":31,"rows_kept":494,"cut":false,"hidden":false,"merged":[[1,19,1,21]]}
["Official time - work",null,null,null,null,null,null,null,null,null,null,null,null,null,null,"رجــــوع"]
["#","App. Date","Name","Surname","Pasaport No.","Date of birth","Note of status","Price $","Paid $","Route","Unpaid $","GT","Case of appl","TG.Gov",null,"رجــــوع","رجــــوع",null,null,"TOTAL"]
[null,null,null,null,null,null,null,100,{"$f":"IF(J3<>\"\",\"\",H3)","v":""},"hamza",{"$f":"IF(AND(I3=\"\",J3<>\"\"),H3,\"\")","v":100},25,"Not extractor",{"$f":"IF(M3=\"Extractor\",62.5,0)","v":0},null,"رجــــوع",null,"DONE",null,"Total amount",null,"Net profit",null,"Route","Coun of Rout","Total Unpaid",null,{"$f":"NoBlanks(J3:J100)","v":"hamza"},null,"Note of status","Count of Mistake"]
[null,"2019-08-03",null,null,null,null,null,110,"","salah",{"$f":"IF(AND(I4=\"\",J4<>\"\"),H4,\"\")","v":110},25,null,{"$f":"IF(M4=\"Extractor\",62.5,0)","v":0},null,null,null,"CANCELLED",null,{"$f":"SUM(H3:H70)","v":330},null,{"$f":"T4-V14","v":-1395},null,{"$f":"IF(ISERROR(INDEX($AB$3:$AB$70,MATCH(0,COUNTIF($X$3:X3,$AB$3:$AB$69),0))),\"\",INDEX($AB$3:$AB$69,MATCH(0,COUNTIF($X$3:X3,$AB$3:$AB$69),0)))","v":"hamza"},{"$f":"IF(X4=\"\",\"\",COUNTIF(J2:J100,X4))","v":1},{"$f":"IF(X4<>\"\",SUMPRODUCT(--($J$2:$J$69=X4),$K$2:$K$69),\"\")","v":100},null,{"$f":"NoBlanks(J3:J500)","v":"hamza"},null,"DONE",{"$f":"COUNTIF(C1:C69,\"Done\")","v":0}]
[null,null,null,null,null,"2012-02-02",null,120,"","ihab",{"$f":"IF(AND(I5=\"\",J5<>\"\"),H5,\"\")","v":120},25,null,0,null,null,null,"REFUSED",null,null,null,null,null,{"$f":"IF(ISERROR(INDEX($AB$3:$AB$70,MATCH(0,COUNTIF($X$3:X4,$AB$3:$AB$69),0))),\"\",INDEX($AB$3:$AB$69,MATCH(0,COUNTIF($X$3:X4,$AB$3:$AB$69),0)))","v":"salah"},1,110,null,{"$f":"NoBlanks(J4:J501)","v":"salah"},null,"CANCELLED",{"$f":"COUNTIF(C2:C70,\"Cancelled\")","v":0}]
[null,null,null,null,null,null,null," "," ",null,{"$f":"IF(AND(I6=\"\",J6<>\"\"),H6,\"\")","v":""},25,null,0,null,null,null,"MISTAKE",null,"Total Paid",null,"Difrent amount",null,{"$f":"IF(ISERROR(INDEX($AB$3:$AB$70,MATCH(0,COUNTIF($X$3:X5,$AB$3:$AB$69),0))),\"\",INDEX($AB$3:$AB$69,MATCH(0,COUNTIF($X$3:X5,$AB$3:$AB$69),0)))","v":"ihab"},1,120,null,{"$f":"NoBlanks(J5:J502)","v":"ihab"},null,"REFUSED",{"$f":"COUNTIF(C3:C71,\"Refused\")","v":0}]
{"$rows_left_out":489}
{"sheet":"23-08-2019","index":4,"n_rows":493,"n_cols":31,"rows_kept":493,"cut":false,"hidden":false,"merged":[[1,19,1,21]]}
["Official time - work",null,null,null,null,null,null,null,null,null,null,null,null,null,null,"رجــــوع"]
["#","App. Date","Name","Surname","Pasaport No.","Date of birth","Note of status"," ","Paid $","Route","Unpaid $","GT","Case of appl","TG.Gov",null,"رجــــوع","رجــــوع",null,null,"TOTAL"]
[null,null,null,null,null,null,null," ",{"$f":"IF(J3<>\"\",\"\",H3)","v":""},"ihab",{"$f":"IF(AND(I3=\"\",J3<>\"\"),H3,\"\")","v":" "},{"$f":"IF(C3=\"\",\"\",25)","v":""},null,{"$f":"IF(M3=\"Extractor\",62.5,0)","v":0},null,null,null,"DONE",null,"Total amount",null,"Net profit",null,"Route","Coun of Rout","Total Unpaid",null,{"$f":"NoBlanks(J3:J100)","v":"ihab"},null,"Note of status","Count of Mistake"]
[null,null,null,null,null,null,null," "," ",null,{"$f":"IF(AND(I4=\"\",J4<>\"\"),H4,\"\")","v":""},"",null,0,null,null,null,"CANCELLED",null,{"$f":"SUM(H2:H70)","v":0},null,{"$f":"T4-V14","v":0},null,{"$f":"IF(ISERROR(INDEX($AB$3:$AB$70,MATCH(0,COUNTIF($X$3:X3,$AB$3:$AB$69),0))),\"\",INDEX($AB$3:$AB$69,MATCH(0,COUNTIF($X$3:X3,$AB$3:$AB$69),0)))","v":"ihab"},{"$f":"IF(X4=\"\",\"\",COUNTIF(J2:J100,X4))","v":1},{"$f":"IF(X4<>\"\",SUMPRODUCT(--($J$2:$J$69=X4),$K$2:$K$69),\"\")","v":0},null,{"$f":"NoBlanks(J3:J500)","v":"ihab"},null,"DONE",{"$f":"COUNTIF(C1:C69,\"Done\")","v":0}]
[null,null,null,null,null,null,null," "," ",null,"","",null,0,null,null,null,"REFUSED",null,null,null,null,null,{"$f":"IF(ISERROR(INDEX($AB$3:$AB$70,MATCH(0,COUNTIF($X$3:X4,$AB$3:$AB$69),0))),\"\",INDEX($AB$3:$AB$69,MATCH(0,COUNTIF($X$3:X4,$AB$3:$AB$69),0)))","v":""},"","",null,{"$f":"NoBlanks(J4:J501)","v":""},null,"CANCELLED",{"$f":"COUNTIF(C2:C70,\"Cancelled\")","v":0}]
[null,null,null,null,null,null,null," "," ",null,"","",null,0,null,null,null,"MISTAKE",null,"Total Paid",null,"Difrent amount",null,{"$f":"IF(ISERROR(INDEX($AB$3:$AB$70,MATCH(0,COUNTIF($X$3:X5,$AB$3:$AB$69),0))),\"\",INDEX($AB$3:$AB$69,MATCH(0,COUNTIF($X$3:X5,$AB$3:$AB$69),0)))","v":""},"","",null,{"$f":"NoBlanks(J5:J502)","v":""},null,"REFUSED",{"$f":"COUNTIF(C3:C71,\"Refused\")","v":0}]
{"$rows_left_out":488}
{"sheet":"24-08-2019","index":5,"n_rows":493,"n_cols":31,"rows_kept":493,"cut":false,"hidden":false,"merged":[[1,19,1,21]]}
["Official time - work",null,null,null,null,null,null,null,null,null,null,null,null,null,null,"رجــــوع"]
["#","App. Date","Name","Surname","Pasaport No.","Date of birth","Note of status"," ","Paid $","Route","Unpaid $","GT","Case of appl","TG.Gov",null,"رجــــوع","رجــــوع",null,null,"TOTAL"]
[null,null,null,null,null,null,null," ",{"$f":"IF(J3<>\"\",\"\",H3)","v":""},"wesam",{"$f":"IF(AND(I3=\"\",J3<>\"\"),H3,\"\")","v":" "},{"$f":"IF(C3=\"\",\"\",25)","v":""},null,{"$f":"IF(M3=\"Extractor\",62.5,0)","v":0},null,null,null,"DONE",null,"Total amount",null,"Net profit",null,"Route","Coun of Rout","Total Unpaid",null,{"$f":"NoBlanks(J3:J100)","v":"wesam"},null,"Note of status","Count of Mistake"]
[null,null,null,null,null,null,null," ","","wesam"," ","",null,0,null,null,null,"CANCELLED",null,{"$f":"SUM(H2:H70)","v":0},null,{"$f":"T4-V14","v":0},null,{"$f":"IF(ISERROR(INDEX($AB$3:$AB$70,MATCH(0,COUNTIF($X$3:X3,$AB$3:$AB$69),0))),\"\",INDEX($AB$3:$AB$69,MATCH(0,COUNTIF($X$3:X3,$AB$3:$AB$69),0)))","v":"wesam"},{"$f":"IF(X4=\"\",\"\",COUNTIF(J2:J100,X4))","v":2},{"$f":"IF(X4<>\"\",SUMPRODUCT(--($J$2:$J$69=X4),$K$2:$K$69),\"\")","v":0},null,{"$f":"NoBlanks(J3:J500)","v":"wesam"},null,"DONE",{"$f":"COUNTIF(C2:C70,\"Done\")","v":0}]
[null,null,null,null,null,null,null," "," ",null,"","",null,0,null,null,null,"REFUSED",null,null,null,null,null,{"$f":"IF(ISERROR(INDEX($AB$3:$AB$70,MATCH(0,COUNTIF($X$3:X4,$AB$3:$AB$69),0))),\"\",INDEX($AB$3:$AB$69,MATCH(0,COUNTIF($X$3:X4,$AB$3:$AB$69),0)))","v":""},"","",null,{"$f":"NoBlanks(J4:J501)","v":"wesam"},null,"CANCELLED",{"$f":"COUNTIF(C3:C71,\"Cancelled\")","v":0}]
[null,null,null,null,null,null,null," "," ",null,"","",null,0,null,null,null,"MISTAKE",null,"Total Paid",null,"Difrent amount",null,{"$f":"IF(ISERROR(INDEX($AB$3:$AB$70,MATCH(0,COUNTIF($X$3:X5,$AB$3:$AB$69),0))),\"\",INDEX($AB$3:$AB$69,MATCH(0,COUNTIF($X$3:X5,$AB$3:$AB$69),0)))","v":""},"","",null,{"$f":"NoBlanks(J5:J502)","v":""},null,"REFUSED",{"$f":"COUNTIF(C4:C72,\"Refused\")","v":0}]
{"$rows_left_out":487}