{"text_format":"1","workbook":"xlsx","n_sheets":4,"sheets":["القائمة","النسب ","الشغل","تفرير"],"not_rendered":{"charts":0,"images":0,"macros":1,"external_links":0,"defined_names":7,"comments":0,"pivot_tables":0},"unopened":[],"bounds":{"document_bytes":16777216,"sheet_cells":100000,"rows_first":2000,"rows_last":500,"rows_between":2000,"halvings":0,"cell_chars":16384,"cell_head_chars":4096},"cells_cut":0,"cells_raw":0,"read":"whole","date_system":"1900"}

{"sheet":"القائمة","index":0,"n_rows":24,"n_cols":13,"rows_kept":24,"cut":false,"hidden":false,"merged":[[0,3,0,4]]}
["أسماء المقاولين","الكلاستر","الصوبة","العملية",null,{"$f":"+F2-تفرير!I4","v":0},"المقاول","المبلغ"]
["خالد مهدى",2,"A",1,"1حفر وردم 10%0",{"$f":"SUM(H2:H22)","v":66900},{"$f":"+A2","v":"خالد مهدى"},{"$f":"SUMIF(الشغل!$L$5:$M$197,$G2,الشغل!$M$5:$M$1226)","v":66900}]
["إيهاب ",6,"B",2,"2بناء ومحارة وعزل40%0",null,{"$f":"+A3","v":"إيهاب "},{"$f":"SUMIF(الشغل!$L$5:$M$197,$G3,الشغل!$M$5:$M$1226)","v":0}]
[null,13,"C",3,"3عـــــــــــــــــزل35%0",null,0,{"$f":"SUMIF(الشغل!$L$5:$M$197,$G4,الشغل!$M$5:$M$1226)","v":0},{"$f":"(0.2+0.44+0.68+0.64+0.44+0.52+0.48+0.2+0.32+0.52+0.44+0.28)","v":5.16},1400,{"$f":"+I4*J4","v":7224}]
[null,22,"D",4,"4مواسير صرف ورى5%0",null,0,{"$f":"SUMIF(الشغل!$L$5:$M$197,$G5,الشغل!$M$5:$M$1226)","v":0}]
[null,32,"E",5,"5سورالخارجى10%0",null,0,{"$f":"SUMIF(الشغل!$L$5:$M$197,$G6,الشغل!$M$5:$M$1226)","v":0}]
[null,33,"F",null,null,null,0,{"$f":"SUMIF(الشغل!$L$5:$M$197,$G7,الشغل!$M$5:$M$1226)","v":0},{"$f":"(2+2+8+1+8+4+4)*160","v":4640}]
[null,23,null,null,null,null,0,{"$f":"SUMIF(الشغل!$L$5:$M$197,$G8,الشغل!$M$5:$M$1226)","v":0}]
[null,34,null,null,null,null,0,{"$f":"SUMIF(الشغل!$L$5:$M$197,$G9,الشغل!$M$5:$M$1226)","v":0}]
[null,24,null,null,null,null,0,{"$f":"SUMIF(الشغل!$L$5:$M$197,$G10,الشغل!$M$5:$M$1226)","v":0}]
[null,8,null,null,null,null,0,{"$f":"SUMIF(الشغل!$L$5:$M$197,$G11,الشغل!$M$5:$M$1226)","v":0},{"$f":"(0.8+0.56+0.08+0.24+0.28+0.44+0.32+0.32+0.16+0.8+0.48+0.4+0.24+0.36+0.32+0.52+1+0.16+0.2+0.28+0.48+0.4+0.24)*1400+12712+21600","v":47024.000000000007},{"$f":"1600*75/100","v":1200},{"$f":"+J11*18","v":21600},9.08,{"$f":"+L11*1400","v":12712}]
[null,88,null,null,null,null,0,{"$f":"SUMIF(الشغل!$L$5:$M$197,$G12,الشغل!$M$5:$M$1226)","v":0}]
[null,47,null,null,null,null,0,{"$f":"SUMIF(الشغل!$L$5:$M$197,$G13,الشغل!$M$5:$M$1226)","v":0}]
[null,48,null,null,null,null,0,{"$f":"SUMIF(الشغل!$L$5:$M$197,$G14,الشغل!$M$5:$M$1226)","v":0}]
[null,63,null,null,null,null,0,{"$f":"SUMIF(الشغل!$L$5:$M$197,$G15,الشغل!$M$5:$M$1226)","v":0}]
[null,83,null,null,null,null,0,{"$f":"SUMIF(الشغل!$L$5:$M$197,$G16,الشغل!$M$5:$M$1226)","v":0}]
[null,67,null,null,null,null,0,{"$f":"SUMIF(الشغل!$L$5:$M$197,$G17,الشغل!$M$5:$M$1226)","v":0}]
[null,87,null,null,null,null,0,{"$f":"SUMIF(الشغل!$L$5:$M$197,$G18,الشغل!$M$5:$M$1226)","v":0}]
[null,66,null,null,null,null,{"$f":"+A19","v":0},{"$f":"SUMIF(الشغل!$L$5:$M$197,$G19,الشغل!$M$5:$M$1226)","v":0}]
[null,86,null,null,null,null,0,{"$f":"SUMIF(الشغل!$L$5:$M$197,$G20,الشغل!$M$5:$M$1226)","v":0}]
[null,88,null,null,null,null,0,{"$f":"SUMIF(الشغل!$L$5:$M$197,$G21,الشغل!$M$5:$M$1226)","v":0}]
[null,58,null,null,null,null,0,{"$f":"SUMIF(الشغل!$L$5:$M$197,$G22,الشغل!$M$5:$M$1226)","v":0}]
[null,56]
[null,57]

{"sheet":"النسب ","index":1,"n_rows":24,"n_cols":35,"rows_kept":24,"cut":false,"hidden":false,"merged":[]}
[]
["النسبة المؤية","النسبة العامة","المبلغ","اسم البند","النسبة","العمل","القيمة المستحقة ","النسبة المؤية","النسبة العامة","المبلغ","اسم البند","النسبة","العمل","القيمة المستحقة ","النسبة المؤية","النسبة العامة","المبلغ","اسم البند","النسبة","العمل","القيمة المستحقة ","النسبة المؤية","النسبة العامة","المبلغ","اسم البند","النسبة","العمل","القيمة المستحقة ","النسبة المؤية","النسبة العامة","المبلغ","اسم البند","النسبة","العمل","القيمة المستحقة "]
[0,0,0,0,0,0,0,0,0,0,0,0,0,0,0,0,0,0,0,0,0,0,0,0,0,0,0,0,0,0,0,0,0,0,0]
[0.05,5,4000,"حفروردم 10%",{"$f":"100/10","v":10},{"$f":"+B4/E4","v":0.5},{"$f":"+C4*A4","v":200},0.05,5,16000,"بناء محارة وعزل40%",{"$f":"100/40","v":2.5},{"$f":"+B4/L4","v":2},{"$f":"+J4*A4","v":800},0.05,5,14000,"عزل 35%",{"$f":"100/35","v":2.8571428571428572},{"$f":"+P4/S4","v":1.75},{"$f":"+Q4*O4","v":700},0.05,5,2000,"مواسير صرف ورى5%",{"$f":"100/5","v":20},{"$f":"+W4/Z4","v":0.25},{"$f":"+X4*V4","v":100},0.05,5,4000,"سور10%",{"$f":"100/10","v":10},{"$f":"+AD4/AG4","v":0.5},{"$f":"+AE4*AC4","v":200}]
[0.1,10,{"$f":"+C4","v":4000},{"$f":"+D4","v":"حفروردم 10%"},{"$f":"+E4","v":10},1,400,0.1,10,{"$f":"+J4","v":16000},{"$f":"+K4","v":"بناء محارة وعزل40%"},{"$f":"+L4","v":2.5},{"$f":"+B5/L5","v":4},{"$f":"+J5*A5","v":1600},0.1,10,{"$f":"+Q4","v":14000},{"$f":"+R4","v":"عزل 35%"},{"$f":"+S4","v":2.8571428571428572},3.5,1400,0.1,10,{"$f":"+X4","v":2000},{"$f":"+Y4","v":"مواسير صرف ورى5%"},{"$f":"+Z4","v":20},0.5,200,0.1,10,{"$f":"+AE4","v":4000},{"$f":"+AF4","v":"سور10%"},{"$f":"+AG4","v":10},1,400]
[0.15,15,{"$f":"+C5","v":4000},"حفروردم 10%",10,1.5,600,0.15,15,{"$f":"+J5","v":16000},"بناء محارة وعزل40%",2.5,6,2400,0.15,15,{"$f":"+Q5","v":14000},"عزل 35%",2.8571428571428572,5.25,2100,0.15,15,{"$f":"+X5","v":2000},"مواسير صرف ورى5%",20,0.75,300,0.15,15,{"$f":"+AE5","v":4000},"سور10%",10,1.5,600]
[0.2,20,4000,"حفروردم 10%",10,2,800,0.2,20,16000,"بناء محارة وعزل40%",2.5,8,3200,0.2,20,{"$f":"+Q6","v":14000},"عزل 35%",2.8571428571428572,7,2800,0.2,20,{"$f":"+X6","v":2000},"مواسير صرف ورى5%",20,1,400,0.2,20,{"$f":"+AE6","v":4000},"سور10%",10,2,800]
[0.25,25,4000,"حفروردم 10%",10,2.5,1000,0.25,25,16000,"بناء محارة وعزل40%",2.5,10,4000,0.25,25,{"$f":"+Q7","v":14000},"عزل 35%",2.8571428571428572,8.75,3500,0.25,25,{"$f":"+X7","v":2000},"مواسير صرف ورى5%",20,1.25,500,0.25,25,{"$f":"+AE7","v":4000},"سور10%",10,2.5,1000]
[0.3,30,4000,"حفروردم 10%",10,3,1200,0.3,30,16000,"بناء محارة وعزل40%",2.5,12,4800,0.3,30,{"$f":"+Q8","v":14000},"عزل 35%",2.8571428571428572,10.5,4200,0.3,30,{"$f":"+X8","v":2000},"مواسير صرف ورى5%",20,1.5,600,0.3,30,{"$f":"+AE8","v":4000},"سور10%",10,3,1200]
[0.35,35,4000,"حفروردم 10%",10,3.5,1400,0.35,35,16000,"بناء محارة وعزل40%",2.5,14,5600,0.35,35,{"$f":"+Q9","v":14000},"عزل 35%",2.8571428571428572,12.25,4900,0.35,35,{"$f":"+X9","v":2000},"مواسير صرف ورى5%",20,1.75,700,0.35,35,{"$f":"+AE9","v":4000},"سور10%",10,3.5,1400]
[0.4,40,4000,"حفروردم 10%",10,4,1600,0.4,40,16000,"بناء محارة وعزل40%",2.5,16,6400,0.4,40,{"$f":"+Q10","v":14000},"عزل 35%",2.8571428571428572,14,5600,0.4,40,{"$f":"+X10","v":2000},"مواسير صرف ورى5%",20,2,800,0.4,40,{"$f":"+AE10","v":4000},"سور10%",10,4,1600]
[0.45,45,4000,"حفروردم 10%",10,4.5,1800,0.45,45,16000,"بناء محارة وعزل40%",2.5,18,7200,0.45,45,{"$f":"+Q11","v":14000},"عزل 35%",2.8571428571428572,15.75,6300,0.45,45,{"$f":"+X11","v":2000},"مواسير صرف ورى5%",20,2.25,900,0.45,45,{"$f":"+AE11","v":4000},"سور10%",10,4.5,1800]
[0.5,50,4000,"حفروردم 10%",10,5,2000,0.5,50,16000,"بناء محارة وعزل40%",2.5,20,8000,0.5,50,{"$f":"+Q12","v":14000},"عزل 35%",2.8571428571428572,17.5,7000,0.5,50,{"$f":"+X12","v":2000},"مواسير صرف ورى5%",20,2.5,1000,0.5,50,{"$f":"+AE12","v":4000},"سور10%",10,5,2000]
[0.55000000000000004,55,4000,"حفروردم 10%",10,5.5,2200,0.55000000000000004,55,16000,"بناء محارة وعزل40%",2.5,22,8800,0.55000000000000004,55,{"$f":"+Q13","v":14000},"عزل 35%",2.8571428571428572,19.25,7700.0000000000009,0.55000000000000004,55,{"$f":"+X13","v":2000},"مواسير صرف ورى5%",20,2.75,1100,0.55000000000000004,55,{"$f":"+AE13","v":4000},"سور10%",10,5.5,2200]
[0.6,60,4000,"حفروردم 10%",10,6,2400,0.6,60,16000,"بناء محارة وعزل40%",2.5,24,9600,0.6,60,{"$f":"+Q14","v":14000},"عزل 35%",2.8571428571428572,21,8400,0.6,60,{"$f":"+X14","v":2000},"مواسير صرف ورى5%",20,3,1200,0.6,60,{"$f":"+AE14","v":4000},"سور10%",10,6,2400]
[0.65,65,4000,"حفروردم 10%",10,6.5,2600,0.65,65,16000,"بناء محارة وعزل40%",2.5,26,10400,0.65,65,{"$f":"+Q15","v":14000},"عزل 35%",2.8571428571428572,22.75,9100,0.65,65,{"$f":"+X15","v":2000},"مواسير صرف ورى5%",20,3.25,1300,0.65,65,{"$f":"+AE15","v":4000},"سور10%",10,6.5,2600]
[0.7,70,4000,"حفروردم 10%",10,7,2800,0.7,70,16000,"بناء محارة وعزل40%",2.5,28,11200,0.7,70,{"$f":"+Q16","v":14000},"عزل 35%",2.8571428571428572,24.5,9800,0.7,70,{"$f":"+X16","v":2000},"مواسير صرف ورى5%",20,3.5,1400,0.7,70,{"$f":"+AE16","v":4000},"سور10%",10,7,2800]
[0.75,75,4000,"حفروردم 10%",10,7.5,3000,0.75,75,16000,"بناء محارة وعزل40%",2.5,30,12000,0.75,75,{"$f":"+Q17","v":14000},"عزل 35%",2.8571428571428572,26.25,10500,0.75,75,{"$f":"+X17","v":2000},"مواسير صرف ورى5%",20,3.75,1500,0.75,75,{"$f":"+AE17","v":4000},"سور10%",10,7.5,3000]
[0.8,80,4000,"حفروردم 10%",10,8,3200,0.8,80,16000,"بناء محارة وعزل40%",2.5,32,12800,0.8,80,{"$f":"+Q18","v":14000},"عزل 35%",2.8571428571428572,28,11200,0.8,80,{"$f":"+X18","v":2000},"مواسير صرف ورى5%",20,4,1600,0.8,80,{"$f":"+AE18","v":4000},"سور10%",10,8,3200]
[0.85,85,4000,"حفروردم 10%",10,8.5,3400,0.85,85,16000,"بناء محارة وعزل40%",2.5,34,13600,0.85,85,{"$f":"+Q19","v":14000},"عزل 35%",2.8571428571428572,29.75,11900,0.85,85,{"$f":"+X19","v":2000},"مواسير صرف ورى5%",20,4.25,1700,0.85,85,{"$f":"+AE19","v":4000},"سور10%",10,8.5,3400]
[0.9,90,4000,"حفروردم 10%",10,9,3600,0.9,90,16000,"بناء محارة وعزل40%",2.5,36,14400,0.9,90,{"$f":"+Q20","v":14000},"عزل 35%",2.8571428571428572,31.5,12600,0.9,90,{"$f":"+X20","v":2000},"مواسير صرف ورى5%",20,4.5,1800,0.9,90,{"$f":"+AE20","v":4000},"سور10%",10,9,3600]
[0.95,95,{"$f":"+C21","v":4000},"حفروردم 10%",10,9.5,3800,0.95,95,16000,"بناء محارة وعزل40%",2.5,38,15200,0.95,95,{"$f":"+Q21","v":14000},"عزل 35%",2.8571428571428572,33.25,13300,0.95,95,{"$f":"+X21","v":2000},"مواسير صرف ورى5%",20,4.75,1900,0.95,95,{"$f":"+AE21","v":4000},"سور10%",10,9.5,3800]
[1,100,4000,"حفروردم 10%",10,10,4000,1,100,16000,"بناء محارة وعزل40%",2.5,40,16000,1,100,{"$f":"+Q22","v":14000},"عزل 35%",2.8571428571428572,35,14000,1,100,{"$f":"+X22","v":2000},"مواسير صرف ورى5%",20,5,2000,1,100,{"$f":"+AE22","v":4000},"سور10%",10,10,4000]
[null,null,{"$f":"+C23","v":4000},null,null,null,{"$f":"+G23","v":4000},null,null,{"$f":"+J23","v":16000},null,null,null,{"$f":"+N23","v":16000}]

{"sheet":"الشغل","index":2,"n_rows":500,"n_cols":18,"rows_kept":500,"cut":false,"hidden":false,"merged":[]}
[]
[null,null,null,null,null,null,null,null,null,{"$f":"SUBTOTAL(9,J5:J24)","v":66900},null,null,null,{"$f":"IF(G5<>\"\",IF(G5=القائمة!E2,VLOOKUP($H5,'النسب '!$A$3:$G$23,6,0),\"\"),AND(IF(G5=القائمة!E3,VLOOKUP($H5,'النسب '!$H$3:$N$23,6,0),\"\"),AND(IF(G5=القائمة!E4,VLOOKUP($H5,'النسب '!$O$3:$U$23,6,0),\"\")),AND(IF(G5=القائمة!E4,VLOOKUP($H5,'النسب '!$O$3:$U$23,6,0),\"\")),AND(IF(G5=القائمة!E6,VLOOKUP($H5,'النسب '!$AC$2:$AI$23,6,0),\"\"))))","v":10},null,{"$f":"OR(IF(G5=القائمة!E3,VLOOKUP($H5,'النسب '!$H$3:$N$23,6,0),\"\"),IF(G5=القائمة!E4,VLOOKUP($H5,'النسب '!$O$3:$U$23,6,0),\"\"),IF(G5=القائمة!E4,VLOOKUP($H5,'النسب '!$O$3:$U$23,6,0),\"\"),IF(G5=القائمة!E6,VLOOKUP($H5,'النسب '!$AC$2:$AI$23,6,0),\"\"))","v":{"$error":"#VALUE!"}}]
[null,null,null,null,null,null,null,null,null,null,null,null,null,{"$f":"IF(G5=القائمة!E2,VLOOKUP($H5,'النسب '!$A$3:$G$23,6,0),\"\")","v":10},{"$f":"IF(G5=القائمة!E3,VLOOKUP($H5,'النسب '!$H$3:$N$23,6,0),\"\")","v":""},{"$f":"IF(G5=القائمة!E4,VLOOKUP($H5,'النسب '!$O$3:$U$23,6,0),\"\")","v":""},{"$f":"IF(G5=القائمة!E5,VLOOKUP($H5,'النسب '!$V$3:$AB$23,6,0),\"\")","v":""},{"$f":"IF(G5=القائمة!E6,VLOOKUP($H5,'النسب '!$AC$2:$AI$23,6,0),\"\")","v":""}]
[null,"التاريخ","المقاول","الكلاستر","الصوبة","عدد العمال","العمل","النسبة يدوى","العمل من صفحة النسبة","القيمة المستحقة من صفحة النسبة",null,"المقاول","القيمة المستحقة","جدول 1","جدول 2","جدول 3","جدول 4","جدول 5"]
[null,"2019-08-28","خالد مهدى",56,null,null,"1حفر وردم 10%0",1,{"$f":"IF(G5<>\"\",VLOOKUP($H5,'النسب '!$A$2:$N$23,6,0),\"\")","v":10},{"$f":"IF(G5=القائمة!$E$2,VLOOKUP($H5,'النسب '!$A$3:$N$23,7,0),VLOOKUP($H5,'النسب '!$A$3:$N$23,12,0))","v":4000},null,{"$f":"+C5","v":"خالد مهدى"},{"$f":"+J5","v":4000},{"$f":"VLOOKUP($H5,'النسب '!$A$3:$G$23,6,0)","v":10},{"$f":"VLOOKUP($H5,'النسب '!$H$3:$N$23,6,0)","v":40},{"$f":"VLOOKUP($H5,'النسب '!$O$3:$U$23,6,0)","v":35},{"$f":"VLOOKUP($H5,'النسب '!$V$3:$AB$23,6,0)","v":5},{"$f":"VLOOKUP($H5,'النسب '!$AC$2:$AI$23,6,0)","v":10}]
[null,"2019-08-28","خالد مهدى",56,null,null,"2بناء ومحارة وعزل40%0",0.75,30,12000,null,"خالد مهدى",{"$f":"+J6","v":12000},{"$f":"IF(G6=القائمة!E5,VLOOKUP($H8,'النسب '!$A$3:$G$23,6,0),\"\")","v":""},{"$f":"IF(G6=القائمة!E6,VLOOKUP($H8,'النسب '!$H$3:$N$23,6,0),\"\")","v":""},{"$f":"IF(G6=القائمة!E7,VLOOKUP($H8,'النسب '!$O$3:$U$23,6,0),\"\")","v":""},{"$f":"IF(G6=القائمة!E8,VLOOKUP($H8,'النسب '!$V$3:$AB$23,6,0),\"\")","v":""},{"$f":"IF(G6=القائمة!E9,VLOOKUP($H8,'النسب '!$AC$2:$AI$23,6,0),\"\")","v":""}]
[null,"2019-08-28","خالد مهدى",56,null,null,"3عـــــــــــــــــزل35%0",0.45,15.75,6300,null,"خالد مهدى",6300]
[null,"2019-08-28","خالد مهدى",57,null,null,"1حفر وردم 10%0",1,{"$f":"IF(G8<>\"\",VLOOKUP($H8,'النسب '!$A$2:$N$23,6,0),\"\")","v":10},{"$f":"IF(G8=القائمة!$E$2,VLOOKUP($H8,'النسب '!$A$3:$N$23,7,0),VLOOKUP($H8,'النسب '!$A$3:$N$23,12,0))","v":4000},null,"خالد مهدى",4000]
[null,"2019-08-28","خالد مهدى",57,null,null,"2بناء ومحارة وعزل40%0",0.75,30,12000,null,"خالد مهدى",12000]
[null,"2019-08-28","خالد مهدى",57,null,null,"3عـــــــــــــــــزل35%0",0.45,15.75,6300,null,"خالد مهدى",6300]
[null,"2019-08-28","خالد مهدى",58,null,null,"1حفر وردم 10%0",1,{"$f":"IF(G11<>\"\",VLOOKUP($H11,'النسب '!$A$2:$N$23,6,0),\"\")","v":10},{"$f":"IF(G11=القائمة!$E$2,VLOOKUP($H11,'النسب '!$A$3:$N$23,7,0),VLOOKUP($H11,'النسب '!$A$3:$N$23,12,0))","v":4000},null,"خالد مهدى",4000]
[null,"2019-08-28","خالد مهدى",58,null,null,"2بناء ومحارة وعزل40%0",0.75,30,12000,null,"خالد مهدى",12000]
[null,"2019-08-28","خالد مهدى",58,null,null,"3عـــــــــــــــــزل35%0",0.45,15.75,6300,null,"خالد مهدى",6300]
[null,null,null,null,null,null,{"$f":"IFERROR(VLOOKUP(#REF!,القائمة!$D$2:$E$6,2,0),\"\")","v":""},null,{"$f":"IF(G14=القائمة!$E$2,VLOOKUP($H14,'النسب '!$A$2:$N$23,6,0),VLOOKUP($H14,'النسب '!$A$2:$N$23,11,0))","v":0},{"$f":"IF(G14=القائمة!$E$2,VLOOKUP($H14,'النسب '!$A$3:$N$23,7,0),VLOOKUP($H14,'النسب '!$A$3:$N$23,12,0))","v":0},null,0,0]
[null,null,null,null,null,null,{"$f":"IFERROR(VLOOKUP(#REF!,القائمة!$D$2:$E$6,2,0),\"\")","v":""},null,{"$f":"IF(G15=القائمة!$E$2,VLOOKUP($H15,'النسب '!$A$2:$N$23,6,0),VLOOKUP($H15,'النسب '!$A$2:$N$23,11,0))","v":0},{"$f":"IF(G15=القائمة!$E$2,VLOOKUP($H15,'النسب '!$A$3:$N$23,7,0),VLOOKUP($H15,'النسب '!$A$3:$N$23,12,0))","v":0},null,0,0]
[null,null,null,null,null,null,{"$f":"IFERROR(VLOOKUP(#REF!,القائمة!$D$2:$E$6,2,0),\"\")","v":""},null,{"$f":"IF(G16=القائمة!$E$2,VLOOKUP($H16,'النسب '!$A$2:$N$23,6,0),VLOOKUP($H16,'النسب '!$A$2:$N$23,11,0))","v":0},{"$f":"IF(G16=القائمة!$E$2,VLOOKUP($H16,'النسب '!$A$3:$N$23,7,0),VLOOKUP($H16,'النسب '!$A$3:$N$23,12,0))","v":0},null,0,0]
[null,null,null,null,null,null,{"$f":"IFERROR(VLOOKUP(#REF!,القائمة!$D$2:$E$6,2,0),\"\")","v":""},null,{"$f":"IF(G17=القائمة!$E$2,VLOOKUP($H17,'النسب '!$A$2:$N$23,6,0),VLOOKUP($H17,'النسب '!$A$2:$N$23,11,0))","v":0},{"$f":"IF(G17=القائمة!$E$2,VLOOKUP($H17,'النسب '!$A$3:$N$23,7,0),VLOOKUP($H17,'النسب '!$A$3:$N$23,12,0))","v":0},null,0,0]
[null,null,null,null,null,null,{"$f":"IFERROR(VLOOKUP(#REF!,القائمة!$D$2:$E$6,2,0),\"\")","v":""},null,{"$f":"IF(G18=القائمة!$E$2,VLOOKUP($H18,'النسب '!$A$2:$N$23,6,0),VLOOKUP($H18,'النسب '!$A$2:$N$23,11,0))","v":0},{"$f":"IF(G18=القائمة!$E$2,VLOOKUP($H18,'النسب '!$A$3:$N$23,7,0),VLOOKUP($H18,'النسب '!$A$3:$N$23,12,0))","v":0},null,0,0]
[null,null,null,null,null,null,{"$f":"IFERROR(VLOOKUP(#REF!,القائمة!$D$2:$E$6,2,0),\"\")","v":""},null,{"$f":"IF(G19=القائمة!$E$2,VLOOKUP($H19,'النسب '!$A$2:$N$23,6,0),VLOOKUP($H19,'النسب '!$A$2:$N$23,11,0))","v":0},{"$f":"IF(G19=القائمة!$E$2,VLOOKUP($H19,'النسب '!$A$3:$N$23,7,0),VLOOKUP($H19,'النسب '!$A$3:$N$23,12,0))","v":0},null,0,0]
[null,null,null,null,null,null,{"$f":"IFERROR(VLOOKUP(#REF!,القائمة!$D$2:$E$6,2,0),\"\")","v":""},null,{"$f":"IF(G20=القائمة!$E$2,VLOOKUP($H20,'النسب '!$A$2:$N$23,6,0),VLOOKUP($H20,'النسب '!$A$2:$N$23,11,0))","v":0},{"$f":"IF(G20=القائمة!$E$2,VLOOKUP($H20,'النسب '!$A$3:$N$23,7,0),VLOOKUP($H20,'النسب '!$A$3:$N$23,12,0))","v":0},null,0,0]
[null,null,null,null,null,null,{"$f":"IFERROR(VLOOKUP(#REF!,القائمة!$D$2:$E$6,2,0),\"\")","v":""},null,{"$f":"IF(G21=القائمة!$E$2,VLOOKUP($H21,'النسب '!$A$2:$N$23,6,0),VLOOKUP($H21,'النسب '!$A$2:$N$23,11,0))","v":0},{"$f":"IF(G21=القائمة!$E$2,VLOOKUP($H21,'النسب '!$A$3:$N$23,7,0),VLOOKUP($H21,'النسب '!$A$3:$N$23,12,0))","v":0},null,0,0]
[null,null,null,null,null,null,{"$f":"IFERROR(VLOOKUP(#REF!,القائمة!$D$2:$E$6,2,0),\"\")","v":""},null,{"$f":"IF(G22=القائمة!$E$2,VLOOKUP($H22,'النسب '!$A$2:$N$23,6,0),VLOOKUP($H22,'النسب '!$A$2:$N$23,11,0))","v":0},{"$f":"IF(G22=القائمة!$E$2,VLOOKUP($H22,'النسب '!$A$3:$N$23,7,0),VLOOKUP($H22,'النسب '!$A$3:$N$23,12,0))","v":0},null,0,0]
[null,null,null,null,null,null,{"$f":"IFERROR(VLOOKUP(#REF!,القائمة!$D$2:$E$6,2,0),\"\")","v":""},null,{"$f":"IF(G23=القائمة!$E$2,VLOOKUP($H23,'النسب '!$A$2:$N$23,6,0),VLOOKUP($H23,'النسب '!$A$2:$N$23,11,0))","v":0},{"$f":"IF(G23=القائمة!$E$2,VLOOKUP($H23,'النسب '!$A$3:$N$23,7,0),VLOOKUP($H23,'النسب '!$A$3:$N$23,12,0))","v":0},null,0,0]
[null,null,null,null,null,null,{"$f":"IFERROR(VLOOKUP(#REF!,القائمة!$D$2:$E$6,2,0),\"\")","v":""},null,{"$f":"IF(G24=القائمة!$E$2,VLOOKUP($H24,'النسب '!$A$2:$N$23,6,0),VLOOKUP($H24,'النسب '!$A$2:$N$23,11,0))","v":0},{"$f":"IF(G24=القائمة!$E$2,VLOOKUP($H24,'النسب '!$A$3:$N$23,7,0),VLOOKUP($H24,'النسب '!$A$3:$N$23,12,0))","v":0},null,0,0]
[null,null,null,null,null,null,{"$f":"IFERROR(VLOOKUP(#REF!,القائمة!$D$2:$E$6,2,0),\"\")","v":""},null,{"$f":"IF(G25=القائمة!$E$2,VLOOKUP($H25,'النسب '!$A$2:$N$23,6,0),VLOOKUP($H25,'النسب '!$A$2:$N$23,11,0))","v":0},{"$f":"IF(G25=القائمة!$E$2,VLOOKUP($H25,'النسب '!$A$3:$N$23,7,0),VLOOKUP($H25,'النسب '!$A$3:$N$23,12,0))","v":0},null,0,0]
[null,null,null,null,null,null,{"$f":"IFERROR(VLOOKUP(#REF!,القائمة!$D$2:$E$6,2,0),\"\")","v":""},null,{"$f":"IF(G26=القائمة!$E$2,VLOOKUP($H26,'النسب '!$A$2:$N$23,6,0),VLOOKUP($H26,'النسب '!$A$2:$N$23,11,0))","v":0},{"$f":"IF(G26=القائمة!$E$2,VLOOKUP($H26,'النسب '!$A$3:$N$23,7,0),VLOOKUP($H26,'النسب '!$A$3:$N$23,12,0))","v":0},null,0,0]
[null,null,null,null,null,null,{"$f":"IFERROR(VLOOKUP(#REF!,القائمة!$D$2:$E$6,2,0),\"\")","v":""},null,{"$f":"IF(G27=القائمة!$E$2,VLOOKUP($H27,'النسب '!$A$2:$N$23,6,0),VLOOKUP($H27,'النسب '!$A$2:$N$23,11,0))","v":0},{"$f":"IF(G27=القائمة!$E$2,VLOOKUP($H27,'النسب '!$A$3:$N$23,7,0),VLOOKUP($H27,'النسب '!$A$3:$N$23,12,0))","v":0},null,0,0]
[null,null,null,null,null,null,{"$f":"IFERROR(VLOOKUP(#REF!,القائمة!$D$2:$E$6,2,0),\"\")","v":""},null,{"$f":"IF(G28=القائمة!$E$2,VLOOKUP($H28,'النسب '!$A$2:$N$23,6,0),VLOOKUP($H28,'النسب '!$A$2:$N$23,11,0))","v":0},{"$f":"IF(G28=القائمة!$E$2,VLOOKUP($H28,'النسب '!$A$3:$N$23,7,0),VLOOKUP($H28,'النسب '!$A$3:$N$23,12,0))","v":0},null,0,0]
[null,null,null,null,null,null,{"$f":"IFERROR(VLOOKUP(#REF!,القائمة!$D$2:$E$6,2,0),\"\")","v":""},null,{"$f":"IF(G29=القائمة!$E$2,VLOOKUP($H29,'النسب '!$A$2:$N$23,6,0),VLOOKUP($H29,'النسب '!$A$2:$N$23,11,0))","v":0},{"$f":"IF(G29=القائمة!$E$2,VLOOKUP($H29,'النسب '!$A$3:$N$23,7,0),VLOOKUP($H29,'النسب '!$A$3:$N$23,12,0))","v":0},null,0,0]
[null,null,null,null,null,null,{"$f":"IFERROR(VLOOKUP(#REF!,القائمة!$D$2:$E$6,2,0),\"\")","v":""},null,{"$f":"IF(G30=القائمة!$E$2,VLOOKUP($H30,'النسب '!$A$2:$N$23,6,0),VLOOKUP($H30,'النسب '!$A$2:$N$23,11,0))","v":0},{"$f":"IF(G30=القائمة!$E$2,VLOOKUP($H30,'النسب '!$A$3:$N$23,7,0),VLOOKUP($H30,'النسب '!$A$3:$N$23,12,0))","v":0},null,0,0]
{"$rows_left_out":471}
{"sheet":"تفرير","index":3,"n_rows":102,"n_cols":17,"rows_kept":102,"cut":false,"hidden":false,"merged":[[1,1,1,4],[5,5,5,9]]}
[]
[null,"تقرير النسب والمبلغ خلال العمليات للمقولين",null,null,null,null,null,null,null,null,null,{"$f":"+القائمة!G2","v":"خالد مهدى"},{"$f":"+القائمة!H2","v":66900}]
[null,null,null,null,null,null,null,"البيان","التقرير","القائمة",null,{"$f":"+القائمة!G3","v":"إيهاب "},{"$f":"+القائمة!H3","v":0}]
[null,"المقاول","العملية","الكلاستر","الصوبة",null,null,"الاجمالى القيمة",{"$f":"SUM(J10:J102)","v":66900},{"$f":"VLOOKUP(B5,القائمة!$G$2:$H$21,2,0)","v":66900},null,{"$f":"+القائمة!G4","v":0},{"$f":"+القائمة!H4","v":0}]
[null,"خالد مهدى",null,null,null,null,null,"الاجمالى العمالة",{"$f":"SUM($F$10:F102)","v":0},{"$f":"IF(B5<>\"\",I4-J4,\"\")","v":0},null,{"$f":"+القائمة!G5","v":0},{"$f":"+القائمة!H5","v":0}]
[null,null,null,null,"المبلغ",{"$f":"NoToTxt(I4,\"جنيها\",\"قرش\")","v":"فقط ستة وستون ألف وتسعمائة جنيها"},null,null,null,null,null,{"$f":"+القائمة!G6","v":0},{"$f":"+القائمة!H6","v":0},null,null,{"$f":"3.4+2.8+3.88","v":10.079999999999998}]
[null,null,null,null,null,null,null,null,null,null,null,{"$f":"+القائمة!G7","v":0},{"$f":"+القائمة!H7","v":0},null,null,1700]
[null,null,null,null,null,null,null,null,null,null,null,{"$f":"+القائمة!G8","v":0},{"$f":"+القائمة!H8","v":0},null,null,{"$f":"+P6*P7","v":17135.999999999996}]
[null,"التاريخ","المقاول","الكلاستر","الصوبة","عدد العمال","العمل","النسبة يدوى","العمل من صفحة النسبة","القيمة المستحقة من صفحة النسبة",null,{"$f":"+القائمة!G9","v":0},{"$f":"+القائمة!H9","v":0}]
[null,"2019-08-28","خالد مهدى",56,null,null,"1حفر وردم 10%0",1,10,4000,null,{"$f":"+القائمة!G10","v":0},{"$f":"+القائمة!H10","v":0}]
[null,"2019-08-28","خالد مهدى",56,null,null,"2بناء ومحارة وعزل40%0",0.75,30,12000,null,{"$f":"+القائمة!G11","v":0},{"$f":"+القائمة!H11","v":0}]
[null,"2019-08-28","خالد مهدى",56,null,null,"3عـــــــــــــــــزل35%0",0.45,15.75,6300,null,{"$f":"+القائمة!G12","v":0},{"$f":"+القائمة!H12","v":0},null,{"$f":"2000+1500","v":3500},{"$f":"+M12+O12","v":3500}]
[null,"2019-08-28","خالد مهدى",57,null,null,"1حفر وردم 10%0",1,10,4000,null,{"$f":"+القائمة!G13","v":0},{"$f":"+القائمة!H13","v":0}]
[null,"2019-08-28","خالد مهدى",57,null,null,"2بناء ومحارة وعزل40%0",0.75,30,12000,null,{"$f":"+القائمة!G14","v":0},{"$f":"+القائمة!H14","v":0}]
[null,"2019-08-28","خالد مهدى",57,null,null,"3عـــــــــــــــــزل35%0",0.45,15.75,6300,null,{"$f":"+القائمة!G15","v":0},{"$f":"+القائمة!H15","v":0}]
[null,"2019-08-28","خالد مهدى",58,null,null,"1حفر وردم 10%0",1,10,4000,null,{"$f":"+القائمة!G16","v":0},{"$f":"+القائمة!H16","v":0}]
[null,"2019-08-28","خالد مهدى",58,null,null,"2بناء ومحارة وعزل40%0",0.75,30,12000,null,{"$f":"+القائمة!G17","v":0},{"$f":"+القائمة!H17","v":0}]
[null,"2019-08-28","خالد مهدى",58,null,null,"3عـــــــــــــــــزل35%0",0.45,15.75,6300,null,{"$f":"+القائمة!G18","v":0},{"$f":"+القائمة!H18","v":0}]
[null,null,null,null,null,null,null,null,null,null,null,{"$f":"+القائمة!G19","v":0},{"$f":"+القائمة!H19","v":0}]
[null,null,null,null,null,null,null,null,null,null,null,{"$f":"+القائمة!G20","v":0},{"$f":"+القائمة!H20","v":0}]
[null,null,null,null,null,null,null,null,null,null,null,{"$f":"+القائمة!G21","v":0},{"$f":"+القائمة!H21","v":0},null,{"$f":"14950-6900","v":8050},6900,{"$f":"+O21+P21","v":14950}]
[null,null,null,null,null,null,null,null,null,null,null,{"$f":"+القائمة!G22","v":0},{"$f":"+القائمة!H22","v":0}]
[null,null,null,null,null,null,null,null,null,null,null,{"$f":"+القائمة!G23","v":0},{"$f":"+القائمة!H23","v":0}]
[null,null,null,null,null,null,null,null,null,null,null,{"$f":"+القائمة!G24","v":0},{"$f":"+القائمة!H24","v":0}]
[null,null,null,null,null,null,null,null,null,null,null,{"$f":"+القائمة!G25","v":0},{"$f":"+القائمة!H25","v":0}]
[null,null,null,null,null,null,null,null,null,null,null,{"$f":"+القائمة!G26","v":0},{"$f":"+القائمة!H26","v":0}]
[null,null,null,null,null,null,null,null,null,null,null,{"$f":"+القائمة!G27","v":0},{"$f":"+القائمة!H27","v":0}]
[null,null,null,null,null,null,null,null,null,null,null,{"$f":"+القائمة!G28","v":0},{"$f":"+القائمة!H28","v":0}]
[null,null,null,null,null,null,null,null,null,null,null,{"$f":"+القائمة!G29","v":0},{"$f":"+القائمة!H29","v":0}]
[null,null,null,null,null,null,null,null,null,null,null,{"$f":"+القائمة!G30","v":0},{"$f":"+القائمة!H30","v":0}]
{"$rows_left_out":72}