{"text_format":"1","workbook":"xlsx","n_sheets":6,"sheets":["بيانات اساسية","بيانات المعلمين","الشيت الرئيسي","الاشراف","المعلمين","الفصول"],"not_rendered":{"charts":0,"images":4,"macros":1,"external_links":0,"defined_names":30,"comments":0,"pivot_tables":0},"unopened":[],"bounds":{"document_bytes":16777216,"sheet_cells":100000,"rows_first":2000,"rows_last":500,"rows_between":2000,"halvings":0,"cell_chars":16384,"cell_head_chars":4096},"cells_cut":0,"cells_raw":0,"read":"whole","date_system":"1900"}

{"sheet":"بيانات اساسية","index":0,"n_rows":30,"n_cols":10,"rows_kept":30,"cut":false,"hidden":false,"merged":[[11,1,14,1],[14,2,14,4],[6,2,6,4],[8,2,8,4],[11,2,11,4],[12,2,12,4],[13,2,13,4]]}
[null,null,null,null,null,"F"]
[]
[]
[]
[null,"المديرية","المنيا",null,null,null,"الصف","عدد الفصول"]
[null,"الإدارة","بني مزار",null,null,null,"الأول",2]
[null,"المدرسة","بردونة الأشراف الإعدادية",null,null,null,"الثاني",3]
[null,"العام الدراسي","2019-2020م",null,null,null,"الثالث",2]
[null,"مدير المدرسة","هالة لطفي إبراهيم"]
[null,"بداية العام الدراسي","21/9/2019م"]
[null,"الإجازة الأسبوعية","السبت- الأحد"]
[null,"لجنة الجدول","أ/ محمود محمد علي"]
[null,null,"أ/ محمد محمد عبد السلام"]
[]
[]
{"$rows_left_out":16}
{"sheet":"بيانات المعلمين","index":1,"n_rows":25,"n_cols":14,"rows_kept":25,"cut":false,"hidden":false,"merged":[[57,1,57,4],[24,8,24,10],[63,1,63,4],[64,1,64,4],[65,1,65,4],[66,1,66,4],[58,1,58,4],[59,1,59,4],[60,1,60,4],[61,1,61,4],[62,1,62,4]]}
[]
[]
[null,null,null,null,null,"م","المادة","فصل 1-1","فصل1-2","فصل2-1","فصل2-2","فصل2-3","فصل3-1","فصل3-2"]
[null,null,null,null,null,1,"عربي ","مصطفي","مصطفي","وفاء","وفاء","وفاء","أشرف","أشرف"]
["م","الاسم ","المختصر","نصاب الحصص",null,2,"انجليزى","رحاب","رحاب","رحاب","رحاب","بهانة","بهانة","بهانة"]
[1,"مصطفي عبد الوهاب محمد ","مصطفي",17,null,3,"دراسات ","محمد عبد","محمد عبد","محمود","محمود","محمود","محمد عبد","محمد عبد"]
[2,"أشرف خطاب حسن نصار","أشرف",17,null,4,"رياضيات","محمد أ","محمد أ","محمد أ","محمد أ","محمد أ","خالد","خالد"]
[3,"محسن محمد عبد الغني أحمد","محسن",20,null,5,"علـــــــــوم","محمد ز","محمد ز","سهير","سهير","سهير","سهير","سهير"]
[4,"وفاء أبو بكر محمد جمال ","وفاء",20,null,6,"حاسب آلي","عثمان","عثمان","عثمان","عثمان","عثمان","عثمان","عثمان"]
[5,"بهانة السيد محمد حسن","بهانة",15,null,7,"تربية فنية","س فنية","س فنية","س فنية","س فنية","س فنية","س فنية","س فنية"]
[6,"رحاب محمد عبد الرحمن ","رحاب",20,null,8,"تربية رياضية",null,"س رياضية",null,"س رياضية","س رياضية",null,"س رياضية"]
[7,"خالد عبد العاطي حسن محمد","خالد",10,null,9,"اقتصاد منزلي","آمال",null,"آمال","آمال",null,"آمال"]
[8,"محمد أحمد علي محمد ","محمد أحمد",25,null,10,"مجال زراعي","حمادة","عبد الرحمن",null,"عبد الرحمن","عبد الرحمن",null,"عبد الرحمن"]
[9,"محمد محمد عبد السلام محمود ","محمد عبدالسلام",16,null,11,"مجال صناعي",null,"علي",null,"علي","علي",null,"علي"]
[10,"محمود جلال محمد حسانين","محمود",12,null,12,"تربية دينية","مصطفي"]
{"$rows_left_out":11}
{"sheet":"الشيت الرئيسي","index":2,"n_rows":112,"n_cols":42,"rows_kept":112,"cut":false,"hidden":false,"merged":[[5,36,5,37],[5,38,5,39],[5,26,5,27],[5,32,5,33],[5,34,5,35],[4,26,4,33],[4,34,4,41],[5,2,5,3],[5,4,5,5],[5,10,5,11],[5,16,5,17],[5,18,5,19],[5,20,5,21],[5,24,5,25],[5,28,5,29],[5,40,5,41],[5,6,5,7],[5,8,5,9],[5,12,5,13],[5,14,5,15],[5,30,5,31],[4,18,4,25],[5,22,5,23],[7,0,8,0],[9,0,10,0],[11,0,12,0],[4,1,6,1],[19,0,20,0],[15,0,16,0],[1,5,1,15],[4,2,4,9],[4,10,4,17],[13,0,14,0],[17,0,18,0]]}
[]
[null,null,null,null,null,"الشـــــــــــــــيت   الرئيسى لجــــــــــــــدول الــــــــــــحصص   ( الفصول و الاشراف اليومى )"]
[]
[]
[null,"البيان","الاحــــــــــــــــــــــــــــد",null,null,null,null,null,null,null,"الاثنين",null,null,null,null,null,null,null,"الثلاثاء",null,null,null,null,null,null,null,"الاربعاء",null,null,null,null,null,null,null,"الخميس"]
[null,null,"الفترة الأولي",null,"الفترة الثانية",null,"الثالثة",null,"الرابعة",null,"الفترة الأولي",null,"الفترة الثانية",null,"الثالثة",null,"الرابعة",null,"الفترة الأولي",null,"الفترة الثانية",null,"الثالثة",null,"الرابعة",null,"الفترة الأولي",null,"الفترة الثانية",null,"الثالثة",null,"الرابعة",null,"الفترة الأولي",null,"الفترة الثانية",null,"الثالثة",null,"الرابعة"]
[null,null,1,2,3,4,5,6,7,8,1,2,3,4,5,6,7,8,1,2,3,4,5,6,7,8,1,2,3,4,5,6,7,8,1,2,3,4,5,6,7,8]
["1/1","المعلم"]
[null,"المادة",{"$f":"IFERROR(VLOOKUP(C8,$G$86:$H$107,2,0),\"\")","v":""},{"$f":"IFERROR(VLOOKUP(D8,$G$86:$H$107,2,0),\"\")","v":""},{"$f":"IFERROR(VLOOKUP(E8,$G$86:$H$107,2,0),\"\")","v":""},{"$f":"IFERROR(VLOOKUP(F8,$G$86:$H$107,2,0),\"\")","v":""},{"$f":"IFERROR(VLOOKUP(G8,$G$86:$H$107,2,0),\"\")","v":""},{"$f":"IFERROR(VLOOKUP(H8,$G$86:$H$107,2,0),\"\")","v":""},{"$f":"IFERROR(VLOOKUP(I8,$G$86:$H$107,2,0),\"\")","v":""},{"$f":"IFERROR(VLOOKUP(J8,$G$86:$H$107,2,0),\"\")","v":""},{"$f":"IFERROR(VLOOKUP(K8,$G$86:$H$107,2,0),\"\")","v":""},{"$f":"IFERROR(VLOOKUP(L8,$G$86:$H$107,2,0),\"\")","v":""},"","","","","",{"$f":"IFERROR(VLOOKUP(R8,$G$86:$H$107,2,0),\"\")","v":""},{"$f":"IFERROR(VLOOKUP(S8,$G$86:$H$107,2,0),\"\")","v":""},{"$f":"IFERROR(VLOOKUP(T8,$G$86:$H$107,2,0),\"\")","v":""},{"$f":"IFERROR(VLOOKUP(U8,$G$86:$H$107,2,0),\"\")","v":""},{"$f":"IFERROR(VLOOKUP(V8,$G$86:$H$107,2,0),\"\")","v":""},{"$f":"IFERROR(VLOOKUP(W8,$G$86:$H$107,2,0),\"\")","v":""},{"$f":"IFERROR(VLOOKUP(X8,$G$86:$H$107,2,0),\"\")","v":""},{"$f":"IFERROR(VLOOKUP(Y8,$G$86:$H$107,2,0),\"\")","v":""},{"$f":"IFERROR(VLOOKUP(Z8,$G$86:$H$107,2,0),\"\")","v":""},{"$f":"IFERROR(VLOOKUP(AA8,$G$86:$H$107,2,0),\"\")","v":""},{"$f":"IFERROR(VLOOKUP(AB8,$G$86:$H$107,2,0),\"\")","v":""},{"$f":"IFERROR(VLOOKUP(AC8,$G$86:$H$107,2,0),\"\")","v":""},{"$f":"IFERROR(VLOOKUP(AD8,$G$86:$H$107,2,0),\"\")","v":""},{"$f":"IFERROR(VLOOKUP(AE8,$G$86:$H$107,2,0),\"\")","v":""},{"$f":"IFERROR(VLOOKUP(AF8,$G$86:$H$107,2,0),\"\")","v":""},{"$f":"IFERROR(VLOOKUP(AG8,$G$86:$H$107,2,0),\"\")","v":""},{"$f":"IFERROR(VLOOKUP(AH8,$G$86:$H$107,2,0),\"\")","v":""},{"$f":"IFERROR(VLOOKUP(AI8,$G$86:$H$107,2,0),\"\")","v":""},{"$f":"IFERROR(VLOOKUP(AJ8,$G$86:$H$107,2,0),\"\")","v":""},{"$f":"IFERROR(VLOOKUP(AK8,$G$86:$H$107,2,0),\"\")","v":""},{"$f":"IFERROR(VLOOKUP(AL8,$G$86:$H$107,2,0),\"\")","v":""},{"$f":"IFERROR(VLOOKUP(AM8,$G$86:$H$107,2,0),\"\")","v":""},{"$f":"IFERROR(VLOOKUP(AN8,$G$86:$H$107,2,0),\"\")","v":""},{"$f":"IFERROR(VLOOKUP(AO8,$G$86:$H$107,2,0),\"\")","v":""},{"$f":"IFERROR(VLOOKUP(AP8,$G$86:$H$107,2,0),\"\")","v":""}]
["2/1","2/1"]
[null,"2/1",{"$f":"IFERROR(VLOOKUP(C10,$G$86:$H$107,2,0),\"\")","v":""},{"$f":"IFERROR(VLOOKUP(D10,$G$86:$H$107,2,0),\"\")","v":""},{"$f":"IFERROR(VLOOKUP(E10,$G$86:$H$107,2,0),\"\")","v":""},{"$f":"IFERROR(VLOOKUP(F10,$G$86:$H$107,2,0),\"\")","v":""},{"$f":"IFERROR(VLOOKUP(G10,$G$86:$H$107,2,0),\"\")","v":""},"",{"$f":"IFERROR(VLOOKUP(I10,$G$86:$H$107,2,0),\"\")","v":""},{"$f":"IFERROR(VLOOKUP(J10,$G$86:$H$107,2,0),\"\")","v":""},{"$f":"IFERROR(VLOOKUP(K10,$G$86:$H$107,2,0),\"\")","v":""},{"$f":"IFERROR(VLOOKUP(L10,$G$86:$H$107,2,0),\"\")","v":""},{"$f":"IFERROR(VLOOKUP(M10,$G$86:$H$107,2,0),\"\")","v":""},{"$f":"IFERROR(VLOOKUP(N10,$G$86:$H$107,2,0),\"\")","v":""},{"$f":"IFERROR(VLOOKUP(O10,$G$86:$H$107,2,0),\"\")","v":""},{"$f":"IFERROR(VLOOKUP(P10,$G$86:$H$107,2,0),\"\")","v":""},{"$f":"IFERROR(VLOOKUP(Q10,$G$86:$H$107,2,0),\"\")","v":""},{"$f":"IFERROR(VLOOKUP(R10,$G$86:$H$107,2,0),\"\")","v":""},{"$f":"IFERROR(VLOOKUP(S10,$G$86:$H$107,2,0),\"\")","v":""},{"$f":"IFERROR(VLOOKUP(T10,$G$86:$H$107,2,0),\"\")","v":""},{"$f":"IFERROR(VLOOKUP(U10,$G$86:$H$107,2,0),\"\")","v":""},{"$f":"IFERROR(VLOOKUP(V10,$G$86:$H$107,2,0),\"\")","v":""},{"$f":"IFERROR(VLOOKUP(W10,$G$86:$H$107,2,0),\"\")","v":""},{"$f":"IFERROR(VLOOKUP(X10,$G$86:$H$107,2,0),\"\")","v":""},{"$f":"IFERROR(VLOOKUP(Y10,$G$86:$H$107,2,0),\"\")","v":""},{"$f":"IFERROR(VLOOKUP(Z10,$G$86:$H$107,2,0),\"\")","v":""},{"$f":"IFERROR(VLOOKUP(AA10,$G$86:$H$107,2,0),\"\")","v":""},{"$f":"IFERROR(VLOOKUP(AB10,$G$86:$H$107,2,0),\"\")","v":""},{"$f":"IFERROR(VLOOKUP(AC10,$G$86:$H$107,2,0),\"\")","v":""},{"$f":"IFERROR(VLOOKUP(AD10,$G$86:$H$107,2,0),\"\")","v":""},{"$f":"IFERROR(VLOOKUP(AE10,$G$86:$H$107,2,0),\"\")","v":""},{"$f":"IFERROR(VLOOKUP(AF10,$G$86:$H$107,2,0),\"\")","v":""},{"$f":"IFERROR(VLOOKUP(AG10,$G$86:$H$107,2,0),\"\")","v":""},{"$f":"IFERROR(VLOOKUP(AH10,$G$86:$H$107,2,0),\"\")","v":""},{"$f":"IFERROR(VLOOKUP(AI10,$G$86:$H$107,2,0),\"\")","v":""},{"$f":"IFERROR(VLOOKUP(AJ10,$G$86:$H$107,2,0),\"\")","v":""},{"$f":"IFERROR(VLOOKUP(AK10,$G$86:$H$107,2,0),\"\")","v":""},{"$f":"IFERROR(VLOOKUP(AL10,$G$86:$H$107,2,0),\"\")","v":""},{"$f":"IFERROR(VLOOKUP(AM10,$G$86:$H$107,2,0),\"\")","v":""},{"$f":"IFERROR(VLOOKUP(AN10,$G$86:$H$107,2,0),\"\")","v":""},{"$f":"IFERROR(VLOOKUP(AO10,$G$86:$H$107,2,0),\"\")","v":""},{"$f":"IFERROR(VLOOKUP(AP10,$G$86:$H$107,2,0),\"\")","v":""}]
["1/2","1/2"]
[null,"1/2",{"$f":"IFERROR(VLOOKUP(C12,$G$86:$H$107,2,0),\"\")","v":""},{"$f":"IFERROR(VLOOKUP(D12,$G$86:$H$107,2,0),\"\")","v":""},{"$f":"IFERROR(VLOOKUP(E12,$G$86:$H$107,2,0),\"\")","v":""},{"$f":"IFERROR(VLOOKUP(F12,$G$86:$H$107,2,0),\"\")","v":""},{"$f":"IFERROR(VLOOKUP(G12,$G$86:$H$107,2,0),\"\")","v":""},{"$f":"IFERROR(VLOOKUP(H12,$G$86:$H$107,2,0),\"\")","v":""},{"$f":"IFERROR(VLOOKUP(I12,$G$86:$H$107,2,0),\"\")","v":""},{"$f":"IFERROR(VLOOKUP(J12,$G$86:$H$107,2,0),\"\")","v":""},"",{"$f":"IFERROR(VLOOKUP(L12,$G$86:$H$107,2,0),\"\")","v":""},{"$f":"IFERROR(VLOOKUP(M12,$G$86:$H$107,2,0),\"\")","v":""},{"$f":"IFERROR(VLOOKUP(N12,$G$86:$H$107,2,0),\"\")","v":""},{"$f":"IFERROR(VLOOKUP(O12,$G$86:$H$107,2,0),\"\")","v":""},{"$f":"IFERROR(VLOOKUP(P12,$G$86:$H$107,2,0),\"\")","v":""},{"$f":"IFERROR(VLOOKUP(Q12,$G$86:$H$107,2,0),\"\")","v":""},{"$f":"IFERROR(VLOOKUP(R12,$G$86:$H$107,2,0),\"\")","v":""},{"$f":"IFERROR(VLOOKUP(S12,$G$86:$H$107,2,0),\"\")","v":""},{"$f":"IFERROR(VLOOKUP(T12,$G$86:$H$107,2,0),\"\")","v":""},{"$f":"IFERROR(VLOOKUP(U12,$G$86:$H$107,2,0),\"\")","v":""},{"$f":"IFERROR(VLOOKUP(V12,$G$86:$H$107,2,0),\"\")","v":""},{"$f":"IFERROR(VLOOKUP(W12,$G$86:$H$107,2,0),\"\")","v":""},{"$f":"IFERROR(VLOOKUP(X12,$G$86:$H$107,2,0),\"\")","v":""},{"$f":"IFERROR(VLOOKUP(Y12,$G$86:$H$107,2,0),\"\")","v":""},{"$f":"IFERROR(VLOOKUP(Z12,$G$86:$H$107,2,0),\"\")","v":""},{"$f":"IFERROR(VLOOKUP(AA12,$G$86:$H$107,2,0),\"\")","v":""},{"$f":"IFERROR(VLOOKUP(AB12,$G$86:$H$107,2,0),\"\")","v":""},{"$f":"IFERROR(VLOOKUP(AC12,$G$86:$H$107,2,0),\"\")","v":""},{"$f":"IFERROR(VLOOKUP(AD12,$G$86:$H$107,2,0),\"\")","v":""},{"$f":"IFERROR(VLOOKUP(AE12,$G$86:$H$107,2,0),\"\")","v":""},"",{"$f":"IFERROR(VLOOKUP(AG12,$G$86:$H$107,2,0),\"\")","v":""},{"$f":"IFERROR(VLOOKUP(AH12,$G$86:$H$107,2,0),\"\")","v":""},{"$f":"IFERROR(VLOOKUP(AI12,$G$86:$H$107,2,0),\"\")","v":""},{"$f":"IFERROR(VLOOKUP(AJ12,$G$86:$H$107,2,0),\"\")","v":""},{"$f":"IFERROR(VLOOKUP(AK12,$G$86:$H$107,2,0),\"\")","v":""},{"$f":"IFERROR(VLOOKUP(AL12,$G$86:$H$107,2,0),\"\")","v":""},{"$f":"IFERROR(VLOOKUP(AM12,$G$86:$H$107,2,0),\"\")","v":""},{"$f":"IFERROR(VLOOKUP(AN12,$G$86:$H$107,2,0),\"\")","v":""},{"$f":"IFERROR(VLOOKUP(AO12,$G$86:$H$107,2,0),\"\")","v":""},{"$f":"IFERROR(VLOOKUP(AP12,$G$86:$H$107,2,0),\"\")","v":""}]
["2/2","2/2"]
[null,"2/2",{"$f":"IFERROR(VLOOKUP(C14,$G$86:$H$107,2,0),\"\")","v":""},{"$f":"IFERROR(VLOOKUP(D14,$G$86:$H$107,2,0),\"\")","v":""},{"$f":"IFERROR(VLOOKUP(E14,$G$86:$H$107,2,0),\"\")","v":""},{"$f":"IFERROR(VLOOKUP(F14,$G$86:$H$107,2,0),\"\")","v":""},{"$f":"IFERROR(VLOOKUP(G14,$G$86:$H$107,2,0),\"\")","v":""},{"$f":"IFERROR(VLOOKUP(H14,$G$86:$H$107,2,0),\"\")","v":""},{"$f":"IFERROR(VLOOKUP(I14,$G$86:$H$107,2,0),\"\")","v":""},{"$f":"IFERROR(VLOOKUP(J14,$G$86:$H$107,2,0),\"\")","v":""},{"$f":"IFERROR(VLOOKUP(K14,$G$86:$H$107,2,0),\"\")","v":""},{"$f":"IFERROR(VLOOKUP(L14,$G$86:$H$107,2,0),\"\")","v":""},{"$f":"IFERROR(VLOOKUP(M14,$G$86:$H$107,2,0),\"\")","v":""},{"$f":"IFERROR(VLOOKUP(N14,$G$86:$H$107,2,0),\"\")","v":""},{"$f":"IFERROR(VLOOKUP(O14,$G$86:$H$107,2,0),\"\")","v":""},{"$f":"IFERROR(VLOOKUP(P14,$G$86:$H$107,2,0),\"\")","v":""},{"$f":"IFERROR(VLOOKUP(Q14,$G$86:$H$107,2,0),\"\")","v":""},{"$f":"IFERROR(VLOOKUP(R14,$G$86:$H$107,2,0),\"\")","v":""},{"$f":"IFERROR(VLOOKUP(S14,$G$86:$H$107,2,0),\"\")","v":""},{"$f":"IFERROR(VLOOKUP(T14,$G$86:$H$107,2,0),\"\")","v":""},{"$f":"IFERROR(VLOOKUP(U14,$G$86:$H$107,2,0),\"\")","v":""},{"$f":"IFERROR(VLOOKUP(V14,$G$86:$H$107,2,0),\"\")","v":""},{"$f":"IFERROR(VLOOKUP(W14,$G$86:$H$107,2,0),\"\")","v":""},{"$f":"IFERROR(VLOOKUP(X14,$G$86:$H$107,2,0),\"\")","v":""},{"$f":"IFERROR(VLOOKUP(Y14,$G$86:$H$107,2,0),\"\")","v":""},{"$f":"IFERROR(VLOOKUP(Z14,$G$86:$H$107,2,0),\"\")","v":""},{"$f":"IFERROR(VLOOKUP(AA14,$G$86:$H$107,2,0),\"\")","v":""},{"$f":"IFERROR(VLOOKUP(AB14,$G$86:$H$107,2,0),\"\")","v":""},{"$f":"IFERROR(VLOOKUP(AC14,$G$86:$H$107,2,0),\"\")","v":""},{"$f":"IFERROR(VLOOKUP(AD14,$G$86:$H$107,2,0),\"\")","v":""},{"$f":"IFERROR(VLOOKUP(AE14,$G$86:$H$107,2,0),\"\")","v":""},{"$f":"IFERROR(VLOOKUP(AF14,$G$86:$H$107,2,0),\"\")","v":""},{"$f":"IFERROR(VLOOKUP(AG14,$G$86:$H$107,2,0),\"\")","v":""},{"$f":"IFERROR(VLOOKUP(AH14,$G$86:$H$107,2,0),\"\")","v":""},{"$f":"IFERROR(VLOOKUP(AI14,$G$86:$H$107,2,0),\"\")","v":""},{"$f":"IFERROR(VLOOKUP(AJ14,$G$86:$H$107,2,0),\"\")","v":""},{"$f":"IFERROR(VLOOKUP(AK14,$G$86:$H$107,2,0),\"\")","v":""},{"$f":"IFERROR(VLOOKUP(AL14,$G$86:$H$107,2,0),\"\")","v":""},{"$f":"IFERROR(VLOOKUP(AM14,$G$86:$H$107,2,0),\"\")","v":""},{"$f":"IFERROR(VLOOKUP(AN14,$G$86:$H$107,2,0),\"\")","v":""},{"$f":"IFERROR(VLOOKUP(AO14,$G$86:$H$107,2,0),\"\")","v":""},{"$f":"IFERROR(VLOOKUP(AP14,$G$86:$H$107,2,0),\"\")","v":""}]
{"$rows_left_out":98}
{"sheet":"الاشراف","index":3,"n_rows":147,"n_cols":10,"rows_kept":147,"cut":false,"hidden":false,"merged":[[6,0,6,9],[7,4,7,7],[8,4,8,7],[10,0,11,0],[10,2,10,3],[10,4,10,5],[10,6,10,7],[24,0,25,0],[31,0,31,3],[10,8,10,9],[22,0,23,0],[12,0,13,0],[14,0,15,0],[16,0,17,0],[18,0,19,0],[20,0,21,0],[27,1,27,3],[28,0,28,4],[29,0,29,4],[29,7,29,8],[30,0,30,4],[30,5,30,9],[119,4,119,7],[120,4,120,7],[94,2,94,3],[94,4,94,5],[94,6,94,7],[94,8,94,9],[122,4,122,5],[122,6,122,7],[122,0,123,0],[122,2,122,3],[126,0,127,0],[128,0,129,0],[130,0,131,0],[136,0,137,0],[132,0,133,0],[134,0,135,0],[140,0,140,4],[141,0,141,4],[122,8,122,9],[124,0,125,0],[74,0,75,0],[76,0,77,0],[66,2,66,3],[66,4,66,5],[66,6,66,7],[66,8,66,9],[38,2,38,3],[38,4,38,5],[38,6,38,7],[38,8,38,9],[57,7,57,8],[58,5,58,9],[68,0,69,0],[70,0,71,0],[57,0,57,4],[59,0,59,3],[60,0,60,3],[61,0,61,3],[58,0,58,4],[62,0,62,3],[72,0,73,0],[32,0,32,3],[33,0,33,3],[34,0,34,3],[56,0,56,4],[55,1,55,3],[106,0,107,0],[108,0,109,0],[42,0,43,0],[38,0,39,0],[66,0,67,0],[94,0,95,0],[96,0,97,0],[98,0,99,0],[100,0,101,0],[102,0,103,0],[104,0,105,0],[78,0,79,0],[80,0,81,0],[40,0,41,0],[44,0,45,0],[46,0,47,0],[48,0,49,0],[50,0,51,0],[52,0,53,0],[88,0,88,3],[89,0,89,3],[90,0,90,3],[111,1,111,3],[83,1,83,3],[84,0,84,4],[85,0,85,4],[85,7,85,8],[86,0,86,4],[86,5,86,9],[145,0,145,3],[146,0,146,3],[35,4,35,7],[36,4,36,7],[63,4,63,7],[64,4,64,7],[91,4,91,7],[92,4,92,7],[141,7,141,8],[142,0,142,4],[142,5,142,9],[143,0,143,3],[144,0,144,3],[115,0,115,3],[116,0,116,3],[117,0,117,3],[118,0,118,3],[139,1,139,3],[112,0,112,4],[113,0,113,4],[113,7,113,8],[114,0,114,4],[114,5,114,9],[87,0,87,3]]}
[]
[]
[]
[]
[]
[]
[]
["إدارة بني مزار التعليمية",null,null,null,"جدول الأشراف اليومى  "]
["مدرسة بردونة الأشرف الإعدادية",null,null,null,"يوم الأحـــــــــــــــــد"]
[null,null,"يبدأ العمل بهذا الجدول من يوم 21/9/2019م"]
["الفصول","الفترات","الفترة الأولي",null,"الفترة الثانية",null,"الفترة الثالثة",null,"الفترة الرابعة"]
[null,"الحصص",1,2,3,4,5,6,7,8]
["(1-1)","المعلم",{"$f":"'الشيت الرئيسي'!C8","v":0},{"$f":"'الشيت الرئيسي'!D8","v":0},{"$f":"'الشيت الرئيسي'!E8","v":0},{"$f":"'الشيت الرئيسي'!F8","v":0},{"$f":"'الشيت الرئيسي'!G8","v":0},{"$f":"'الشيت الرئيسي'!H8","v":0},{"$f":"'الشيت الرئيسي'!$I$8","v":0},{"$f":"'الشيت الرئيسي'!J8","v":0}]
[null,"المادة",{"$f":"'الشيت الرئيسي'!C9","v":""},{"$f":"'الشيت الرئيسي'!D9","v":""},{"$f":"'الشيت الرئيسي'!E9","v":""},{"$f":"'الشيت الرئيسي'!F9","v":""},{"$f":"'الشيت الرئيسي'!G9","v":""},{"$f":"'الشيت الرئيسي'!H9","v":""},{"$f":"'الشيت الرئيسي'!I9","v":""},{"$f":"'الشيت الرئيسي'!J9","v":""}]
["(2-1)","المعلم",{"$f":"'الشيت الرئيسي'!C10","v":0},{"$f":"'الشيت الرئيسي'!D10","v":0},{"$f":"'الشيت الرئيسي'!E10","v":0},{"$f":"'الشيت الرئيسي'!F10","v":0},{"$f":"'الشيت الرئيسي'!G10","v":0},{"$f":"'الشيت الرئيسي'!H10","v":0},{"$f":"'الشيت الرئيسي'!I10","v":0},{"$f":"'الشيت الرئيسي'!J10","v":0}]
{"$rows_left_out":133}
{"sheet":"المعلمين","index":4,"n_rows":35,"n_cols":10,"rows_kept":35,"cut":false,"hidden":false,"merged":[[26,8,26,9],[6,8,6,9],[3,5,3,7],[13,7,13,9],[14,0,14,3],[14,7,14,9],[13,4,13,6],[13,0,13,2],[21,3,21,4],[21,5,21,7],[23,5,23,7],[26,0,27,0],[26,2,26,3],[26,4,26,5],[26,6,26,7],[1,3,1,4],[1,5,1,7],[6,0,7,0],[6,2,6,3],[6,4,6,5],[6,6,6,7],[33,0,33,2],[33,4,33,6],[33,7,33,9],[34,0,34,3],[34,7,34,9]]}
["    إدارة بني مزار التعليمية"]
["  مدرسة بردونة الأشرف الإعدادية",null,null,"جدول حصص",null,{"$f":"VLOOKUP($C$4,#REF!,2,0)","v":{"$error":"#REF!"}}]
[]
[null,"الكود",11,null,"المادة",{"$f":"VLOOKUP($C$4,#REF!,3,0)","v":{"$error":"#REF!"}}]
[]
[null,"عدد الحصص",{"$f":"VLOOKUP(C4,#REF!,44,0)","v":{"$error":"#REF!"}},null,null,null,"يبدأ العمل بهذا الجدول من يوم 21/9/2019م"]
["الأيام","الفترات","الفترة الأولي",null,"الفترة الثانية",null,"الفترة الثالثة",null,"الفترة الرابعة"]
[null,"الحصص",1,2,3,4,5,6,3,4]
["الأحد","الفصل",{"$f":"VLOOKUP($C$4,#REF!,4,0)","v":{"$error":"#REF!"}},{"$f":"VLOOKUP($C$4,#REF!,5,0)","v":{"$error":"#REF!"}},{"$f":"VLOOKUP($C$4,#REF!,6,0)","v":{"$error":"#REF!"}},{"$f":"VLOOKUP($C$4,#REF!,7,0)","v":{"$error":"#REF!"}},{"$f":"VLOOKUP($C$4,#REF!,8,0)","v":{"$error":"#REF!"}},{"$f":"VLOOKUP($C$4,#REF!,9,0)","v":{"$error":"#REF!"}},{"$f":"VLOOKUP($C$4,#REF!,10,0)","v":{"$error":"#REF!"}},{"$f":"VLOOKUP($C$4,#REF!,11,0)","v":{"$error":"#REF!"}}]
["الأثنين","الفصل",{"$f":"VLOOKUP($C$4,#REF!,12,0)","v":{"$error":"#REF!"}},{"$f":"VLOOKUP($C$4,#REF!,13,0)","v":{"$error":"#REF!"}},{"$f":"VLOOKUP($C$4,#REF!,14,0)","v":{"$error":"#REF!"}},{"$f":"VLOOKUP($C$4,#REF!,15,0)","v":{"$error":"#REF!"}},{"$f":"VLOOKUP($C$4,#REF!,16,0)","v":{"$error":"#REF!"}},{"$f":"VLOOKUP($C$4,#REF!,17,0)","v":{"$error":"#REF!"}},{"$f":"VLOOKUP($C$4,#REF!,18,0)","v":{"$error":"#REF!"}},{"$f":"VLOOKUP($C$4,#REF!,19,0)","v":{"$error":"#REF!"}}]
["الثلاثاء","الفصل",{"$f":"VLOOKUP($C$4,#REF!,20,0)","v":{"$error":"#REF!"}},{"$f":"VLOOKUP($C$4,#REF!,21,0)","v":{"$error":"#REF!"}},{"$f":"VLOOKUP($C$4,#REF!,22,0)","v":{"$error":"#REF!"}},{"$f":"VLOOKUP($C$4,#REF!,23,0)","v":{"$error":"#REF!"}},{"$f":"VLOOKUP($C$4,#REF!,24,0)","v":{"$error":"#REF!"}},{"$f":"VLOOKUP($C$4,#REF!,25,0)","v":{"$error":"#REF!"}},{"$f":"VLOOKUP($C$4,#REF!,26,0)","v":{"$error":"#REF!"}},{"$f":"VLOOKUP($C$4,#REF!,27,0)","v":{"$error":"#REF!"}}]
["الأربعاء","الفصل",{"$f":"VLOOKUP($C$4,#REF!,28,0)","v":{"$error":"#REF!"}},{"$f":"VLOOKUP($C$4,#REF!,29,0)","v":{"$error":"#REF!"}},{"$f":"VLOOKUP($C$4,#REF!,30,0)","v":{"$error":"#REF!"}},{"$f":"VLOOKUP($C$4,#REF!,31,0)","v":{"$error":"#REF!"}},{"$f":"VLOOKUP($C$4,#REF!,32,0)","v":{"$error":"#REF!"}},{"$f":"VLOOKUP($C$4,#REF!,33,0)","v":{"$error":"#REF!"}},{"$f":"VLOOKUP($C$4,#REF!,34,0)","v":{"$error":"#REF!"}},{"$f":"VLOOKUP($C$4,#REF!,35,0)","v":{"$error":"#REF!"}}]
["الخميس","الفصل",{"$f":"VLOOKUP($C$4,#REF!,36,0)","v":{"$error":"#REF!"}},{"$f":"VLOOKUP($C$4,#REF!,37,0)","v":{"$error":"#REF!"}},{"$f":"VLOOKUP($C$4,#REF!,38,0)","v":{"$error":"#REF!"}},{"$f":"VLOOKUP($C$4,#REF!,39,0)","v":{"$error":"#REF!"}},{"$f":"VLOOKUP($C$4,#REF!,40,0)","v":{"$error":"#REF!"}},{"$f":"VLOOKUP($C$4,#REF!,41,0)","v":{"$error":"#REF!"}},{"$f":"VLOOKUP($C$4,#REF!,42,0)","v":{"$error":"#REF!"}},{"$f":"VLOOKUP($C$4,#REF!,43,0)","v":{"$error":"#REF!"}}]
["لجنة الجدول",null,null,null,"التوقيع بالاستلام",null,null,"يعتمد مدير المدرسة"]
["أ/ محمود محمد على  -   أ/ محمد محمد عبد السلام",null,null,null,null,null,null,"أ/ هالة لطفي إبراهيم "]
{"$rows_left_out":21}
{"sheet":"الفصول","index":5,"n_rows":197,"n_cols":10,"rows_kept":197,"cut":false,"hidden":false,"merged":[[190,0,190,2],[190,7,190,8],[191,0,191,3],[191,7,191,8],[180,0,181,0],[182,0,183,0],[184,0,185,0],[186,0,187,0],[188,0,189,0],[178,0,179,0],[178,2,178,3],[178,4,178,5],[178,6,178,7],[178,8,178,9],[161,0,161,2],[161,7,161,8],[162,0,162,3],[162,7,162,8],[174,3,174,5],[174,6,174,7],[151,0,152,0],[153,0,154,0],[155,0,156,0],[157,0,158,0],[159,0,160,0],[149,0,150,0],[149,2,149,3],[149,4,149,5],[149,6,149,7],[149,8,149,9],[132,0,132,2],[132,7,132,8],[133,0,133,3],[133,7,133,8],[145,3,145,5],[145,6,145,7],[122,0,123,0],[124,0,125,0],[126,0,127,0],[128,0,129,0],[130,0,131,0],[120,0,121,0],[120,2,120,3],[120,4,120,5],[120,6,120,7],[120,8,120,9],[103,0,103,2],[103,7,103,8],[104,0,104,3],[104,7,104,8],[116,3,116,5],[116,6,116,7],[93,0,94,0],[95,0,96,0],[97,0,98,0],[99,0,100,0],[101,0,102,0],[91,0,92,0],[91,2,91,3],[91,4,91,5],[91,6,91,7],[91,8,91,9],[74,0,74,2],[74,7,74,8],[75,0,75,3],[75,7,75,8],[87,3,87,5],[87,6,87,7],[64,0,65,0],[66,0,67,0],[68,0,69,0],[70,0,71,0],[72,0,73,0],[62,0,63,0],[62,2,62,3],[62,4,62,5],[62,6,62,7],[62,8,62,9],[58,3,58,5],[58,6,58,7],[43,0,44,0],[45,0,45,2],[45,7,45,8],[46,0,46,3],[46,7,46,8],[33,8,33,9],[35,0,36,0],[37,0,38,0],[39,0,40,0],[41,0,42,0],[29,3,29,5],[29,6,29,7],[33,0,34,0],[33,2,33,3],[33,4,33,5],[33,6,33,7],[18,0,18,3],[1,3,1,5],[1,6,1,7],[15,0,16,0],[5,2,5,3],[5,4,5,5],[5,6,5,7],[17,0,17,2],[17,7,17,8],[5,0,6,0],[7,0,8,0],[9,0,10,0],[11,0,12,0],[13,0,14,0],[5,8,5,9],[18,7,18,8]]}
["إدارة بني مزار التعليمية"]
["مدرسة بردونة الأشرف الإعدادية",null,null,"جدول حصص فصل",null,null,"1/1"]
[]
[null,null,null,null,"يبدأ العمل بهذا الجدول من يوم 21/9/2019م"]
[]
["الأيام","الفترات","الفترة الأولي",null,"الفترة الثانية",null,"الفترة الثالثة",null,"الفترة الرابعة"]
[null,"الحصص",1,2,3,4,5,6,7,8]
["الأحد","المعلم",{"$f":"'الشيت الرئيسي'!C8","v":0},{"$f":"'الشيت الرئيسي'!D8","v":0},{"$f":"'الشيت الرئيسي'!E8","v":0},{"$f":"'الشيت الرئيسي'!F8","v":0},{"$f":"'الشيت الرئيسي'!G8","v":0},{"$f":"'الشيت الرئيسي'!H8","v":0},{"$f":"'الشيت الرئيسي'!I8","v":0},{"$f":"'الشيت الرئيسي'!J8","v":0}]
[null,"المادة",{"$f":"'الشيت الرئيسي'!C9","v":""},{"$f":"'الشيت الرئيسي'!D9","v":""},{"$f":"'الشيت الرئيسي'!E9","v":""},{"$f":"'الشيت الرئيسي'!F9","v":""},{"$f":"'الشيت الرئيسي'!G9","v":""},{"$f":"'الشيت الرئيسي'!H9","v":""},{"$f":"'الشيت الرئيسي'!I9","v":""},{"$f":"'الشيت الرئيسي'!J9","v":""}]
["الأثنين","المعلم",{"$f":"'الشيت الرئيسي'!C8","v":0},{"$f":"'الشيت الرئيسي'!D8","v":0},{"$f":"'الشيت الرئيسي'!E8","v":0},{"$f":"'الشيت الرئيسي'!F8","v":0},{"$f":"'الشيت الرئيسي'!G8","v":0},{"$f":"'الشيت الرئيسي'!H8","v":0},{"$f":"'الشيت الرئيسي'!I8","v":0},{"$f":"'الشيت الرئيسي'!J8","v":0}]
[null,"المادة",{"$f":"'الشيت الرئيسي'!C9","v":""},{"$f":"'الشيت الرئيسي'!D9","v":""},{"$f":"'الشيت الرئيسي'!E9","v":""},{"$f":"'الشيت الرئيسي'!F9","v":""},{"$f":"'الشيت الرئيسي'!G9","v":""},{"$f":"'الشيت الرئيسي'!H9","v":""},{"$f":"'الشيت الرئيسي'!I9","v":""},{"$f":"'الشيت الرئيسي'!J9","v":""}]
["الثلاثاء","المعلم",{"$f":"'الشيت الرئيسي'!S8","v":0},{"$f":"'الشيت الرئيسي'!T8","v":0},{"$f":"'الشيت الرئيسي'!U8","v":0},{"$f":"'الشيت الرئيسي'!V8","v":0},{"$f":"'الشيت الرئيسي'!W8","v":0},{"$f":"'الشيت الرئيسي'!X8","v":0},{"$f":"'الشيت الرئيسي'!Y8","v":0},{"$f":"'الشيت الرئيسي'!Z8","v":0}]
[null,"المادة",{"$f":"'الشيت الرئيسي'!S9","v":""},{"$f":"'الشيت الرئيسي'!T9","v":""},{"$f":"'الشيت الرئيسي'!U9","v":""},{"$f":"'الشيت الرئيسي'!V9","v":""},{"$f":"'الشيت الرئيسي'!W9","v":""},{"$f":"'الشيت الرئيسي'!X9","v":""},{"$f":"'الشيت الرئيسي'!Y9","v":""},{"$f":"'الشيت الرئيسي'!Z9","v":""}]
["الأربعاء","المعلم",{"$f":"'الشيت الرئيسي'!AA8","v":0},{"$f":"'الشيت الرئيسي'!AB8","v":0},{"$f":"'الشيت الرئيسي'!AC8","v":0},{"$f":"'الشيت الرئيسي'!AD8","v":0},{"$f":"'الشيت الرئيسي'!AE8","v":0},{"$f":"'الشيت الرئيسي'!AF8","v":0},{"$f":"'الشيت الرئيسي'!AG8","v":0},{"$f":"'الشيت الرئيسي'!AH8","v":0}]
[null,"المادة",{"$f":"'الشيت الرئيسي'!AA9","v":""},{"$f":"'الشيت الرئيسي'!AB9","v":""},{"$f":"'الشيت الرئيسي'!AC9","v":""},{"$f":"'الشيت الرئيسي'!AD9","v":""},{"$f":"'الشيت الرئيسي'!AE9","v":""},{"$f":"'الشيت الرئيسي'!AF9","v":""},{"$f":"'الشيت الرئيسي'!AG9","v":""},{"$f":"'الشيت الرئيسي'!AH9","v":""}]
{"$rows_left_out":182}