{"text_format":"1","workbook":"xlsx","n_sheets":15,"sheets":["ورقة1","ورقة4","ايصال طلبة","ورقة6","المصروفات","ورقة8","شهر 10","شهر 11","شهر 12","شهر 1-2017","شهر 2-2017","تجميع الشهور","ورقة11","ورقة12","الرئيسية"],"not_rendered":{"charts":0,"images":0,"macros":1,"external_links":0,"defined_names":21,"comments":0,"pivot_tables":0},"unopened":[],"bounds":{"document_bytes":16777216,"sheet_cells":100000,"rows_first":2000,"rows_last":500,"rows_between":2000,"halvings":0,"cell_chars":16384,"cell_head_chars":4096},"cells_cut":0,"cells_raw":0,"read":"whole","date_system":"1900"}

{"sheet":"ورقة1","index":0,"n_rows":164,"n_cols":50,"rows_kept":164,"cut":false,"hidden":false,"merged":[]}
[null,null,null,null,null,null,"اجمالي مدفوع",null,"المستهدف"]
[null,null,null,null,null,null,{"$f":"SUM(AQ5:AQ1000)","v":1650},null,{"$f":"SUM(I5:I1000)","v":43019}]
[null,null,null,"2016-01-03"]
["اسم الطالب","رقم القيد","الصف ","تاريخ التسجيل","المدة بلايام",null,"قيمة القسط السنوي","قيمة القسط المرحل","الاجمالي","المدفوع","تاريخ الدفع","الباقي","المدفوع","تاريخ الدفع","الباقي","المدفوع","تاريخ الدفع","الباقي","المدفوع","تاريخ الدفع","الباقي","المدفوع","تاريخ الدفع","الباقي","المدفوع","تاريخ الدفع","الباقي","المدفوع","تاريخ الدفع","الباقي","المدفوع","تاريخ الدفع","الباقي","المدفوع","تاريخ الدفع","الباقي","المدفوع","تاريخ الدفع","الباقي","المدفوع","تاريخ الدفع","الباقي","اجمالي مدفوع","اخر دفعة",null,"القيمة الباقية","باقي الدين","توضيح","النقل","رقم الدفعة"]
["ابتسام",null,"الاول","2016-09-26",{"$f":"DATEDIF($D$3,$D5,\"d\")","v":267},null,700,300,{"$f":"IF(A5<>\"\",IF(AW5<>\"\",AQ5,H5+G5),0)","v":1000},500,"2016-10-19",{"$f":"IF(J5<>\"\",I5-J5,0)","v":500},null,null,{"$f":"IF(M5<>\"\",L5-M5,0)","v":0},null,null,{"$f":"IF(P5<>\"\",O5-P5,0)","v":0},null,null,{"$f":"IF(S5<>\"\",R5-S5,0)","v":0},null,null,{"$f":"IF(V5<>\"\",U5-V5,0)","v":0},null,null,{"$f":"IF(Y5<>\"\",X5-Y5,0)","v":0},null,null,{"$f":"IF(AB5<>\"\",AA5-AB5,0)","v":0},null,null,{"$f":"IF(AE5<>\"\",AD5-AE5,0)","v":0},null,null,{"$f":"IF(AH5<>\"\",AG5-AH5,0)","v":0},null,null,{"$f":"IF(AK5<>\"\",AJ5-AK5,0)","v":0},null,null,{"$f":"IF(AN5<>\"\",AM5-AN5,0)","v":0},{"$f":"SUM(AN5+AK5+AH5+AE5+AB5+Y5+V5+S5+P5+M5+J5)","v":500},{"$f":"IF(AN5<>\"\",AN5,IF(AK5<>\"\",AK5,IF(AH5<>\"\",AH5,IF(AE5<>\"\",AE5,IF(AB5<>\"\",AB5,IF(Y5<>\"\",Y5,IF(V5<>\"\",V5,IF(S5<>\"\",S5,IF(P5<>\"\",P5,IF(M5<>\"\",M5,IF(J5<>\"\",J5,0)))))))))))","v":500},null,{"$f":"IF(AQ5=I5,0,IF(AP5>1,AP5,IF(AM5>1,AM5,IF(AJ5>1,AJ5,IF(AG5>1,AG5,IF(AD5>1,AD5,IF(AA5>1,AA5,IF(X5>1,X5,IF(U5>1,U5,IF(R5>1,R5,IF(O5>1,O5,IF(L5>1,L5,I5))))))))))))","v":500},{"$f":"IF(H5>AQ5,H5-AQ5,\"لا يوجد\")","v":"لا يوجد"},{"$f":"IF(AQ5=I5,\"تم دفع كامل القيمة\",\"القيمة غير مكتملة\")","v":"القيمة غير مكتملة"},null,{"$f":"COUNTIF(J5:AP5,\">1\")/3","v":1}]
["اروى",null,"التاسع","2016-10-16",287,null,700,300,1000,null,null,0,null,null,0,null,null,0,null,null,0,null,null,0,null,null,0,null,null,0,null,null,0,null,null,0,null,null,0,null,null,0,0,0,null,1000,300,"القيمة غير مكتملة",null,0]
["اسعد",null,"التاسع","2016-10-16",287,null,700,300,1000,null,null,0,null,null,0,null,null,0,null,null,0,null,null,0,null,null,0,null,null,0,null,null,0,null,null,0,null,null,0,null,null,0,0,0,null,1000,300,"القيمة غير مكتملة",null,0]
["اسلام",null,"الاول","2016-09-26",267,null,700,300,1000,null,null,0,null,null,0,null,null,0,null,null,0,null,null,0,null,null,0,null,null,0,null,null,0,null,null,0,null,null,0,null,null,0,0,0,null,1000,300,"القيمة غير مكتملة",null,0]
["الاء",null,"التاسع","2016-10-16",287,null,700,300,1000,null,null,0,null,null,0,null,null,0,null,null,0,null,null,0,null,null,0,null,null,0,null,null,0,null,null,0,null,null,0,null,null,0,0,0,null,1000,300,"القيمة غير مكتملة",null,0]
["الخامسة",null,"الخامس","2016-09-26",267,null,700,300,1000,null,null,0,null,null,0,null,null,0,null,null,0,null,null,0,null,null,0,null,null,0,null,null,0,null,null,0,null,null,0,null,null,0,0,0,null,1000,300,"القيمة غير مكتملة",null,0]
["اياد",null,"الاول","2016-09-26",267,null,700,300,1000,null,null,0,null,null,0,null,null,0,null,null,0,null,null,0,null,null,0,null,null,0,null,null,0,null,null,0,null,null,0,null,null,0,0,0,null,1000,300,"القيمة غير مكتملة",null,0]
["ايمان",null,"الاول","2016-10-17",288,null,700,300,830,330,"2016-10-17",500,500,"2016-10-17",0,null,null,0,null,null,0,null,null,0,null,null,0,null,null,0,null,null,0,null,null,0,null,null,0,null,null,0,830,500,null,0,"لا يوجد","تم دفع كامل القيمة","انتقل",1.6666666666666667]
["ايمن",null,"الاول","2016-10-17",288,null,700,300,1000,null,null,0,null,null,0,null,null,0,null,null,0,null,null,0,null,null,0,null,null,0,null,null,0,null,null,0,null,null,0,null,null,0,0,0,null,1000,300,"القيمة غير مكتملة",null,0]
["بلال",null,"الاول","2016-09-26",267,null,700,300,1000,null,null,0,null,null,0,null,null,0,null,null,0,null,null,0,null,null,0,null,null,0,null,null,0,null,null,0,null,null,0,null,null,0,0,0,null,1000,300,"القيمة غير مكتملة",null,0]
["ثامر",null,"الثاني","2016-09-26",267,null,700,300,1000,null,null,0,null,null,0,null,null,0,null,null,0,null,null,0,null,null,0,null,null,0,null,null,0,null,null,0,null,null,0,null,null,0,0,0,null,1000,300,"القيمة غير مكتملة",null,0]
["ثريا",null,"الثاني","2016-09-26",267,null,700,300,1000,null,null,0,null,null,0,null,null,0,null,null,0,null,null,0,null,null,0,null,null,0,null,null,0,null,null,0,null,null,0,null,null,0,0,0,null,1000,300,"القيمة غير مكتملة",null,0]
["جابر",null,"الثالث","2016-09-26",267,null,700,300,1000,null,null,0,null,null,0,null,null,0,null,null,0,null,null,0,null,null,0,null,null,0,null,null,0,null,null,0,null,null,0,null,null,0,0,0,null,1000,300,"القيمة غير مكتملة",null,0]
["جلال",null,"الثالث","2016-09-26",267,null,700,300,1000,null,null,0,null,null,0,null,null,0,null,null,0,null,null,0,null,null,0,null,null,0,null,null,0,null,null,0,null,null,0,null,null,0,0,0,null,1000,300,"القيمة غير مكتملة",null,0]
["جلال",null,"الثامن","2016-10-16",287,null,700,300,1000,null,null,0,null,null,0,null,null,0,null,null,0,null,null,0,null,null,0,null,null,0,null,null,0,null,null,0,null,null,0,null,null,0,0,0,null,1000,300,"القيمة غير مكتملة",null,0]
["جمال ",null,"الثالث","2016-09-26",267,null,700,300,1000,null,null,0,null,null,0,null,null,0,null,null,0,null,null,0,null,null,0,null,null,0,null,null,0,null,null,0,null,null,0,null,null,0,0,0,null,1000,300,"القيمة غير مكتملة",null,0]
["جميلة",null,"الثالث","2016-09-26",267,null,700,300,1000,null,null,0,null,null,0,null,null,0,null,null,0,null,null,0,null,null,0,null,null,0,null,null,0,null,null,0,null,null,0,null,null,0,0,0,null,1000,300,"القيمة غير مكتملة",null,0]
["جهاد",null,"الثامن","2016-10-16",287,null,700,300,1000,null,null,0,null,null,0,null,null,0,null,null,0,null,null,0,null,null,0,null,null,0,null,null,0,null,null,0,null,null,0,null,null,0,0,0,null,1000,300,"القيمة غير مكتملة",null,0]
["جهينة",null,"الثامن","2016-10-16",287,null,700,300,1000,null,null,0,null,null,0,null,null,0,null,null,0,null,null,0,null,null,0,null,null,0,null,null,0,null,null,0,null,null,0,null,null,0,0,0,null,1000,300,"القيمة غير مكتملة",null,0]
["خالد",null,"الخامس","2016-09-26",267,null,700,300,1000,null,null,0,null,null,0,null,null,0,null,null,0,null,null,0,null,null,0,null,null,0,null,null,0,null,null,0,null,null,0,null,null,0,0,0,null,1000,300,"القيمة غير مكتملة",null,0]
["خليفة",null,"الخامس","2016-09-26",267,null,700,300,1000,null,null,0,null,null,0,null,null,0,null,null,0,null,null,0,null,null,0,null,null,0,null,null,0,null,null,0,null,null,0,null,null,0,0,0,null,1000,300,"القيمة غير مكتملة",null,0]
["خميس",null,"الخامس","2016-09-26",267,null,700,300,1000,null,null,0,null,null,0,null,null,0,null,null,0,null,null,0,null,null,0,null,null,0,null,null,0,null,null,0,null,null,0,null,null,0,0,0,null,1000,300,"القيمة غير مكتملة",null,0]
["خيري",null,"الخامس","2016-09-26",267,null,700,300,1000,null,null,0,null,null,0,null,null,0,null,null,0,null,null,0,null,null,0,null,null,0,null,null,0,null,null,0,null,null,0,null,null,0,0,0,null,1000,300,"القيمة غير مكتملة",null,0]
["رائد",null,"الرابع","2016-09-26",267,null,700,300,1000,null,null,0,null,null,0,null,null,0,null,null,0,null,null,0,null,null,0,null,null,0,null,null,0,null,null,0,null,null,0,null,null,0,0,0,null,1000,300,"القيمة غير مكتملة",null,0]
["ربيع",null,"الرابع","2016-09-26",267,null,700,300,1000,null,null,0,null,null,0,null,null,0,null,null,0,null,null,0,null,null,0,null,null,0,null,null,0,null,null,0,null,null,0,null,null,0,0,0,null,1000,300,"القيمة غير مكتملة",null,0]
["ربيعة",null,"الرابع","2016-09-26",267,null,700,300,1000,null,null,0,null,null,0,null,null,0,null,null,0,null,null,0,null,null,0,null,null,0,null,null,0,null,null,0,null,null,0,null,null,0,0,0,null,1000,300,"القيمة غير مكتملة",null,0]
["رواد",null,"الرابع","2016-09-26",267,null,700,300,1000,null,null,0,null,null,0,null,null,0,null,null,0,null,null,0,null,null,0,null,null,0,null,null,0,null,null,0,null,null,0,null,null,0,0,0,null,1000,300,"القيمة غير مكتملة",null,0]
["سالم",null,"السادس","2016-09-26",267,null,700,300,1000,null,null,0,null,null,0,null,null,0,null,null,0,null,null,0,null,null,0,null,null,0,null,null,0,null,null,0,null,null,0,null,null,0,0,0,null,1000,300,"القيمة غير مكتملة",null,0]
["سالمة",null,"السادس","2016-09-26",267,{"$f":"(E33/7)*25","v":953.57142857142867},700,300,1000,null,null,0,null,null,0,null,null,0,null,null,0,null,null,0,null,null,0,null,null,0,null,null,0,null,null,0,null,null,0,null,null,0,0,0,null,1000,300,"القيمة غير مكتملة",null,0]
["سناء",null,"التمهيدي","2016-10-16",287,null,700,300,1000,null,null,0,null,null,0,null,null,0,null,null,0,null,null,0,null,null,0,null,null,0,null,null,0,null,null,0,null,null,0,null,null,0,0,0,null,1000,300,"القيمة غير مكتملة",null,0]
["سناء",null,"السادس","2016-09-26",267,{"$f":"(E35/7)*25","v":953.57142857142867},700,300,1000,null,null,0,null,null,0,null,null,0,null,null,0,null,null,0,null,null,0,null,null,0,null,null,0,null,null,0,null,null,0,null,null,0,0,0,null,1000,300,"القيمة غير مكتملة",null,0]
["سند",null,"التمهيدي","2016-10-16",287,null,700,300,1000,null,null,0,null,null,0,null,null,0,null,null,0,null,null,0,null,null,0,null,null,0,null,null,0,null,null,0,null,null,0,null,null,0,0,0,null,1000,300,"القيمة غير مكتملة",null,0]
["سند",null,"السادس","2016-09-26",267,{"$f":"(E37/7)*25","v":953.57142857142867},700,300,1000,null,null,0,null,null,0,null,null,0,null,null,0,null,null,0,null,null,0,null,null,0,null,null,0,null,null,0,null,null,0,null,null,0,0,0,null,1000,300,"القيمة غير مكتملة",null,0]
["سوسن",null,"التمهيدي","2016-10-16",287,null,700,300,1000,null,null,0,null,null,0,null,null,0,null,null,0,null,null,0,null,null,0,null,null,0,null,null,0,null,null,0,null,null,0,null,null,0,0,0,null,1000,300,"القيمة غير مكتملة",null,0]
["عامر",null,"السابع","2016-10-16",287,{"$f":"(E39/7)*25","v":1025},700,300,1000,null,null,0,null,null,0,null,null,0,null,null,0,null,null,0,null,null,0,null,null,0,null,null,0,null,null,0,null,null,0,null,null,0,0,0,null,1000,300,"القيمة غير مكتملة",null,0]
["عمر",null,"الثاني","2016-09-26",267,null,700,300,1000,null,null,0,null,null,0,null,null,0,null,null,0,null,null,0,null,null,0,null,null,0,null,null,0,null,null,0,null,null,0,null,null,0,0,0,null,1000,300,"القيمة غير مكتملة",null,0]
{"$rows_left_out":125}
{"sheet":"ورقة4","index":1,"n_rows":20,"n_cols":5,"rows_kept":20,"cut":false,"hidden":false,"merged":[[2,1,3,7]]}
[]
[]
[null,"توضيح للحركة المالية لايرادات الطلبة"]
[]
[]
[]
[]
[]
[null,"الصف","الاجمالي المستهدف","الاجمالي المدفوع","القيمة الباقية"]
[null,"الاول",{"$f":"INDEX(ورقة1!$I$154,COUNTA(B$10))","v":0},{"$f":"ورقة1!AQ155","v":0},{"$f":"ورقة1!AT155","v":0}]
[null,"الثاني",null,{"$f":"ورقة1!AQ156","v":320},{"$f":"ورقة1!AT156","v":0}]
[null,"الثالث",null,{"$f":"ورقة1!AQ157","v":0},{"$f":"ورقة1!AT157","v":0}]
[null,"الرابع",null,{"$f":"ورقة1!AQ158","v":0},{"$f":"ورقة1!AT158","v":0}]
[null,"الخامس",null,{"$f":"ورقة1!AQ159","v":0},{"$f":"ورقة1!AT159","v":0}]
[null,"السادس",null,{"$f":"ورقة1!AQ160","v":0},{"$f":"ورقة1!AT160","v":0}]
[null,"السابع",null,{"$f":"ورقة1!AQ161","v":0},{"$f":"ورقة1!AT161","v":0}]
[null,"الثامن",null,{"$f":"ورقة1!AQ162","v":0},{"$f":"ورقة1!AT162","v":0}]
[null,"التاسع",null,{"$f":"ورقة1!AQ163","v":0},{"$f":"ورقة1!AT163","v":0}]
[null,null,"المستهدف","المستلم","الباقي"]
[null,null,{"$f":"SUM(C10:C18)","v":0},{"$f":"SUM(D10:D18)","v":320},{"$f":"SUM(E10:E18)","v":0}]

{"sheet":"ايصال طلبة","index":2,"n_rows":67,"n_cols":9,"rows_kept":67,"cut":false,"hidden":false,"merged":[[19,0,19,8],[38,5,38,6],[37,5,37,6],[22,2,22,4],[25,0,25,1],[27,0,27,1],[27,2,27,3],[27,4,27,5],[29,6,29,7],[33,2,33,3],[35,2,35,4],[27,6,27,7],[28,6,28,7],[17,5,17,6],[1,2,1,4],[4,0,4,1],[6,0,6,1],[6,2,6,3],[7,6,7,7],[8,6,8,7],[12,2,12,3],[14,2,14,4],[6,4,6,5],[6,6,6,7],[16,5,16,6]]}
[]
[null,null,"مدرسة النهج السليم",null,null,null,null,null,"OFFSET(ورقة1!A5;MATCH(ورقة5!G7;ورقة1!C5:C400;0)-1;;COUNTIF(ورقة1!C5:C400;ورقة5!G7))"]
[]
[]
["ايصال مالي",null,null,null,null,"دفعة رقم",{"$f":"VLOOKUP($C$7,ورقة1!$A1:$AX146,50,FALSE)","v":0}]
[]
["اسم الطالب              /",null,"سوسن",null,"الصف               /",null,"التمهيدي"]
["دين سابق","القيمة السنوية","اجمالي القيمة","القيمة المدفوعة","الدفعة الحالية","القيمة الباقية","التاريخ"]
[{"$f":"VLOOKUP($C$7,ورقة1!$A5:$AX150,8,FALSE)","v":300},{"$f":"VLOOKUP($C$7,ورقة1!$A5:$AX150,7,FALSE)","v":700},{"$f":"VLOOKUP($C$7,ورقة1!$A5:$AX150,9,FALSE)","v":1000},{"$f":"VLOOKUP($C$7,ورقة1!$A5:$AX150,43,FALSE)","v":0},{"$f":"VLOOKUP($C$7,ورقة1!$A5:$AX150,44,FALSE)","v":0},{"$f":"VLOOKUP($C$7,ورقة1!$A5:$AX150,46,FALSE)","v":1000},{"$f":"TODAY()","v":"2016-10-21"}]
[]
[]
[]
[null,null,"دين سابق",null,{"$f":"VLOOKUP($C$7,ورقة1!$A5:$AX150,47,FALSE)","v":300}]
[]
[null,null,{"$f":"VLOOKUP($C$7,ورقة1!$A5:$AX150,48,FALSE)","v":"القيمة غير مكتملة"}]
[]
[null,null,null,null,null,"الشئون المالية"]
[null,null,null,null,null,"..........................."]
[]
["……………………………………………………………………………………………………………"]
[]
[]
[null,null,{"$f":"C2","v":"مدرسة النهج السليم"}]
[]
[]
["ايصال مالي",null,null,null,null,"دفعة رقم",{"$f":"G5","v":0}]
[]
[{"$f":"A7","v":"اسم الطالب              /"},null,{"$f":"C7","v":"سوسن"},null,"الصف                   /",null,{"$f":"G7","v":"التمهيدي"}]
["دين سابق","القيمة السنوية","اجمالي القيمة","القيمة المدفوعة","الدفعة الحالية","القيمة الباقية","التاريخ"]
[{"$f":"A9","v":300},700,1000,0,0,1000,"2016-10-21"]
[]
[]
[]
[null,null,"دين سابق",null,{"$f":"E13","v":300}]
[]
[null,null,{"$f":"C15","v":"القيمة غير مكتملة"}]
[]
[null,null,null,null,null,"الشئون المالية"]
[null,null,null,null,null,"..........................."]
[]
{"$rows_left_out":28}
{"sheet":"ورقة6","index":3,"n_rows":8,"n_cols":10,"rows_kept":8,"cut":false,"hidden":false,"merged":[]}
[]
[]
[]
[]
[null,"الاول","الثاني","الثالث","الرابع","الخامس","السادس","السابع","الثامن","التاسع"]
["المستهدف",{"$f":"ورقة1!F156","v":0},{"$f":"ورقة1!F157","v":0},{"$f":"ورقة1!F158","v":0},{"$f":"ورقة1!F159","v":0},{"$f":"ورقة1!F160","v":0},{"$f":"ورقة1!F161","v":0}]
["الموجود"]
["الباقي"]

{"sheet":"المصروفات","index":4,"n_rows":10,"n_cols":12,"rows_kept":10,"cut":false,"hidden":false,"merged":[]}
[]
[]
[]
[]
[]
["ت","نوع الصرف","رقم الفاتورة","نوع المواد","تاريخ الفيتورة","قيمة الفيتورة","اسم الموظف",null,null,"مجموع قيمة الفواتير","اصول ثابتة","مستهلكة"]
[1,"اثاث مدرسي",20,"ثابتة","2016-10-17",120,"علي",null,null,{"$f":"SUM(F7:F300)","v":3295},{"$f":"SUMIF(D7:D300,\"ثابتة\",F7:F300)","v":120},{"$f":"SUMIF(D7:D300,\"مستهلكة\",F7:F300)","v":3175}]
[2,"قرطاسية",21,"مستهلكة","2016-10-17",115,"احمد"]
[3,"ايجار سيارة",22,"مستهلكة","2016-10-17",60,"عمر"]
[4,"ايجار مبنى",24,"مستهلكة","2016-10-18",3000,"احمد"]

{"sheet":"ورقة8","index":5,"n_rows":18,"n_cols":7,"rows_kept":18,"cut":false,"hidden":false,"merged":[[9,2,10,6],[14,2,15,6],[17,3,17,5],[2,2,3,6],[4,4,5,4]]}
[]
[]
[null,null,"المدخول  ...   المصروف  ...  الموجود  "]
[]
[null,null,null,null,{"$f":"TODAY()","v":"2016-10-21"}]
[]
[null,null,"القيمة النقدية","ايرادات طلبة","الاجمالي الكلي","ديون طلبة","الاجمالي بالديون"]
[null,null,5000,{"$f":"ورقة1!G2","v":1650},{"$f":"SUM(C8:D8)","v":6650},{"$f":"ورقة1!I2-ورقة1!G2","v":41369},{"$f":"ورقة1!I2","v":43019}]
[]
[null,null,"المصروفات"]
[]
[null,null,"اجمالي فواتير","اجمالي رواتب","اجمالي كلي"]
[null,null,{"$f":"المصروفات!J7","v":3295},{"$f":"'تجميع الشهور'!E22","v":550},{"$f":"SUM(C13:D13)","v":3845}]
[]
[null,null,"الصافي الموجود"]
[]
[]
[null,null,null,{"$f":"SUM(E8-E13)","v":2805}]

{"sheet":"شهر 10","index":6,"n_rows":8,"n_cols":24,"rows_kept":8,"cut":false,"hidden":false,"merged":[[1,7,1,14]]}
[]
[null,null,null,null,null,null,null,"المالية .... رواتب شهر 10",null,null,null,null,null,null,null,null,null,{"$f":"TODAY()","v":"2016-10-21"}]
[]
["ت","اسم المعلم","التخصص","الوظيفة","الراتب","عدد الفصول","عدد الحصص","قيمة الحصة","الاجمالي الاسبوعي","الاجمالي الشهري","الغياب","منحة اضافية","قيمة مرحلة","الصافي","دفعة اولى","دفعة ثانية","دفعة ثالثة","دفعة رابعة","اجمالي مدفوع","الباقي",null,"اجمالي مستحق ش 10","اجمالي مدفوع شهر 10","اجمالي باقي ش10"]
[1,null,null,"معلم",null,"6+5+7",10,8,{"$f":"SUM(H5*G5)","v":80},{"$f":"SUM(I5*4+E5)","v":320},2,20,null,{"$f":"SUM(J5-(K5*H5)+M5+L5)","v":324},150,null,null,null,{"$f":"SUM(O5+P5+Q5+R5)","v":150},{"$f":"SUM(N5-S5)","v":174},null,{"$f":"SUM(N5:N100)","v":1274},{"$f":"SUM(S5:S100)","v":350},{"$f":"SUM(T5:T100)","v":924}]
[2,null,null,"موظف",null,null,5,50,{"$f":"SUM(H6*G6)","v":250},{"$f":"SUM(I6*4)","v":1000},1,null,null,{"$f":"SUM(J6-(K6*H6))","v":950},200,null,null,null,{"$f":"SUM(O6+P6+Q6+R6)","v":200},{"$f":"SUM(N6-S6)","v":750}]
[3]
[4]

{"sheet":"شهر 11","index":7,"n_rows":8,"n_cols":24,"rows_kept":8,"cut":false,"hidden":false,"merged":[[1,7,1,14]]}
[]
[null,null,null,null,null,null,null,"المالية .... رواتب شهر 11",null,null,null,null,null,null,null,null,null,{"$f":"TODAY()","v":"2016-10-21"}]
[]
["ت","اسم المعلم","التخصص","الوظيفة","الراتب","عدد الفصول","عدد الحصص","قيمة الحصة","الاجمالي الاسبوعي","الاجمالي الشهري","الغياب","منحة اضافية","قيمة مرحلة","الصافي","دفعة اولى","دفعة ثانية","دفعة ثالثة","دفعة رابعة","اجمالي مدفوع","الباقي",null,"اجمالي مستحق ش 11","اجمالي مدفوع شهر 11","اجمالي باقي ش11"]
[1,null,null,"معلم",500,"6+5+7",10,8,{"$f":"SUM(H5*G5)","v":80},{"$f":"SUM(I5*4+E5)","v":820},null,null,{"$f":"'شهر 10'!T5","v":174},{"$f":"SUM(J5-(K5*H5)+M5+L5)","v":994},null,null,null,null,{"$f":"SUM(O5+P5+Q5+R5)","v":0},{"$f":"SUM(N5-S5)","v":994},null,{"$f":"SUM(N5:N100)","v":1944},{"$f":"SUM(S5:S100)","v":200},{"$f":"SUM(T5:T100)","v":1744}]
[2,null,null,"موظف",null,null,5,50,{"$f":"SUM(H6*G6)","v":250},{"$f":"SUM(I6*4)","v":1000},1,null,null,{"$f":"SUM(J6-(K6*H6))","v":950},200,null,null,null,{"$f":"SUM(O6+P6+Q6+R6)","v":200},{"$f":"SUM(N6-S6)","v":750}]
[3]
[4]

{"sheet":"شهر 12","index":8,"n_rows":8,"n_cols":24,"rows_kept":8,"cut":false,"hidden":false,"merged":[[1,7,1,14]]}
[]
[null,null,null,null,null,null,null,"المالية .... رواتب شهر 12",null,null,null,null,null,null,null,null,null,{"$f":"TODAY()","v":"2016-10-21"}]
[]
["ت","اسم المعلم","التخصص","الوظيفة","الراتب","عدد الفصول","عدد الحصص","قيمة الحصة","الاجمالي الاسبوعي","الاجمالي الشهري","الغياب","منحة اضافية","قيمة مرحلة","الصافي","دفعة اولى","دفعة ثانية","دفعة ثالثة","دفعة رابعة","اجمالي مدفوع","الباقي",null,"اجمالي مستحق ش 11","اجمالي مدفوع شهر 11","اجمالي باقي ش11"]
[1,null,null,"معلم",300,"6+5+7",10,8,{"$f":"SUM(H5*G5)","v":80},{"$f":"SUM(I5*4+E5)","v":620},null,50,{"$f":"'شهر 11'!T5","v":994},{"$f":"SUM(J5-(K5*H5)+M5+L5)","v":1664},10,1,7,50,{"$f":"SUM(O5+P5+Q5+R5)","v":68},{"$f":"SUM(N5-S5)","v":1596},null,{"$f":"SUM(N5:N100)","v":2614},{"$f":"SUM(S5:S100)","v":268},{"$f":"SUM(T5:T100)","v":2346}]
[2,null,null,"موظف",null,null,5,50,{"$f":"SUM(H6*G6)","v":250},{"$f":"SUM(I6*4)","v":1000},1,null,null,{"$f":"SUM(J6-(K6*H6))","v":950},200,null,null,null,{"$f":"SUM(O6+P6+Q6+R6)","v":200},{"$f":"SUM(N6-S6)","v":750}]
[3]
[4]

{"sheet":"شهر 1-2017","index":9,"n_rows":8,"n_cols":24,"rows_kept":8,"cut":false,"hidden":false,"merged":[[1,7,1,14]]}
[]
[null,null,null,null,null,null,null,"المالية .... رواتب شهر 1/2017",null,null,null,null,null,null,null,null,null,{"$f":"TODAY()","v":"2016-10-21"}]
[]
["ت","اسم المعلم","التخصص","الوظيفة","الراتب","عدد الفصول","عدد الحصص","قيمة الحصة","الاجمالي الاسبوعي","الاجمالي الشهري","الغياب","منحة اضافية","قيمة مرحلة","الصافي","دفعة اولى","دفعة ثانية","دفعة ثالثة","دفعة رابعة","اجمالي مدفوع","الباقي",null,"اجمالي مستحق ش 11","اجمالي مدفوع شهر 11","اجمالي باقي ش11"]
[1,null,null,"معلم",300,"6+5+7",10,8,{"$f":"SUM(H5*G5)","v":80},{"$f":"SUM(I5*4+E5)","v":620},null,null,{"$f":"'شهر 12'!T5","v":1596},{"$f":"SUM(J5-(K5*H5)+M5+L5)","v":2216},10,1,7,50,{"$f":"SUM(O5+P5+Q5+R5)","v":68},{"$f":"SUM(N5-S5)","v":2148},null,{"$f":"SUM(N5:N100)","v":3166},{"$f":"SUM(S5:S100)","v":268},{"$f":"SUM(T5:T100)","v":2898}]
[2,null,null,"موظف",null,null,5,50,{"$f":"SUM(H6*G6)","v":250},{"$f":"SUM(I6*4)","v":1000},1,null,null,{"$f":"SUM(J6-(K6*H6))","v":950},200,null,null,null,{"$f":"SUM(O6+P6+Q6+R6)","v":200},{"$f":"SUM(N6-S6)","v":750}]
[3]
[4]

{"sheet":"شهر 2-2017","index":10,"n_rows":8,"n_cols":24,"rows_kept":8,"cut":false,"hidden":false,"merged":[[1,7,1,14]]}
[]
[null,null,null,null,null,null,null,"المالية .... رواتب شهر 2/2017",null,null,null,null,null,null,null,null,null,{"$f":"TODAY()","v":"2016-10-21"}]
[]
["ت","اسم المعلم","التخصص","الوظيفة","الراتب","عدد الفصول","عدد الحصص","قيمة الحصة","الاجمالي الاسبوعي","الاجمالي الشهري","الغياب","منحة اضافية","قيمة مرحلة","الصافي","دفعة اولى","دفعة ثانية","دفعة ثالثة","دفعة رابعة","اجمالي مدفوع","الباقي",null,"اجمالي مستحق ش 11","اجمالي مدفوع شهر 11","اجمالي باقي ش11"]
[1,null,null,"معلم",300,"6+5+7",10,8,{"$f":"SUM(H5*G5)","v":80},{"$f":"SUM(I5*4+E5)","v":620},null,null,{"$f":"'شهر 1-2017'!T5","v":2148},{"$f":"SUM(J5-(K5*H5)+M5+L5)","v":2768},10,1,7,50,{"$f":"SUM(O5+P5+Q5+R5)","v":68},{"$f":"SUM(N5-S5)","v":2700},null,{"$f":"SUM(N5:N100)","v":3718},{"$f":"SUM(S5:S100)","v":268},{"$f":"SUM(T5:T100)","v":3450}]
[2,null,null,"موظف",null,null,5,50,{"$f":"SUM(H6*G6)","v":250},{"$f":"SUM(I6*4)","v":1000},1,null,null,{"$f":"SUM(J6-(K6*H6))","v":950},200,null,null,null,{"$f":"SUM(O6+P6+Q6+R6)","v":200},{"$f":"SUM(N6-S6)","v":750}]
[3]
[4]

{"sheet":"تجميع الشهور","index":11,"n_rows":22,"n_cols":6,"rows_kept":22,"cut":false,"hidden":false,"merged":[]}
[]
[]
[]
[]
[null,null,"الشهر","اجمالي مستحق ","اجمالي  مدفوع","اجمالي باقي"]
[null,null,"شهر 10",{"$f":"'شهر 10'!V5","v":1274},{"$f":"'شهر 10'!W5","v":350},{"$f":"'شهر 10'!X5","v":924}]
[null,null,"شهر 11",{"$f":"'شهر 11'!V5","v":1944},{"$f":"'شهر 11'!W5","v":200},{"$f":"'شهر 11'!X5","v":1744}]
[null,null,"شهر 12"]
[null,null," شهر 1-2017"]
[null,null,"شهر 2-2017"]
[]
[]
[]
[]
[]
[]
[]
[]
[]
[]
[]
[null,null,null,{"$f":"SUM(D6:D21)","v":3218},{"$f":"SUM(E6:E21)","v":550},{"$f":"SUM(F6:F21)","v":2668}]

{"sheet":"ورقة11","index":12,"n_rows":0,"n_cols":0,"rows_kept":0,"cut":false,"hidden":false,"merged":[]}

{"sheet":"ورقة12","index":13,"n_rows":0,"n_cols":0,"rows_kept":0,"cut":false,"hidden":false,"merged":[]}

{"sheet":"الرئيسية","index":14,"n_rows":0,"n_cols":0,"rows_kept":0,"cut":false,"hidden":false,"merged":[]}