{"text_format":"1","workbook":"xlsx","n_sheets":3,"sheets":["Sheet1","Sheet2","Sheet3"],"not_rendered":{"charts":0,"images":0,"macros":1,"external_links":0,"defined_names":1,"comments":0,"pivot_tables":0},"unopened":[],"bounds":{"document_bytes":16777216,"sheet_cells":100000,"rows_first":2000,"rows_last":500,"rows_between":2000,"halvings":0,"cell_chars":16384,"cell_head_chars":4096},"cells_cut":0,"cells_raw":0,"read":"whole","date_system":"1900"}

{"sheet":"Sheet1","index":0,"n_rows":20,"n_cols":5,"rows_kept":20,"cut":false,"hidden":false,"merged":[[0,1,0,3],[3,1,3,4],[4,1,4,4]]}
[null,"فاتورة بيع"]
["رقم الفاتورة",100,"رقم الجوال"]
["تاريخ الفاتورة",{"$f":"TODAY()","v":"2019-09-11"},{"$f":"IFERROR(INDEX(Sheet2!$E:$E,MATCH($B$2,Sheet2!$C:$C,0)),\"\")","v":54222222}]
["اسم العميل",{"$f":"IFERROR(INDEX(Sheet2!$B:$B,MATCH($B$2,Sheet2!$C:$C,0)),\"\")","v":"محمد"}]
[]
["رقم الجهاز","نوع الخدمة ","الاقراص التي تريد تهيئتها","السعر ","الإجمالى"]
[{"$f":"IFERROR(INDEX(Sheet2!$F:$F,MATCH($B$2,Sheet2!$C:$C,0)),\"\")","v":101},{"$f":"IFERROR(INDEX(Sheet2!$G:$G,MATCH($B$2,Sheet2!$C:$C,0)),\"\")","v":521},{"$f":"IFERROR(INDEX(Sheet2!$J:$J,MATCH($B$2,Sheet2!$C:$C,0)),\"\")","v":"الكل"},{"$f":"IFERROR(INDEX(Sheet2!$H:$H,MATCH($B$2,Sheet2!$C:$C,0)),\"\")","v":20},{"$f":"IFERROR(INDEX(Sheet2!$I:$I,MATCH($B$2,Sheet2!$C:$C,0)),\"\")","v":20}]
[]
[]
[]
[]
[]
[]
[]
[]
[]
[]
[]
[]
[null,null,null,"الاجمالى",{"$f":"SUBTOTAL(9,E7:E18)","v":20}]

{"sheet":"Sheet2","index":1,"n_rows":3,"n_cols":10,"rows_kept":3,"cut":false,"hidden":false,"merged":[]}
["التاريخ","اسم العميل","رقم الفاتورة","تاريخ الفاتورة","رقم الجوال","رقم الجهاز","نوع الخدمة","السعر لكل خدمة","الاجمالي","الاقراص التي تريد تهيئتها"]
["12/1/1440","محمد",100,"12/1/1440",54222222,101,521,20,20,"الكل"]
["12/1/1440","خالد",101,"12/1/1440",554512655,102,231,40,40,"الكل"]

{"sheet":"Sheet3","index":2,"n_rows":13,"n_cols":5,"rows_kept":13,"cut":false,"hidden":false,"merged":[]}
[]
[]
[1,"ll","ll","oo","ii"]
[3,"o","o","oo","o"]
[]
[7,"uu","uu","uu","uu"]
[9,"ii","ii","ii","ii"]
[]
[98,"iii","kk","kk","kk"]
[]
[]
[]
["ii9",99,999,9,9]