{"text_format":"1","workbook":"xlsx","n_sheets":3,"sheets":["Sheet1","Main","salim"],"not_rendered":{"charts":0,"images":0,"macros":1,"external_links":1,"defined_names":1,"comments":0,"pivot_tables":0},"unopened":[],"bounds":{"document_bytes":16777216,"sheet_cells":100000,"rows_first":2000,"rows_last":500,"rows_between":2000,"halvings":0,"cell_chars":16384,"cell_head_chars":4096},"cells_cut":0,"cells_raw":0,"read":"whole","date_system":"1900"}

{"sheet":"Sheet1","index":0,"n_rows":537,"n_cols":21,"rows_kept":537,"cut":false,"hidden":true,"merged":[]}
[]
["Sales Document","Transaction Group","Description","Sales Document Type","Description","Sold-to party","Created on","Document Date","Transaction Group","Partner Function","Person responsible","Created by","Sales Organization","Distribution Channel","Division","Sales Office","Sales Group","Document Currency","Net value","order tybe","الفرع "]
[495330,0,"Sales order","OR","KA Standard Order",1211831001,"2019-09-24","2019-09-24","SMH0169",null,0,"A.ALZAHMI",2000,60,70,2210,215,"SAR",9199.7999999999993,{"$f":"IF(A3<60000000,\"sales orders\",\"return orders\")","v":"sales orders"},{"$f":"VLOOKUP(P:P,'[1]MVT Name'!D:E,2,0)","v":"فرع جدة"}]
[495375,0,"Sales order","OR","KA Standard Order",2230141001,"2019-09-24","2019-09-24","mn1909/271",null,0,"B.ALGHAMDI",2000,20,20,2410,413,"SAR",3557.32,"sales orders",{"$f":"VLOOKUP(P:P,'[1]MVT Name'!D:E,2,0)","v":"فرع المدينة"}]
[495427,0,"Sales order","ZPRO","Discounts",2230141001,"2019-09-24","2019-09-24","mn1909/272",null,0,"B.ALGHAMDI",2000,20,20,2410,413,"SAR",921.6,"sales orders",{"$f":"VLOOKUP(P:P,'[1]MVT Name'!D:E,2,0)","v":"فرع المدينة"}]
[495456,0,"Sales order","OR","KA Standard Order",1310121190,"2019-09-24","2019-09-24",42261265,null,0,"A.ALZAHMI",2000,10,20,2210,210,"SAR",12967.83,"sales orders",{"$f":"VLOOKUP(P:P,'[1]MVT Name'!D:E,2,0)","v":"فرع جدة"}]
[495490,0,"Sales order","OR","KA Standard Order",3221941001,"2019-09-24","2019-09-24","mn1909/250",null,0,"B.ALGHAMDI",2000,30,20,2410,411,"SAR",4793.3900000000003,"sales orders",{"$f":"VLOOKUP(P:P,'[1]MVT Name'!D:E,2,0)","v":"فرع المدينة"}]
[495505,0,"Sales order","OR","KA Standard Order",1310121190,"2019-09-24","2019-09-24",42261759,null,0,"A.ALZAHMI",2000,10,20,2210,210,"SAR",19064.5,"sales orders",{"$f":"VLOOKUP(P:P,'[1]MVT Name'!D:E,2,0)","v":"فرع جدة"}]
[495514,0,"Sales order","OR","KA Standard Order",1210832015,"2019-09-24","2019-09-24",548141,null,0,"B.ALGHAMDI",2000,10,70,2320,320,"SAR",2795.6,"sales orders",{"$f":"VLOOKUP(P:P,'[1]MVT Name'!D:E,2,0)","v":"فرع الإحساء"}]
[495524,0,"Sales order","ZNR","Near Ex.promot order",2247221001,"2019-09-24","2019-09-24",1,null,0,"M.SAGGAF",2000,90,20,2210,213,"SAR",1465,"sales orders",{"$f":"VLOOKUP(P:P,'[1]MVT Name'!D:E,2,0)","v":"فرع جدة"}]
[495527,0,"Sales order","ZSO","Sale-Out+PromoOrder",1110121003,"2019-09-24","2019-09-24",42230395,null,0,"A.ALZAHMI",2000,10,20,2210,210,"SAR",4940.5,"sales orders",{"$f":"VLOOKUP(P:P,'[1]MVT Name'!D:E,2,0)","v":"فرع جدة"}]
[495528,0,"Sales order","OR","KA Standard Order",1210732002,"2019-09-24","2019-09-24",12519945,null,0,"B.ALGHAMDI",2000,10,20,2320,320,"SAR",4240,"sales orders",{"$f":"VLOOKUP(P:P,'[1]MVT Name'!D:E,2,0)","v":"فرع الإحساء"}]
[495532,0,"Sales order","OR","KA Standard Order",1210732002,"2019-09-24","2019-09-24",12493988,null,0,"B.ALGHAMDI",2000,10,70,2320,320,"SAR",212,"sales orders",{"$f":"VLOOKUP(P:P,'[1]MVT Name'!D:E,2,0)","v":"فرع الإحساء"}]
[495541,0,"Sales order","OR","KA Standard Order",1210732002,"2019-09-24","2019-09-24",12519930,null,0,"B.ALGHAMDI",2000,10,20,2320,320,"SAR",238,"sales orders",{"$f":"VLOOKUP(P:P,'[1]MVT Name'!D:E,2,0)","v":"فرع الإحساء"}]
[495543,0,"Sales order","ZSO","Sale-Out+PromoOrder",1110121003,"2019-09-24","2019-09-24",42215335,null,0,"A.ALZAHMI",2000,10,20,2210,210,"SAR",6079.5,"sales orders",{"$f":"VLOOKUP(P:P,'[1]MVT Name'!D:E,2,0)","v":"فرع جدة"}]
[495549,0,"Sales order","OR","KA Standard Order",1210732002,"2019-09-24","2019-09-24",12519899,null,0,"B.ALGHAMDI",2000,10,20,2320,320,"SAR",1527.5,"sales orders",{"$f":"VLOOKUP(P:P,'[1]MVT Name'!D:E,2,0)","v":"فرع الإحساء"}]
[495557,0,"Sales order","OR","KA Standard Order",1110721001,"2019-09-24","2019-09-24",12519973,null,0,"A.ALZAHMI",2000,10,20,2210,210,"SAR",730,"sales orders",{"$f":"VLOOKUP(P:P,'[1]MVT Name'!D:E,2,0)","v":"فرع جدة"}]
[495582,0,"Sales order","OR","KA Standard Order",1215232001,"2019-09-24","2019-09-24",1309,null,0,"B.ALGHAMDI",2000,10,70,2320,320,"SAR",6360,"sales orders",{"$f":"VLOOKUP(P:P,'[1]MVT Name'!D:E,2,0)","v":"فرع الإحساء"}]
[495591,0,"Sales order","OR","KA Standard Order",1111821001,"2019-09-24","2019-09-24",4712441159,null,0,"A.ALZAHMI",2000,10,20,2210,210,"SAR",6394.33,"sales orders",{"$f":"VLOOKUP(P:P,'[1]MVT Name'!D:E,2,0)","v":"فرع جدة"}]
[495594,0,"Sales order","OR","KA Standard Order",1215232002,"2019-09-24","2019-09-24",1354,null,0,"B.ALGHAMDI",2000,10,20,2320,320,"SAR",5501,"sales orders",{"$f":"VLOOKUP(P:P,'[1]MVT Name'!D:E,2,0)","v":"فرع الإحساء"}]
[495596,0,"Sales order","OR","KA Standard Order",2237611001,"2019-09-24","2019-09-24","ra1909/2028",null,0,"E.ALSOMAHI",2000,20,20,2110,113,"SAR",14680,"sales orders",{"$f":"VLOOKUP(P:P,'[1]MVT Name'!D:E,2,0)","v":"فرع الرياض"}]
[495600,0,"Sales order","OR","KA Standard Order",1215232002,"2019-09-24","2019-09-24",1354,null,0,"B.ALGHAMDI",2000,10,70,2320,320,"SAR",10912,"sales orders",{"$f":"VLOOKUP(P:P,'[1]MVT Name'!D:E,2,0)","v":"فرع الإحساء"}]
[495604,0,"Sales order","OR","KA Standard Order",1215232002,"2019-09-24","2019-09-24",1354,null,0,"B.ALGHAMDI",2000,10,20,2320,320,"SAR",1723,"sales orders",{"$f":"VLOOKUP(P:P,'[1]MVT Name'!D:E,2,0)","v":"فرع الإحساء"}]
[495605,0,"Sales order","OR","KA Standard Order",2243011001,"2019-09-24","2019-09-24","ra1909/2076",null,0,"E.ALSOMAHI",2000,20,20,2110,113,"SAR",5805,"sales orders",{"$f":"VLOOKUP(P:P,'[1]MVT Name'!D:E,2,0)","v":"فرع الرياض"}]
[495606,0,"Sales order","OR","KA Standard Order",1111821001,"2019-09-24","2019-09-24",4712441132,null,0,"A.ALZAHMI",2000,10,20,2210,210,"SAR",5172,"sales orders",{"$f":"VLOOKUP(P:P,'[1]MVT Name'!D:E,2,0)","v":"فرع جدة"}]
[495607,0,"Sales order","ZSO","Sale-Out+PromoOrder",1210832015,"2019-09-24","2019-09-24",548053,null,0,"B.ALGHAMDI",2000,10,20,2320,320,"SAR",2084,"sales orders",{"$f":"VLOOKUP(P:P,'[1]MVT Name'!D:E,2,0)","v":"فرع الإحساء"}]
[495608,0,"Sales order","OR","KA Standard Order",2239311001,"2019-09-24","2019-09-24","ra1909/2077",null,0,"E.ALSOMAHI",2000,20,20,2110,113,"SAR",3984,"sales orders",{"$f":"VLOOKUP(P:P,'[1]MVT Name'!D:E,2,0)","v":"فرع الرياض"}]
[495609,0,"Sales order","ZSO","Sale-Out+PromoOrder",1210232023,"2019-09-24","2019-09-24",18751,null,0,"B.ALGHAMDI",2000,10,70,2320,320,"SAR",1582,"sales orders",{"$f":"VLOOKUP(P:P,'[1]MVT Name'!D:E,2,0)","v":"فرع الإحساء"}]
[495610,0,"Sales order","ZSO","Sale-Out+PromoOrder",1210332011,"2019-09-24","2019-09-24",20100205759,null,0,"B.ALGHAMDI",2000,10,20,2320,320,"SAR",1394.66,"sales orders",{"$f":"VLOOKUP(P:P,'[1]MVT Name'!D:E,2,0)","v":"فرع الإحساء"}]
[495611,0,"Sales order","ZSO","Sale-Out+PromoOrder",1210332011,"2019-09-24","2019-09-24",20100205759,null,0,"B.ALGHAMDI",2000,10,70,2320,320,"SAR",175,"sales orders",{"$f":"VLOOKUP(P:P,'[1]MVT Name'!D:E,2,0)","v":"فرع الإحساء"}]
[495612,0,"Sales order","OR","KA Standard Order",3228112001,"2019-09-24","2019-09-24","QM1909/3067",null,0,"M.ALHARTHI",2000,60,20,2120,121,"SAR",13996,"sales orders",{"$f":"VLOOKUP(P:P,'[1]MVT Name'!D:E,2,0)","v":"فرع القصيم"}]
[495613,0,"Sales order","OR","KA Standard Order",1110721001,"2019-09-24","2019-09-24",12519929,null,0,"A.ALZAHMI",2000,10,20,2210,210,"SAR",15554.67,"sales orders",{"$f":"VLOOKUP(P:P,'[1]MVT Name'!D:E,2,0)","v":"فرع جدة"}]
[495614,0,"Sales order","OR","KA Standard Order",1210721009,"2019-09-24","2019-09-24",12514629,null,0,"A.ALZAHMI",2000,10,20,2210,210,"SAR",2344.84,"sales orders",{"$f":"VLOOKUP(P:P,'[1]MVT Name'!D:E,2,0)","v":"فرع جدة"}]
[495615,0,"Sales order","OR","KA Standard Order",1210721009,"2019-09-24","2019-09-24",12506884,null,0,"A.ALZAHMI",2000,10,20,2210,210,"SAR",2164.5,"sales orders",{"$f":"VLOOKUP(P:P,'[1]MVT Name'!D:E,2,0)","v":"فرع جدة"}]
[495616,0,"Sales order","OR","KA Standard Order",3226712001,"2019-09-24","2019-09-24","QM1909/3059",null,0,"M.ALHARTHI",2000,60,20,2120,121,"SAR",8005.5,"sales orders",{"$f":"VLOOKUP(P:P,'[1]MVT Name'!D:E,2,0)","v":"فرع القصيم"}]
[495617,0,"Sales order","OR","KA Standard Order",1210132137,"2019-09-24","2019-09-24",42263839,null,0,"B.ALGHAMDI",2000,10,20,2320,320,"SAR",8846.5,"sales orders",{"$f":"VLOOKUP(P:P,'[1]MVT Name'!D:E,2,0)","v":"فرع الإحساء"}]
[495618,0,"Sales order","OR","KA Standard Order",3230212001,"2019-09-24","2019-09-24","QM1909/3065",null,0,"M.ALHARTHI",2000,30,20,2120,121,"SAR",2170,"sales orders",{"$f":"VLOOKUP(P:P,'[1]MVT Name'!D:E,2,0)","v":"فرع القصيم"}]
[495619,0,"Sales order","OR","KA Standard Order",1210232024,"2019-09-24","2019-09-24",357951,null,0,"B.ALGHAMDI",2000,10,70,2320,320,"SAR",780,"sales orders",{"$f":"VLOOKUP(P:P,'[1]MVT Name'!D:E,2,0)","v":"فرع الإحساء"}]
[495620,0,"Sales order","OR","KA Standard Order",1110121004,"2019-09-24","2019-09-24",42241431,null,0,"A.ALZAHMI",2000,10,70,2210,210,"SAR",1815,"sales orders",{"$f":"VLOOKUP(P:P,'[1]MVT Name'!D:E,2,0)","v":"فرع جدة"}]
[495621,0,"Sales order","OR","KA Standard Order",1310212002,"2019-09-24","2019-09-24","QM1909/3064",null,0,"M.ALHARTHI",2000,50,20,2120,120,"SAR",1746.5,"sales orders",{"$f":"VLOOKUP(P:P,'[1]MVT Name'!D:E,2,0)","v":"فرع القصيم"}]
[495622,0,"Sales order","OR","KA Standard Order",3228342001,"2019-09-24","2019-09-24","tk1909/58",null,0,"E.ALSOMAHI",2000,30,20,2420,421,"SAR",13498.74,"sales orders",{"$f":"VLOOKUP(P:P,'[1]MVT Name'!D:E,2,0)","v":"فرع تبوك"}]
[495623,0,"Sales order","OR","KA Standard Order",1210542003,"2019-09-24","2019-09-24",103004505,null,0,"E.ALSOMAHI",2000,10,20,2420,420,"SAR",2968.5,"sales orders",{"$f":"VLOOKUP(P:P,'[1]MVT Name'!D:E,2,0)","v":"فرع تبوك"}]
[495624,0,"Sales order","OR","KA Standard Order",1214842002,"2019-09-24","2019-09-24","tk1909/55",null,0,"E.ALSOMAHI",2000,10,20,2420,420,"SAR",10402,"sales orders",{"$f":"VLOOKUP(P:P,'[1]MVT Name'!D:E,2,0)","v":"فرع تبوك"}]
[495625,0,"Sales order","OR","KA Standard Order",3227412001,"2019-09-24","2019-09-24","QM1909/3066",null,0,"M.ALHARTHI",2000,30,20,2120,121,"SAR",9137.99,"sales orders",{"$f":"VLOOKUP(P:P,'[1]MVT Name'!D:E,2,0)","v":"فرع القصيم"}]
[495626,0,"Sales order","OR","KA Standard Order",1214842006,"2019-09-24","2019-09-24",290014,null,0,"E.ALSOMAHI",2000,10,20,2420,420,"SAR",2491,"sales orders",{"$f":"VLOOKUP(P:P,'[1]MVT Name'!D:E,2,0)","v":"فرع تبوك"}]
[495627,0,"Sales order","ZPRO","Discounts",3231012001,"2019-09-24","2019-09-24","QM1909/3057",null,0,"M.ALHARTHI",2000,30,20,2120,121,"SAR",5147.6099999999997,"sales orders",{"$f":"VLOOKUP(P:P,'[1]MVT Name'!D:E,2,0)","v":"فرع القصيم"}]
[495628,0,"Sales order","OR","KA Standard Order",1214842004,"2019-09-24","2019-09-24",290013,null,0,"E.ALSOMAHI",2000,10,20,2420,420,"SAR",1905,"sales orders",{"$f":"VLOOKUP(P:P,'[1]MVT Name'!D:E,2,0)","v":"فرع تبوك"}]
[495629,0,"Sales order","OR","KA Standard Order",1214842003,"2019-09-24","2019-09-24",290012,null,0,"E.ALSOMAHI",2000,10,20,2420,420,"SAR",2496,"sales orders",{"$f":"VLOOKUP(P:P,'[1]MVT Name'!D:E,2,0)","v":"فرع تبوك"}]
[495630,0,"Sales order","OR","KA Standard Order",3229212001,"2019-09-24","2019-09-24","QM1909/3062",null,0,"M.ALHARTHI",2000,30,20,2120,121,"SAR",4407,"sales orders",{"$f":"VLOOKUP(P:P,'[1]MVT Name'!D:E,2,0)","v":"فرع القصيم"}]
[495631,0,"Sales order","ZPRO","Discounts",2234241001,"2019-09-24","2019-09-24","mn1909/270",null,0,"B.ALGHAMDI",2000,20,10,2410,413,"SAR",1830.4,"sales orders",{"$f":"VLOOKUP(P:P,'[1]MVT Name'!D:E,2,0)","v":"فرع المدينة"}]
[495632,0,"Sales order","ZPRO","Discounts",3226712001,"2019-09-24","2019-09-24","QM1909/3060",null,0,"M.ALHARTHI",2000,60,20,2120,121,"SAR",2986.5,"sales orders",{"$f":"VLOOKUP(P:P,'[1]MVT Name'!D:E,2,0)","v":"فرع القصيم"}]
[495633,0,"Sales order","OR","KA Standard Order",1214842001,"2019-09-24","2019-09-24",290011,null,0,"E.ALSOMAHI",2000,10,20,2420,420,"SAR",1855,"sales orders",{"$f":"VLOOKUP(P:P,'[1]MVT Name'!D:E,2,0)","v":"فرع تبوك"}]
[495634,0,"Sales order","OR","KA Standard Order",3231012001,"2019-09-24","2019-09-24","QM1909/3061",null,0,"M.ALHARTHI",2000,30,20,2120,121,"SAR",3685.33,"sales orders",{"$f":"VLOOKUP(P:P,'[1]MVT Name'!D:E,2,0)","v":"فرع القصيم"}]
[495635,0,"Sales order","OR","KA Standard Order",2232542001,"2019-09-24","2019-09-24","tk1909/50",null,0,"E.ALSOMAHI",2000,20,20,2420,423,"SAR",7968,"sales orders",{"$f":"VLOOKUP(P:P,'[1]MVT Name'!D:E,2,0)","v":"فرع تبوك"}]
[495636,0,"Sales order","ZPRO","Discounts",2232542001,"2019-09-24","2019-09-24","tk1909/51",null,0,"E.ALSOMAHI",2000,20,20,2420,423,"SAR",4638.4799999999996,"sales orders",{"$f":"VLOOKUP(P:P,'[1]MVT Name'!D:E,2,0)","v":"فرع تبوك"}]
[495637,0,"Sales order","ZPRO","Discounts",3230212001,"2019-09-24","2019-09-24","QM1909/3063",null,0,"M.ALHARTHI",2000,30,20,2120,121,"SAR",6494.59,"sales orders",{"$f":"VLOOKUP(P:P,'[1]MVT Name'!D:E,2,0)","v":"فرع القصيم"}]
[495638,0,"Sales order","OR","KA Standard Order",3211523001,"2019-09-24","2019-09-24","TF1909/113",null,0,"A.ALZAHMI",2000,30,20,2230,231,"SAR",1230,"sales orders",{"$f":"VLOOKUP(P:P,'[1]MVT Name'!D:E,2,0)","v":"فرع الطائف"}]
[495639,0,"Sales order","OR","KA Standard Order",3212023001,"2019-09-24","2019-09-24","TF1909/112",null,0,"A.ALZAHMI",2000,30,20,2230,231,"SAR",492,"sales orders",{"$f":"VLOOKUP(P:P,'[1]MVT Name'!D:E,2,0)","v":"فرع الطائف"}]
[495640,0,"Sales order","OR","KA Standard Order",3212823001,"2019-09-24","2019-09-24","TF1909/111",null,0,"A.ALZAHMI",2000,30,20,2230,231,"SAR",6888,"sales orders",{"$f":"VLOOKUP(P:P,'[1]MVT Name'!D:E,2,0)","v":"فرع الطائف"}]
[495641,0,"Sales order","OR","KA Standard Order",3217723001,"2019-09-24","2019-09-24","TF1909/110",null,0,"A.ALZAHMI",2000,30,20,2230,231,"SAR",3198,"sales orders",{"$f":"VLOOKUP(P:P,'[1]MVT Name'!D:E,2,0)","v":"فرع الطائف"}]
[495642,0,"Sales order","OR","KA Standard Order",3218722001,"2019-09-24","2019-09-24","mk1909/71",null,0,"A.ALZAHMI",2000,30,20,2220,221,"SAR",4414,"sales orders",{"$f":"VLOOKUP(P:P,'[1]MVT Name'!D:E,2,0)","v":"فرع مكة"}]
[495643,0,"Sales order","ZSO","Sale-Out+PromoOrder",1210523011,"2019-09-24","2019-09-24",102995615,null,0,"A.ALZAHMI",2000,10,20,2230,230,"SAR",1490.16,"sales orders",{"$f":"VLOOKUP(P:P,'[1]MVT Name'!D:E,2,0)","v":"فرع الطائف"}]
[495644,0,"Sales order","ZSO","Sale-Out+PromoOrder",1210523015,"2019-09-24","2019-09-24",102995636,null,0,"A.ALZAHMI",2000,10,20,2230,230,"SAR",1305.6600000000001,"sales orders",{"$f":"VLOOKUP(P:P,'[1]MVT Name'!D:E,2,0)","v":"فرع الطائف"}]
[495645,0,"Sales order","ZSO","Sale-Out+PromoOrder",1210523021,"2019-09-24","2019-09-24",102995700,null,0,"A.ALZAHMI",2000,10,20,2230,230,"SAR",606.33000000000004,"sales orders",{"$f":"VLOOKUP(P:P,'[1]MVT Name'!D:E,2,0)","v":"فرع الطائف"}]
[495646,0,"Sales order","OR","KA Standard Order",3223842001,"2019-09-24","2019-09-24","Tk1909/52",null,0,"E.ALSOMAHI",2000,30,20,2420,421,"SAR",12873.5,"sales orders",{"$f":"VLOOKUP(P:P,'[1]MVT Name'!D:E,2,0)","v":"فرع تبوك"}]
[495647,0,"Sales order","ZSO","Sale-Out+PromoOrder",1210523012,"2019-09-24","2019-09-24",102995627,null,0,"A.ALZAHMI",2000,10,20,2230,230,"SAR",237.33,"sales orders",{"$f":"VLOOKUP(P:P,'[1]MVT Name'!D:E,2,0)","v":"فرع الطائف"}]
[495648,0,"Sales order","OR","KA Standard Order",1210341010,"2019-09-24","2019-09-24",28555,null,0,"B.ALGHAMDI",2000,10,20,2410,410,"SAR",3862,{"$f":"IF(A67<60000000,\"sales orders\",\"return orders\")","v":"sales orders"},{"$f":"VLOOKUP(P:P,'[1]MVT Name'!D:E,2,0)","v":"فرع المدينة"}]
[495649,0,"Sales order","OR","KA Standard Order",1110711005,"2019-09-24","2019-09-24",12517491,null,0,"E.ALSOMAHI",2000,10,20,2110,110,"SAR",18907.669999999998,"sales orders",{"$f":"VLOOKUP(P:P,'[1]MVT Name'!D:E,2,0)","v":"فرع الرياض"}]
[495650,0,"Sales order","OR","KA Standard Order",1210711023,"2019-09-24","2019-09-24",12505723,null,0,"E.ALSOMAHI",2000,10,20,2110,110,"SAR",407.17,"sales orders",{"$f":"VLOOKUP(P:P,'[1]MVT Name'!D:E,2,0)","v":"فرع الرياض"}]
[495651,0,"Sales order","ZSO","Sale-Out+PromoOrder",1210172162,"2019-09-24","2019-09-24",42230387,null,0,"M.ALHARTHI",2000,10,20,2720,720,"SAR",2655,"sales orders",{"$f":"VLOOKUP(P:P,'[1]MVT Name'!D:E,2,0)","v":"فرع جيزان"}]
[495652,0,"Sales order","OR","KA Standard Order",3219221003,"2019-09-24","2019-09-24","jd1909/136",null,0,"A.ALZAHMI",2000,50,20,2210,211,"SAR",5317.59,"sales orders",{"$f":"VLOOKUP(P:P,'[1]MVT Name'!D:E,2,0)","v":"فرع جدة"}]
[495653,0,"Sales order","OR","KA Standard Order",3212021001,"2019-09-24","2019-09-24","jd1909/137",null,0,"A.ALZAHMI",2000,30,20,2210,211,"SAR",6902.66,"sales orders",{"$f":"VLOOKUP(P:P,'[1]MVT Name'!D:E,2,0)","v":"فرع جدة"}]
[495654,0,"Sales order","ZSO","Sale-Out+PromoOrder",1110172009,"2019-09-24","2019-09-24",42230412,null,0,"M.ALHARTHI",2000,10,20,2720,720,"SAR",3394.5,"sales orders",{"$f":"VLOOKUP(P:P,'[1]MVT Name'!D:E,2,0)","v":"فرع جيزان"}]
[495655,0,"Sales order","ZSO","Sale-Out+PromoOrder",1110172011,"2019-09-24","2019-09-24",42217125,null,0,"M.ALHARTHI",2000,10,20,2720,720,"SAR",7346.5,"sales orders",{"$f":"VLOOKUP(P:P,'[1]MVT Name'!D:E,2,0)","v":"فرع جيزان"}]
[495656,0,"Sales order","OR","KA Standard Order",1210132137,"2019-09-24","2019-09-24",42267175,null,0,"B.ALGHAMDI",2000,10,70,2320,320,"SAR",5349,"sales orders",{"$f":"VLOOKUP(P:P,'[1]MVT Name'!D:E,2,0)","v":"فرع الإحساء"}]
[495657,0,"Sales order","OR","KA Standard Order",1110121009,"2019-09-24","2019-09-24",42251962,null,0,"A.ALZAHMI",2000,10,20,2210,210,"SAR",5504.5,"sales orders",{"$f":"VLOOKUP(P:P,'[1]MVT Name'!D:E,2,0)","v":"فرع جدة"}]
[495659,0,"Sales order","ZPRO","Discounts",2233612001,"2019-09-24","2019-09-24","QM1909/2054",null,0,"M.ALHARTHI",2000,20,20,2120,123,"SAR",33008.949999999997,"sales orders",{"$f":"VLOOKUP(P:P,'[1]MVT Name'!D:E,2,0)","v":"فرع القصيم"}]
[495660,0,"Sales order","ZSO","Sale-Out+PromoOrder",1210123170,"2019-09-24","2019-09-24",42243958,null,0,"A.ALZAHMI",2000,10,20,2230,230,"SAR",3169.5,"sales orders",{"$f":"VLOOKUP(P:P,'[1]MVT Name'!D:E,2,0)","v":"فرع الطائف"}]
[495661,0,"Sales order","ZSO","Sale-Out+PromoOrder",1210123171,"2019-09-24","2019-09-24",42214005,null,0,"A.ALZAHMI",2000,10,70,2230,230,"SAR",954,"sales orders",{"$f":"VLOOKUP(P:P,'[1]MVT Name'!D:E,2,0)","v":"فرع الطائف"}]
[495662,0,"Sales order","ZSO","Sale-Out+PromoOrder",1210123170,"2019-09-24","2019-09-24",42243958,null,0,"A.ALZAHMI",2000,10,70,2230,230,"SAR",650,"sales orders",{"$f":"VLOOKUP(P:P,'[1]MVT Name'!D:E,2,0)","v":"فرع الطائف"}]
[495663,0,"Sales order","OR","KA Standard Order",1110411005,"2019-09-24","2019-09-24",19045694,null,0,"E.ALSOMAHI",2000,10,20,2110,110,"SAR",26235.5,"sales orders",{"$f":"VLOOKUP(P:P,'[1]MVT Name'!D:E,2,0)","v":"فرع الرياض"}]
[495664,0,"Sales order","OR","KA Standard Order",2233612001,"2019-09-24","2019-09-24","QM1909/2056",null,0,"M.ALHARTHI",2000,20,20,2120,123,"SAR",19581,"sales orders",{"$f":"VLOOKUP(P:P,'[1]MVT Name'!D:E,2,0)","v":"فرع القصيم"}]
[495665,0,"Sales order","OR","KA Standard Order",1212321002,"2019-09-24","2019-09-24",380953,null,0,"A.ALZAHMI",2000,10,70,2210,210,"SAR",1856,"sales orders",{"$f":"VLOOKUP(P:P,'[1]MVT Name'!D:E,2,0)","v":"فرع جدة"}]
[495666,0,"Sales order","ZPRO","Discounts",2234341001,"2019-09-24","2019-09-24","MN1909/300",null,0,"B.ALGHAMDI",2000,20,20,2410,413,"SAR",114110.28,"sales orders",{"$f":"VLOOKUP(P:P,'[1]MVT Name'!D:E,2,0)","v":"فرع المدينة"}]
[495667,0,"Sales order","OR","KA Standard Order",2234341001,"2019-09-24","2019-09-24","MN1909/301",null,0,"B.ALGHAMDI",2000,20,20,2410,413,"SAR",4265,"sales orders",{"$f":"VLOOKUP(P:P,'[1]MVT Name'!D:E,2,0)","v":"فرع المدينة"}]
[495668,0,"Sales order","OR","KA Standard Order",3310323004,"2019-09-24","2019-09-24","tf1909/127",null,0,"A.ALZAHMI",2000,50,20,2230,231,"SAR",4837.33,"sales orders",{"$f":"VLOOKUP(P:P,'[1]MVT Name'!D:E,2,0)","v":"فرع الطائف"}]
[495669,0,"Sales order","OR","KA Standard Order",2241012001,"2019-09-24","2019-09-24","QM1909/2051",null,0,"M.ALHARTHI",2000,20,20,2120,123,"SAR",5287,"sales orders",{"$f":"VLOOKUP(P:P,'[1]MVT Name'!D:E,2,0)","v":"فرع القصيم"}]
[495670,0,"Sales order","OR","KA Standard Order",1210132137,"2019-09-24","2019-09-24",42263833,null,0,"B.ALGHAMDI",2000,10,70,2320,320,"SAR",2024,"sales orders",{"$f":"VLOOKUP(P:P,'[1]MVT Name'!D:E,2,0)","v":"فرع الإحساء"}]
[495671,0,"Sales order","OR","KA Standard Order",1210132134,"2019-09-24","2019-09-24",42253133,null,0,"B.ALGHAMDI",2000,10,70,2320,320,"SAR",846,"sales orders",{"$f":"VLOOKUP(P:P,'[1]MVT Name'!D:E,2,0)","v":"فرع الإحساء"}]
[495672,0,"Sales order","OR","KA Standard Order",2240112001,"2019-09-24","2019-09-24","QM1909/2049",null,0,"M.ALHARTHI",2000,20,20,2120,123,"SAR",7322,"sales orders",{"$f":"VLOOKUP(P:P,'[1]MVT Name'!D:E,2,0)","v":"فرع القصيم"}]
[495673,0,"Sales order","OR","KA Standard Order",3221321001,"2019-09-24","2019-09-24","jd1909/139",null,0,"A.ALZAHMI",2000,30,20,2210,211,"SAR",2341.39,"sales orders",{"$f":"VLOOKUP(P:P,'[1]MVT Name'!D:E,2,0)","v":"فرع جدة"}]
[495674,0,"Sales order","OR","KA Standard Order",2238022001,"2019-09-24","2019-09-24","QM1909/2052",null,0,"M.ALHARTHI",2000,20,20,2120,123,"SAR",4922.5,"sales orders",{"$f":"VLOOKUP(P:P,'[1]MVT Name'!D:E,2,0)","v":"فرع القصيم"}]
[495675,0,"Sales order","OR","KA Standard Order",1217121001,"2019-09-24","2019-09-24","jd1909/140",null,0,"A.ALZAHMI",2000,60,20,2210,210,"SAR",237900,"sales orders",{"$f":"VLOOKUP(P:P,'[1]MVT Name'!D:E,2,0)","v":"فرع جدة"}]
[495676,0,"Sales order","ZPRO","Discounts",2241012001,"2019-09-24","2019-09-24","QM1909/2054",null,0,"M.ALHARTHI",2000,20,20,2120,123,"SAR",958.23,"sales orders",{"$f":"VLOOKUP(P:P,'[1]MVT Name'!D:E,2,0)","v":"فرع القصيم"}]
[495677,0,"Sales order","OR","KA Standard Order",2213721001,"2019-09-24","2019-09-24","jd1909/143",null,0,"A.ALZAHMI",2000,20,20,2210,213,"SAR",18225,"sales orders",{"$f":"VLOOKUP(P:P,'[1]MVT Name'!D:E,2,0)","v":"فرع جدة"}]
[495678,0,"Sales order","OR","KA Standard Order",1110711005,"2019-09-24","2019-09-24",12517959,null,0,"E.ALSOMAHI",2000,10,20,2110,110,"SAR",27885.99,"sales orders",{"$f":"VLOOKUP(P:P,'[1]MVT Name'!D:E,2,0)","v":"فرع الرياض"}]
[495679,0,"Sales order","OR","KA Standard Order",2213721001,"2019-09-24","2019-09-24","jd1909/141",null,0,"A.ALZAHMI",2000,20,20,2210,213,"SAR",4040,"sales orders",{"$f":"VLOOKUP(P:P,'[1]MVT Name'!D:E,2,0)","v":"فرع جدة"}]
[495680,0,"Sales order","ZSO","Sale-Out+PromoOrder",1210132137,"2019-09-24","2019-09-24",42263827,null,0,"B.ALGHAMDI",2000,10,20,2320,320,"SAR",7644.5,"sales orders",{"$f":"VLOOKUP(P:P,'[1]MVT Name'!D:E,2,0)","v":"فرع الإحساء"}]
[495681,0,"Sales order","ZPRO","Discounts",2240112001,"2019-09-24","2019-09-24","QM1909/2049",null,0,"M.ALHARTHI",2000,20,20,2120,123,"SAR",21814.799999999999,"sales orders",{"$f":"VLOOKUP(P:P,'[1]MVT Name'!D:E,2,0)","v":"فرع القصيم"}]
[495682,0,"Sales order","OR","KA Standard Order",1210132144,"2019-09-24","2019-09-24",87031,null,0,"B.ALGHAMDI",2000,10,60,2320,320,"SAR",3385.5,"sales orders",{"$f":"VLOOKUP(P:P,'[1]MVT Name'!D:E,2,0)","v":"فرع الإحساء"}]
[495683,0,"Sales order","OR","KA Standard Order",1210132144,"2019-09-24","2019-09-24",87031,null,0,"B.ALGHAMDI",2000,10,60,2320,320,"SAR",3385.5,"sales orders",{"$f":"VLOOKUP(P:P,'[1]MVT Name'!D:E,2,0)","v":"فرع الإحساء"}]
[495684,0,"Sales order","OR","KA Standard Order",1111811002,"2019-09-24","2019-09-24",4712364409,null,0,"E.ALSOMAHI",2000,10,20,2110,110,"SAR",5101,"sales orders",{"$f":"VLOOKUP(P:P,'[1]MVT Name'!D:E,2,0)","v":"فرع الرياض"}]
[495685,0,"Sales order","OR","KA Standard Order",1210132144,"2019-09-24","2019-09-24",42254871,null,0,"B.ALGHAMDI",2000,10,20,2320,320,"SAR",10960.5,"sales orders",{"$f":"VLOOKUP(P:P,'[1]MVT Name'!D:E,2,0)","v":"فرع الإحساء"}]
[495686,0,"Sales order","OR","KA Standard Order",1111811003,"2019-09-24","2019-09-24",4712426605,null,0,"E.ALSOMAHI",2000,10,70,2110,110,"SAR",1160.2,"sales orders",{"$f":"VLOOKUP(P:P,'[1]MVT Name'!D:E,2,0)","v":"فرع الرياض"}]
[495687,0,"Sales order","ZPRO","Discounts",2213721001,"2019-09-24","2019-09-24","jd1909/142",null,0,"A.ALZAHMI",2000,20,20,2210,213,"SAR",88536.51,"sales orders",{"$f":"VLOOKUP(P:P,'[1]MVT Name'!D:E,2,0)","v":"فرع جدة"}]
[495688,0,"Sales order","OR","KA Standard Order",3310321005,"2019-09-24","2019-09-24","jd1909/138",null,0,"A.ALZAHMI",2000,50,20,2210,211,"SAR",1104.3,"sales orders",{"$f":"VLOOKUP(P:P,'[1]MVT Name'!D:E,2,0)","v":"فرع جدة"}]
[495689,0,"Sales order","OR","KA Standard Order",1111811007,"2019-09-24","2019-09-24",4712483665,null,0,"E.ALSOMAHI",2000,10,20,2110,110,"SAR",5534.5,"sales orders",{"$f":"VLOOKUP(P:P,'[1]MVT Name'!D:E,2,0)","v":"فرع الرياض"}]
[495690,0,"Sales order","OR","KA Standard Order",3310321001,"2019-09-24","2019-09-24","jd1909/135",null,0,"A.ALZAHMI",2000,50,20,2210,211,"SAR",2904.97,"sales orders",{"$f":"VLOOKUP(P:P,'[1]MVT Name'!D:E,2,0)","v":"فرع جدة"}]
[495691,0,"Sales order","ZPRO","Discounts",2233712001,"2019-09-24","2019-09-24","QM1909/2053",null,0,"M.ALHARTHI",2000,20,20,2120,123,"SAR",54485.95,"sales orders",{"$f":"VLOOKUP(P:P,'[1]MVT Name'!D:E,2,0)","v":"فرع القصيم"}]
[495692,0,"Sales order","OR","KA Standard Order",1210211048,"2019-09-24","2019-09-24",15474861,null,0,"E.ALSOMAHI",2000,10,20,2110,110,"SAR",5779.66,"sales orders",{"$f":"VLOOKUP(P:P,'[1]MVT Name'!D:E,2,0)","v":"فرع الرياض"}]
[495693,0,"Sales order","OR","KA Standard Order",1210211064,"2019-09-24","2019-09-24",15474850,null,0,"E.ALSOMAHI",2000,10,20,2110,110,"SAR",2719.53,"sales orders",{"$f":"VLOOKUP(P:P,'[1]MVT Name'!D:E,2,0)","v":"فرع الرياض"}]
[495694,0,"Sales order","OR","KA Standard Order",1210111056,"2019-09-24","2019-09-24",42207025,null,0,"E.ALSOMAHI",2000,10,20,2110,110,"SAR",2290,"sales orders",{"$f":"VLOOKUP(P:P,'[1]MVT Name'!D:E,2,0)","v":"فرع الرياض"}]
[495696,0,"Sales order","OR","KA Standard Order",1110121009,"2019-09-24","2019-09-24",42251587,null,0,"A.ALZAHMI",2000,10,70,2210,210,"SAR",4911,"sales orders",{"$f":"VLOOKUP(P:P,'[1]MVT Name'!D:E,2,0)","v":"فرع جدة"}]
[495697,0,"Sales order","OR","KA Standard Order",1110121006,"2019-09-24","2019-09-24",345821,null,0,"A.ALZAHMI",2000,10,70,2210,210,"SAR",970,"sales orders",{"$f":"VLOOKUP(P:P,'[1]MVT Name'!D:E,2,0)","v":"فرع جدة"}]
[495698,0,"Sales order","OR","KA Standard Order",1110121006,"2019-09-24","2019-09-24",345843,null,0,"A.ALZAHMI",2000,10,20,2210,210,"SAR",9572.5,"sales orders",{"$f":"VLOOKUP(P:P,'[1]MVT Name'!D:E,2,0)","v":"فرع جدة"}]
[495699,0,"Sales order","OR","KA Standard Order",1210141155,"2019-09-24","2019-09-24",64218,null,0,"B.ALGHAMDI",2000,10,20,2410,410,"SAR",26866.5,"sales orders",{"$f":"VLOOKUP(P:P,'[1]MVT Name'!D:E,2,0)","v":"فرع المدينة"}]
[495701,0,"Sales order","OR","KA Standard Order",1110121007,"2019-09-24","2019-09-24",249223,null,0,"A.ALZAHMI",2000,10,20,2210,210,"SAR",2791.95,"sales orders",{"$f":"VLOOKUP(P:P,'[1]MVT Name'!D:E,2,0)","v":"فرع جدة"}]
[495702,0,"Sales order","OR","KA Standard Order",1210141150,"2019-09-24","2019-09-24",225429,null,0,"B.ALGHAMDI",2000,10,20,2410,410,"SAR",5873,"sales orders",{"$f":"VLOOKUP(P:P,'[1]MVT Name'!D:E,2,0)","v":"فرع المدينة"}]
[495703,0,"Sales order","OR","KA Standard Order",1110121007,"2019-09-24","2019-09-24",249223,null,0,"A.ALZAHMI",2000,10,20,2210,210,"SAR",2791.95,"sales orders",{"$f":"VLOOKUP(P:P,'[1]MVT Name'!D:E,2,0)","v":"فرع جدة"}]
[495704,0,"Sales order","OR","KA Standard Order",1210111056,"2019-09-24","2019-09-24",42207025,null,0,"E.ALSOMAHI",2000,10,20,2110,110,"SAR",16557.39,"sales orders",{"$f":"VLOOKUP(P:P,'[1]MVT Name'!D:E,2,0)","v":"فرع الرياض"}]
[495705,0,"Sales order","OR","KA Standard Order",1210141150,"2019-09-24","2019-09-24",225413,null,0,"B.ALGHAMDI",2000,10,20,2410,410,"SAR",21627.65,"sales orders",{"$f":"VLOOKUP(P:P,'[1]MVT Name'!D:E,2,0)","v":"فرع المدينة"}]
[495706,0,"Sales order","OR","KA Standard Order",1210141155,"2019-09-24","2019-09-24",25850,null,0,"B.ALGHAMDI",2000,10,20,2410,410,"SAR",0.02,"sales orders",{"$f":"VLOOKUP(P:P,'[1]MVT Name'!D:E,2,0)","v":"فرع المدينة"}]
[495707,0,"Sales order","OR","KA Standard Order",1210111067,"2019-09-24","2019-09-24",252762,null,0,"E.ALSOMAHI",2000,10,20,2110,110,"SAR",5276.62,"sales orders",{"$f":"VLOOKUP(P:P,'[1]MVT Name'!D:E,2,0)","v":"فرع الرياض"}]
[495708,0,"Sales order","OR","KA Standard Order",1210141150,"2019-09-24","2019-09-24",25851,null,0,"B.ALGHAMDI",2000,10,20,2410,410,"SAR",0.02,"sales orders",{"$f":"VLOOKUP(P:P,'[1]MVT Name'!D:E,2,0)","v":"فرع المدينة"}]
[495709,0,"Sales order","OR","KA Standard Order",1210141151,"2019-09-24","2019-09-24",42216685,null,0,"B.ALGHAMDI",2000,10,70,2410,410,"SAR",650,"sales orders",{"$f":"VLOOKUP(P:P,'[1]MVT Name'!D:E,2,0)","v":"فرع المدينة"}]
[495710,0,"Sales order","OR","KA Standard Order",1210111058,"2019-09-24","2019-09-24",42248778,null,0,"E.ALSOMAHI",2000,10,70,2110,110,"SAR",4582,"sales orders",{"$f":"VLOOKUP(P:P,'[1]MVT Name'!D:E,2,0)","v":"فرع الرياض"}]
[495711,0,"Sales order","OR","KA Standard Order",1210141149,"2019-09-24","2019-09-24",42216584,null,0,"B.ALGHAMDI",2000,10,70,2410,410,"SAR",650,"sales orders",{"$f":"VLOOKUP(P:P,'[1]MVT Name'!D:E,2,0)","v":"فرع المدينة"}]
[495712,0,"Sales order","OR","KA Standard Order",1210111100,"2019-09-24","2019-09-24",117784,null,0,"E.ALSOMAHI",2000,10,70,2110,110,"SAR",326,"sales orders",{"$f":"VLOOKUP(P:P,'[1]MVT Name'!D:E,2,0)","v":"فرع الرياض"}]
[495713,0,"Sales order","OR","KA Standard Order",1210111100,"2019-09-24","2019-09-24",42208227,null,0,"E.ALSOMAHI",2000,10,20,2110,110,"SAR",1128,"sales orders",{"$f":"VLOOKUP(P:P,'[1]MVT Name'!D:E,2,0)","v":"فرع الرياض"}]
[495714,0,"Sales order","OR","KA Standard Order",1210141153,"2019-09-24","2019-09-24",42213546,null,0,"B.ALGHAMDI",2000,10,70,2410,410,"SAR",802,"sales orders",{"$f":"VLOOKUP(P:P,'[1]MVT Name'!D:E,2,0)","v":"فرع المدينة"}]
[495715,0,"Sales order","OR","KA Standard Order",1210111101,"2019-09-24","2019-09-24",42224412,null,0,"E.ALSOMAHI",2000,10,70,2110,110,"SAR",2270,{"$f":"IF(A131<60000000,\"sales orders\",\"return orders\")","v":"sales orders"},{"$f":"VLOOKUP(P:P,'[1]MVT Name'!D:E,2,0)","v":"فرع الرياض"}]
[495716,0,"Sales order","OR","KA Standard Order",1210141154,"2019-09-24","2019-09-24",42213590,null,0,"B.ALGHAMDI",2000,10,70,2410,410,"SAR",802,"sales orders",{"$f":"VLOOKUP(P:P,'[1]MVT Name'!D:E,2,0)","v":"فرع المدينة"}]
[495717,0,"Sales order","OR","KA Standard Order",1210121053,"2019-09-24","2019-09-24",42138975,null,0,"A.ALZAHMI",2000,10,20,2210,210,"SAR",14395.66,"sales orders",{"$f":"VLOOKUP(P:P,'[1]MVT Name'!D:E,2,0)","v":"فرع جدة"}]
[495718,0,"Sales order","ZSO","Sale-Out+PromoOrder",1210121095,"2019-09-24","2019-09-24",42230370,null,0,"A.ALZAHMI",2000,10,20,2210,210,"SAR",3947,"sales orders",{"$f":"VLOOKUP(P:P,'[1]MVT Name'!D:E,2,0)","v":"فرع جدة"}]
[495719,0,"Sales order","OR","KA Standard Order",1210141151,"2019-09-24","2019-09-24",141417,null,0,"B.ALGHAMDI",2000,10,20,2410,410,"SAR",0.02,"sales orders",{"$f":"VLOOKUP(P:P,'[1]MVT Name'!D:E,2,0)","v":"فرع المدينة"}]
[495720,0,"Sales order","OR","KA Standard Order",1210141149,"2019-09-24","2019-09-24",125252,null,0,"B.ALGHAMDI",2000,10,20,2410,410,"SAR",0.02,"sales orders",{"$f":"VLOOKUP(P:P,'[1]MVT Name'!D:E,2,0)","v":"فرع المدينة"}]
[495721,0,"Sales order","OR","KA Standard Order",1210811000,"2019-09-24","2019-09-24",4507697740,null,0,"B.ALGHAMDI",2000,10,70,2310,310,"SAR",39738,"sales orders",{"$f":"VLOOKUP(P:P,'[1]MVT Name'!D:E,2,0)","v":"فرع الدمام"}]
[495722,0,"Sales order","ZSO","Sale-Out+PromoOrder",1210121051,"2019-09-24","2019-09-24",42230367,null,0,"A.ALZAHMI",2000,10,20,2210,210,"SAR",4327,"sales orders",{"$f":"VLOOKUP(P:P,'[1]MVT Name'!D:E,2,0)","v":"فرع جدة"}]
[495723,0,"Sales order","OR","KA Standard Order",1210111101,"2019-09-24","2019-09-24",42203009,null,0,"E.ALSOMAHI",2000,10,20,2110,110,"SAR",11937.24,"sales orders",{"$f":"VLOOKUP(P:P,'[1]MVT Name'!D:E,2,0)","v":"فرع الرياض"}]
[495724,0,"Sales order","OR","KA Standard Order",1212321006,"2019-09-24","2019-09-24",380996,null,0,"A.ALZAHMI",2000,10,70,2210,210,"SAR",2491,"sales orders",{"$f":"VLOOKUP(P:P,'[1]MVT Name'!D:E,2,0)","v":"فرع جدة"}]
[495725,0,"Sales order","OR","KA Standard Order",1212321006,"2019-09-24","2019-09-24",380995,null,0,"A.ALZAHMI",2000,10,20,2210,210,"SAR",914,"sales orders",{"$f":"VLOOKUP(P:P,'[1]MVT Name'!D:E,2,0)","v":"فرع جدة"}]
[495726,0,"Sales order","OR","KA Standard Order",1218011002,"2019-09-24","2019-09-24",3696151,null,0,"E.ALSOMAHI",2000,10,70,2110,110,"SAR",877.4,"sales orders",{"$f":"VLOOKUP(P:P,'[1]MVT Name'!D:E,2,0)","v":"فرع الرياض"}]
[495727,0,"Sales order","ZSO","Sale-Out+PromoOrder",1210121093,"2019-09-24","2019-09-24",42211034,null,0,"A.ALZAHMI",2000,10,20,2210,210,"SAR",5137.5,"sales orders",{"$f":"VLOOKUP(P:P,'[1]MVT Name'!D:E,2,0)","v":"فرع جدة"}]
[495728,0,"Sales order","ZSO","Sale-Out+PromoOrder",1210121097,"2019-09-24","2019-09-24",42148114,null,0,"A.ALZAHMI",2000,10,20,2210,210,"SAR",1446,"sales orders",{"$f":"VLOOKUP(P:P,'[1]MVT Name'!D:E,2,0)","v":"فرع جدة"}]
[495729,0,"Sales order","OR","KA Standard Order",1210111101,"2019-09-24","2019-09-24",42208283,null,0,"E.ALSOMAHI",2000,10,20,2110,110,"SAR",3401,"sales orders",{"$f":"VLOOKUP(P:P,'[1]MVT Name'!D:E,2,0)","v":"فرع الرياض"}]
[495730,0,"Sales order","OR","KA Standard Order",1218011002,"2019-09-24","2019-09-24",3696041,null,0,"E.ALSOMAHI",2000,10,20,2110,110,"SAR",3869.83,"sales orders",{"$f":"VLOOKUP(P:P,'[1]MVT Name'!D:E,2,0)","v":"فرع الرياض"}]
[495731,0,"Sales order","OR","KA Standard Order",1218011002,"2019-09-24","2019-09-24",3695802,null,0,"E.ALSOMAHI",2000,10,20,2110,110,"SAR",52,"sales orders",{"$f":"VLOOKUP(P:P,'[1]MVT Name'!D:E,2,0)","v":"فرع الرياض"}]
[495732,0,"Sales order","OR","KA Standard Order",1210111102,"2019-09-24","2019-09-24",227941,null,0,"E.ALSOMAHI",2000,10,20,2110,110,"SAR",7022.83,"sales orders",{"$f":"VLOOKUP(P:P,'[1]MVT Name'!D:E,2,0)","v":"فرع الرياض"}]
[495733,0,"Sales order","OR","KA Standard Order",1110111035,"2019-09-24","2019-09-24",84702,null,0,"E.ALSOMAHI",2000,10,20,2110,110,"SAR",21182.11,"sales orders",{"$f":"VLOOKUP(P:P,'[1]MVT Name'!D:E,2,0)","v":"فرع الرياض"}]
[495734,0,"Sales order","OR","KA Standard Order",1210111174,"2019-09-24","2019-09-24",50972,null,0,"E.ALSOMAHI",2000,10,20,2110,110,"SAR",666,"sales orders",{"$f":"VLOOKUP(P:P,'[1]MVT Name'!D:E,2,0)","v":"فرع الرياض"}]
[495735,0,"Sales order","OR","KA Standard Order",1210111105,"2019-09-24","2019-09-24",42174020,null,0,"E.ALSOMAHI",2000,10,20,2110,110,"SAR",17315.71,"sales orders",{"$f":"VLOOKUP(P:P,'[1]MVT Name'!D:E,2,0)","v":"فرع الرياض"}]
[495736,0,"Sales order","OR","KA Standard Order",1110111037,"2019-09-24","2019-09-24",71130,null,0,"E.ALSOMAHI",2000,10,20,2110,110,"SAR",7955.6,"sales orders",{"$f":"VLOOKUP(P:P,'[1]MVT Name'!D:E,2,0)","v":"فرع الرياض"}]
[495737,0,"Sales order","OR","KA Standard Order",1210141149,"2019-09-24","2019-09-24",42252453,null,0,"B.ALGHAMDI",2000,10,20,2410,410,"SAR",2220,"sales orders",{"$f":"VLOOKUP(P:P,'[1]MVT Name'!D:E,2,0)","v":"فرع المدينة"}]
[495738,0,"Sales order","OR","KA Standard Order",1110111032,"2019-09-24","2019-09-24",356656,null,0,"E.ALSOMAHI",2000,10,70,2110,110,"SAR",3323,"sales orders",{"$f":"VLOOKUP(P:P,'[1]MVT Name'!D:E,2,0)","v":"فرع الرياض"}]
[495739,0,"Sales order","ZSO","Sale-Out+PromoOrder",1210121095,"2019-09-24","2019-09-24",42230370,null,0,"A.ALZAHMI",2000,10,20,2210,210,"SAR",3947,"sales orders",{"$f":"VLOOKUP(P:P,'[1]MVT Name'!D:E,2,0)","v":"فرع جدة"}]
[495740,0,"Sales order","OR","KA Standard Order",1110111030,"2019-09-24","2019-09-24",4214452,null,0,"E.ALSOMAHI",2000,10,20,2110,110,"SAR",6401.5,"sales orders",{"$f":"VLOOKUP(P:P,'[1]MVT Name'!D:E,2,0)","v":"فرع الرياض"}]
[495741,0,"Sales order","OR","KA Standard Order",1110111030,"2019-09-24","2019-09-24",42187124,null,0,"E.ALSOMAHI",2000,10,20,2110,110,"SAR",7073.95,"sales orders",{"$f":"VLOOKUP(P:P,'[1]MVT Name'!D:E,2,0)","v":"فرع الرياض"}]
[495742,0,"Sales order","OR","KA Standard Order",1210111170,"2019-09-24","2019-09-24",42259978,null,0,"E.ALSOMAHI",2000,10,20,2110,110,"SAR",14156.55,"sales orders",{"$f":"VLOOKUP(P:P,'[1]MVT Name'!D:E,2,0)","v":"فرع الرياض"}]
[495743,0,"Sales order","OR","KA Standard Order",1210111107,"2019-09-24","2019-09-24",42208654,null,0,"E.ALSOMAHI",2000,10,20,2110,110,"SAR",3992.5,"sales orders",{"$f":"VLOOKUP(P:P,'[1]MVT Name'!D:E,2,0)","v":"فرع الرياض"}]
[495744,0,"Sales order","OR","KA Standard Order",1210111107,"2019-09-24","2019-09-24",42226240,null,0,"E.ALSOMAHI",2000,10,70,2110,110,"SAR",2255,"sales orders",{"$f":"VLOOKUP(P:P,'[1]MVT Name'!D:E,2,0)","v":"فرع الرياض"}]
[495745,0,"Sales order","OR","KA Standard Order",1210241001,"2019-09-24","2019-09-24",12524223,null,0,"B.ALGHAMDI",2000,10,70,2410,410,"SAR",2862,"sales orders",{"$f":"VLOOKUP(P:P,'[1]MVT Name'!D:E,2,0)","v":"فرع المدينة"}]
[495746,0,"Sales order","OR","KA Standard Order",1210111105,"2019-09-24","2019-09-24",42208545,null,0,"E.ALSOMAHI",2000,10,20,2110,110,"SAR",4245,"sales orders",{"$f":"VLOOKUP(P:P,'[1]MVT Name'!D:E,2,0)","v":"فرع الرياض"}]
[495747,0,"Sales order","OR","KA Standard Order",1210141151,"2019-09-24","2019-09-24",42230409,null,0,"B.ALGHAMDI",2000,10,20,2410,410,"SAR",3987,"sales orders",{"$f":"VLOOKUP(P:P,'[1]MVT Name'!D:E,2,0)","v":"فرع المدينة"}]
[495748,0,"Sales order","OR","KA Standard Order",1210811021,"2019-09-24","2019-09-24",548016,null,0,"E.ALSOMAHI",2000,10,20,2110,110,"SAR",13927.29,"sales orders",{"$f":"VLOOKUP(P:P,'[1]MVT Name'!D:E,2,0)","v":"فرع الرياض"}]
[495749,0,"Sales order","OR","KA Standard Order",1210121094,"2019-09-24","2019-09-24",42187411,null,0,"A.ALZAHMI",2000,10,20,2210,210,"SAR",15596.66,"sales orders",{"$f":"VLOOKUP(P:P,'[1]MVT Name'!D:E,2,0)","v":"فرع جدة"}]
[495750,0,"Sales order","OR","KA Standard Order",1210811023,"2019-09-24","2019-09-24",548027,null,0,"E.ALSOMAHI",2000,10,20,2110,110,"SAR",20904.490000000002,"sales orders",{"$f":"VLOOKUP(P:P,'[1]MVT Name'!D:E,2,0)","v":"فرع الرياض"}]
[495751,0,"Sales order","OR","KA Standard Order",1210141149,"2019-09-24","2019-09-24",42252425,null,0,"B.ALGHAMDI",2000,10,20,2410,410,"SAR",25116.5,"sales orders",{"$f":"VLOOKUP(P:P,'[1]MVT Name'!D:E,2,0)","v":"فرع المدينة"}]
[495752,0,"Sales order","OR","KA Standard Order",1210811013,"2019-09-24","2019-09-24",542479,null,0,"E.ALSOMAHI",2000,10,20,2110,110,"SAR",5254,"sales orders",{"$f":"VLOOKUP(P:P,'[1]MVT Name'!D:E,2,0)","v":"فرع الرياض"}]
[495753,0,"Sales order","OR","KA Standard Order",1210811007,"2019-09-24","2019-09-24",548459,null,0,"E.ALSOMAHI",2000,10,20,2110,110,"SAR",9931.17,"sales orders",{"$f":"VLOOKUP(P:P,'[1]MVT Name'!D:E,2,0)","v":"فرع الرياض"}]
[495754,0,"Sales order","OR","KA Standard Order",1210811018,"2019-09-24","2019-09-24",548055,null,0,"E.ALSOMAHI",2000,10,20,2110,110,"SAR",3316,"sales orders",{"$f":"VLOOKUP(P:P,'[1]MVT Name'!D:E,2,0)","v":"فرع الرياض"}]
[495755,0,"Sales order","OR","KA Standard Order",1218011004,"2019-09-24","2019-09-24",3696044,null,0,"E.ALSOMAHI",2000,10,20,2110,110,"SAR",6642.83,"sales orders",{"$f":"VLOOKUP(P:P,'[1]MVT Name'!D:E,2,0)","v":"فرع الرياض"}]
[495756,0,"Sales order","ZSO","Sale-Out+PromoOrder",1210331044,"2019-09-24","2019-09-24","20100205537-54",null,0,"B.ALGHAMDI",2000,10,20,2310,310,"SAR",454,"sales orders",{"$f":"VLOOKUP(P:P,'[1]MVT Name'!D:E,2,0)","v":"فرع الدمام"}]
[495757,0,"Sales order","OR","KA Standard Order",1218011004,"2019-09-24","2019-09-24",3695805,null,0,"E.ALSOMAHI",2000,10,20,2110,110,"SAR",247,"sales orders",{"$f":"VLOOKUP(P:P,'[1]MVT Name'!D:E,2,0)","v":"فرع الرياض"}]
[495758,0,"Sales order","OR","KA Standard Order",1218011004,"2019-09-24","2019-09-24",3696154,null,0,"E.ALSOMAHI",2000,10,70,2110,110,"SAR",1630,"sales orders",{"$f":"VLOOKUP(P:P,'[1]MVT Name'!D:E,2,0)","v":"فرع الرياض"}]
[495759,0,"Sales order","ZSO","Sale-Out+PromoOrder",1210331022,"2019-09-24","2019-09-24","20100205537-14",null,0,"B.ALGHAMDI",2000,10,20,2310,310,"SAR",912.33,"sales orders",{"$f":"VLOOKUP(P:P,'[1]MVT Name'!D:E,2,0)","v":"فرع الدمام"}]
[495760,0,"Sales order","ZSO","Sale-Out+PromoOrder",1210331013,"2019-09-24","2019-09-24",20100205537,null,0,"B.ALGHAMDI",2000,10,20,2310,310,"SAR",233,"sales orders",{"$f":"VLOOKUP(P:P,'[1]MVT Name'!D:E,2,0)","v":"فرع الدمام"}]
[495761,0,"Sales order","OR","KA Standard Order",1218011005,"2019-09-24","2019-09-24",3696043,null,0,"E.ALSOMAHI",2000,10,20,2110,110,"SAR",15253.23,"sales orders",{"$f":"VLOOKUP(P:P,'[1]MVT Name'!D:E,2,0)","v":"فرع الرياض"}]
[495762,0,"Sales order","OR","KA Standard Order",1218011005,"2019-09-24","2019-09-24",3695804,null,0,"E.ALSOMAHI",2000,10,20,2110,110,"SAR",228,"sales orders",{"$f":"VLOOKUP(P:P,'[1]MVT Name'!D:E,2,0)","v":"فرع الرياض"}]
[495763,0,"Sales order","OR","KA Standard Order",1218011005,"2019-09-24","2019-09-24",3696153,null,0,"E.ALSOMAHI",2000,10,70,2110,110,"SAR",1100,"sales orders",{"$f":"VLOOKUP(P:P,'[1]MVT Name'!D:E,2,0)","v":"فرع الرياض"}]
[495764,0,"Sales order","OR","KA Standard Order",1111011009,"2019-09-24","2019-09-24",3696146,null,0,"E.ALSOMAHI",2000,10,70,2110,110,"SAR",1591.6,"sales orders",{"$f":"VLOOKUP(P:P,'[1]MVT Name'!D:E,2,0)","v":"فرع الرياض"}]
[495765,0,"Sales order","ZSO","Sale-Out+PromoOrder",1210331039,"2019-09-24","2019-09-24",20100205537,null,0,"B.ALGHAMDI",2000,10,20,2310,310,"SAR",474.66,"sales orders",{"$f":"VLOOKUP(P:P,'[1]MVT Name'!D:E,2,0)","v":"فرع الدمام"}]
[495766,0,"Sales order","OR","KA Standard Order",1111011009,"2019-09-24","2019-09-24",3695990,null,0,"E.ALSOMAHI",2000,10,20,2110,110,"SAR",4113,"sales orders",{"$f":"VLOOKUP(P:P,'[1]MVT Name'!D:E,2,0)","v":"فرع الرياض"}]
[495767,0,"Sales order","ZSO","Sale-Out+PromoOrder",1210331052,"2019-09-24","2019-09-24",20100205537,null,0,"B.ALGHAMDI",2000,10,20,2310,310,"SAR",474.66,"sales orders",{"$f":"VLOOKUP(P:P,'[1]MVT Name'!D:E,2,0)","v":"فرع الدمام"}]
[495768,0,"Sales order","OR","KA Standard Order",1210521015,"2019-09-24","2019-09-24",10310212,null,0,"A.ALZAHMI",2000,10,20,2210,210,"SAR",9651.33,"sales orders",{"$f":"VLOOKUP(P:P,'[1]MVT Name'!D:E,2,0)","v":"فرع جدة"}]
[495769,0,"Sales order","OR","KA Standard Order",1111011009,"2019-09-24","2019-09-24",3695798,null,0,"E.ALSOMAHI",2000,10,20,2110,110,"SAR",430,"sales orders",{"$f":"VLOOKUP(P:P,'[1]MVT Name'!D:E,2,0)","v":"فرع الرياض"}]
[495770,0,"Sales order","OR","KA Standard Order",1111011006,"2019-09-24","2019-09-24",3696145,null,0,"E.ALSOMAHI",2000,10,70,2110,110,"SAR",2331,"sales orders",{"$f":"VLOOKUP(P:P,'[1]MVT Name'!D:E,2,0)","v":"فرع الرياض"}]
[495771,0,"Sales order","ZSO","Sale-Out+PromoOrder",1210331039,"2019-09-24","2019-09-24",20100205997,null,0,"B.ALGHAMDI",2000,10,70,2310,310,"SAR",700,"sales orders",{"$f":"VLOOKUP(P:P,'[1]MVT Name'!D:E,2,0)","v":"فرع الدمام"}]
[495772,0,"Sales order","OR","KA Standard Order",1111011006,"2019-09-24","2019-09-24",3695989,null,0,"E.ALSOMAHI",2000,10,20,2110,110,"SAR",3768.5,"sales orders",{"$f":"VLOOKUP(P:P,'[1]MVT Name'!D:E,2,0)","v":"فرع الرياض"}]
[495773,0,"Sales order","ZSO","Sale-Out+PromoOrder",1210331013,"2019-09-24","2019-09-24",20100205997,null,0,"B.ALGHAMDI",2000,10,70,2310,310,"SAR",175,"sales orders",{"$f":"VLOOKUP(P:P,'[1]MVT Name'!D:E,2,0)","v":"فرع الدمام"}]
[495774,0,"Sales order","OR","KA Standard Order",1111011006,"2019-09-24","2019-09-24",3695797,null,0,"E.ALSOMAHI",2000,10,20,2110,110,"SAR",183,"sales orders",{"$f":"VLOOKUP(P:P,'[1]MVT Name'!D:E,2,0)","v":"فرع الرياض"}]
[495775,0,"Sales order","OR","KA Standard Order",1111011004,"2019-09-24","2019-09-24",3696143,null,0,"E.ALSOMAHI",2000,10,70,2110,110,"SAR",1215.8,"sales orders",{"$f":"VLOOKUP(P:P,'[1]MVT Name'!D:E,2,0)","v":"فرع الرياض"}]
[495776,0,"Sales order","ZSO","Sale-Out+PromoOrder",1210331044,"2019-09-24","2019-09-24","20100205997-54",null,0,"B.ALGHAMDI",2000,10,70,2310,310,"SAR",175,"sales orders",{"$f":"VLOOKUP(P:P,'[1]MVT Name'!D:E,2,0)","v":"فرع الدمام"}]
[495777,0,"Sales order","ZSO","Sale-Out+PromoOrder",1210123171,"2019-09-24","2019-09-24",42214005,null,0,"A.ALZAHMI",2000,10,20,2230,230,"SAR",3346.5,"sales orders",{"$f":"VLOOKUP(P:P,'[1]MVT Name'!D:E,2,0)","v":"فرع الطائف"}]
[495778,0,"Sales order","OR","KA Standard Order",1111011004,"2019-09-24","2019-09-24",3695987,null,0,"E.ALSOMAHI",2000,10,20,2110,110,"SAR",3621.33,"sales orders",{"$f":"VLOOKUP(P:P,'[1]MVT Name'!D:E,2,0)","v":"فرع الرياض"}]
[495779,0,"Sales order","ZSO","Sale-Out+PromoOrder",1210331034,"2019-09-24","2019-09-24",20100205997,null,0,"B.ALGHAMDI",2000,10,70,2310,310,"SAR",350,{"$f":"IF(A195<60000000,\"sales orders\",\"return orders\")","v":"sales orders"},{"$f":"VLOOKUP(P:P,'[1]MVT Name'!D:E,2,0)","v":"فرع الدمام"}]
[495780,0,"Sales order","OR","KA Standard Order",1111011004,"2019-09-24","2019-09-24",3695795,null,0,"E.ALSOMAHI",2000,10,20,2110,110,"SAR",143.5,"sales orders",{"$f":"VLOOKUP(P:P,'[1]MVT Name'!D:E,2,0)","v":"فرع الرياض"}]
[495781,0,"Sales order","ZSO","Sale-Out+PromoOrder",1210331037,"2019-09-24","2019-09-24",20100205997,null,0,"B.ALGHAMDI",2000,10,70,2310,310,"SAR",350,"sales orders",{"$f":"VLOOKUP(P:P,'[1]MVT Name'!D:E,2,0)","v":"فرع الدمام"}]
[495782,0,"Sales order","OR","KA Standard Order",1111011003,"2019-09-24","2019-09-24",3696142,null,0,"E.ALSOMAHI",2000,10,70,2110,110,"SAR",591.6,"sales orders",{"$f":"VLOOKUP(P:P,'[1]MVT Name'!D:E,2,0)","v":"فرع الرياض"}]
[495783,0,"Sales order","OR","KA Standard Order",1111011003,"2019-09-24","2019-09-24",3695986,null,0,"E.ALSOMAHI",2000,10,20,2110,110,"SAR",5621.83,"sales orders",{"$f":"VLOOKUP(P:P,'[1]MVT Name'!D:E,2,0)","v":"فرع الرياض"}]
[495784,0,"Sales order","OR","KA Standard Order",1111011003,"2019-09-24","2019-09-24",3695794,null,0,"E.ALSOMAHI",2000,10,20,2110,110,"SAR",235,"sales orders",{"$f":"VLOOKUP(P:P,'[1]MVT Name'!D:E,2,0)","v":"فرع الرياض"}]
[495785,0,"Sales order","OR","KA Standard Order",1111831010,"2019-09-24","2019-09-24",4712430677,null,0,"B.ALGHAMDI",2000,10,70,2310,310,"SAR",4919,"sales orders",{"$f":"VLOOKUP(P:P,'[1]MVT Name'!D:E,2,0)","v":"فرع الدمام"}]
[495786,0,"Sales order","OR","KA Standard Order",1111011008,"2019-09-24","2019-09-24",3695983,null,0,"E.ALSOMAHI",2000,10,20,2110,110,"SAR",3569.33,"sales orders",{"$f":"VLOOKUP(P:P,'[1]MVT Name'!D:E,2,0)","v":"فرع الرياض"}]
[495787,0,"Sales order","OR","KA Standard Order",1111011008,"2019-09-24","2019-09-24",3695791,null,0,"E.ALSOMAHI",2000,10,20,2110,110,"SAR",339.5,"sales orders",{"$f":"VLOOKUP(P:P,'[1]MVT Name'!D:E,2,0)","v":"فرع الرياض"}]
[495788,0,"Sales order","OR","KA Standard Order",1111011001,"2019-09-24","2019-09-24",3696138,null,0,"E.ALSOMAHI",2000,10,70,2110,110,"SAR",635,"sales orders",{"$f":"VLOOKUP(P:P,'[1]MVT Name'!D:E,2,0)","v":"فرع الرياض"}]
[495789,0,"Sales order","OR","KA Standard Order",1210811015,"2019-09-24","2019-09-24",546217,null,0,"E.ALSOMAHI",2000,10,70,2110,110,"SAR",3129.2,"sales orders",{"$f":"VLOOKUP(P:P,'[1]MVT Name'!D:E,2,0)","v":"فرع الرياض"}]
[495790,0,"Sales order","OR","KA Standard Order",1210121099,"2019-09-24","2019-09-24",42253264,null,0,"A.ALZAHMI",2000,10,20,2210,210,"SAR",8875,"sales orders",{"$f":"VLOOKUP(P:P,'[1]MVT Name'!D:E,2,0)","v":"فرع جدة"}]
[495791,0,"Sales order","OR","KA Standard Order",1210811015,"2019-09-24","2019-09-24",546174,null,0,"E.ALSOMAHI",2000,10,20,2110,110,"SAR",8448.33,"sales orders",{"$f":"VLOOKUP(P:P,'[1]MVT Name'!D:E,2,0)","v":"فرع الرياض"}]
[495792,0,"Sales order","OR","KA Standard Order",1210811012,"2019-09-24","2019-09-24",545931,null,0,"E.ALSOMAHI",2000,10,20,2110,110,"SAR",12790.83,"sales orders",{"$f":"VLOOKUP(P:P,'[1]MVT Name'!D:E,2,0)","v":"فرع الرياض"}]
[495793,0,"Sales order","ZSO","Sale-Out+PromoOrder",1210331051,"2019-09-24","2019-09-24",20100205997,null,0,"B.ALGHAMDI",2000,10,70,2310,310,"SAR",350,"sales orders",{"$f":"VLOOKUP(P:P,'[1]MVT Name'!D:E,2,0)","v":"فرع الدمام"}]
[495794,0,"Sales order","OR","KA Standard Order",1111011001,"2019-09-24","2019-09-24",3695790,null,0,"E.ALSOMAHI",2000,10,20,2110,110,"SAR",404.5,"sales orders",{"$f":"VLOOKUP(P:P,'[1]MVT Name'!D:E,2,0)","v":"فرع الرياض"}]
[495795,0,"Sales order","OR","KA Standard Order",1111011001,"2019-09-24","2019-09-24",3695982,null,0,"E.ALSOMAHI",2000,10,20,2110,110,"SAR",1650,"sales orders",{"$f":"VLOOKUP(P:P,'[1]MVT Name'!D:E,2,0)","v":"فرع الرياض"}]
[495796,0,"Sales order","ZSO","Sale-Out+PromoOrder",1210331041,"2019-09-24","2019-09-24",20100205997,null,0,"B.ALGHAMDI",2000,10,70,2310,310,"SAR",875,"sales orders",{"$f":"VLOOKUP(P:P,'[1]MVT Name'!D:E,2,0)","v":"فرع الدمام"}]
[495797,0,"Sales order","ZSO","Sale-Out+PromoOrder",1210331015,"2019-09-24","2019-09-24",20100205997,null,0,"B.ALGHAMDI",2000,10,70,2310,310,"SAR",175,"sales orders",{"$f":"VLOOKUP(P:P,'[1]MVT Name'!D:E,2,0)","v":"فرع الدمام"}]
[495798,0,"Sales order","ZPRO","Discounts",2219372001,"2019-09-24","2019-09-24","jz1909/90",null,0,"E.ALSOMAHI",2000,20,20,2720,723,"SAR",10298.24,"sales orders",{"$f":"VLOOKUP(P:P,'[1]MVT Name'!D:E,2,0)","v":"فرع جيزان"}]
[495799,0,"Sales order","ZSO","Sale-Out+PromoOrder",1210331038,"2019-09-24","2019-09-24",20100205537,null,0,"B.ALGHAMDI",2000,10,20,2310,310,"SAR",442,"sales orders",{"$f":"VLOOKUP(P:P,'[1]MVT Name'!D:E,2,0)","v":"فرع الدمام"}]
[495800,0,"Sales order","OR","KA Standard Order",3219572001,"2019-09-24","2019-09-24","jz1909-89",null,0,"M.ALHARTHI",2000,30,20,2720,721,"SAR",6844.5,"sales orders",{"$f":"VLOOKUP(P:P,'[1]MVT Name'!D:E,2,0)","v":"فرع جيزان"}]
[495801,0,"Sales order","OR","KA Standard Order",1210331038,"2019-09-24","2019-09-24",20100205918,null,0,"B.ALGHAMDI",2000,10,70,2310,310,"SAR",1761,"sales orders",{"$f":"VLOOKUP(P:P,'[1]MVT Name'!D:E,2,0)","v":"فرع الدمام"}]
[495802,0,"Sales order","OR","KA Standard Order",2216872001,"2019-09-24","2019-09-24","jz1909/91",null,0,"E.ALSOMAHI",2000,20,20,2720,723,"SAR",4485,"sales orders",{"$f":"VLOOKUP(P:P,'[1]MVT Name'!D:E,2,0)","v":"فرع جيزان"}]
[495803,0,"Sales order","ZSO","Sale-Out+PromoOrder",1210331038,"2019-09-24","2019-09-24",20100205537,null,0,"B.ALGHAMDI",2000,10,20,2310,310,"SAR",916.66,"sales orders",{"$f":"VLOOKUP(P:P,'[1]MVT Name'!D:E,2,0)","v":"فرع الدمام"}]
[495804,0,"Sales order","ZSO","Sale-Out+PromoOrder",1210331014,"2019-09-24","2019-09-24",20100205537,null,0,"B.ALGHAMDI",2000,10,20,2310,310,"SAR",470.33,"sales orders",{"$f":"VLOOKUP(P:P,'[1]MVT Name'!D:E,2,0)","v":"فرع الدمام"}]
[495805,0,"Sales order","ZSO","Sale-Out+PromoOrder",1210331028,"2019-09-24","2019-09-24",20100205537,null,0,"B.ALGHAMDI",2000,10,20,2310,310,"SAR",916.66,"sales orders",{"$f":"VLOOKUP(P:P,'[1]MVT Name'!D:E,2,0)","v":"فرع الدمام"}]
[495806,0,"Sales order","OR","KA Standard Order",1210331038,"2019-09-24","2019-09-24",20100205919,null,0,"B.ALGHAMDI",2000,10,20,2310,310,"SAR",4013.5,"sales orders",{"$f":"VLOOKUP(P:P,'[1]MVT Name'!D:E,2,0)","v":"فرع الدمام"}]
[495807,0,"Sales order","ZSO","Sale-Out+PromoOrder",1210331050,"2019-09-24","2019-09-24",20100205537,null,0,"B.ALGHAMDI",2000,10,20,2310,310,"SAR",675,"sales orders",{"$f":"VLOOKUP(P:P,'[1]MVT Name'!D:E,2,0)","v":"فرع الدمام"}]
[495808,0,"Sales order","OR","KA Standard Order",1210831018,"2019-09-24","2019-09-24",550360,null,0,"B.ALGHAMDI",2000,10,20,2310,310,"SAR",6601,"sales orders",{"$f":"VLOOKUP(P:P,'[1]MVT Name'!D:E,2,0)","v":"فرع الدمام"}]
[496031,0,"Sales order","OR","KA Standard Order",3112941001,"2019-09-25","2019-09-24","CInv19030000471",null,0,"S.MOUSA",2000,70,20,2410,414,"SAR",114.75,"sales orders",{"$f":"VLOOKUP(P:P,'[1]MVT Name'!D:E,2,0)","v":"فرع المدينة"}]
[496035,0,"Sales order","OR","KA Standard Order",3113142001,"2019-09-25","2019-09-24","CInv19036006366",null,0,"S.MOUSA",2000,70,20,2420,424,"SAR",28.71,"sales orders",{"$f":"VLOOKUP(P:P,'[1]MVT Name'!D:E,2,0)","v":"فرع تبوك"}]
[496036,0,"Sales order","OR","KA Standard Order",3113142001,"2019-09-25","2019-09-24","CInv19036006367",null,0,"S.MOUSA",2000,70,20,2420,424,"SAR",32.56,"sales orders",{"$f":"VLOOKUP(P:P,'[1]MVT Name'!D:E,2,0)","v":"فرع تبوك"}]
[496041,0,"Sales order","OR","KA Standard Order",3115911001,"2019-09-25","2019-09-24","CInv19046001719",null,0,"S.MOUSA",2000,70,20,2110,114,"SAR",20.5,"sales orders",{"$f":"VLOOKUP(P:P,'[1]MVT Name'!D:E,2,0)","v":"فرع الرياض"}]
[496042,0,"Sales order","OR","KA Standard Order",3115312001,"2019-09-25","2019-09-24","CInv19057000455",null,0,"S.MOUSA",2000,70,20,2120,124,"SAR",234,"sales orders",{"$f":"VLOOKUP(P:P,'[1]MVT Name'!D:E,2,0)","v":"فرع القصيم"}]
[496043,0,"Sales order","OR","KA Standard Order",3115312001,"2019-09-25","2019-09-24","CInv19057000456",null,0,"S.MOUSA",2000,70,20,2120,124,"SAR",97.5,"sales orders",{"$f":"VLOOKUP(P:P,'[1]MVT Name'!D:E,2,0)","v":"فرع القصيم"}]
[496046,0,"Sales order","OR","KA Standard Order",3111172001,"2019-09-25","2019-09-24","CInv19080001153",null,0,"S.MOUSA",2000,70,10,2720,724,"SAR",174.5,"sales orders",{"$f":"VLOOKUP(P:P,'[1]MVT Name'!D:E,2,0)","v":"فرع جيزان"}]
[496047,0,"Sales order","OR","KA Standard Order",3111172001,"2019-09-25","2019-09-24","CInv19080001154",null,0,"S.MOUSA",2000,70,20,2720,724,"SAR",1465.5,"sales orders",{"$f":"VLOOKUP(P:P,'[1]MVT Name'!D:E,2,0)","v":"فرع جيزان"}]
[496048,0,"Sales order","ZNR","Near Ex.promot order",3111172001,"2019-09-25","2019-09-24","CInv19080001155",null,0,"S.MOUSA",2000,70,20,2720,724,"SAR",9.5,"sales orders",{"$f":"VLOOKUP(P:P,'[1]MVT Name'!D:E,2,0)","v":"فرع جيزان"}]
[496049,0,"Sales order","ZNR","Near Ex.promot order",3111172001,"2019-09-25","2019-09-24","CInv19080001156",null,0,"S.MOUSA",2000,70,20,2720,724,"SAR",9.5,"sales orders",{"$f":"VLOOKUP(P:P,'[1]MVT Name'!D:E,2,0)","v":"فرع جيزان"}]
[496050,0,"Sales order","OR","KA Standard Order",3117422001,"2019-09-25","2019-09-24","CInv19094001921",null,0,"S.MOUSA",2000,70,20,2220,224,"SAR",594,"sales orders",{"$f":"VLOOKUP(P:P,'[1]MVT Name'!D:E,2,0)","v":"فرع مكة"}]
[496051,0,"Sales order","OR","KA Standard Order",3117422001,"2019-09-25","2019-09-24","CInv19094001922",null,0,"S.MOUSA",2000,70,20,2220,224,"SAR",135.41999999999999,"sales orders",{"$f":"VLOOKUP(P:P,'[1]MVT Name'!D:E,2,0)","v":"فرع مكة"}]
[496052,0,"Sales order","OR","KA Standard Order",3117422001,"2019-09-25","2019-09-24","CInv19094001923",null,0,"S.MOUSA",2000,70,10,2220,224,"SAR",35.5,"sales orders",{"$f":"VLOOKUP(P:P,'[1]MVT Name'!D:E,2,0)","v":"فرع مكة"}]
[496053,0,"Sales order","ZPRO","Discounts",3117422001,"2019-09-25","2019-09-24","CInv19094001924",null,0,"S.MOUSA",2000,70,20,2220,224,"SAR",711.34,"sales orders",{"$f":"VLOOKUP(P:P,'[1]MVT Name'!D:E,2,0)","v":"فرع مكة"}]
[496054,0,"Sales order","OR","KA Standard Order",3117422001,"2019-09-25","2019-09-24","CInv19094001925",null,0,"S.MOUSA",2000,70,10,2220,224,"SAR",71,"sales orders",{"$f":"VLOOKUP(P:P,'[1]MVT Name'!D:E,2,0)","v":"فرع مكة"}]
[496055,0,"Sales order","OR","KA Standard Order",3112571001,"2019-09-25","2019-09-24","CInv19095001838",null,0,"S.MOUSA",2000,70,20,2710,714,"SAR",354,"sales orders",{"$f":"VLOOKUP(P:P,'[1]MVT Name'!D:E,2,0)","v":"فرع خميس مشيط"}]
[496059,0,"Sales order","ZPRO","Discounts",3117222001,"2019-09-25","2019-09-24","CInv19099000863",null,0,"S.MOUSA",2000,70,20,2220,224,"SAR",705.34,"sales orders",{"$f":"VLOOKUP(P:P,'[1]MVT Name'!D:E,2,0)","v":"فرع مكة"}]
[496060,0,"Sales order","OR","KA Standard Order",3117222001,"2019-09-25","2019-09-24","CInv19099000864",null,0,"S.MOUSA",2000,70,20,2220,224,"SAR",18.04,"sales orders",{"$f":"VLOOKUP(P:P,'[1]MVT Name'!D:E,2,0)","v":"فرع مكة"}]
[496061,0,"Sales order","OR","KA Standard Order",3117222001,"2019-09-25","2019-09-24","CInv19099000865",null,0,"S.MOUSA",2000,70,20,2220,224,"SAR",180.42,"sales orders",{"$f":"VLOOKUP(P:P,'[1]MVT Name'!D:E,2,0)","v":"فرع مكة"}]
[496062,0,"Sales order","OR","KA Standard Order",3111472001,"2019-09-25","2019-09-24","CInv19122000615",null,0,"S.MOUSA",2000,70,20,2720,724,"SAR",9.83,"sales orders",{"$f":"VLOOKUP(P:P,'[1]MVT Name'!D:E,2,0)","v":"فرع جيزان"}]
[496063,0,"Sales order","OR","KA Standard Order",3113542001,"2019-09-25","2019-09-24","CInv19153003311",null,0,"S.MOUSA",2000,70,20,2420,424,"SAR",41,"sales orders",{"$f":"VLOOKUP(P:P,'[1]MVT Name'!D:E,2,0)","v":"فرع تبوك"}]
[496064,0,"Sales order","OR","KA Standard Order",3113542001,"2019-09-25","2019-09-24","CInv19153003312",null,0,"S.MOUSA",2000,70,20,2420,424,"SAR",41,"sales orders",{"$f":"VLOOKUP(P:P,'[1]MVT Name'!D:E,2,0)","v":"فرع تبوك"}]
[496066,0,"Sales order","OR","KA Standard Order",3113542001,"2019-09-25","2019-09-24","CInv19153003313",null,0,"S.MOUSA",2000,70,20,2420,424,"SAR",41,"sales orders",{"$f":"VLOOKUP(P:P,'[1]MVT Name'!D:E,2,0)","v":"فرع تبوك"}]
[496067,0,"Sales order","OR","KA Standard Order",3113542001,"2019-09-25","2019-09-24","CInv19153003314",null,0,"S.MOUSA",2000,70,20,2420,424,"SAR",41,"sales orders",{"$f":"VLOOKUP(P:P,'[1]MVT Name'!D:E,2,0)","v":"فرع تبوك"}]
[496068,0,"Sales order","OR","KA Standard Order",3113542001,"2019-09-25","2019-09-24","CInv19153003315",null,0,"S.MOUSA",2000,70,20,2420,424,"SAR",41,"sales orders",{"$f":"VLOOKUP(P:P,'[1]MVT Name'!D:E,2,0)","v":"فرع تبوك"}]
[496069,0,"Sales order","OR","KA Standard Order",3113542001,"2019-09-25","2019-09-24","CInv19153003316",null,0,"S.MOUSA",2000,70,20,2420,424,"SAR",41,"sales orders",{"$f":"VLOOKUP(P:P,'[1]MVT Name'!D:E,2,0)","v":"فرع تبوك"}]
[496070,0,"Sales order","OR","KA Standard Order",3113542001,"2019-09-25","2019-09-24","CInv19153003317",null,0,"S.MOUSA",2000,70,20,2420,424,"SAR",20.5,"sales orders",{"$f":"VLOOKUP(P:P,'[1]MVT Name'!D:E,2,0)","v":"فرع تبوك"}]
[496071,0,"Sales order","OR","KA Standard Order",3119211001,"2019-09-25","2019-09-24","CInv19163001621",null,0,"S.MOUSA",2000,70,20,2110,114,"SAR",619.6,"sales orders",{"$f":"VLOOKUP(P:P,'[1]MVT Name'!D:E,2,0)","v":"فرع الرياض"}]
[496072,0,"Sales order","OR","KA Standard Order",3119211001,"2019-09-25","2019-09-24","CInv19163001622",null,0,"S.MOUSA",2000,70,20,2110,114,"SAR",119,"sales orders",{"$f":"VLOOKUP(P:P,'[1]MVT Name'!D:E,2,0)","v":"فرع الرياض"}]
[496076,0,"Sales order","OR","KA Standard Order",3119311001,"2019-09-25","2019-09-24","CInv19164002842",null,0,"S.MOUSA",2000,70,20,2110,114,"SAR",4.25,"sales orders",{"$f":"VLOOKUP(P:P,'[1]MVT Name'!D:E,2,0)","v":"فرع الرياض"}]
[496077,0,"Sales order","OR","KA Standard Order",3119311001,"2019-09-25","2019-09-24","CInv19164002843",null,0,"S.MOUSA",2000,70,20,2110,114,"SAR",4.25,"sales orders",{"$f":"VLOOKUP(P:P,'[1]MVT Name'!D:E,2,0)","v":"فرع الرياض"}]
[496078,0,"Sales order","OR","KA Standard Order",3119311001,"2019-09-25","2019-09-24","CInv19164002844",null,0,"S.MOUSA",2000,70,20,2110,114,"SAR",20.5,"sales orders",{"$f":"VLOOKUP(P:P,'[1]MVT Name'!D:E,2,0)","v":"فرع الرياض"}]
[496079,0,"Sales order","OR","KA Standard Order",3119311001,"2019-09-25","2019-09-24","CInv19164002845",null,0,"S.MOUSA",2000,70,20,2110,114,"SAR",20.5,"sales orders",{"$f":"VLOOKUP(P:P,'[1]MVT Name'!D:E,2,0)","v":"فرع الرياض"}]
[496086,0,"Sales order","OR","KA Standard Order",3117622001,"2019-09-25","2019-09-24","CInv19171001662",null,0,"S.MOUSA",2000,70,20,2220,224,"SAR",1340,"sales orders",{"$f":"VLOOKUP(P:P,'[1]MVT Name'!D:E,2,0)","v":"فرع مكة"}]
[496087,0,"Sales order","OR","KA Standard Order",3118423001,"2019-09-25","2019-09-24","CInv19174001956",null,0,"S.MOUSA",2000,70,20,2230,234,"SAR",123,{"$f":"IF(A259<60000000,\"sales orders\",\"return orders\")","v":"sales orders"},{"$f":"VLOOKUP(P:P,'[1]MVT Name'!D:E,2,0)","v":"فرع الطائف"}]
[496088,0,"Sales order","OR","KA Standard Order",3118423001,"2019-09-25","2019-09-24","CInv19174001957",null,0,"S.MOUSA",2000,70,20,2230,234,"SAR",41,"sales orders",{"$f":"VLOOKUP(P:P,'[1]MVT Name'!D:E,2,0)","v":"فرع الطائف"}]
[496090,0,"Sales order","OR","KA Standard Order",3118423001,"2019-09-25","2019-09-24","CInv19174001958",null,0,"S.MOUSA",2000,70,20,2230,234,"SAR",144,"sales orders",{"$f":"VLOOKUP(P:P,'[1]MVT Name'!D:E,2,0)","v":"فرع الطائف"}]
[496091,0,"Sales order","OR","KA Standard Order",3118423001,"2019-09-25","2019-09-24","CInv19174001959",null,0,"S.MOUSA",2000,70,20,2230,234,"SAR",282,"sales orders",{"$f":"VLOOKUP(P:P,'[1]MVT Name'!D:E,2,0)","v":"فرع الطائف"}]
[496093,0,"Sales order","OR","KA Standard Order",3118423001,"2019-09-25","2019-09-24","CInv19174001960",null,0,"S.MOUSA",2000,70,20,2230,234,"SAR",415.26,"sales orders",{"$f":"VLOOKUP(P:P,'[1]MVT Name'!D:E,2,0)","v":"فرع الطائف"}]
[496094,0,"Sales order","OR","KA Standard Order",3118631001,"2019-09-25","2019-09-24","CInv19197000363",null,0,"S.MOUSA",2000,70,20,2310,314,"SAR",20.5,"sales orders",{"$f":"VLOOKUP(P:P,'[1]MVT Name'!D:E,2,0)","v":"فرع الدمام"}]
[496095,0,"Sales order","OR","KA Standard Order",3118631001,"2019-09-25","2019-09-24","CInv19197000364",null,0,"S.MOUSA",2000,70,20,2310,314,"SAR",20.5,"sales orders",{"$f":"VLOOKUP(P:P,'[1]MVT Name'!D:E,2,0)","v":"فرع الدمام"}]
[496096,0,"Sales order","OR","KA Standard Order",3118631001,"2019-09-25","2019-09-24","CInv19197000365",null,0,"S.MOUSA",2000,70,20,2310,314,"SAR",20.5,"sales orders",{"$f":"VLOOKUP(P:P,'[1]MVT Name'!D:E,2,0)","v":"فرع الدمام"}]
[496101,0,"Sales order","OR","KA Standard Order",3119511001,"2019-09-25","2019-09-24","CInv19618000988",null,0,"S.MOUSA",2000,70,20,2110,114,"SAR",134.5,"sales orders",{"$f":"VLOOKUP(P:P,'[1]MVT Name'!D:E,2,0)","v":"فرع الرياض"}]
[496102,0,"Sales order","OR","KA Standard Order",3119511001,"2019-09-25","2019-09-24","CInv19618000989",null,0,"S.MOUSA",2000,70,20,2110,114,"SAR",106.21,"sales orders",{"$f":"VLOOKUP(P:P,'[1]MVT Name'!D:E,2,0)","v":"فرع الرياض"}]
[496103,0,"Sales order","OR","KA Standard Order",3116012001,"2019-09-25","2019-09-24","CInv19626000225",null,0,"S.MOUSA",2000,70,20,2120,121,"SAR",41,"sales orders",{"$f":"VLOOKUP(P:P,'[1]MVT Name'!D:E,2,0)","v":"فرع القصيم"}]
[496104,0,"Sales order","OR","KA Standard Order",3116012001,"2019-09-25","2019-09-24","CInv19626000226",null,0,"S.MOUSA",2000,70,20,2120,121,"SAR",41,"sales orders",{"$f":"VLOOKUP(P:P,'[1]MVT Name'!D:E,2,0)","v":"فرع القصيم"}]
[496105,0,"Sales order","OR","KA Standard Order",3116012001,"2019-09-25","2019-09-24","CInv19626000227",null,0,"S.MOUSA",2000,70,20,2120,121,"SAR",41,"sales orders",{"$f":"VLOOKUP(P:P,'[1]MVT Name'!D:E,2,0)","v":"فرع القصيم"}]
[496106,0,"Sales order","OR","KA Standard Order",3116012001,"2019-09-25","2019-09-24","CInv19626000228",null,0,"S.MOUSA",2000,70,20,2120,121,"SAR",61.5,"sales orders",{"$f":"VLOOKUP(P:P,'[1]MVT Name'!D:E,2,0)","v":"فرع القصيم"}]
[496107,0,"Sales order","OR","KA Standard Order",3116012001,"2019-09-25","2019-09-24","CInv19626000229",null,0,"S.MOUSA",2000,70,20,2120,121,"SAR",61.5,"sales orders",{"$f":"VLOOKUP(P:P,'[1]MVT Name'!D:E,2,0)","v":"فرع القصيم"}]
[496109,0,"Sales order","OR","KA Standard Order",3113781001,"2019-09-25","2019-09-24","CInv19631000554",null,0,"S.MOUSA",2000,70,20,2710,714,"SAR",13,"sales orders",{"$f":"VLOOKUP(P:P,'[1]MVT Name'!D:E,2,0)","v":"فرع خميس مشيط"}]
[496110,0,"Sales order","ZPRO","Discounts",3113781001,"2019-09-25","2019-09-24","CInv19631000555",null,0,"S.MOUSA",2000,70,20,2710,714,"SAR",1926.02,"sales orders",{"$f":"VLOOKUP(P:P,'[1]MVT Name'!D:E,2,0)","v":"فرع خميس مشيط"}]
[496111,0,"Sales order","ZPRO","Discounts",3113781001,"2019-09-25","2019-09-24","CInv19631000556",null,0,"S.MOUSA",2000,70,20,2710,714,"SAR",4338.97,"sales orders",{"$f":"VLOOKUP(P:P,'[1]MVT Name'!D:E,2,0)","v":"فرع خميس مشيط"}]
[496112,0,"Sales order","ZPRO","Discounts",3113781001,"2019-09-25","2019-09-24","CInv19631000557",null,0,"S.MOUSA",2000,70,20,2710,714,"SAR",2098.84,"sales orders",{"$f":"VLOOKUP(P:P,'[1]MVT Name'!D:E,2,0)","v":"فرع خميس مشيط"}]
[496114,0,"Sales order","OR","KA Standard Order",3113801001,"2019-09-25","2019-09-24","CInv19634000758",null,0,"S.MOUSA",2000,70,20,2710,714,"SAR",118.5,"sales orders",{"$f":"VLOOKUP(P:P,'[1]MVT Name'!D:E,2,0)","v":"فرع خميس مشيط"}]
[496116,0,"Sales order","OR","KA Standard Order",3113801001,"2019-09-25","2019-09-24","CInv19634000759",null,0,"S.MOUSA",2000,70,20,2710,714,"SAR",93.5,"sales orders",{"$f":"VLOOKUP(P:P,'[1]MVT Name'!D:E,2,0)","v":"فرع خميس مشيط"}]
[496117,0,"Sales order","OR","KA Standard Order",3119131001,"2019-09-25","2019-09-24","CInv19641001147",null,0,"S.MOUSA",2000,70,20,2310,314,"SAR",41,"sales orders",{"$f":"VLOOKUP(P:P,'[1]MVT Name'!D:E,2,0)","v":"فرع الدمام"}]
[496118,0,"Sales order","OR","KA Standard Order",3119131001,"2019-09-25","2019-09-24","CInv19641001148",null,0,"S.MOUSA",2000,70,20,2310,314,"SAR",41,"sales orders",{"$f":"VLOOKUP(P:P,'[1]MVT Name'!D:E,2,0)","v":"فرع الدمام"}]
[496119,0,"Sales order","ZPRO","Discounts",3119131001,"2019-09-25","2019-09-24","CInv19641001149",null,0,"S.MOUSA",2000,70,20,2310,314,"SAR",3261.78,"sales orders",{"$f":"VLOOKUP(P:P,'[1]MVT Name'!D:E,2,0)","v":"فرع الدمام"}]
[496120,0,"Sales order","OR","KA Standard Order",3116112001,"2019-09-25","2019-09-24","CInv19659000455",null,0,"S.MOUSA",2000,70,20,2120,121,"SAR",9.83,"sales orders",{"$f":"VLOOKUP(P:P,'[1]MVT Name'!D:E,2,0)","v":"فرع القصيم"}]
[496121,0,"Sales order","OR","KA Standard Order",3119611001,"2019-09-25","2019-09-24","CInv19660000814",null,0,"S.MOUSA",2000,70,20,2110,114,"SAR",263.13,"sales orders",{"$f":"VLOOKUP(P:P,'[1]MVT Name'!D:E,2,0)","v":"فرع الرياض"}]
[496122,0,"Sales order","OR","KA Standard Order",3119611001,"2019-09-25","2019-09-24","CInv19660000815",null,0,"S.MOUSA",2000,70,20,2110,114,"SAR",20.5,"sales orders",{"$f":"VLOOKUP(P:P,'[1]MVT Name'!D:E,2,0)","v":"فرع الرياض"}]
[496123,0,"Sales order","OR","KA Standard Order",3119611001,"2019-09-25","2019-09-24","CInv19660000816",null,0,"S.MOUSA",2000,70,20,2110,114,"SAR",987.01,"sales orders",{"$f":"VLOOKUP(P:P,'[1]MVT Name'!D:E,2,0)","v":"فرع الرياض"}]
[496124,0,"Sales order","OR","KA Standard Order",3119611001,"2019-09-25","2019-09-24","CInv19660000817",null,0,"S.MOUSA",2000,70,20,2110,114,"SAR",61.5,"sales orders",{"$f":"VLOOKUP(P:P,'[1]MVT Name'!D:E,2,0)","v":"فرع الرياض"}]
[496125,0,"Sales order","OR","KA Standard Order",3119611001,"2019-09-25","2019-09-24","CInv19660000818",null,0,"S.MOUSA",2000,70,20,2110,114,"SAR",61.5,"sales orders",{"$f":"VLOOKUP(P:P,'[1]MVT Name'!D:E,2,0)","v":"فرع الرياض"}]
[496127,0,"Sales order","OR","KA Standard Order",3119611001,"2019-09-25","2019-09-24","CInv19660000819",null,0,"S.MOUSA",2000,70,20,2110,114,"SAR",30,"sales orders",{"$f":"VLOOKUP(P:P,'[1]MVT Name'!D:E,2,0)","v":"فرع الرياض"}]
[496128,0,"Sales order","ZNR","Near Ex.promot order",3119611001,"2019-09-25","2019-09-24","CInv19660000820",null,0,"S.MOUSA",2000,70,20,2110,114,"SAR",19,"sales orders",{"$f":"VLOOKUP(P:P,'[1]MVT Name'!D:E,2,0)","v":"فرع الرياض"}]
[496129,0,"Sales order","ZPRO","Discounts",3111011001,"2019-09-25","2019-09-24","CInv19664001819",null,0,"S.MOUSA",2000,70,20,2110,114,"SAR",34.200000000000003,"sales orders",{"$f":"VLOOKUP(P:P,'[1]MVT Name'!D:E,2,0)","v":"فرع الرياض"}]
[496130,0,"Sales order","OR","KA Standard Order",3111011001,"2019-09-25","2019-09-24","CInv19664001820",null,0,"S.MOUSA",2000,70,20,2110,114,"SAR",24,"sales orders",{"$f":"VLOOKUP(P:P,'[1]MVT Name'!D:E,2,0)","v":"فرع الرياض"}]
[496131,0,"Sales order","OR","KA Standard Order",3111011001,"2019-09-25","2019-09-24","CInv19664001821",null,0,"S.MOUSA",2000,70,20,2110,114,"SAR",1989,"sales orders",{"$f":"VLOOKUP(P:P,'[1]MVT Name'!D:E,2,0)","v":"فرع الرياض"}]
[496133,0,"Sales order","OR","KA Standard Order",3111011001,"2019-09-25","2019-09-24","CInv19664001822",null,0,"S.MOUSA",2000,70,20,2110,114,"SAR",61.5,"sales orders",{"$f":"VLOOKUP(P:P,'[1]MVT Name'!D:E,2,0)","v":"فرع الرياض"}]
[496134,0,"Sales order","OR","KA Standard Order",3111011001,"2019-09-25","2019-09-24","CInv19664001823",null,0,"S.MOUSA",2000,70,20,2110,114,"SAR",59,"sales orders",{"$f":"VLOOKUP(P:P,'[1]MVT Name'!D:E,2,0)","v":"فرع الرياض"}]
[496141,0,"Sales order","OR","KA Standard Order",3113811001,"2019-09-25","2019-09-24","CInv19672000931",null,0,"S.MOUSA",2000,70,20,2710,714,"SAR",164,"sales orders",{"$f":"VLOOKUP(P:P,'[1]MVT Name'!D:E,2,0)","v":"فرع خميس مشيط"}]
[496142,0,"Sales order","OR","KA Standard Order",3113811001,"2019-09-25","2019-09-24","CInv19672000932",null,0,"S.MOUSA",2000,70,20,2710,714,"SAR",75.38,"sales orders",{"$f":"VLOOKUP(P:P,'[1]MVT Name'!D:E,2,0)","v":"فرع خميس مشيط"}]
[496145,0,"Sales order","OR","KA Standard Order",3113911001,"2019-09-25","2019-09-24","CInv19683000323",null,0,"S.MOUSA",2000,70,20,2710,714,"SAR",300.5,"sales orders",{"$f":"VLOOKUP(P:P,'[1]MVT Name'!D:E,2,0)","v":"فرع خميس مشيط"}]
[496147,0,"Sales order","OR","KA Standard Order",3113942001,"2019-09-25","2019-09-24","CInv19689000399",null,0,"S.MOUSA",2000,70,20,2420,424,"SAR",49.21,"sales orders",{"$f":"VLOOKUP(P:P,'[1]MVT Name'!D:E,2,0)","v":"فرع تبوك"}]
[496148,0,"Sales order","ZNR","Near Ex.promot order",3113942001,"2019-09-25","2019-09-24","CInv19689000400",null,0,"S.MOUSA",2000,70,20,2420,424,"SAR",47.08,"sales orders",{"$f":"VLOOKUP(P:P,'[1]MVT Name'!D:E,2,0)","v":"فرع تبوك"}]
[496149,0,"Sales order","OR","KA Standard Order",3113942001,"2019-09-25","2019-09-24","CInv19689000401",null,0,"S.MOUSA",2000,70,20,2420,424,"SAR",41,"sales orders",{"$f":"VLOOKUP(P:P,'[1]MVT Name'!D:E,2,0)","v":"فرع تبوك"}]
[496150,0,"Sales order","OR","KA Standard Order",3113942001,"2019-09-25","2019-09-24","CInv19689000402",null,0,"S.MOUSA",2000,70,20,2420,424,"SAR",57.42,"sales orders",{"$f":"VLOOKUP(P:P,'[1]MVT Name'!D:E,2,0)","v":"فرع تبوك"}]
[496151,0,"Sales order","OR","KA Standard Order",3113942001,"2019-09-25","2019-09-24","CInv19689000403",null,0,"S.MOUSA",2000,70,20,2420,424,"SAR",82,"sales orders",{"$f":"VLOOKUP(P:P,'[1]MVT Name'!D:E,2,0)","v":"فرع تبوك"}]
[496153,0,"Sales order","OR","KA Standard Order",3113942001,"2019-09-25","2019-09-24","CInv19689000404",null,0,"S.MOUSA",2000,70,20,2420,424,"SAR",49.21,"sales orders",{"$f":"VLOOKUP(P:P,'[1]MVT Name'!D:E,2,0)","v":"فرع تبوك"}]
[496160,0,"Sales order","ZPRO","Discounts",3118323001,"2019-09-25","2019-09-24","CInv19690000248",null,0,"S.MOUSA",2000,70,20,2230,234,"SAR",431.41,"sales orders",{"$f":"VLOOKUP(P:P,'[1]MVT Name'!D:E,2,0)","v":"فرع الطائف"}]
[496161,0,"Sales order","OR","KA Standard Order",3118323001,"2019-09-25","2019-09-24","CInv19690000249",null,0,"S.MOUSA",2000,70,20,2230,234,"SAR",106.33,"sales orders",{"$f":"VLOOKUP(P:P,'[1]MVT Name'!D:E,2,0)","v":"فرع الطائف"}]
[496162,0,"Sales order","OR","KA Standard Order",3118323001,"2019-09-25","2019-09-24","CInv19690000250",null,0,"S.MOUSA",2000,70,20,2230,234,"SAR",225.5,"sales orders",{"$f":"VLOOKUP(P:P,'[1]MVT Name'!D:E,2,0)","v":"فرع الطائف"}]
[496167,0,"Sales order","OR","KA Standard Order",3116532001,"2019-09-25","2019-09-24","CInv19693000053",null,0,"S.MOUSA",2000,70,20,2320,324,"SAR",28.5,"sales orders",{"$f":"VLOOKUP(P:P,'[1]MVT Name'!D:E,2,0)","v":"فرع الإحساء"}]
[496168,0,"Sales order","ZNR","Near Ex.promot order",3116232001,"2019-09-25","2019-09-24","CrInv19014001019",null,0,"S.MOUSA",2000,70,60,2320,324,"SAR",45.75,"sales orders",{"$f":"VLOOKUP(P:P,'[1]MVT Name'!D:E,2,0)","v":"فرع الإحساء"}]
[496181,0,"Sales order","ZPRO","Discounts",3115032001,"2019-09-25","2019-09-24","CrInv19068001941",null,0,"S.MOUSA",2000,70,20,2320,324,"SAR",521.4,"sales orders",{"$f":"VLOOKUP(P:P,'[1]MVT Name'!D:E,2,0)","v":"فرع الإحساء"}]
[496182,0,"Sales order","OR","KA Standard Order",3115032001,"2019-09-25","2019-09-24","CrInv19068001942",null,0,"S.MOUSA",2000,70,20,2320,324,"SAR",813.84,"sales orders",{"$f":"VLOOKUP(P:P,'[1]MVT Name'!D:E,2,0)","v":"فرع الإحساء"}]
[496184,0,"Sales order","OR","KA Standard Order",3111172001,"2019-09-25","2019-09-24","CrInv19080001653",null,0,"S.MOUSA",2000,70,20,2720,724,"SAR",601.63,"sales orders",{"$f":"VLOOKUP(P:P,'[1]MVT Name'!D:E,2,0)","v":"فرع جيزان"}]
[496185,0,"Sales order","ZPRO","Discounts",3117422001,"2019-09-25","2019-09-24","CrInv19094002248",null,0,"S.MOUSA",2000,70,20,2220,224,"SAR",1878.04,"sales orders",{"$f":"VLOOKUP(P:P,'[1]MVT Name'!D:E,2,0)","v":"فرع مكة"}]
[496186,0,"Sales order","OR","KA Standard Order",3117422001,"2019-09-25","2019-09-24","CrInv19094002249",null,0,"S.MOUSA",2000,70,20,2220,224,"SAR",711,"sales orders",{"$f":"VLOOKUP(P:P,'[1]MVT Name'!D:E,2,0)","v":"فرع مكة"}]
[496187,0,"Sales order","OR","KA Standard Order",3112571001,"2019-09-25","2019-09-24","CrInv19095003487",null,0,"S.MOUSA",2000,70,20,2710,714,"SAR",1378,"sales orders",{"$f":"VLOOKUP(P:P,'[1]MVT Name'!D:E,2,0)","v":"فرع خميس مشيط"}]
[496188,0,"Sales order","OR","KA Standard Order",3112571001,"2019-09-25","2019-09-24","CrInv19095003488",null,0,"S.MOUSA",2000,70,20,2710,714,"SAR",160,"sales orders",{"$f":"VLOOKUP(P:P,'[1]MVT Name'!D:E,2,0)","v":"فرع خميس مشيط"}]
[496189,0,"Sales order","ZPRO","Discounts",3112571001,"2019-09-25","2019-09-24","CrInv19095003489",null,0,"S.MOUSA",2000,70,20,2710,714,"SAR",141.05000000000001,"sales orders",{"$f":"VLOOKUP(P:P,'[1]MVT Name'!D:E,2,0)","v":"فرع خميس مشيط"}]
[496191,0,"Sales order","OR","KA Standard Order",3112571001,"2019-09-25","2019-09-24","CrInv19095003490",null,0,"S.MOUSA",2000,70,20,2710,714,"SAR",1033.5,"sales orders",{"$f":"VLOOKUP(P:P,'[1]MVT Name'!D:E,2,0)","v":"فرع خميس مشيط"}]
[496192,0,"Sales order","OR","KA Standard Order",3112571001,"2019-09-25","2019-09-24","CrInv19095003491",null,0,"S.MOUSA",2000,70,20,2710,714,"SAR",172.25,"sales orders",{"$f":"VLOOKUP(P:P,'[1]MVT Name'!D:E,2,0)","v":"فرع خميس مشيط"}]
[496196,0,"Sales order","ZPRO","Discounts",3117222001,"2019-09-25","2019-09-24","CrInv19099001806",null,0,"S.MOUSA",2000,70,20,2220,224,"SAR",1825.6,"sales orders",{"$f":"VLOOKUP(P:P,'[1]MVT Name'!D:E,2,0)","v":"فرع مكة"}]
[496197,0,"Sales order","OR","KA Standard Order",3117222001,"2019-09-25","2019-09-24","CrInv19099001807",null,0,"S.MOUSA",2000,70,20,2220,224,"SAR",1048.76,"sales orders",{"$f":"VLOOKUP(P:P,'[1]MVT Name'!D:E,2,0)","v":"فرع مكة"}]
[496198,0,"Sales order","OR","KA Standard Order",3111272001,"2019-09-25","2019-09-24","CrInv19102003609",null,0,"S.MOUSA",2000,70,10,2720,724,"SAR",365,"sales orders",{"$f":"VLOOKUP(P:P,'[1]MVT Name'!D:E,2,0)","v":"فرع جيزان"}]
[496199,0,"Sales order","OR","KA Standard Order",3111272001,"2019-09-25","2019-09-24","CrInv19102003610",null,0,"S.MOUSA",2000,70,10,2720,724,"SAR",431,{"$f":"IF(A323<60000000,\"sales orders\",\"return orders\")","v":"sales orders"},{"$f":"VLOOKUP(P:P,'[1]MVT Name'!D:E,2,0)","v":"فرع جيزان"}]
[496200,0,"Sales order","ZPRO","Discounts",3111272001,"2019-09-25","2019-09-24","CrInv19102003611",null,0,"S.MOUSA",2000,70,20,2720,724,"SAR",1310.3399999999999,"sales orders",{"$f":"VLOOKUP(P:P,'[1]MVT Name'!D:E,2,0)","v":"فرع جيزان"}]
[496201,0,"Sales order","OR","KA Standard Order",3111272001,"2019-09-25","2019-09-24","CrInv19102003612",null,0,"S.MOUSA",2000,70,20,2720,724,"SAR",708.5,"sales orders",{"$f":"VLOOKUP(P:P,'[1]MVT Name'!D:E,2,0)","v":"فرع جيزان"}]
[496202,0,"Sales order","OR","KA Standard Order",3111272001,"2019-09-25","2019-09-24","CrInv19102003613",null,0,"S.MOUSA",2000,70,20,2720,724,"SAR",727.67,"sales orders",{"$f":"VLOOKUP(P:P,'[1]MVT Name'!D:E,2,0)","v":"فرع جيزان"}]
[496203,0,"Sales order","ZNR","Near Ex.promot order",3111272001,"2019-09-25","2019-09-24","CrInv19102003614",null,0,"S.MOUSA",2000,70,20,2720,724,"SAR",38,"sales orders",{"$f":"VLOOKUP(P:P,'[1]MVT Name'!D:E,2,0)","v":"فرع جيزان"}]
[496204,0,"Sales order","ZNR","Near Ex.promot order",3111272001,"2019-09-25","2019-09-24","CrInv19102003615",null,0,"S.MOUSA",2000,70,20,2720,724,"SAR",19,"sales orders",{"$f":"VLOOKUP(P:P,'[1]MVT Name'!D:E,2,0)","v":"فرع جيزان"}]
[496205,0,"Sales order","ZNR","Near Ex.promot order",3111272001,"2019-09-25","2019-09-24","CrInv19102003616",null,0,"S.MOUSA",2000,70,20,2720,724,"SAR",19,"sales orders",{"$f":"VLOOKUP(P:P,'[1]MVT Name'!D:E,2,0)","v":"فرع جيزان"}]
[496206,0,"Sales order","ZNR","Near Ex.promot order",3111272001,"2019-09-25","2019-09-24","CrInv19102003617",null,0,"S.MOUSA",2000,70,20,2720,724,"SAR",19,"sales orders",{"$f":"VLOOKUP(P:P,'[1]MVT Name'!D:E,2,0)","v":"فرع جيزان"}]
[496207,0,"Sales order","ZNR","Near Ex.promot order",3111272001,"2019-09-25","2019-09-24","CrInv19102003618",null,0,"S.MOUSA",2000,70,20,2720,724,"SAR",19,"sales orders",{"$f":"VLOOKUP(P:P,'[1]MVT Name'!D:E,2,0)","v":"فرع جيزان"}]
[496208,0,"Sales order","ZNR","Near Ex.promot order",3111272001,"2019-09-25","2019-09-24","CrInv19102003619",null,0,"S.MOUSA",2000,70,20,2720,724,"SAR",19,"sales orders",{"$f":"VLOOKUP(P:P,'[1]MVT Name'!D:E,2,0)","v":"فرع جيزان"}]
[496209,0,"Sales order","ZNR","Near Ex.promot order",3111272001,"2019-09-25","2019-09-24","CrInv19102003620",null,0,"S.MOUSA",2000,70,20,2720,724,"SAR",38,"sales orders",{"$f":"VLOOKUP(P:P,'[1]MVT Name'!D:E,2,0)","v":"فرع جيزان"}]
[496210,0,"Sales order","ZNR","Near Ex.promot order",3111272001,"2019-09-25","2019-09-24","CrInv19102003621",null,0,"S.MOUSA",2000,70,20,2720,724,"SAR",19,"sales orders",{"$f":"VLOOKUP(P:P,'[1]MVT Name'!D:E,2,0)","v":"فرع جيزان"}]
[496211,0,"Sales order","ZPRO","Discounts",3111472001,"2019-09-25","2019-09-24","CrInv19122001016",null,0,"S.MOUSA",2000,70,20,2720,724,"SAR",1237.26,"sales orders",{"$f":"VLOOKUP(P:P,'[1]MVT Name'!D:E,2,0)","v":"فرع جيزان"}]
[496212,0,"Sales order","ZNR","Near Ex.promot order",3111472001,"2019-09-25","2019-09-24","CrInv19122001017",null,0,"S.MOUSA",2000,70,20,2720,724,"SAR",19,"sales orders",{"$f":"VLOOKUP(P:P,'[1]MVT Name'!D:E,2,0)","v":"فرع جيزان"}]
[496213,0,"Sales order","ZPRO","Discounts",3114741001,"2019-09-25","2019-09-24","CrInv19127001639",null,0,"S.MOUSA",2000,70,20,2410,414,"SAR",1781.32,"sales orders",{"$f":"VLOOKUP(P:P,'[1]MVT Name'!D:E,2,0)","v":"فرع المدينة"}]
[496214,0,"Sales order","OR","KA Standard Order",3114741001,"2019-09-25","2019-09-24","CrInv19127001640",null,0,"S.MOUSA",2000,70,20,2410,414,"SAR",628,"sales orders",{"$f":"VLOOKUP(P:P,'[1]MVT Name'!D:E,2,0)","v":"فرع المدينة"}]
[496215,0,"Sales order","OR","KA Standard Order",3117722001,"2019-09-25","2019-09-24","CrInv19134001127",null,0,"S.MOUSA",2000,70,20,2220,224,"SAR",1810.26,"sales orders",{"$f":"VLOOKUP(P:P,'[1]MVT Name'!D:E,2,0)","v":"فرع مكة"}]
[496216,0,"Sales order","OR","KA Standard Order",3117722001,"2019-09-25","2019-09-24","CrInv19134001128",null,0,"S.MOUSA",2000,70,20,2220,224,"SAR",1190,"sales orders",{"$f":"VLOOKUP(P:P,'[1]MVT Name'!D:E,2,0)","v":"فرع مكة"}]
[496218,0,"Sales order","OR","KA Standard Order",3114241001,"2019-09-25","2019-09-24","CrInv19141002123",null,0,"S.MOUSA",2000,70,20,2410,414,"SAR",511.5,"sales orders",{"$f":"VLOOKUP(P:P,'[1]MVT Name'!D:E,2,0)","v":"فرع المدينة"}]
[496220,0,"Sales order","OR","KA Standard Order",3114241001,"2019-09-25","2019-09-24","CrInv19141002124",null,0,"S.MOUSA",2000,70,20,2410,414,"SAR",1266.2,"sales orders",{"$f":"VLOOKUP(P:P,'[1]MVT Name'!D:E,2,0)","v":"فرع المدينة"}]
[496221,0,"Sales order","OR","KA Standard Order",3113542001,"2019-09-25","2019-09-24","CrInv19153000989",null,0,"S.MOUSA",2000,70,20,2420,424,"SAR",328,"sales orders",{"$f":"VLOOKUP(P:P,'[1]MVT Name'!D:E,2,0)","v":"فرع تبوك"}]
[496222,0,"Sales order","OR","KA Standard Order",3113921001,"2019-09-25","2019-09-24","CrInv19158000879",null,0,"S.MOUSA",2000,70,20,2210,214,"SAR",1683.63,"sales orders",{"$f":"VLOOKUP(P:P,'[1]MVT Name'!D:E,2,0)","v":"فرع جدة"}]
[496223,0,"Sales order","ZPRO","Discounts",3113921001,"2019-09-25","2019-09-24","CrInv19158000880",null,0,"S.MOUSA",2000,70,20,2210,214,"SAR",1865.44,"sales orders",{"$f":"VLOOKUP(P:P,'[1]MVT Name'!D:E,2,0)","v":"فرع جدة"}]
[496224,0,"Sales order","ZPRO","Discounts",3113921001,"2019-09-25","2019-09-24","CrInv19158000881",null,0,"S.MOUSA",2000,70,20,2210,214,"SAR",1543.34,"sales orders",{"$f":"VLOOKUP(P:P,'[1]MVT Name'!D:E,2,0)","v":"فرع جدة"}]
[496226,0,"Sales order","OR","KA Standard Order",3114341001,"2019-09-25","2019-09-24","CrInv19162003005",null,0,"S.MOUSA",2000,70,20,2410,414,"SAR",281.70999999999998,"sales orders",{"$f":"VLOOKUP(P:P,'[1]MVT Name'!D:E,2,0)","v":"فرع المدينة"}]
[496227,0,"Sales order","ZPRO","Discounts",3114341001,"2019-09-25","2019-09-24","CrInv19162003006",null,0,"S.MOUSA",2000,70,20,2410,414,"SAR",1812.6,"sales orders",{"$f":"VLOOKUP(P:P,'[1]MVT Name'!D:E,2,0)","v":"فرع المدينة"}]
[496230,0,"Sales order","OR","KA Standard Order",3117622001,"2019-09-25","2019-09-24","CrInv19171000716",null,0,"S.MOUSA",2000,70,20,2220,224,"SAR",1844,"sales orders",{"$f":"VLOOKUP(P:P,'[1]MVT Name'!D:E,2,0)","v":"فرع مكة"}]
[496231,0,"Sales order","OR","KA Standard Order",3118423001,"2019-09-25","2019-09-24","CrInv19174000486",null,0,"S.MOUSA",2000,70,20,2230,234,"SAR",552.5,"sales orders",{"$f":"VLOOKUP(P:P,'[1]MVT Name'!D:E,2,0)","v":"فرع الطائف"}]
[496232,0,"Sales order","ZPRO","Discounts",3118423001,"2019-09-25","2019-09-24","CrInv19174000487",null,0,"S.MOUSA",2000,70,20,2230,234,"SAR",697.18,"sales orders",{"$f":"VLOOKUP(P:P,'[1]MVT Name'!D:E,2,0)","v":"فرع الطائف"}]
[496233,0,"Sales order","OR","KA Standard Order",3118423001,"2019-09-25","2019-09-24","CrInv19174000488",null,0,"S.MOUSA",2000,70,20,2230,234,"SAR",186,"sales orders",{"$f":"VLOOKUP(P:P,'[1]MVT Name'!D:E,2,0)","v":"فرع الطائف"}]
[496234,0,"Sales order","OR","KA Standard Order",3118423001,"2019-09-25","2019-09-24","CrInv19174000489",null,0,"S.MOUSA",2000,70,20,2230,234,"SAR",271.13,"sales orders",{"$f":"VLOOKUP(P:P,'[1]MVT Name'!D:E,2,0)","v":"فرع الطائف"}]
[10011549,0,"Sales order","ZKB","Consi.Load",3115812001,"2019-09-24","2019-09-24","STIO18172000137",null,0,"S.MOUSA",2000,70,20,2120,121,"SAR",0,"sales orders",{"$f":"VLOOKUP(P:P,'[1]MVT Name'!D:E,2,0)","v":"فرع القصيم"}]
[10011550,0,"Sales order","ZKB","Consi.Load",3117811001,"2019-09-24","2019-09-24","STIO18042000215",null,0,"S.MOUSA",2000,70,20,2110,114,"SAR",0,"sales orders",{"$f":"VLOOKUP(P:P,'[1]MVT Name'!D:E,2,0)","v":"فرع الرياض"}]
[10011551,0,"Sales order","ZKB","Consi.Load",3113721001,"2019-09-24","2019-09-24","STIO19027000332",null,0,"S.MOUSA",2000,70,20,2210,214,"SAR",0,"sales orders",{"$f":"VLOOKUP(P:P,'[1]MVT Name'!D:E,2,0)","v":"فرع جدة"}]
[10011552,0,"Sales order","ZKB","Consi.Load",3111272001,"2019-09-24","2019-09-24","STIO19102000762",null,0,"S.MOUSA",2000,70,20,2720,724,"SAR",0,"sales orders",{"$f":"VLOOKUP(P:P,'[1]MVT Name'!D:E,2,0)","v":"فرع جيزان"}]
[10011553,0,"Sales order","ZKB","Consi.Load",3113921001,"2019-09-24","2019-09-24","STIO19158000223",null,0,"S.MOUSA",2000,70,20,2210,214,"SAR",0,"sales orders",{"$f":"VLOOKUP(P:P,'[1]MVT Name'!D:E,2,0)","v":"فرع جدة"}]
[10011554,0,"Sales order","ZKB","Consi.Load",3118331001,"2019-09-24","2019-09-24","STIO19165000219",null,0,"S.MOUSA",2000,70,20,2310,314,"SAR",0,"sales orders",{"$f":"VLOOKUP(P:P,'[1]MVT Name'!D:E,2,0)","v":"فرع الدمام"}]
[10011555,0,"Sales order","ZKB","Consi.Load",3119511001,"2019-09-24","2019-09-24","STIO19618000158",null,0,"S.MOUSA",2000,70,20,2110,114,"SAR",0,"sales orders",{"$f":"VLOOKUP(P:P,'[1]MVT Name'!D:E,2,0)","v":"فرع الرياض"}]
[10011556,0,"Sales order","ZKB","Consi.Load",3115321001,"2019-09-24","2019-09-24","STIO19658000095",null,0,"S.MOUSA",2000,70,20,2210,214,"SAR",0,"sales orders",{"$f":"VLOOKUP(P:P,'[1]MVT Name'!D:E,2,0)","v":"فرع جدة"}]
[10011557,0,"Sales order","ZKB","Consi.Load",3115321001,"2019-09-24","2019-09-24","STIO19658000096",null,0,"S.MOUSA",2000,70,20,2210,214,"SAR",0,"sales orders",{"$f":"VLOOKUP(P:P,'[1]MVT Name'!D:E,2,0)","v":"فرع جدة"}]
[10011558,0,"Sales order","ZKB","Consi.Load",3119811001,"2019-09-24","2019-09-24","STIO19669000071",null,0,"S.MOUSA",2000,70,20,2110,114,"SAR",0,"sales orders",{"$f":"VLOOKUP(P:P,'[1]MVT Name'!D:E,2,0)","v":"فرع الرياض"}]
[10011559,0,"Sales order","ZKB","Consi.Load",3115621001,"2019-09-24","2019-09-24","STIO19686000093",null,0,"S.MOUSA",2000,70,20,2210,214,"SAR",0,"sales orders",{"$f":"VLOOKUP(P:P,'[1]MVT Name'!D:E,2,0)","v":"فرع جدة"}]
[10011560,0,"Sales order","ZKB","Consi.Load",3111172001,"2019-09-24","2019-09-24","STIO19080000533",null,0,"S.MOUSA",2000,70,20,2720,724,"SAR",0,"sales orders",{"$f":"VLOOKUP(P:P,'[1]MVT Name'!D:E,2,0)","v":"فرع جيزان"}]
[10011561,0,"Sales order","ZKB","Consi.Load",3118323001,"2019-09-24","2019-09-24","STIO19690000037",null,0,"S.MOUSA",2000,70,20,2230,234,"SAR",0,"sales orders",{"$f":"VLOOKUP(P:P,'[1]MVT Name'!D:E,2,0)","v":"فرع الطائف"}]
[10011565,0,"Sales order","ZKB","Consi.Load",3117622001,"2019-09-25","2019-09-24","STIO19171000206",null,0,"S.MOUSA",2000,70,20,2220,224,"SAR",0,"sales orders",{"$f":"VLOOKUP(P:P,'[1]MVT Name'!D:E,2,0)","v":"فرع مكة"}]
[10011566,0,"Sales order","ZKB","Consi.Load",3119511001,"2019-09-25","2019-09-24","STIO19618000159",null,0,"S.MOUSA",2000,70,20,2110,114,"SAR",0,"sales orders",{"$f":"VLOOKUP(P:P,'[1]MVT Name'!D:E,2,0)","v":"فرع الرياض"}]
[10011567,0,"Sales order","ZKB","Consi.Load",3116012001,"2019-09-25","2019-09-24","STIO19626000042",null,0,"S.MOUSA",2000,70,20,2120,121,"SAR",0,"sales orders",{"$f":"VLOOKUP(P:P,'[1]MVT Name'!D:E,2,0)","v":"فرع القصيم"}]
[30001430,0,"Sales order","ZKA","Consi.Unload",3115221001,"2019-09-24","2019-09-24","ULR19621000006",null,0,"ITSAP",2000,70,20,2210,214,"SAR",0,"sales orders",{"$f":"VLOOKUP(P:P,'[1]MVT Name'!D:E,2,0)","v":"فرع جدة"}]
[30001431,0,"Sales order","ZKA","Consi.Unload",3116112001,"2019-09-24","2019-09-24","ULR19659000005",null,0,"ITSAP",2000,70,20,2120,121,"SAR",0,"sales orders",{"$f":"VLOOKUP(P:P,'[1]MVT Name'!D:E,2,0)","v":"فرع القصيم"}]
[30001432,0,"Sales order","ZKA","Consi.Unload",3117522001,"2019-09-24","2019-09-24","ULR19169000013",null,0,"ITSAP",2000,70,20,2220,224,"SAR",0,"sales orders",{"$f":"VLOOKUP(P:P,'[1]MVT Name'!D:E,2,0)","v":"فرع مكة"}]
[30001433,0,"Sales order","ZKA","Consi.Unload",3117522001,"2019-09-24","2019-09-24","ULR19169000014",null,0,"ITSAP",2000,70,20,2220,224,"SAR",0,"sales orders",{"$f":"VLOOKUP(P:P,'[1]MVT Name'!D:E,2,0)","v":"فرع مكة"}]
[60225752,0,"Sales order","YBRE","RMA Request",3310331025,"2019-09-24","2019-09-24",2310062898,null,0,"A.ALNASIR",2000,50,20,2310,311,"SAR",708,"return orders",{"$f":"VLOOKUP(P:P,'[1]MVT Name'!D:E,2,0)","v":"فرع الدمام"}]
[60225753,0,"Sales order","YBRE","RMA Request",1210331037,"2019-09-24","2019-09-24",2310062831,null,0,"A.ALNASIR",2000,10,20,2310,310,"SAR",91.5,"return orders",{"$f":"VLOOKUP(P:P,'[1]MVT Name'!D:E,2,0)","v":"فرع الدمام"}]
[60225754,0,"Sales order","YBRE","RMA Request",3310331021,"2019-09-24","2019-09-24",2310062896,null,0,"A.ALNASIR",2000,50,20,2310,311,"SAR",2.37,"return orders",{"$f":"VLOOKUP(P:P,'[1]MVT Name'!D:E,2,0)","v":"فرع الدمام"}]
[60225755,0,"Sales order","YBRE","RMA Request",1210131077,"2019-09-24","2019-09-24",2310062879,null,0,"A.ALNASIR",2000,10,20,2310,310,"SAR",851.5,"return orders",{"$f":"VLOOKUP(P:P,'[1]MVT Name'!D:E,2,0)","v":"فرع الدمام"}]
[60225756,0,"Sales order","YBRE","RMA Request",1210231097,"2019-09-24","2019-09-24",2310062894,null,0,"A.ALNASIR",2000,10,20,2310,310,"SAR",147,"return orders",{"$f":"VLOOKUP(P:P,'[1]MVT Name'!D:E,2,0)","v":"فرع الدمام"}]
[60225757,0,"Sales order","YBRE","RMA Request",3310331016,"2019-09-24","2019-09-24",2310062872,null,0,"A.ALNASIR",2000,50,20,2310,311,"SAR",71,"return orders",{"$f":"VLOOKUP(P:P,'[1]MVT Name'!D:E,2,0)","v":"فرع الدمام"}]
[60225758,0,"Sales order","YBRE","RMA Request",1210231094,"2019-09-24","2019-09-24",2310062871,null,0,"A.ALNASIR",2000,10,20,2310,310,"SAR",147,"return orders",{"$f":"VLOOKUP(P:P,'[1]MVT Name'!D:E,2,0)","v":"فرع الدمام"}]
[60225759,0,"Sales order","YBRE","RMA Request",1210732003,"2019-09-24","2019-09-24",3603162,null,0,"M.ALAHMED",2000,10,20,2320,320,"SAR",5867.37,"return orders",{"$f":"VLOOKUP(P:P,'[1]MVT Name'!D:E,2,0)","v":"فرع الإحساء"}]
[60225760,0,"Sales order","YBRE","RMA Request",1210731018,"2019-09-24","2019-09-24",3593083,null,0,"A.ALNASIR",2000,10,20,2310,310,"SAR",2318,"return orders",{"$f":"VLOOKUP(P:P,'[1]MVT Name'!D:E,2,0)","v":"فرع الدمام"}]
[60225761,0,"Sales order","YBRE","RMA Request",1210622014,"2019-09-24","2019-09-24",2220028601,null,0,"W.SAAD",2000,10,20,2220,220,"SAR",739.5,"return orders",{"$f":"VLOOKUP(P:P,'[1]MVT Name'!D:E,2,0)","v":"فرع مكة"}]
[60225762,0,"Sales order","YBRE","RMA Request",1210731018,"2019-09-24","2019-09-24",3593083,null,0,"A.ALNASIR",2000,10,20,2310,310,"SAR",2210.65,"return orders",{"$f":"VLOOKUP(P:P,'[1]MVT Name'!D:E,2,0)","v":"فرع الدمام"}]
[60225763,0,"Sales order","YSO","Sales-Out RE Request",1210731015,"2019-09-24","2019-09-24",3500951,null,0,"E.ALSOMAHI",2000,10,70,2310,310,"SAR",328.12,"return orders",{"$f":"VLOOKUP(P:P,'[1]MVT Name'!D:E,2,0)","v":"فرع الدمام"}]
[60225764,0,"Sales order","YBRE","RMA Request",1217512001,"2019-09-24","2019-09-24",2120034482,null,0,"A.HARBI",2000,10,20,2120,120,"SAR",91.5,"return orders",{"$f":"VLOOKUP(P:P,'[1]MVT Name'!D:E,2,0)","v":"فرع القصيم"}]
[60225765,0,"Sales order","YBRE","RMA Request",1210212008,"2019-09-24","2019-09-24",2120034445,null,0,"A.HARBI",2000,10,70,2120,120,"SAR",171,{"$f":"IF(A387<60000000,\"sales orders\",\"return orders\")","v":"return orders"},{"$f":"VLOOKUP(P:P,'[1]MVT Name'!D:E,2,0)","v":"فرع القصيم"}]
[60225766,0,"Sales order","YBRE","RMA Request",1210212112,"2019-09-24","2019-09-24",2120034450,null,0,"A.HARBI",2000,10,70,2120,120,"SAR",171,"return orders",{"$f":"VLOOKUP(P:P,'[1]MVT Name'!D:E,2,0)","v":"فرع القصيم"}]
[60225767,0,"Sales order","YBRE","RMA Request",1210512001,"2019-09-24","2019-09-24",2120034471,null,0,"A.HARBI",2000,10,20,2120,120,"SAR",2058.66,"return orders",{"$f":"VLOOKUP(P:P,'[1]MVT Name'!D:E,2,0)","v":"فرع القصيم"}]
[60225768,0,"Sales order","YBRE","RMA Request",1210212111,"2019-09-24","2019-09-24",2120034481,null,0,"A.HARBI",2000,10,20,2120,120,"SAR",61.5,"return orders",{"$f":"VLOOKUP(P:P,'[1]MVT Name'!D:E,2,0)","v":"فرع القصيم"}]
[60225769,0,"Sales order","YBRE","RMA Request",1210212116,"2019-09-24","2019-09-24",2120034467,null,0,"A.HARBI",2000,10,20,2120,120,"SAR",91.5,"return orders",{"$f":"VLOOKUP(P:P,'[1]MVT Name'!D:E,2,0)","v":"فرع القصيم"}]
[60225770,0,"Sales order","YBRE","RMA Request",1210731015,"2019-09-24","2019-09-24",3500951,null,0,"E.ALSOMAHI",2000,10,70,2310,310,"SAR",1018.83,"return orders",{"$f":"VLOOKUP(P:P,'[1]MVT Name'!D:E,2,0)","v":"فرع الدمام"}]
[60225787,0,"Sales order","YBRE","RMA Request",1210211080,"2019-09-24","2019-09-24",2110119923,null,0,"B.ELNOUR",2000,10,20,2110,110,"SAR",469,"return orders",{"$f":"VLOOKUP(P:P,'[1]MVT Name'!D:E,2,0)","v":"فرع الرياض"}]
[60225788,0,"Sales order","YBRE","RMA Request",1210211066,"2019-09-24","2019-09-24",2110119933,null,0,"B.ELNOUR",2000,10,20,2110,110,"SAR",99,"return orders",{"$f":"VLOOKUP(P:P,'[1]MVT Name'!D:E,2,0)","v":"فرع الرياض"}]
[60225789,0,"Sales order","YBRE","RMA Request",1210211112,"2019-09-24","2019-09-24",2110119932,null,0,"B.ELNOUR",2000,10,20,2110,110,"SAR",172.33,"return orders",{"$f":"VLOOKUP(P:P,'[1]MVT Name'!D:E,2,0)","v":"فرع الرياض"}]
[60225790,0,"Sales order","YBRE","RMA Request",1210211138,"2019-09-24","2019-09-24",2110119916,null,0,"B.ELNOUR",2000,10,20,2110,110,"SAR",293,"return orders",{"$f":"VLOOKUP(P:P,'[1]MVT Name'!D:E,2,0)","v":"فرع الرياض"}]
[60225791,0,"Sales order","YBRE","RMA Request",1210211070,"2019-09-24","2019-09-24",2110119911,null,0,"B.ELNOUR",2000,10,20,2110,110,"SAR",293,"return orders",{"$f":"VLOOKUP(P:P,'[1]MVT Name'!D:E,2,0)","v":"فرع الرياض"}]
[60225792,0,"Sales order","YBRE","RMA Request",3228242001,"2019-09-24","2019-09-24",2420019638,null,0,"Y.HABIB",2000,30,20,2420,421,"SAR",117,"return orders",{"$f":"VLOOKUP(P:P,'[1]MVT Name'!D:E,2,0)","v":"فرع تبوك"}]
[60225793,0,"Sales order","YBRE","RMA Request",1210211117,"2019-09-24","2019-09-24",2110119910,null,0,"B.ELNOUR",2000,10,20,2110,110,"SAR",260.5,"return orders",{"$f":"VLOOKUP(P:P,'[1]MVT Name'!D:E,2,0)","v":"فرع الرياض"}]
[60225794,0,"Sales order","YBRE","RMA Request",1210111114,"2019-09-24","2019-09-24",2110119901,null,0,"B.ELNOUR",2000,10,20,2110,110,"SAR",245.5,"return orders",{"$f":"VLOOKUP(P:P,'[1]MVT Name'!D:E,2,0)","v":"فرع الرياض"}]
[60225795,0,"Sales order","YBRE","RMA Request",3224442001,"2019-09-24","2019-09-24",2420019627,null,0,"Y.HABIB",2000,30,20,2420,421,"SAR",578.5,"return orders",{"$f":"VLOOKUP(P:P,'[1]MVT Name'!D:E,2,0)","v":"فرع تبوك"}]
[60225796,0,"Sales order","YBRE","RMA Request",1210211115,"2019-09-24","2019-09-24",2110119909,null,0,"B.ELNOUR",2000,10,20,2110,110,"SAR",871,"return orders",{"$f":"VLOOKUP(P:P,'[1]MVT Name'!D:E,2,0)","v":"فرع الرياض"}]
[60225797,0,"Sales order","YBRE","RMA Request",1210242031,"2019-09-24","2019-09-24",2420019606,null,0,"Y.HABIB",2000,10,20,2420,420,"SAR",293,"return orders",{"$f":"VLOOKUP(P:P,'[1]MVT Name'!D:E,2,0)","v":"فرع تبوك"}]
[60225798,0,"Sales order","YBRE","RMA Request",1210211120,"2019-09-24","2019-09-24",2110119908,null,0,"B.ELNOUR",2000,10,20,2110,110,"SAR",1312.03,"return orders",{"$f":"VLOOKUP(P:P,'[1]MVT Name'!D:E,2,0)","v":"فرع الرياض"}]
[60225799,0,"Sales order","YBRE","RMA Request",1210211119,"2019-09-24","2019-09-24",2110119918,null,0,"B.ELNOUR",2000,10,20,2110,110,"SAR",61.5,"return orders",{"$f":"VLOOKUP(P:P,'[1]MVT Name'!D:E,2,0)","v":"فرع الرياض"}]
[60225800,0,"Sales order","YBRE","RMA Request",2243531002,"2019-09-24","2019-09-24",190100000001,null,0,"A.ALNASIR",2000,30,20,2310,311,"SAR",110,"return orders",{"$f":"VLOOKUP(P:P,'[1]MVT Name'!D:E,2,0)","v":"فرع الدمام"}]
[60225801,0,"Sales order","YBRE","RMA Request",1210211113,"2019-09-24","2019-09-24",2110119816,null,0,"B.ELNOUR",2000,10,70,2110,110,"SAR",954,"return orders",{"$f":"VLOOKUP(P:P,'[1]MVT Name'!D:E,2,0)","v":"فرع الرياض"}]
[60225802,0,"Sales order","YBRE","RMA Request",1210211112,"2019-09-24","2019-09-24",2110119815,null,0,"B.ELNOUR",2000,10,70,2110,110,"SAR",954,"return orders",{"$f":"VLOOKUP(P:P,'[1]MVT Name'!D:E,2,0)","v":"فرع الرياض"}]
[60225803,0,"Sales order","YBRE","RMA Request",1210211088,"2019-09-24","2019-09-24",2110119813,null,0,"B.ELNOUR",2000,10,70,2110,110,"SAR",954,"return orders",{"$f":"VLOOKUP(P:P,'[1]MVT Name'!D:E,2,0)","v":"فرع الرياض"}]
[60225804,0,"Sales order","YBRE","RMA Request",3239331001,"2019-09-24","2019-09-24",47,null,0,"A.ALNASIR",2000,30,20,2310,311,"SAR",311.44,"return orders",{"$f":"VLOOKUP(P:P,'[1]MVT Name'!D:E,2,0)","v":"فرع الدمام"}]
[60225805,0,"Sales order","YNR","RE.Req (Near EXP.)",2213322001,"2019-09-24","2019-09-24",2220026885,null,0,"W.SAAD",2000,20,20,2220,223,"SAR",5942.78,"return orders",{"$f":"VLOOKUP(P:P,'[1]MVT Name'!D:E,2,0)","v":"فرع مكة"}]
[60225806,0,"Sales order","YPRO","Pro Cal+Dic RE Req.",3239331001,"2019-09-24","2019-09-24",47,null,0,"A.ALNASIR",2000,30,20,2310,311,"SAR",216.66,"return orders",{"$f":"VLOOKUP(P:P,'[1]MVT Name'!D:E,2,0)","v":"فرع الدمام"}]
[60225807,0,"Sales order","YBRE","RMA Request",3237431001,"2019-09-24","2019-09-24","5556+5636+6099+5503+5923",null,0,"A.ALNASIR",2000,60,20,2310,311,"SAR",1501.44,"return orders",{"$f":"VLOOKUP(P:P,'[1]MVT Name'!D:E,2,0)","v":"فرع الدمام"}]
[60225808,0,"Sales order","YBRE","RMA Request",1210231097,"2019-09-24","2019-09-24",6593713,null,0,"A.ALNASIR",2000,10,20,2310,310,"SAR",26.46,"return orders",{"$f":"VLOOKUP(P:P,'[1]MVT Name'!D:E,2,0)","v":"فرع الدمام"}]
[60225809,0,"Sales order","YBRE","RMA Request",1210731016,"2019-09-24","2019-09-24",3603399,null,0,"A.ALNASIR",2000,10,70,2310,310,"SAR",707.17,"return orders",{"$f":"VLOOKUP(P:P,'[1]MVT Name'!D:E,2,0)","v":"فرع الدمام"}]
[60225810,0,"Sales order","YSO","Sales-Out RE Request",1210731016,"2019-09-24","2019-09-24",3603399,null,0,"A.ALNASIR",2000,10,70,2310,310,"SAR",529.25,"return orders",{"$f":"VLOOKUP(P:P,'[1]MVT Name'!D:E,2,0)","v":"فرع الدمام"}]
[60225811,0,"Sales order","YBRE","RMA Request",1210731016,"2019-09-24","2019-09-24",3603398,null,0,"A.ALNASIR",2000,10,70,2310,310,"SAR",794.59,"return orders",{"$f":"VLOOKUP(P:P,'[1]MVT Name'!D:E,2,0)","v":"فرع الدمام"}]
[60225812,0,"Sales order","YBRE","RMA Request",1212841002,"2019-09-24","2019-09-24",2410037962,null,0,"M.HASSAN",2000,10,20,2410,410,"SAR",875,"return orders",{"$f":"VLOOKUP(P:P,'[1]MVT Name'!D:E,2,0)","v":"فرع المدينة"}]
[60225813,0,"Sales order","YSO","Sales-Out RE Request",1210731016,"2019-09-24","2019-09-24",3603398,null,0,"A.ALNASIR",2000,10,70,2310,310,"SAR",935.63,"return orders",{"$f":"VLOOKUP(P:P,'[1]MVT Name'!D:E,2,0)","v":"فرع الدمام"}]
[60225814,0,"Sales order","YBRE","RMA Request",1210321003,"2019-09-24","2019-09-24",621237,null,0,"A.ABDELHALIM",2000,10,20,2210,210,"SAR",48.83,"return orders",{"$f":"VLOOKUP(P:P,'[1]MVT Name'!D:E,2,0)","v":"فرع جدة"}]
[60225815,0,"Sales order","YBRE","RMA Request",1210111061,"2019-09-24","2019-09-24",2110119137,null,0,"B.ELNOUR",2000,10,20,2110,110,"SAR",280,"return orders",{"$f":"VLOOKUP(P:P,'[1]MVT Name'!D:E,2,0)","v":"فرع الرياض"}]
[60225816,0,"Sales order","YBRE","RMA Request",1111831010,"2019-09-24","2019-09-24",4712430234,null,0,"A.ALNASIR",2000,10,20,2310,310,"SAR",242.41,"return orders",{"$f":"VLOOKUP(P:P,'[1]MVT Name'!D:E,2,0)","v":"فرع الدمام"}]
[60225817,0,"Sales order","YBRE","RMA Request",1210131140,"2019-09-24","2019-09-24",112101,null,0,"A.ALNASIR",2000,10,20,2310,310,"SAR",1055.01,"return orders",{"$f":"VLOOKUP(P:P,'[1]MVT Name'!D:E,2,0)","v":"فرع الدمام"}]
[60225818,0,"Sales order","YBRE","RMA Request",1210131143,"2019-09-24","2019-09-24",97158,null,0,"A.ALNASIR",2000,10,70,2310,310,"SAR",848.96,"return orders",{"$f":"VLOOKUP(P:P,'[1]MVT Name'!D:E,2,0)","v":"فرع الدمام"}]
[60225819,0,"Sales order","YBRE","RMA Request",3310311015,"2019-09-24","2019-09-24","2019/09/21",null,0,"K.NASEER",2000,50,20,2110,111,"SAR",567.95000000000005,"return orders",{"$f":"VLOOKUP(P:P,'[1]MVT Name'!D:E,2,0)","v":"فرع الرياض"}]
[60225820,0,"Sales order","YBRE","RMA Request",2213322001,"2019-09-24","2019-09-24",2220020962,null,0,"W.SAAD",2000,20,20,2220,223,"SAR",302.88,"return orders",{"$f":"VLOOKUP(P:P,'[1]MVT Name'!D:E,2,0)","v":"فرع مكة"}]
[60225821,0,"Sales order","YPRO","Pro Cal+Dic RE Req.",1210131143,"2019-09-24","2019-09-24",97158,null,0,"A.ALNASIR",2000,10,70,2310,310,"SAR",212.92,"return orders",{"$f":"VLOOKUP(P:P,'[1]MVT Name'!D:E,2,0)","v":"فرع الدمام"}]
[60225822,0,"Sales order","YPRO","Pro Cal+Dic RE Req.",2213322001,"2019-09-24","2019-09-24",2220017529,null,0,"W.SAAD",2000,20,20,2220,223,"SAR",362.98,"return orders",{"$f":"VLOOKUP(P:P,'[1]MVT Name'!D:E,2,0)","v":"فرع مكة"}]
[60225824,0,"Sales order","YBRE","RMA Request",1212922001,"2019-09-24","2019-09-24",3356,null,0,"W.SAAD",2000,10,20,2220,220,"SAR",30.5,"return orders",{"$f":"VLOOKUP(P:P,'[1]MVT Name'!D:E,2,0)","v":"فرع مكة"}]
[60225825,0,"Sales order","YSO","Sales-Out RE Request",1212922001,"2019-09-24","2019-09-24",3356,null,0,"W.SAAD",2000,10,20,2220,220,"SAR",117.6,"return orders",{"$f":"VLOOKUP(P:P,'[1]MVT Name'!D:E,2,0)","v":"فرع مكة"}]
[60225826,0,"Sales order","YBRE","RMA Request",1110121005,"2019-09-24","2019-09-24",1958,null,0,"A.ABDELHALIM",2000,10,20,2210,210,"SAR",1567.58,"return orders",{"$f":"VLOOKUP(P:P,'[1]MVT Name'!D:E,2,0)","v":"فرع جدة"}]
[60225827,0,"Sales order","YBRE","RMA Request",1211831004,"2019-09-24","2019-09-24",4712429535,null,0,"A.ALNASIR",2000,10,20,2310,310,"SAR",2116.52,"return orders",{"$f":"VLOOKUP(P:P,'[1]MVT Name'!D:E,2,0)","v":"فرع الدمام"}]
[60225828,0,"Sales order","YBRE","RMA Request",1210732001,"2019-09-24","2019-09-24",3605822,null,0,"M.ALAHMED",2000,10,20,2320,320,"SAR",369.54,"return orders",{"$f":"VLOOKUP(P:P,'[1]MVT Name'!D:E,2,0)","v":"فرع الإحساء"}]
[60225829,0,"Sales order","YBRE","RMA Request",1211211036,"2019-09-24","2019-09-24",105229,null,0,"K.NASEER",2000,50,20,2110,111,"SAR",41.83,"return orders",{"$f":"VLOOKUP(P:P,'[1]MVT Name'!D:E,2,0)","v":"فرع الرياض"}]
[60225830,0,"Sales order","YBRE","RMA Request",1210641016,"2019-09-24","2019-09-24",3600774,null,0,"M.HASSAN",2000,10,20,2410,410,"SAR",509.64,"return orders",{"$f":"VLOOKUP(P:P,'[1]MVT Name'!D:E,2,0)","v":"فرع المدينة"}]
[60225831,0,"Sales order","YBRE","RMA Request",1211211009,"2019-09-24","2019-09-24",105269,null,0,"K.NASEER",2000,50,20,2110,111,"SAR",112.56,"return orders",{"$f":"VLOOKUP(P:P,'[1]MVT Name'!D:E,2,0)","v":"فرع الرياض"}]
[60225832,0,"Sales order","YBRE","RMA Request",1210211138,"2019-09-24","2019-09-24",6590998,null,0,"A.MOAWAD",2000,10,70,2110,110,"SAR",12.67,"return orders",{"$f":"VLOOKUP(P:P,'[1]MVT Name'!D:E,2,0)","v":"فرع الرياض"}]
[60225833,0,"Sales order","YBRE","RMA Request",1211211034,"2019-09-24","2019-09-24",101340,null,0,"K.NASEER",2000,50,20,2110,111,"SAR",24.42,"return orders",{"$f":"VLOOKUP(P:P,'[1]MVT Name'!D:E,2,0)","v":"فرع الرياض"}]
[60225834,0,"Sales order","YBRE","RMA Request",1110121005,"2019-09-24","2019-09-24",1959,null,0,"A.ABDELHALIM",2000,10,20,2210,210,"SAR",498.06,"return orders",{"$f":"VLOOKUP(P:P,'[1]MVT Name'!D:E,2,0)","v":"فرع جدة"}]
[60225835,0,"Sales order","YBRE","RMA Request",1110111012,"2019-09-24","2019-09-24",259363,null,0,"B.ELNOUR",2000,10,20,2110,110,"SAR",2684.44,"return orders",{"$f":"VLOOKUP(P:P,'[1]MVT Name'!D:E,2,0)","v":"فرع الرياض"}]
[60225836,0,"Sales order","YBRE","RMA Request",3310311016,"2019-09-24","2019-09-24",6072019,null,0,"B.ELNOUR",2000,50,20,2110,111,"SAR",31.08,"return orders",{"$f":"VLOOKUP(P:P,'[1]MVT Name'!D:E,2,0)","v":"فرع الرياض"}]
[60225837,0,"Sales order","YBRE","RMA Request",1211211095,"2019-09-24","2019-09-24",101619,null,0,"K.NASEER",2000,50,20,2110,111,"SAR",28.47,"return orders",{"$f":"VLOOKUP(P:P,'[1]MVT Name'!D:E,2,0)","v":"فرع الرياض"}]
[60225838,0,"Sales order","YBRE","RMA Request",1310211110,"2019-09-24","2019-09-24",6592473,null,0,"K.NASEER",2000,50,20,2110,110,"SAR",156.16999999999999,"return orders",{"$f":"VLOOKUP(P:P,'[1]MVT Name'!D:E,2,0)","v":"فرع الرياض"}]
[60225839,0,"Sales order","YBRE","RMA Request",1210811004,"2019-09-24","2019-09-24",16872207191,null,0,"B.ELNOUR",2000,10,60,2110,110,"SAR",831.13,"return orders",{"$f":"VLOOKUP(P:P,'[1]MVT Name'!D:E,2,0)","v":"فرع الرياض"}]
[60225840,0,"Sales order","YBRE","RMA Request",1210131164,"2019-09-24","2019-09-24",67388,null,0,"A.ALNASIR",2000,10,20,2310,310,"SAR",199.38,"return orders",{"$f":"VLOOKUP(P:P,'[1]MVT Name'!D:E,2,0)","v":"فرع الدمام"}]
[60225841,0,"Sales order","YBRE","RMA Request",1210811004,"2019-09-24","2019-09-24",16872207191,null,0,"B.ELNOUR",2000,10,20,2110,110,"SAR",322.36,"return orders",{"$f":"VLOOKUP(P:P,'[1]MVT Name'!D:E,2,0)","v":"فرع الرياض"}]
[60225842,0,"Sales order","YBRE","RMA Request",1211211060,"2019-09-24","2019-09-24",68269,null,0,"K.NASEER",2000,50,20,2110,111,"SAR",262.58,"return orders",{"$f":"VLOOKUP(P:P,'[1]MVT Name'!D:E,2,0)","v":"فرع الرياض"}]
[60225843,0,"Sales order","YBRE","RMA Request",1210831018,"2019-09-24","2019-09-24","RS10316871909191",null,0,"A.ALNASIR",2000,10,70,2310,310,"SAR",354.54,"return orders",{"$f":"VLOOKUP(P:P,'[1]MVT Name'!D:E,2,0)","v":"فرع الدمام"}]
[60225844,0,"Sales order","YBRE","RMA Request",1110121005,"2019-09-24","2019-09-24",1961,null,0,"A.ABDELHALIM",2000,10,20,2210,210,"SAR",672.62,"return orders",{"$f":"VLOOKUP(P:P,'[1]MVT Name'!D:E,2,0)","v":"فرع جدة"}]
[60225845,0,"Sales order","YBRE","RMA Request",1211211097,"2019-09-24","2019-09-24",40373,null,0,"K.NASEER",2000,50,20,2110,111,"SAR",3.75,"return orders",{"$f":"VLOOKUP(P:P,'[1]MVT Name'!D:E,2,0)","v":"فرع الرياض"}]
[60225846,0,"Sales order","YBRE","RMA Request",1211211083,"2019-09-24","2019-09-24",658,null,0,"K.NASEER",2000,50,20,2110,111,"SAR",14.73,{"$f":"IF(A451<60000000,\"sales orders\",\"return orders\")","v":"return orders"},{"$f":"VLOOKUP(P:P,'[1]MVT Name'!D:E,2,0)","v":"فرع الرياض"}]
[60225847,0,"Sales order","YBRE","RMA Request",1210131163,"2019-09-24","2019-09-24",60113,null,0,"A.ALNASIR",2000,10,20,2310,310,"SAR",790.82,"return orders",{"$f":"VLOOKUP(P:P,'[1]MVT Name'!D:E,2,0)","v":"فرع الدمام"}]
[60225848,0,"Sales order","YBRE","RMA Request",1211211088,"2019-09-24","2019-09-24",105996,null,0,"K.NASEER",2000,50,20,2110,111,"SAR",49.17,"return orders",{"$f":"VLOOKUP(P:P,'[1]MVT Name'!D:E,2,0)","v":"فرع الرياض"}]
[60225849,0,"Sales order","YBRE","RMA Request",1210122169,"2019-09-24","2019-09-24",748,null,0,"W.SAAD",2000,10,20,2220,220,"SAR",209.57,"return orders",{"$f":"VLOOKUP(P:P,'[1]MVT Name'!D:E,2,0)","v":"فرع مكة"}]
[60225850,0,"Sales order","YBRE","RMA Request",1210131078,"2019-09-24","2019-09-24",224104,null,0,"A.ALNASIR",2000,10,20,2310,310,"SAR",372.57,"return orders",{"$f":"VLOOKUP(P:P,'[1]MVT Name'!D:E,2,0)","v":"فرع الدمام"}]
[60225851,0,"Sales order","YBRE","RMA Request",1217811003,"2019-09-24","2019-09-24","08/09/2019",null,0,"K.NASEER",2000,50,20,2110,111,"SAR",25.28,"return orders",{"$f":"VLOOKUP(P:P,'[1]MVT Name'!D:E,2,0)","v":"فرع الرياض"}]
[60225852,0,"Sales order","YBRE","RMA Request",1210211052,"2019-09-24","2019-09-24",6543320,null,0,"K.NASEER",2000,50,20,2110,110,"SAR",4.75,"return orders",{"$f":"VLOOKUP(P:P,'[1]MVT Name'!D:E,2,0)","v":"فرع الرياض"}]
[60225853,0,"Sales order","YBRE","RMA Request",1211211091,"2019-09-24","2019-09-24",469,null,0,"K.NASEER",2000,50,20,2110,111,"SAR",113.03,"return orders",{"$f":"VLOOKUP(P:P,'[1]MVT Name'!D:E,2,0)","v":"فرع الرياض"}]
[60225854,0,"Sales order","YBRE","RMA Request",1210131142,"2019-09-24","2019-09-24",100633,null,0,"A.ALNASIR",2000,10,20,2310,310,"SAR",162.54,"return orders",{"$f":"VLOOKUP(P:P,'[1]MVT Name'!D:E,2,0)","v":"فرع الدمام"}]
[60225855,0,"Sales order","YBRE","RMA Request",1210121092,"2019-09-24","2019-09-24",2210079584,null,0,"S.ALSHABRAWY",2000,10,20,2210,210,"SAR",5358.64,"return orders",{"$f":"VLOOKUP(P:P,'[1]MVT Name'!D:E,2,0)","v":"فرع جدة"}]
[60225856,0,"Sales order","YBRE","RMA Request",3219241001,"2019-09-24","2019-09-24",12334,null,0,"A.ALHADRI",2000,30,20,2410,411,"SAR",76,"return orders",{"$f":"VLOOKUP(P:P,'[1]MVT Name'!D:E,2,0)","v":"فرع المدينة"}]
[60225857,0,"Sales order","YBRE","RMA Request",1211211082,"2019-09-24","2019-09-24",105919,null,0,"A.MOAWAD",2000,50,20,2110,111,"SAR",153.16999999999999,"return orders",{"$f":"VLOOKUP(P:P,'[1]MVT Name'!D:E,2,0)","v":"فرع الرياض"}]
[60225858,0,"Sales order","YBRE","RMA Request",1210221107,"2019-09-24","2019-09-24",2210079626,null,0,"S.ALSHABRAWY",2000,10,20,2210,210,"SAR",1442,"return orders",{"$f":"VLOOKUP(P:P,'[1]MVT Name'!D:E,2,0)","v":"فرع جدة"}]
[60225859,0,"Sales order","YBRE","RMA Request",3220721001,"2019-09-24","2019-09-24",2210079606,null,0,"S.ALSHABRAWY",2000,30,20,2210,211,"SAR",144,"return orders",{"$f":"VLOOKUP(P:P,'[1]MVT Name'!D:E,2,0)","v":"فرع جدة"}]
[60225860,0,"Sales order","YBRE","RMA Request",1210521002,"2019-09-24","2019-09-24",2210079639,null,0,"S.ALSHABRAWY",2000,10,60,2210,210,"SAR",97,"return orders",{"$f":"VLOOKUP(P:P,'[1]MVT Name'!D:E,2,0)","v":"فرع جدة"}]
[60225861,0,"Sales order","YBRE","RMA Request",1110121005,"2019-09-24","2019-09-24",1960,null,0,"A.ABDELHALIM",2000,10,20,2210,210,"SAR",641.53,"return orders",{"$f":"VLOOKUP(P:P,'[1]MVT Name'!D:E,2,0)","v":"فرع جدة"}]
[60225862,0,"Sales order","YBRE","RMA Request",1210221109,"2019-09-24","2019-09-24",2210079630,null,0,"S.ALSHABRAWY",2000,10,20,2210,210,"SAR",323,"return orders",{"$f":"VLOOKUP(P:P,'[1]MVT Name'!D:E,2,0)","v":"فرع جدة"}]
[60225863,0,"Sales order","YBRE","RMA Request",1213741001,"2019-09-24","2019-09-24",350,null,0,"M.HASSAN",2000,10,20,2410,410,"SAR",758.21,"return orders",{"$f":"VLOOKUP(P:P,'[1]MVT Name'!D:E,2,0)","v":"فرع المدينة"}]
[60225864,0,"Sales order","YBRE","RMA Request",1310211110,"2019-09-24","2019-09-24",6544815,null,0,"K.NASEER",2000,50,20,2110,110,"SAR",190.17,"return orders",{"$f":"VLOOKUP(P:P,'[1]MVT Name'!D:E,2,0)","v":"فرع الرياض"}]
[60225865,0,"Sales order","YNR","RE.Req (Near EXP.)",3227341001,"2019-09-24","2019-09-24",12351,null,0,"A.ALHADRI",2000,30,20,2410,411,"SAR",228.2,"return orders",{"$f":"VLOOKUP(P:P,'[1]MVT Name'!D:E,2,0)","v":"فرع المدينة"}]
[60225866,0,"Sales order","YBRE","RMA Request",1210523021,"2019-09-24","2019-09-24",102898038,null,0,"R.ALABED",2000,10,20,2230,230,"SAR",760,"return orders",{"$f":"VLOOKUP(P:P,'[1]MVT Name'!D:E,2,0)","v":"فرع الطائف"}]
[60225867,0,"Sales order","YNR","RE.Req (Near EXP.)",3226141001,"2019-09-24","2019-09-24",12326,null,0,"A.ALHADRI",2000,30,20,2410,411,"SAR",87.6,"return orders",{"$f":"VLOOKUP(P:P,'[1]MVT Name'!D:E,2,0)","v":"فرع المدينة"}]
[60225868,0,"Sales order","YSO","Sales-Out RE Request",1210523021,"2019-09-24","2019-09-24",102898038,null,0,"R.ALABED",2000,10,20,2230,230,"SAR",760,"return orders",{"$f":"VLOOKUP(P:P,'[1]MVT Name'!D:E,2,0)","v":"فرع الطائف"}]
[60225869,0,"Sales order","YBRE","RMA Request",1210221106,"2019-09-24","2019-09-24",2210079625,null,0,"S.ALSHABRAWY",2000,10,20,2210,210,"SAR",656,"return orders",{"$f":"VLOOKUP(P:P,'[1]MVT Name'!D:E,2,0)","v":"فرع جدة"}]
[60225870,0,"Sales order","YBRE","RMA Request",1211211083,"2019-09-24","2019-09-24",657,null,0,"K.NASEER",2000,50,20,2110,111,"SAR",40.19,"return orders",{"$f":"VLOOKUP(P:P,'[1]MVT Name'!D:E,2,0)","v":"فرع الرياض"}]
[60225871,0,"Sales order","YPRO","Pro Cal+Dic RE Req.",2214323001,"2019-09-24","2019-09-24",180,null,0,"R.ALABED",2000,20,20,2230,233,"SAR",478.72,"return orders",{"$f":"VLOOKUP(P:P,'[1]MVT Name'!D:E,2,0)","v":"فرع الطائف"}]
[60225872,0,"Sales order","YSO","Sales-Out RE Request",1210721009,"2019-09-24","2019-09-24",2210079556,null,0,"S.ALSHABRAWY",2000,10,70,2210,210,"SAR",349,"return orders",{"$f":"VLOOKUP(P:P,'[1]MVT Name'!D:E,2,0)","v":"فرع جدة"}]
[60225873,0,"Sales order","YBRE","RMA Request",3219541001,"2019-09-24","2019-09-24",12331,null,0,"M.HASSAN",2000,30,20,2410,411,"SAR",76.16,"return orders",{"$f":"VLOOKUP(P:P,'[1]MVT Name'!D:E,2,0)","v":"فرع المدينة"}]
[60225874,0,"Sales order","YBRE","RMA Request",1210122168,"2019-09-24","2019-09-24",23721,null,0,"W.SAAD",2000,10,20,2220,220,"SAR",714.32,"return orders",{"$f":"VLOOKUP(P:P,'[1]MVT Name'!D:E,2,0)","v":"فرع مكة"}]
[60225875,0,"Sales order","YSO","Sales-Out RE Request",1110121005,"2019-09-24","2019-09-24",1960,null,0,"A.ABDELHALIM",2000,10,20,2210,210,"SAR",19.670000000000002,"return orders",{"$f":"VLOOKUP(P:P,'[1]MVT Name'!D:E,2,0)","v":"فرع جدة"}]
[60225876,0,"Sales order","YBRE","RMA Request",1211211094,"2019-09-24","2019-09-24",61147,null,0,"K.NASEER",2000,50,20,2110,111,"SAR",671.68,"return orders",{"$f":"VLOOKUP(P:P,'[1]MVT Name'!D:E,2,0)","v":"فرع الرياض"}]
[60225877,0,"Sales order","YBRE","RMA Request",1210141149,"2019-09-24","2019-09-24",16812,null,0,"A.ALHADRI",2000,10,20,2410,410,"SAR",112.68,"return orders",{"$f":"VLOOKUP(P:P,'[1]MVT Name'!D:E,2,0)","v":"فرع المدينة"}]
[60225878,0,"Sales order","YSO","Sales-Out RE Request",1210141149,"2019-09-24","2019-09-24",16812,null,0,"A.ALHADRI",2000,10,20,2410,410,"SAR",118,"return orders",{"$f":"VLOOKUP(P:P,'[1]MVT Name'!D:E,2,0)","v":"فرع المدينة"}]
[60225879,0,"Sales order","YBRE","RMA Request",2215522001,"2019-09-24","2019-09-24",2220022782,null,0,"W.SAAD",2000,20,20,2220,223,"SAR",1869.58,"return orders",{"$f":"VLOOKUP(P:P,'[1]MVT Name'!D:E,2,0)","v":"فرع مكة"}]
[60225880,0,"Sales order","YNR","RE.Req (Near EXP.)",3243611001,"2019-09-24","2019-09-24",1219,null,0,"K.NASEER",2000,60,20,2110,111,"SAR",1906.12,"return orders",{"$f":"VLOOKUP(P:P,'[1]MVT Name'!D:E,2,0)","v":"فرع الرياض"}]
[60225881,0,"Sales order","YPRO","Pro Cal+Dic RE Req.",2215522001,"2019-09-24","2019-09-24",2220024840,null,0,"W.SAAD",2000,20,20,2220,223,"SAR",888.25,"return orders",{"$f":"VLOOKUP(P:P,'[1]MVT Name'!D:E,2,0)","v":"فرع مكة"}]
[60225882,0,"Sales order","YBRE","RMA Request",1210211135,"2019-09-24","2019-09-24",6599322,null,0,"K.NASEER",2000,10,20,2110,110,"SAR",349.38,"return orders",{"$f":"VLOOKUP(P:P,'[1]MVT Name'!D:E,2,0)","v":"فرع الرياض"}]
[60225883,0,"Sales order","YBRE","RMA Request",1210211095,"2019-09-24","2019-09-24",6513872,null,0,"A.MOAWAD",2000,50,20,2110,110,"SAR",71.22,"return orders",{"$f":"VLOOKUP(P:P,'[1]MVT Name'!D:E,2,0)","v":"فرع الرياض"}]
[60225884,0,"Sales order","YBRE","RMA Request",2214722001,"2019-09-24","2019-09-24",2220020799,null,0,"W.SAAD",2000,20,20,2220,223,"SAR",429.87,"return orders",{"$f":"VLOOKUP(P:P,'[1]MVT Name'!D:E,2,0)","v":"فرع مكة"}]
[60225885,0,"Sales order","YBRE","RMA Request",1210111111,"2019-09-24","2019-09-24",90212,null,0,"K.NASEER",2000,10,60,2110,110,"SAR",377,"return orders",{"$f":"VLOOKUP(P:P,'[1]MVT Name'!D:E,2,0)","v":"فرع الرياض"}]
[60225886,0,"Sales order","YPRO","Pro Cal+Dic RE Req.",2214722001,"2019-09-24","2019-09-24",2220018217,null,0,"W.SAAD",2000,20,20,2220,223,"SAR",285.17,"return orders",{"$f":"VLOOKUP(P:P,'[1]MVT Name'!D:E,2,0)","v":"فرع مكة"}]
[60225887,0,"Sales order","YBRE","RMA Request",1210623001,"2019-09-24","2019-09-24",3504689,null,0,"R.ALABED",2000,10,70,2230,230,"SAR",137.16,"return orders",{"$f":"VLOOKUP(P:P,'[1]MVT Name'!D:E,2,0)","v":"فرع الطائف"}]
[60225888,0,"Sales order","YPRO","Pro Cal+Dic RE Req.",1210622010,"2019-09-24","2019-09-24",3525526,null,0,"W.SAAD",2000,10,20,2220,220,"SAR",24.42,"return orders",{"$f":"VLOOKUP(P:P,'[1]MVT Name'!D:E,2,0)","v":"فرع مكة"}]
[60225889,0,"Sales order","YBRE","RMA Request",1110111014,"2019-09-24","2019-09-24",189916,null,0,"K.NASEER",2000,10,20,2110,110,"SAR",292.27999999999997,"return orders",{"$f":"VLOOKUP(P:P,'[1]MVT Name'!D:E,2,0)","v":"فرع الرياض"}]
[60225890,0,"Sales order","YBRE","RMA Request",1210211101,"2019-09-24","2019-09-24",6589908,null,0,"K.NASEER",2000,10,70,2110,110,"SAR",19.96,"return orders",{"$f":"VLOOKUP(P:P,'[1]MVT Name'!D:E,2,0)","v":"فرع الرياض"}]
[60225891,0,"Sales order","YBRE","RMA Request",1210211078,"2019-09-24","2019-09-24",6591121,null,0,"K.NASEER",2000,10,70,2110,110,"SAR",87.04,"return orders",{"$f":"VLOOKUP(P:P,'[1]MVT Name'!D:E,2,0)","v":"فرع الرياض"}]
[60225892,0,"Sales order","YBRE","RMA Request",1210211078,"2019-09-24","2019-09-24",6599312,null,0,"B.ELNOUR",2000,10,20,2110,110,"SAR",34.33,"return orders",{"$f":"VLOOKUP(P:P,'[1]MVT Name'!D:E,2,0)","v":"فرع الرياض"}]
[60225893,0,"Sales order","YBRE","RMA Request",1210211113,"2019-09-24","2019-09-24",6598970,null,0,"B.ELNOUR",2000,10,20,2110,110,"SAR",67.290000000000006,"return orders",{"$f":"VLOOKUP(P:P,'[1]MVT Name'!D:E,2,0)","v":"فرع الرياض"}]
[60225894,0,"Sales order","YBRE","RMA Request",1210211111,"2019-09-24","2019-09-24",6598601,null,0,"K.NASEER",2000,10,20,2110,110,"SAR",148.11000000000001,"return orders",{"$f":"VLOOKUP(P:P,'[1]MVT Name'!D:E,2,0)","v":"فرع الرياض"}]
[60225895,0,"Sales order","YBRE","RMA Request",1210211111,"2019-09-24","2019-09-24",6598601,null,0,"K.NASEER",2000,10,60,2110,110,"SAR",7.62,"return orders",{"$f":"VLOOKUP(P:P,'[1]MVT Name'!D:E,2,0)","v":"فرع الرياض"}]
[60225896,0,"Sales order","YBRE","RMA Request",1210421014,"2019-09-24","2019-09-24",19705753,null,0,"A.ABDELHALIM",2000,10,20,2210,210,"SAR",663.29,"return orders",{"$f":"VLOOKUP(P:P,'[1]MVT Name'!D:E,2,0)","v":"فرع جدة"}]
[60225897,0,"Sales order","YBRE","RMA Request",1210211120,"2019-09-24","2019-09-24",6593201,null,0,"B.ELNOUR",2000,10,60,2110,110,"SAR",38.130000000000003,"return orders",{"$f":"VLOOKUP(P:P,'[1]MVT Name'!D:E,2,0)","v":"فرع الرياض"}]
[60225898,0,"Sales order","YBRE","RMA Request",1210211120,"2019-09-24","2019-09-24",6593201,null,0,"B.ELNOUR",2000,10,20,2110,110,"SAR",32.33,"return orders",{"$f":"VLOOKUP(P:P,'[1]MVT Name'!D:E,2,0)","v":"فرع الرياض"}]
[60225899,0,"Sales order","YBRE","RMA Request",1210211126,"2019-09-24","2019-09-24",6594744,null,0,"B.ELNOUR",2000,10,20,2110,110,"SAR",186.67,"return orders",{"$f":"VLOOKUP(P:P,'[1]MVT Name'!D:E,2,0)","v":"فرع الرياض"}]
[60225900,0,"Sales order","YBRE","RMA Request",1210211083,"2019-09-24","2019-09-24",6588173,null,0,"K.NASEER",2000,10,70,2110,110,"SAR",164,"return orders",{"$f":"VLOOKUP(P:P,'[1]MVT Name'!D:E,2,0)","v":"فرع الرياض"}]
[60225901,0,"Sales order","YBRE","RMA Request",1210111177,"2019-09-24","2019-09-24",47561,null,0,"B.ELNOUR",2000,10,70,2110,110,"SAR",58.65,"return orders",{"$f":"VLOOKUP(P:P,'[1]MVT Name'!D:E,2,0)","v":"فرع الرياض"}]
[60225902,0,"Sales order","YBRE","RMA Request",1210211041,"2019-09-24","2019-09-24",6586871,null,0,"B.ELNOUR",2000,10,70,2110,110,"SAR",86.37,"return orders",{"$f":"VLOOKUP(P:P,'[1]MVT Name'!D:E,2,0)","v":"فرع الرياض"}]
[60225903,0,"Sales order","YBRE","RMA Request",3310323003,"2019-09-24","2019-09-24",2007191230,null,0,"R.ALABED",2000,50,20,2230,231,"SAR",115.21,"return orders",{"$f":"VLOOKUP(P:P,'[1]MVT Name'!D:E,2,0)","v":"فرع الطائف"}]
[60225904,0,"Sales order","YBRE","RMA Request",1210111072,"2019-09-24","2019-09-24",428219,null,0,"B.ELNOUR",2000,10,70,2110,110,"SAR",619.9,"return orders",{"$f":"VLOOKUP(P:P,'[1]MVT Name'!D:E,2,0)","v":"فرع الرياض"}]
[60225905,0,"Sales order","YBRE","RMA Request",1110721014,"2019-09-24","2019-09-24",3606148,null,0,"K.NASEER",2000,10,20,2110,110,"SAR",1770.79,"return orders",{"$f":"VLOOKUP(P:P,'[1]MVT Name'!D:E,2,0)","v":"فرع الرياض"}]
[60225906,0,"Sales order","YBRE","RMA Request",1210111119,"2019-09-24","2019-09-24",118694,null,0,"B.ELNOUR",2000,10,20,2110,110,"SAR",1144.8800000000001,"return orders",{"$f":"VLOOKUP(P:P,'[1]MVT Name'!D:E,2,0)","v":"فرع الرياض"}]
[60225907,0,"Sales order","YSO","Sales-Out RE Request",1210111119,"2019-09-24","2019-09-24",118694,null,0,"B.ELNOUR",2000,10,20,2110,110,"SAR",462.21,"return orders",{"$f":"VLOOKUP(P:P,'[1]MVT Name'!D:E,2,0)","v":"فرع الرياض"}]
[60225908,0,"Sales order","YBRE","RMA Request",1210821001,"2019-09-24","2019-09-24",14616872209191,null,0,"A.ABDELHALIM",2000,10,20,2210,210,"SAR",66.67,"return orders",{"$f":"VLOOKUP(P:P,'[1]MVT Name'!D:E,2,0)","v":"فرع جدة"}]
[60225909,0,"Sales order","YBRE","RMA Request",3241211001,"2019-09-24","2019-09-24",2079,null,0,"K.NASEER",2000,30,20,2110,111,"SAR",220.92,"return orders",{"$f":"VLOOKUP(P:P,'[1]MVT Name'!D:E,2,0)","v":"فرع الرياض"}]
[60225910,0,"Sales order","YBRE","RMA Request",3310323002,"2019-09-24","2019-09-24",2007191230,null,0,"R.ALABED",2000,50,20,2230,231,"SAR",12.9,{"$f":"IF(A515<60000000,\"sales orders\",\"return orders\")","v":"return orders"},{"$f":"VLOOKUP(P:P,'[1]MVT Name'!D:E,2,0)","v":"فرع الطائف"}]
[60225911,0,"Sales order","YBRE","RMA Request",1210111098,"2019-09-24","2019-09-24",157654,null,0,"B.ELNOUR",2000,10,20,2110,110,"SAR",802.4,"return orders",{"$f":"VLOOKUP(P:P,'[1]MVT Name'!D:E,2,0)","v":"فرع الرياض"}]
[60225912,0,"Sales order","YBRE","RMA Request",1110121004,"2019-09-24","2019-09-24",549948,null,0,"A.ABDELHALIM",2000,10,20,2210,210,"SAR",327.19,"return orders",{"$f":"VLOOKUP(P:P,'[1]MVT Name'!D:E,2,0)","v":"فرع جدة"}]
[60225913,0,"Sales order","YBRE","RMA Request",3310311021,"2019-09-24","2019-09-24",20190910,null,0,"K.NASEER",2000,50,20,2110,111,"SAR",336.35,"return orders",{"$f":"VLOOKUP(P:P,'[1]MVT Name'!D:E,2,0)","v":"فرع الرياض"}]
[60225914,0,"Sales order","YBRE","RMA Request",3310311021,"2019-09-24","2019-09-24",20190910,null,0,"K.NASEER",2000,50,20,2110,111,"SAR",65,"return orders",{"$f":"VLOOKUP(P:P,'[1]MVT Name'!D:E,2,0)","v":"فرع الرياض"}]
[60225915,0,"Sales order","YBRE","RMA Request",1210521016,"2019-09-24","2019-09-24",103018889,null,0,"A.ABDELHALIM",2000,10,20,2210,210,"SAR",557.14,"return orders",{"$f":"VLOOKUP(P:P,'[1]MVT Name'!D:E,2,0)","v":"فرع جدة"}]
[60225916,0,"Sales order","YBRE","RMA Request",3235411001,"2019-09-24","2019-09-24",7596,null,0,"K.NASEER",2000,30,20,2110,111,"SAR",361.35,"return orders",{"$f":"VLOOKUP(P:P,'[1]MVT Name'!D:E,2,0)","v":"فرع الرياض"}]
[60225917,0,"Sales order","YBRE","RMA Request",1210111063,"2019-09-24","2019-09-24",285634,null,0,"B.ELNOUR",2000,10,20,2110,110,"SAR",584.21,"return orders",{"$f":"VLOOKUP(P:P,'[1]MVT Name'!D:E,2,0)","v":"فرع الرياض"}]
[60225918,0,"Sales order","YBRE","RMA Request",1210211112,"2019-09-24","2019-09-24",6395185,null,0,"A.MOAWAD",2000,10,20,2110,110,"SAR",445.96,"return orders",{"$f":"VLOOKUP(P:P,'[1]MVT Name'!D:E,2,0)","v":"فرع الرياض"}]
[60225919,0,"Sales order","YBRE","RMA Request",1210321002,"2019-09-24","2019-09-24",553940,null,0,"A.ABDELHALIM",2000,10,20,2210,210,"SAR",763.47,"return orders",{"$f":"VLOOKUP(P:P,'[1]MVT Name'!D:E,2,0)","v":"فرع جدة"}]
[60225920,0,"Sales order","YBRE","RMA Request",3235411001,"2019-09-24","2019-09-24",7596,null,0,"K.NASEER",2000,30,20,2110,111,"SAR",179.59,"return orders",{"$f":"VLOOKUP(P:P,'[1]MVT Name'!D:E,2,0)","v":"فرع الرياض"}]
[60225921,0,"Sales order","YSO","Sales-Out RE Request",1210321002,"2019-09-24","2019-09-24",553940,null,0,"A.ABDELHALIM",2000,10,20,2210,210,"SAR",6.5,"return orders",{"$f":"VLOOKUP(P:P,'[1]MVT Name'!D:E,2,0)","v":"فرع جدة"}]
[60225922,0,"Sales order","YBRE","RMA Request",1210211080,"2019-09-24","2019-09-24",6578474,null,0,"B.ELNOUR",2000,10,20,2110,110,"SAR",198.64,"return orders",{"$f":"VLOOKUP(P:P,'[1]MVT Name'!D:E,2,0)","v":"فرع الرياض"}]
[60225923,0,"Sales order","YBRE","RMA Request",3231611001,"2019-09-24","2019-09-24",3782,null,0,"K.NASEER",2000,30,20,2110,111,"SAR",818.28,"return orders",{"$f":"VLOOKUP(P:P,'[1]MVT Name'!D:E,2,0)","v":"فرع الرياض"}]
[60225924,0,"Sales order","YBRE","RMA Request",1210211121,"2019-09-24","2019-09-24",6580197,null,0,"B.ELNOUR",2000,10,20,2110,110,"SAR",2451.38,"return orders",{"$f":"VLOOKUP(P:P,'[1]MVT Name'!D:E,2,0)","v":"فرع الرياض"}]
[60225925,0,"Sales order","YBRE","RMA Request",1210211041,"2019-09-24","2019-09-24",6599534,null,0,"B.ELNOUR",2000,10,20,2110,110,"SAR",455.23,"return orders",{"$f":"VLOOKUP(P:P,'[1]MVT Name'!D:E,2,0)","v":"فرع الرياض"}]
[60225926,0,"Sales order","YBRE","RMA Request",1210211046,"2019-09-24","2019-09-24",6599549,null,0,"B.ELNOUR",2000,10,20,2110,110,"SAR",265.61,"return orders",{"$f":"VLOOKUP(P:P,'[1]MVT Name'!D:E,2,0)","v":"فرع الرياض"}]
[60225927,0,"Sales order","YBRE","RMA Request",1110411008,"2019-09-24","2019-09-24",19706449,null,0,"B.ELNOUR",2000,10,20,2110,110,"SAR",1873.01,"return orders",{"$f":"VLOOKUP(P:P,'[1]MVT Name'!D:E,2,0)","v":"فرع الرياض"}]
[60226056,0,"Sales order","YPRO","Pro Cal+Dic RE Req.",3119511001,"2019-09-25","2019-09-24","Rtrn19618000126",null,0,"S.MOUSA",2000,70,20,2110,114,"SAR",66.069999999999993,"return orders",{"$f":"VLOOKUP(P:P,'[1]MVT Name'!D:E,2,0)","v":"فرع الرياض"}]
[60226057,0,"Sales order","YPRO","Pro Cal+Dic RE Req.",3119511001,"2019-09-25","2019-09-24","Rtrn19618000127",null,0,"S.MOUSA",2000,70,20,2110,114,"SAR",22.56,"return orders",{"$f":"VLOOKUP(P:P,'[1]MVT Name'!D:E,2,0)","v":"فرع الرياض"}]
[60226058,0,"Sales order","YPRO","Pro Cal+Dic RE Req.",3119511001,"2019-09-25","2019-09-24","Rtrn19618000128",null,0,"S.MOUSA",2000,70,20,2110,114,"SAR",85.59,"return orders",{"$f":"VLOOKUP(P:P,'[1]MVT Name'!D:E,2,0)","v":"فرع الرياض"}]
[60226059,0,"Sales order","YPRO","Pro Cal+Dic RE Req.",3119511001,"2019-09-25","2019-09-24","Rtrn19618000129",null,0,"S.MOUSA",2000,70,20,2110,114,"SAR",58.56,"return orders",{"$f":"VLOOKUP(P:P,'[1]MVT Name'!D:E,2,0)","v":"فرع الرياض"}]
[60226060,0,"Sales order","YPRO","Pro Cal+Dic RE Req.",3119511001,"2019-09-25","2019-09-24","Rtrn19618000130",null,0,"S.MOUSA",2000,70,10,2110,114,"SAR",76.650000000000006,"return orders",{"$f":"VLOOKUP(P:P,'[1]MVT Name'!D:E,2,0)","v":"فرع الرياض"}]

{"sheet":"Main","index":1,"n_rows":24,"n_cols":21,"rows_kept":24,"cut":false,"hidden":false,"merged":[]}
[]
[]
[]
["Sales Document","Transaction Group","Description","Sales Document Type","Description","Sold-to party","Created on","Document Date","Transaction Group","Partner Function","Person responsible","Created by","Sales Organization","Distribution Channel","Division","Sales Office","Sales Group","Document Currency","Net value","order tybe","الفرع "]
[495330,0,"Sales order","OR","KA Standard Order",1211831001,"2019-09-24","2019-09-24","SMH0169",null,0,"A.ALZAHMI",2000,60,70,2210,215,"SAR",9199.7999999999993,{"$f":"IF(A5<60000000,\"sales orders\",\"return orders\")","v":"sales orders"},{"$f":"VLOOKUP(P:P,'[1]MVT Name'!D:E,2,0)","v":"فرع جدة"}]
[495375,0,"Sales order","OR","KA Standard Order",2230141001,"2019-09-24","2019-09-24","mn1909/271",null,0,"B.ALGHAMDI",2000,20,20,2410,413,"SAR",3557.32,"sales orders",{"$f":"VLOOKUP(P:P,'[1]MVT Name'!D:E,2,0)","v":"فرع المدينة"}]
[495427,0,"Sales order","ZPRO","Discounts",2230141001,"2019-09-24","2019-09-24","mn1909/272",null,0,"B.ALGHAMDI",2000,20,20,2410,413,"SAR",921.6,"sales orders",{"$f":"VLOOKUP(P:P,'[1]MVT Name'!D:E,2,0)","v":"فرع المدينة"}]
[495456,0,"Sales order","OR","KA Standard Order",1310121190,"2019-09-24","2019-09-24",42261265,null,0,"A.ALZAHMI",2000,10,20,2210,210,"SAR",12967.83,"sales orders",{"$f":"VLOOKUP(P:P,'[1]MVT Name'!D:E,2,0)","v":"فرع جدة"}]
[495490,0,"Sales order","OR","KA Standard Order",3221941001,"2019-09-24","2019-09-24","mn1909/250",null,0,"B.ALGHAMDI",2000,30,20,2410,411,"SAR",4793.3900000000003,"sales orders",{"$f":"VLOOKUP(P:P,'[1]MVT Name'!D:E,2,0)","v":"فرع المدينة"}]
[495505,0,"Sales order","OR","KA Standard Order",1310121190,"2019-09-24","2019-09-24",42261759,null,0,"A.ALZAHMI",2000,10,20,2210,210,"SAR",19064.5,"sales orders",{"$f":"VLOOKUP(P:P,'[1]MVT Name'!D:E,2,0)","v":"فرع جدة"}]
[495514,0,"Sales order","OR","KA Standard Order",1210832015,"2019-09-24","2019-09-24",548141,null,0,"B.ALGHAMDI",2000,10,70,2320,320,"SAR",2795.6,"sales orders",{"$f":"VLOOKUP(P:P,'[1]MVT Name'!D:E,2,0)","v":"فرع الإحساء"}]
[495524,0,"Sales order","ZNR","Near Ex.promot order",2247221001,"2019-09-24","2019-09-24",1,null,0,"M.SAGGAF",2000,90,20,2210,213,"SAR",1465,"sales orders",{"$f":"VLOOKUP(P:P,'[1]MVT Name'!D:E,2,0)","v":"فرع جدة"}]
[495527,0,"Sales order","ZSO","Sale-Out+PromoOrder",1110121003,"2019-09-24","2019-09-24",42230395,null,0,"A.ALZAHMI",2000,10,20,2210,210,"SAR",4940.5,"sales orders",{"$f":"VLOOKUP(P:P,'[1]MVT Name'!D:E,2,0)","v":"فرع جدة"}]
[495528,0,"Sales order","OR","KA Standard Order",1210732002,"2019-09-24","2019-09-24",12519945,null,0,"B.ALGHAMDI",2000,10,20,2320,320,"SAR",4240,"sales orders",{"$f":"VLOOKUP(P:P,'[1]MVT Name'!D:E,2,0)","v":"فرع الإحساء"}]
[495532,0,"Sales order","OR","KA Standard Order",1210732002,"2019-09-24","2019-09-24",12493988,null,0,"B.ALGHAMDI",2000,10,70,2320,320,"SAR",212,"sales orders",{"$f":"VLOOKUP(P:P,'[1]MVT Name'!D:E,2,0)","v":"فرع الإحساء"}]
[495541,0,"Sales order","OR","KA Standard Order",1210732002,"2019-09-24","2019-09-24",12519930,null,0,"B.ALGHAMDI",2000,10,20,2320,320,"SAR",238,"sales orders",{"$f":"VLOOKUP(P:P,'[1]MVT Name'!D:E,2,0)","v":"فرع الإحساء"}]
[495543,0,"Sales order","ZSO","Sale-Out+PromoOrder",1110121003,"2019-09-24","2019-09-24",42215335,null,0,"A.ALZAHMI",2000,10,20,2210,210,"SAR",6079.5,"sales orders",{"$f":"VLOOKUP(P:P,'[1]MVT Name'!D:E,2,0)","v":"فرع جدة"}]
[495549,0,"Sales order","OR","KA Standard Order",1210732002,"2019-09-24","2019-09-24",12519899,null,0,"B.ALGHAMDI",2000,10,20,2320,320,"SAR",1527.5,"sales orders",{"$f":"VLOOKUP(P:P,'[1]MVT Name'!D:E,2,0)","v":"فرع الإحساء"}]
[495557,0,"Sales order","OR","KA Standard Order",1110721001,"2019-09-24","2019-09-24",12519973,null,0,"A.ALZAHMI",2000,10,20,2210,210,"SAR",730,"sales orders",{"$f":"VLOOKUP(P:P,'[1]MVT Name'!D:E,2,0)","v":"فرع جدة"}]
[495582,0,"Sales order","OR","KA Standard Order",1215232001,"2019-09-24","2019-09-24",1309,null,0,"B.ALGHAMDI",2000,10,70,2320,320,"SAR",6360,"sales orders",{"$f":"VLOOKUP(P:P,'[1]MVT Name'!D:E,2,0)","v":"فرع الإحساء"}]
[495591,0,"Sales order","OR","KA Standard Order",1111821001,"2019-09-24","2019-09-24",4712441159,null,0,"A.ALZAHMI",2000,10,20,2210,210,"SAR",6394.33,"sales orders",{"$f":"VLOOKUP(P:P,'[1]MVT Name'!D:E,2,0)","v":"فرع جدة"}]
[495594,0,"Sales order","OR","KA Standard Order",1215232002,"2019-09-24","2019-09-24",1354,null,0,"B.ALGHAMDI",2000,10,20,2320,320,"SAR",5501,"sales orders",{"$f":"VLOOKUP(P:P,'[1]MVT Name'!D:E,2,0)","v":"فرع الإحساء"}]
[495596,0,"Sales order","OR","KA Standard Order",2237611001,"2019-09-24","2019-09-24","ra1909/2028",null,0,"E.ALSOMAHI",2000,20,20,2110,113,"SAR",14680,"sales orders",{"$f":"VLOOKUP(P:P,'[1]MVT Name'!D:E,2,0)","v":"فرع الرياض"}]
[495600,0,"Sales order","OR","KA Standard Order",1215232002,"2019-09-24","2019-09-24",1354,null,0,"B.ALGHAMDI",2000,10,70,2320,320,"SAR",10912,"sales orders",{"$f":"VLOOKUP(P:P,'[1]MVT Name'!D:E,2,0)","v":"فرع الإحساء"}]

{"sheet":"salim","index":2,"n_rows":0,"n_cols":0,"rows_kept":0,"cut":false,"hidden":false,"merged":[]}