{"text_format":"1","workbook":"xlsx","n_sheets":3,"sheets":["Sheet1","Main","salim"],"not_rendered":{"charts":0,"images":0,"macros":1,"external_links":1,"defined_names":1,"comments":0,"pivot_tables":0},"unopened":[],"bounds":{"document_bytes":16777216,"sheet_cells":100000,"rows_first":2000,"rows_last":500,"rows_between":2000,"halvings":0,"cell_chars":16384,"cell_head_chars":4096},"cells_cut":0,"cells_raw":0,"read":"whole","date_system":"1900"}

{"sheet":"Sheet1","index":0,"n_rows":537,"n_cols":21,"rows_kept":537,"cut":false,"hidden":true,"merged":[]}
[]
["Sales Document","Transaction Group","Description","Sales Document Type","Description","Sold-to party","Created on","Document Date","Transaction Group","Partner Function","Person responsible","Created by","Sales Organization","Distribution Channel","Division","Sales Office","Sales Group","Document Currency","Net value","order tybe","الفرع "]
[495330,0,"Sales order","OR","KA Standard Order",1211831001,"2019-09-24","2019-09-24","SMH0169",null,0,"A.ALZAHMI",2000,60,70,2210,215,"SAR",9199.7999999999993,{"$f":"IF(A3<60000000,\"sales orders\",\"return orders\")","v":"sales orders"},{"$f":"VLOOKUP(P:P,'[1]MVT Name'!D:E,2,0)","v":"فرع جدة"}]
[495375,0,"Sales order","OR","KA Standard Order",2230141001,"2019-09-24","2019-09-24","mn1909/271",null,0,"B.ALGHAMDI",2000,20,20,2410,413,"SAR",3557.32,"sales orders",{"$f":"VLOOKUP(P:P,'[1]MVT Name'!D:E,2,0)","v":"فرع المدينة"}]
[495427,0,"Sales order","ZPRO","Discounts",2230141001,"2019-09-24","2019-09-24","mn1909/272",null,0,"B.ALGHAMDI",2000,20,20,2410,413,"SAR",921.6,"sales orders",{"$f":"VLOOKUP(P:P,'[1]MVT Name'!D:E,2,0)","v":"فرع المدينة"}]
[495456,0,"Sales order","OR","KA Standard Order",1310121190,"2019-09-24","2019-09-24",42261265,null,0,"A.ALZAHMI",2000,10,20,2210,210,"SAR",12967.83,"sales orders",{"$f":"VLOOKUP(P:P,'[1]MVT Name'!D:E,2,0)","v":"فرع جدة"}]
[495490,0,"Sales order","OR","KA Standard Order",3221941001,"2019-09-24","2019-09-24","mn1909/250",null,0,"B.ALGHAMDI",2000,30,20,2410,411,"SAR",4793.3900000000003,"sales orders",{"$f":"VLOOKUP(P:P,'[1]MVT Name'!D:E,2,0)","v":"فرع المدينة"}]
[495505,0,"Sales order","OR","KA Standard Order",1310121190,"2019-09-24","2019-09-24",42261759,null,0,"A.ALZAHMI",2000,10,20,2210,210,"SAR",19064.5,"sales orders",{"$f":"VLOOKUP(P:P,'[1]MVT Name'!D:E,2,0)","v":"فرع جدة"}]
[495514,0,"Sales order","OR","KA Standard Order",1210832015,"2019-09-24","2019-09-24",548141,null,0,"B.ALGHAMDI",2000,10,70,2320,320,"SAR",2795.6,"sales orders",{"$f":"VLOOKUP(P:P,'[1]MVT Name'!D:E,2,0)","v":"فرع الإحساء"}]
[495524,0,"Sales order","ZNR","Near Ex.promot order",2247221001,"2019-09-24","2019-09-24",1,null,0,"M.SAGGAF",2000,90,20,2210,213,"SAR",1465,"sales orders",{"$f":"VLOOKUP(P:P,'[1]MVT Name'!D:E,2,0)","v":"فرع جدة"}]
[495527,0,"Sales order","ZSO","Sale-Out+PromoOrder",1110121003,"2019-09-24","2019-09-24",42230395,null,0,"A.ALZAHMI",2000,10,20,2210,210,"SAR",4940.5,"sales orders",{"$f":"VLOOKUP(P:P,'[1]MVT Name'!D:E,2,0)","v":"فرع جدة"}]
[495528,0,"Sales order","OR","KA Standard Order",1210732002,"2019-09-24","2019-09-24",12519945,null,0,"B.ALGHAMDI",2000,10,20,2320,320,"SAR",4240,"sales orders",{"$f":"VLOOKUP(P:P,'[1]MVT Name'!D:E,2,0)","v":"فرع الإحساء"}]
[495532,0,"Sales order","OR","KA Standard Order",1210732002,"2019-09-24","2019-09-24",12493988,null,0,"B.ALGHAMDI",2000,10,70,2320,320,"SAR",212,"sales orders",{"$f":"VLOOKUP(P:P,'[1]MVT Name'!D:E,2,0)","v":"فرع الإحساء"}]
[495541,0,"Sales order","OR","KA Standard Order",1210732002,"2019-09-24","2019-09-24",12519930,null,0,"B.ALGHAMDI",2000,10,20,2320,320,"SAR",238,"sales orders",{"$f":"VLOOKUP(P:P,'[1]MVT Name'!D:E,2,0)","v":"فرع الإحساء"}]
[495543,0,"Sales order","ZSO","Sale-Out+PromoOrder",1110121003,"2019-09-24","2019-09-24",42215335,null,0,"A.ALZAHMI",2000,10,20,2210,210,"SAR",6079.5,"sales orders",{"$f":"VLOOKUP(P:P,'[1]MVT Name'!D:E,2,0)","v":"فرع جدة"}]
[495549,0,"Sales order","OR","KA Standard Order",1210732002,"2019-09-24","2019-09-24",12519899,null,0,"B.ALGHAMDI",2000,10,20,2320,320,"SAR",1527.5,"sales orders",{"$f":"VLOOKUP(P:P,'[1]MVT Name'!D:E,2,0)","v":"فرع الإحساء"}]
[495557,0,"Sales order","OR","KA Standard Order",1110721001,"2019-09-24","2019-09-24",12519973,null,0,"A.ALZAHMI",2000,10,20,2210,210,"SAR",730,"sales orders",{"$f":"VLOOKUP(P:P,'[1]MVT Name'!D:E,2,0)","v":"فرع جدة"}]
[495582,0,"Sales order","OR","KA Standard Order",1215232001,"2019-09-24","2019-09-24",1309,null,0,"B.ALGHAMDI",2000,10,70,2320,320,"SAR",6360,"sales orders",{"$f":"VLOOKUP(P:P,'[1]MVT Name'!D:E,2,0)","v":"فرع الإحساء"}]
[495591,0,"Sales order","OR","KA Standard Order",1111821001,"2019-09-24","2019-09-24",4712441159,null,0,"A.ALZAHMI",2000,10,20,2210,210,"SAR",6394.33,"sales orders",{"$f":"VLOOKUP(P:P,'[1]MVT Name'!D:E,2,0)","v":"فرع جدة"}]
[495594,0,"Sales order","OR","KA Standard Order",1215232002,"2019-09-24","2019-09-24",1354,null,0,"B.ALGHAMDI",2000,10,20,2320,320,"SAR",5501,"sales orders",{"$f":"VLOOKUP(P:P,'[1]MVT Name'!D:E,2,0)","v":"فرع الإحساء"}]
[495596,0,"Sales order","OR","KA Standard Order",2237611001,"2019-09-24","2019-09-24","ra1909/2028",null,0,"E.ALSOMAHI",2000,20,20,2110,113,"SAR",14680,"sales orders",{"$f":"VLOOKUP(P:P,'[1]MVT Name'!D:E,2,0)","v":"فرع الرياض"}]
[495600,0,"Sales order","OR","KA Standard Order",1215232002,"2019-09-24","2019-09-24",1354,null,0,"B.ALGHAMDI",2000,10,70,2320,320,"SAR",10912,"sales orders",{"$f":"VLOOKUP(P:P,'[1]MVT Name'!D:E,2,0)","v":"فرع الإحساء"}]
[495604,0,"Sales order","OR","KA Standard Order",1215232002,"2019-09-24","2019-09-24",1354,null,0,"B.ALGHAMDI",2000,10,20,2320,320,"SAR",1723,"sales orders",{"$f":"VLOOKUP(P:P,'[1]MVT Name'!D:E,2,0)","v":"فرع الإحساء"}]
[495605,0,"Sales order","OR","KA Standard Order",2243011001,"2019-09-24","2019-09-24","ra1909/2076",null,0,"E.ALSOMAHI",2000,20,20,2110,113,"SAR",5805,"sales orders",{"$f":"VLOOKUP(P:P,'[1]MVT Name'!D:E,2,0)","v":"فرع الرياض"}]
[495606,0,"Sales order","OR","KA Standard Order",1111821001,"2019-09-24","2019-09-24",4712441132,null,0,"A.ALZAHMI",2000,10,20,2210,210,"SAR",5172,"sales orders",{"$f":"VLOOKUP(P:P,'[1]MVT Name'!D:E,2,0)","v":"فرع جدة"}]
[495607,0,"Sales order","ZSO","Sale-Out+PromoOrder",1210832015,"2019-09-24","2019-09-24",548053,null,0,"B.ALGHAMDI",2000,10,20,2320,320,"SAR",2084,"sales orders",{"$f":"VLOOKUP(P:P,'[1]MVT Name'!D:E,2,0)","v":"فرع الإحساء"}]
[495608,0,"Sales order","OR","KA Standard Order",2239311001,"2019-09-24","2019-09-24","ra1909/2077",null,0,"E.ALSOMAHI",2000,20,20,2110,113,"SAR",3984,"sales orders",{"$f":"VLOOKUP(P:P,'[1]MVT Name'!D:E,2,0)","v":"فرع الرياض"}]
[495609,0,"Sales order","ZSO","Sale-Out+PromoOrder",1210232023,"2019-09-24","2019-09-24",18751,null,0,"B.ALGHAMDI",2000,10,70,2320,320,"SAR",1582,"sales orders",{"$f":"VLOOKUP(P:P,'[1]MVT Name'!D:E,2,0)","v":"فرع الإحساء"}]
[495610,0,"Sales order","ZSO","Sale-Out+PromoOrder",1210332011,"2019-09-24","2019-09-24",20100205759,null,0,"B.ALGHAMDI",2000,10,20,2320,320,"SAR",1394.66,"sales orders",{"$f":"VLOOKUP(P:P,'[1]MVT Name'!D:E,2,0)","v":"فرع الإحساء"}]
[495611,0,"Sales order","ZSO","Sale-Out+PromoOrder",1210332011,"2019-09-24","2019-09-24",20100205759,null,0,"B.ALGHAMDI",2000,10,70,2320,320,"SAR",175,"sales orders",{"$f":"VLOOKUP(P:P,'[1]MVT Name'!D:E,2,0)","v":"فرع الإحساء"}]
[495612,0,"Sales order","OR","KA Standard Order",3228112001,"2019-09-24","2019-09-24","QM1909/3067",null,0,"M.ALHARTHI",2000,60,20,2120,121,"SAR",13996,"sales orders",{"$f":"VLOOKUP(P:P,'[1]MVT Name'!D:E,2,0)","v":"فرع القصيم"}]
[495613,0,"Sales order","OR","KA Standard Order",1110721001,"2019-09-24","2019-09-24",12519929,null,0,"A.ALZAHMI",2000,10,20,2210,210,"SAR",15554.67,"sales orders",{"$f":"VLOOKUP(P:P,'[1]MVT Name'!D:E,2,0)","v":"فرع جدة"}]
[495614,0,"Sales order","OR","KA Standard Order",1210721009,"2019-09-24","2019-09-24",12514629,null,0,"A.ALZAHMI",2000,10,20,2210,210,"SAR",2344.84,"sales orders",{"$f":"VLOOKUP(P:P,'[1]MVT Name'!D:E,2,0)","v":"فرع جدة"}]
[495615,0,"Sales order","OR","KA Standard Order",1210721009,"2019-09-24","2019-09-24",12506884,null,0,"A.ALZAHMI",2000,10,20,2210,210,"SAR",2164.5,"sales orders",{"$f":"VLOOKUP(P:P,'[1]MVT Name'!D:E,2,0)","v":"فرع جدة"}]
[495616,0,"Sales order","OR","KA Standard Order",3226712001,"2019-09-24","2019-09-24","QM1909/3059",null,0,"M.ALHARTHI",2000,60,20,2120,121,"SAR",8005.5,"sales orders",{"$f":"VLOOKUP(P:P,'[1]MVT Name'!D:E,2,0)","v":"فرع القصيم"}]
[495617,0,"Sales order","OR","KA Standard Order",1210132137,"2019-09-24","2019-09-24",42263839,null,0,"B.ALGHAMDI",2000,10,20,2320,320,"SAR",8846.5,"sales orders",{"$f":"VLOOKUP(P:P,'[1]MVT Name'!D:E,2,0)","v":"فرع الإحساء"}]
[495618,0,"Sales order","OR","KA Standard Order",3230212001,"2019-09-24","2019-09-24","QM1909/3065",null,0,"M.ALHARTHI",2000,30,20,2120,121,"SAR",2170,"sales orders",{"$f":"VLOOKUP(P:P,'[1]MVT Name'!D:E,2,0)","v":"فرع القصيم"}]
[495619,0,"Sales order","OR","KA Standard Order",1210232024,"2019-09-24","2019-09-24",357951,null,0,"B.ALGHAMDI",2000,10,70,2320,320,"SAR",780,"sales orders",{"$f":"VLOOKUP(P:P,'[1]MVT Name'!D:E,2,0)","v":"فرع الإحساء"}]
[495620,0,"Sales order","OR","KA Standard Order",1110121004,"2019-09-24","2019-09-24",42241431,null,0,"A.ALZAHMI",2000,10,70,2210,210,"SAR",1815,"sales orders",{"$f":"VLOOKUP(P:P,'[1]MVT Name'!D:E,2,0)","v":"فرع جدة"}]
[495621,0,"Sales order","OR","KA Standard Order",1310212002,"2019-09-24","2019-09-24","QM1909/3064",null,0,"M.ALHARTHI",2000,50,20,2120,120,"SAR",1746.5,"sales orders",{"$f":"VLOOKUP(P:P,'[1]MVT Name'!D:E,2,0)","v":"فرع القصيم"}]
[495622,0,"Sales order","OR","KA Standard Order",3228342001,"2019-09-24","2019-09-24","tk1909/58",null,0,"E.ALSOMAHI",2000,30,20,2420,421,"SAR",13498.74,"sales orders",{"$f":"VLOOKUP(P:P,'[1]MVT Name'!D:E,2,0)","v":"فرع تبوك"}]
[495623,0,"Sales order","OR","KA Standard Order",1210542003,"2019-09-24","2019-09-24",103004505,null,0,"E.ALSOMAHI",2000,10,20,2420,420,"SAR",2968.5,"sales orders",{"$f":"VLOOKUP(P:P,'[1]MVT Name'!D:E,2,0)","v":"فرع تبوك"}]
[495624,0,"Sales order","OR","KA Standard Order",1214842002,"2019-09-24","2019-09-24","tk1909/55",null,0,"E.ALSOMAHI",2000,10,20,2420,420,"SAR",10402,"sales orders",{"$f":"VLOOKUP(P:P,'[1]MVT Name'!D:E,2,0)","v":"فرع تبوك"}]
[495625,0,"Sales order","OR","KA Standard Order",3227412001,"2019-09-24","2019-09-24","QM1909/3066",null,0,"M.ALHARTHI",2000,30,20,2120,121,"SAR",9137.99,"sales orders",{"$f":"VLOOKUP(P:P,'[1]MVT Name'!D:E,2,0)","v":"فرع القصيم"}]
[495626,0,"Sales order","OR","KA Standard Order",1214842006,"2019-09-24","2019-09-24",290014,null,0,"E.ALSOMAHI",2000,10,20,2420,420,"SAR",2491,"sales orders",{"$f":"VLOOKUP(P:P,'[1]MVT Name'!D:E,2,0)","v":"فرع تبوك"}]
[495627,0,"Sales order","ZPRO","Discounts",3231012001,"2019-09-24","2019-09-24","QM1909/3057",null,0,"M.ALHARTHI",2000,30,20,2120,121,"SAR",5147.6099999999997,"sales orders",{"$f":"VLOOKUP(P:P,'[1]MVT Name'!D:E,2,0)","v":"فرع القصيم"}]
[495628,0,"Sales order","OR","KA Standard Order",1214842004,"2019-09-24","2019-09-24",290013,null,0,"E.ALSOMAHI",2000,10,20,2420,420,"SAR",1905,"sales orders",{"$f":"VLOOKUP(P:P,'[1]MVT Name'!D:E,2,0)","v":"فرع تبوك"}]
[495629,0,"Sales order","OR","KA Standard Order",1214842003,"2019-09-24","2019-09-24",290012,null,0,"E.ALSOMAHI",2000,10,20,2420,420,"SAR",2496,"sales orders",{"$f":"VLOOKUP(P:P,'[1]MVT Name'!D:E,2,0)","v":"فرع تبوك"}]
[495630,0,"Sales order","OR","KA Standard Order",3229212001,"2019-09-24","2019-09-24","QM1909/3062",null,0,"M.ALHARTHI",2000,30,20,2120,121,"SAR",4407,"sales orders",{"$f":"VLOOKUP(P:P,'[1]MVT Name'!D:E,2,0)","v":"فرع القصيم"}]
[495631,0,"Sales order","ZPRO","Discounts",2234241001,"2019-09-24","2019-09-24","mn1909/270",null,0,"B.ALGHAMDI",2000,20,10,2410,413,"SAR",1830.4,"sales orders",{"$f":"VLOOKUP(P:P,'[1]MVT Name'!D:E,2,0)","v":"فرع المدينة"}]
[495632,0,"Sales order","ZPRO","Discounts",3226712001,"2019-09-24","2019-09-24","QM1909/3060",null,0,"M.ALHARTHI",2000,60,20,2120,121,"SAR",2986.5,"sales orders",{"$f":"VLOOKUP(P:P,'[1]MVT Name'!D:E,2,0)","v":"فرع القصيم"}]
[495633,0,"Sales order","OR","KA Standard Order",1214842001,"2019-09-24","2019-09-24",290011,null,0,"E.ALSOMAHI",2000,10,20,2420,420,"SAR",1855,"sales orders",{"$f":"VLOOKUP(P:P,'[1]MVT Name'!D:E,2,0)","v":"فرع تبوك"}]
[495634,0,"Sales order","OR","KA Standard Order",3231012001,"2019-09-24","2019-09-24","QM1909/3061",null,0,"M.ALHARTHI",2000,30,20,2120,121,"SAR",3685.33,"sales orders",{"$f":"VLOOKUP(P:P,'[1]MVT Name'!D:E,2,0)","v":"فرع القصيم"}]
[495635,0,"Sales order","OR","KA Standard Order",2232542001,"2019-09-24","2019-09-24","tk1909/50",null,0,"E.ALSOMAHI",2000,20,20,2420,423,"SAR",7968,"sales orders",{"$f":"VLOOKUP(P:P,'[1]MVT Name'!D:E,2,0)","v":"فرع تبوك"}]
[495636,0,"Sales order","ZPRO","Discounts",2232542001,"2019-09-24","2019-09-24","tk1909/51",null,0,"E.ALSOMAHI",2000,20,20,2420,423,"SAR",4638.4799999999996,"sales orders",{"$f":"VLOOKUP(P:P,'[1]MVT Name'!D:E,2,0)","v":"فرع تبوك"}]
[495637,0,"Sales order","ZPRO","Discounts",3230212001,"2019-09-24","2019-09-24","QM1909/3063",null,0,"M.ALHARTHI",2000,30,20,2120,121,"SAR",6494.59,"sales orders",{"$f":"VLOOKUP(P:P,'[1]MVT Name'!D:E,2,0)","v":"فرع القصيم"}]
[495638,0,"Sales order","OR","KA Standard Order",3211523001,"2019-09-24","2019-09-24","TF1909/113",null,0,"A.ALZAHMI",2000,30,20,2230,231,"SAR",1230,"sales orders",{"$f":"VLOOKUP(P:P,'[1]MVT Name'!D:E,2,0)","v":"فرع الطائف"}]
[495639,0,"Sales order","OR","KA Standard Order",3212023001,"2019-09-24","2019-09-24","TF1909/112",null,0,"A.ALZAHMI",2000,30,20,2230,231,"SAR",492,"sales orders",{"$f":"VLOOKUP(P:P,'[1]MVT Name'!D:E,2,0)","v":"فرع الطائف"}]
[495640,0,"Sales order","OR","KA Standard Order",3212823001,"2019-09-24","2019-09-24","TF1909/111",null,0,"A.ALZAHMI",2000,30,20,2230,231,"SAR",6888,"sales orders",{"$f":"VLOOKUP(P:P,'[1]MVT Name'!D:E,2,0)","v":"فرع الطائف"}]
[495641,0,"Sales order","OR","KA Standard Order",3217723001,"2019-09-24","2019-09-24","TF1909/110",null,0,"A.ALZAHMI",2000,30,20,2230,231,"SAR",3198,"sales orders",{"$f":"VLOOKUP(P:P,'[1]MVT Name'!D:E,2,0)","v":"فرع الطائف"}]
[495642,0,"Sales order","OR","KA Standard Order",3218722001,"2019-09-24","2019-09-24","mk1909/71",null,0,"A.ALZAHMI",2000,30,20,2220,221,"SAR",4414,"sales orders",{"$f":"VLOOKUP(P:P,'[1]MVT Name'!D:E,2,0)","v":"فرع مكة"}]
[495643,0,"Sales order","ZSO","Sale-Out+PromoOrder",1210523011,"2019-09-24","2019-09-24",102995615,null,0,"A.ALZAHMI",2000,10,20,2230,230,"SAR",1490.16,"sales orders",{"$f":"VLOOKUP(P:P,'[1]MVT Name'!D:E,2,0)","v":"فرع الطائف"}]
[495644,0,"Sales order","ZSO","Sale-Out+PromoOrder",1210523015,"2019-09-24","2019-09-24",102995636,null,0,"A.ALZAHMI",2000,10,20,2230,230,"SAR",1305.6600000000001,"sales orders",{"$f":"VLOOKUP(P:P,'[1]MVT Name'!D:E,2,0)","v":"فرع الطائف"}]
[495645,0,"Sales order","ZSO","Sale-Out+PromoOrder",1210523021,"2019-09-24","2019-09-24",102995700,null,0,"A.ALZAHMI",2000,10,20,2230,230,"SAR",606.33000000000004,"sales orders",{"$f":"VLOOKUP(P:P,'[1]MVT Name'!D:E,2,0)","v":"فرع الطائف"}]
[495646,0,"Sales order","OR","KA Standard Order",3223842001,"2019-09-24","2019-09-24","Tk1909/52",null,0,"E.ALSOMAHI",2000,30,20,2420,421,"SAR",12873.5,"sales orders",{"$f":"VLOOKUP(P:P,'[1]MVT Name'!D:E,2,0)","v":"فرع تبوك"}]
[495647,0,"Sales order","ZSO","Sale-Out+PromoOrder",1210523012,"2019-09-24","2019-09-24",102995627,null,0,"A.ALZAHMI",2000,10,20,2230,230,"SAR",237.33,"sales orders",{"$f":"VLOOKUP(P:P,'[1]MVT Name'!D:E,2,0)","v":"فرع الطائف"}]
[495648,0,"Sales order","OR","KA Standard Order",1210341010,"2019-09-24","2019-09-24",28555,null,0,"B.ALGHAMDI",2000,10,20,2410,410,"SAR",3862,{"$f":"IF(A67<60000000,\"sales orders\",\"return orders\")","v":"sales orders"},{"$f":"VLOOKUP(P:P,'[1]MVT Name'!D:E,2,0)","v":"فرع المدينة"}]
[495649,0,"Sales order","OR","KA Standard Order",1110711005,"2019-09-24","2019-09-24",12517491,null,0,"E.ALSOMAHI",2000,10,20,2110,110,"SAR",18907.669999999998,"sales orders",{"$f":"VLOOKUP(P:P,'[1]MVT Name'!D:E,2,0)","v":"فرع الرياض"}]
[495650,0,"Sales order","OR","KA Standard Order",1210711023,"2019-09-24","2019-09-24",12505723,null,0,"E.ALSOMAHI",2000,10,20,2110,110,"SAR",407.17,"sales orders",{"$f":"VLOOKUP(P:P,'[1]MVT Name'!D:E,2,0)","v":"فرع الرياض"}]
[495651,0,"Sales order","ZSO","Sale-Out+PromoOrder",1210172162,"2019-09-24","2019-09-24",42230387,null,0,"M.ALHARTHI",2000,10,20,2720,720,"SAR",2655,"sales orders",{"$f":"VLOOKUP(P:P,'[1]MVT Name'!D:E,2,0)","v":"فرع جيزان"}]
[495652,0,"Sales order","OR","KA Standard Order",3219221003,"2019-09-24","2019-09-24","jd1909/136",null,0,"A.ALZAHMI",2000,50,20,2210,211,"SAR",5317.59,"sales orders",{"$f":"VLOOKUP(P:P,'[1]MVT Name'!D:E,2,0)","v":"فرع جدة"}]
[495653,0,"Sales order","OR","KA Standard Order",3212021001,"2019-09-24","2019-09-24","jd1909/137",null,0,"A.ALZAHMI",2000,30,20,2210,211,"SAR",6902.66,"sales orders",{"$f":"VLOOKUP(P:P,'[1]MVT Name'!D:E,2,0)","v":"فرع جدة"}]
[495654,0,"Sales order","ZSO","Sale-Out+PromoOrder",1110172009,"2019-09-24","2019-09-24",42230412,null,0,"M.ALHARTHI",2000,10,20,2720,720,"SAR",3394.5,"sales orders",{"$f":"VLOOKUP(P:P,'[1]MVT Name'!D:E,2,0)","v":"فرع جيزان"}]
[495655,0,"Sales order","ZSO","Sale-Out+PromoOrder",1110172011,"2019-09-24","2019-09-24",42217125,null,0,"M.ALHARTHI",2000,10,20,2720,720,"SAR",7346.5,"sales orders",{"$f":"VLOOKUP(P:P,'[1]MVT Name'!D:E,2,0)","v":"فرع جيزان"}]
[495656,0,"Sales order","OR","KA Standard Order",1210132137,"2019-09-24","2019-09-24",42267175,null,0,"B.ALGHAMDI",2000,10,70,2320,320,"SAR",5349,"sales orders",{"$f":"VLOOKUP(P:P,'[1]MVT Name'!D:E,2,0)","v":"فرع الإحساء"}]
[495657,0,"Sales order","OR","KA Standard Order",1110121009,"2019-09-24","2019-09-24",42251962,null,0,"A.ALZAHMI",2000,10,20,2210,210,"SAR",5504.5,"sales orders",{"$f":"VLOOKUP(P:P,'[1]MVT Name'!D:E,2,0)","v":"فرع جدة"}]
[495659,0,"Sales order","ZPRO","Discounts",2233612001,"2019-09-24","2019-09-24","QM1909/2054",null,0,"M.ALHARTHI",2000,20,20,2120,123,"SAR",33008.949999999997,"sales orders",{"$f":"VLOOKUP(P:P,'[1]MVT Name'!D:E,2,0)","v":"فرع القصيم"}]
[495660,0,"Sales order","ZSO","Sale-Out+PromoOrder",1210123170,"2019-09-24","2019-09-24",42243958,null,0,"A.ALZAHMI",2000,10,20,2230,230,"SAR",3169.5,"sales orders",{"$f":"VLOOKUP(P:P,'[1]MVT Name'!D:E,2,0)","v":"فرع الطائف"}]
[495661,0,"Sales order","ZSO","Sale-Out+PromoOrder",1210123171,"2019-09-24","2019-09-24",42214005,null,0,"A.ALZAHMI",2000,10,70,2230,230,"SAR",954,"sales orders",{"$f":"VLOOKUP(P:P,'[1]MVT Name'!D:E,2,0)","v":"فرع الطائف"}]
[495662,0,"Sales order","ZSO","Sale-Out+PromoOrder",1210123170,"2019-09-24","2019-09-24",42243958,null,0,"A.ALZAHMI",2000,10,70,2230,230,"SAR",650,"sales orders",{"$f":"VLOOKUP(P:P,'[1]MVT Name'!D:E,2,0)","v":"فرع الطائف"}]
{"$rows_left_out":458}
{"sheet":"Main","index":1,"n_rows":24,"n_cols":21,"rows_kept":24,"cut":false,"hidden":false,"merged":[]}
[]
[]
[]
["Sales Document","Transaction Group","Description","Sales Document Type","Description","Sold-to party","Created on","Document Date","Transaction Group","Partner Function","Person responsible","Created by","Sales Organization","Distribution Channel","Division","Sales Office","Sales Group","Document Currency","Net value","order tybe","الفرع "]
[495330,0,"Sales order","OR","KA Standard Order",1211831001,"2019-09-24","2019-09-24","SMH0169",null,0,"A.ALZAHMI",2000,60,70,2210,215,"SAR",9199.7999999999993,{"$f":"IF(A5<60000000,\"sales orders\",\"return orders\")","v":"sales orders"},{"$f":"VLOOKUP(P:P,'[1]MVT Name'!D:E,2,0)","v":"فرع جدة"}]
[495375,0,"Sales order","OR","KA Standard Order",2230141001,"2019-09-24","2019-09-24","mn1909/271",null,0,"B.ALGHAMDI",2000,20,20,2410,413,"SAR",3557.32,"sales orders",{"$f":"VLOOKUP(P:P,'[1]MVT Name'!D:E,2,0)","v":"فرع المدينة"}]
[495427,0,"Sales order","ZPRO","Discounts",2230141001,"2019-09-24","2019-09-24","mn1909/272",null,0,"B.ALGHAMDI",2000,20,20,2410,413,"SAR",921.6,"sales orders",{"$f":"VLOOKUP(P:P,'[1]MVT Name'!D:E,2,0)","v":"فرع المدينة"}]
[495456,0,"Sales order","OR","KA Standard Order",1310121190,"2019-09-24","2019-09-24",42261265,null,0,"A.ALZAHMI",2000,10,20,2210,210,"SAR",12967.83,"sales orders",{"$f":"VLOOKUP(P:P,'[1]MVT Name'!D:E,2,0)","v":"فرع جدة"}]
[495490,0,"Sales order","OR","KA Standard Order",3221941001,"2019-09-24","2019-09-24","mn1909/250",null,0,"B.ALGHAMDI",2000,30,20,2410,411,"SAR",4793.3900000000003,"sales orders",{"$f":"VLOOKUP(P:P,'[1]MVT Name'!D:E,2,0)","v":"فرع المدينة"}]
[495505,0,"Sales order","OR","KA Standard Order",1310121190,"2019-09-24","2019-09-24",42261759,null,0,"A.ALZAHMI",2000,10,20,2210,210,"SAR",19064.5,"sales orders",{"$f":"VLOOKUP(P:P,'[1]MVT Name'!D:E,2,0)","v":"فرع جدة"}]
[495514,0,"Sales order","OR","KA Standard Order",1210832015,"2019-09-24","2019-09-24",548141,null,0,"B.ALGHAMDI",2000,10,70,2320,320,"SAR",2795.6,"sales orders",{"$f":"VLOOKUP(P:P,'[1]MVT Name'!D:E,2,0)","v":"فرع الإحساء"}]
[495524,0,"Sales order","ZNR","Near Ex.promot order",2247221001,"2019-09-24","2019-09-24",1,null,0,"M.SAGGAF",2000,90,20,2210,213,"SAR",1465,"sales orders",{"$f":"VLOOKUP(P:P,'[1]MVT Name'!D:E,2,0)","v":"فرع جدة"}]
[495527,0,"Sales order","ZSO","Sale-Out+PromoOrder",1110121003,"2019-09-24","2019-09-24",42230395,null,0,"A.ALZAHMI",2000,10,20,2210,210,"SAR",4940.5,"sales orders",{"$f":"VLOOKUP(P:P,'[1]MVT Name'!D:E,2,0)","v":"فرع جدة"}]
[495528,0,"Sales order","OR","KA Standard Order",1210732002,"2019-09-24","2019-09-24",12519945,null,0,"B.ALGHAMDI",2000,10,20,2320,320,"SAR",4240,"sales orders",{"$f":"VLOOKUP(P:P,'[1]MVT Name'!D:E,2,0)","v":"فرع الإحساء"}]
[495532,0,"Sales order","OR","KA Standard Order",1210732002,"2019-09-24","2019-09-24",12493988,null,0,"B.ALGHAMDI",2000,10,70,2320,320,"SAR",212,"sales orders",{"$f":"VLOOKUP(P:P,'[1]MVT Name'!D:E,2,0)","v":"فرع الإحساء"}]
[495541,0,"Sales order","OR","KA Standard Order",1210732002,"2019-09-24","2019-09-24",12519930,null,0,"B.ALGHAMDI",2000,10,20,2320,320,"SAR",238,"sales orders",{"$f":"VLOOKUP(P:P,'[1]MVT Name'!D:E,2,0)","v":"فرع الإحساء"}]
[495543,0,"Sales order","ZSO","Sale-Out+PromoOrder",1110121003,"2019-09-24","2019-09-24",42215335,null,0,"A.ALZAHMI",2000,10,20,2210,210,"SAR",6079.5,"sales orders",{"$f":"VLOOKUP(P:P,'[1]MVT Name'!D:E,2,0)","v":"فرع جدة"}]
[495549,0,"Sales order","OR","KA Standard Order",1210732002,"2019-09-24","2019-09-24",12519899,null,0,"B.ALGHAMDI",2000,10,20,2320,320,"SAR",1527.5,"sales orders",{"$f":"VLOOKUP(P:P,'[1]MVT Name'!D:E,2,0)","v":"فرع الإحساء"}]
[495557,0,"Sales order","OR","KA Standard Order",1110721001,"2019-09-24","2019-09-24",12519973,null,0,"A.ALZAHMI",2000,10,20,2210,210,"SAR",730,"sales orders",{"$f":"VLOOKUP(P:P,'[1]MVT Name'!D:E,2,0)","v":"فرع جدة"}]
[495582,0,"Sales order","OR","KA Standard Order",1215232001,"2019-09-24","2019-09-24",1309,null,0,"B.ALGHAMDI",2000,10,70,2320,320,"SAR",6360,"sales orders",{"$f":"VLOOKUP(P:P,'[1]MVT Name'!D:E,2,0)","v":"فرع الإحساء"}]
[495591,0,"Sales order","OR","KA Standard Order",1111821001,"2019-09-24","2019-09-24",4712441159,null,0,"A.ALZAHMI",2000,10,20,2210,210,"SAR",6394.33,"sales orders",{"$f":"VLOOKUP(P:P,'[1]MVT Name'!D:E,2,0)","v":"فرع جدة"}]
[495594,0,"Sales order","OR","KA Standard Order",1215232002,"2019-09-24","2019-09-24",1354,null,0,"B.ALGHAMDI",2000,10,20,2320,320,"SAR",5501,"sales orders",{"$f":"VLOOKUP(P:P,'[1]MVT Name'!D:E,2,0)","v":"فرع الإحساء"}]
[495596,0,"Sales order","OR","KA Standard Order",2237611001,"2019-09-24","2019-09-24","ra1909/2028",null,0,"E.ALSOMAHI",2000,20,20,2110,113,"SAR",14680,"sales orders",{"$f":"VLOOKUP(P:P,'[1]MVT Name'!D:E,2,0)","v":"فرع الرياض"}]
[495600,0,"Sales order","OR","KA Standard Order",1215232002,"2019-09-24","2019-09-24",1354,null,0,"B.ALGHAMDI",2000,10,70,2320,320,"SAR",10912,"sales orders",{"$f":"VLOOKUP(P:P,'[1]MVT Name'!D:E,2,0)","v":"فرع الإحساء"}]

{"sheet":"salim","index":2,"n_rows":0,"n_cols":0,"rows_kept":0,"cut":false,"hidden":false,"merged":[]}