{"text_format":"1","workbook":"xlsx","n_sheets":7,"sheets":["Sheet1","محمد","على","أحمد","ناصر","عبد الناصر","شوقى"],"not_rendered":{"charts":0,"images":0,"macros":1,"external_links":0,"defined_names":0,"comments":0,"pivot_tables":0},"unopened":[],"bounds":{"document_bytes":16777216,"sheet_cells":100000,"rows_first":2000,"rows_last":500,"rows_between":2000,"halvings":0,"cell_chars":16384,"cell_head_chars":4096},"cells_cut":0,"cells_raw":0,"read":"whole","date_system":"1900"}

{"sheet":"Sheet1","index":0,"n_rows":7,"n_cols":6,"rows_kept":7,"cut":false,"hidden":false,"merged":[]}
["رقم الموظف","اسم الموظف","الإدارة","الوظيفة ","الراتب ","تاريخ التعين "]
[820001,"محمد","المالية","محاسب",12500,"2001-09-25"]
[820002,"على","الموارد البشرية","سكرتير",1200,"2009-01-12"]
[820003,"أحمد","التخطيط","الترحيل",8000,"2010-01-01"]
[82004,"ناصر","الموارد البشرية","مدير الموارد",10000,"2011-06-22"]
[820005,"عبد الناصر","الإنتاج","مشرف انتاج",1200,"2013-06-03"]
[820006,"شوقى","الجودة","مشرف جودة",600,"2019-03-01"]

{"sheet":"محمد","index":1,"n_rows":17,"n_cols":8,"rows_kept":17,"cut":false,"hidden":false,"merged":[[11,2,11,3],[13,2,13,3],[13,6,13,7],[2,0,2,4],[7,2,7,4],[4,0,4,7],[9,2,9,3]]}
[]
[]
["شركة المحمود لتصنيع المواد السائلة"]
[]
["بيانات الموظفين"]
[]
[]
[null,"اسم الموظف:","محمد",null,null,null,"رقم الموظف:",{"$f":"IFERROR(INDEX(Sheet1!$A:$A,MATCH($C$8,Sheet1!$B:$B,0)),\"\")","v":820001}]
[]
[null,"الإدارة:",{"$f":"IFERROR(INDEX(Sheet1!$C:$C,MATCH($C$8,Sheet1!$B:$B,0)),\"\")","v":"المالية"}]
[]
[null,"الوظيفة:",{"$f":"IFERROR(INDEX(Sheet1!$D:$D,MATCH($C$8,Sheet1!$B:$B,0)),\"\")","v":"محاسب"}]
[]
[null,"الراتب :",{"$f":"IFERROR(INDEX(Sheet1!$E:$E,MATCH($C$8,Sheet1!$B:$B,0)),\"\")","v":12500},null,null,"تاريخ التعين:",{"$f":"IFERROR(INDEX(Sheet1!$F:$F,MATCH($C$8,Sheet1!$B:$B,0)),\"\")","v":"2001-09-25"}]
[]
[]
[null,"رئيس القسم ",null,null,null,null,"المدير"]

{"sheet":"على","index":2,"n_rows":17,"n_cols":8,"rows_kept":17,"cut":false,"hidden":false,"merged":[[2,0,2,4],[4,0,4,7],[7,2,7,4],[9,2,9,3],[11,2,11,3],[13,2,13,3],[13,6,13,7]]}
[]
[]
["شركة المحمود لتصنيع المواد السائلة"]
[]
["بيانات الموظفين"]
[]
[]
[null,"اسم الموظف:","على",null,null,null,"رقم الموظف:",{"$f":"IFERROR(INDEX(Sheet1!$A:$A,MATCH($C$8,Sheet1!$B:$B,0)),\"\")","v":820002}]
[]
[null,"الإدارة:",{"$f":"IFERROR(INDEX(Sheet1!$C:$C,MATCH($C$8,Sheet1!$B:$B,0)),\"\")","v":"الموارد البشرية"}]
[]
[null,"الوظيفة:",{"$f":"IFERROR(INDEX(Sheet1!$D:$D,MATCH($C$8,Sheet1!$B:$B,0)),\"\")","v":"سكرتير"}]
[]
[null,"الراتب :",{"$f":"IFERROR(INDEX(Sheet1!$E:$E,MATCH($C$8,Sheet1!$B:$B,0)),\"\")","v":1200},null,null,"تاريخ التعين:",{"$f":"IFERROR(INDEX(Sheet1!$F:$F,MATCH($C$8,Sheet1!$B:$B,0)),\"\")","v":"2009-01-12"}]
[]
[]
[null,"رئيس القسم ",null,null,null,null,"المدير"]

{"sheet":"أحمد","index":3,"n_rows":17,"n_cols":8,"rows_kept":17,"cut":false,"hidden":false,"merged":[[2,0,2,4],[4,0,4,7],[7,2,7,4],[9,2,9,3],[11,2,11,3],[13,2,13,3],[13,6,13,7]]}
[]
[]
["شركة المحمود لتصنيع المواد السائلة"]
[]
["بيانات الموظفين"]
[]
[]
[null,"اسم الموظف:","أحمد",null,null,null,"رقم الموظف:",{"$f":"IFERROR(INDEX(Sheet1!$A:$A,MATCH($C$8,Sheet1!$B:$B,0)),\"\")","v":820003}]
[]
[null,"الإدارة:",{"$f":"IFERROR(INDEX(Sheet1!$C:$C,MATCH($C$8,Sheet1!$B:$B,0)),\"\")","v":"التخطيط"}]
[]
[null,"الوظيفة:",{"$f":"IFERROR(INDEX(Sheet1!$D:$D,MATCH($C$8,Sheet1!$B:$B,0)),\"\")","v":"الترحيل"}]
[]
[null,"الراتب :",{"$f":"IFERROR(INDEX(Sheet1!$E:$E,MATCH($C$8,Sheet1!$B:$B,0)),\"\")","v":8000},null,null,"تاريخ التعين:",{"$f":"IFERROR(INDEX(Sheet1!$F:$F,MATCH($C$8,Sheet1!$B:$B,0)),\"\")","v":"2010-01-01"}]
[]
[]
[null,"رئيس القسم ",null,null,null,null,"المدير"]

{"sheet":"ناصر","index":4,"n_rows":17,"n_cols":8,"rows_kept":17,"cut":false,"hidden":false,"merged":[[2,0,2,4],[4,0,4,7],[7,2,7,4],[9,2,9,3],[11,2,11,3],[13,2,13,3],[13,6,13,7]]}
[]
[]
["شركة المحمود لتصنيع المواد السائلة"]
[]
["بيانات الموظفين"]
[]
[]
[null,"اسم الموظف:","ناصر",null,null,null,"رقم الموظف:",{"$f":"IFERROR(INDEX(Sheet1!$A:$A,MATCH($C$8,Sheet1!$B:$B,0)),\"\")","v":82004}]
[]
[null,"الإدارة:",{"$f":"IFERROR(INDEX(Sheet1!$C:$C,MATCH($C$8,Sheet1!$B:$B,0)),\"\")","v":"الموارد البشرية"}]
[]
[null,"الوظيفة:",{"$f":"IFERROR(INDEX(Sheet1!$D:$D,MATCH($C$8,Sheet1!$B:$B,0)),\"\")","v":"مدير الموارد"}]
[]
[null,"الراتب :",{"$f":"IFERROR(INDEX(Sheet1!$E:$E,MATCH($C$8,Sheet1!$B:$B,0)),\"\")","v":10000},null,null,"تاريخ التعين:",{"$f":"IFERROR(INDEX(Sheet1!$F:$F,MATCH($C$8,Sheet1!$B:$B,0)),\"\")","v":"2011-06-22"}]
[]
[]
[null,"رئيس القسم ",null,null,null,null,"المدير"]

{"sheet":"عبد الناصر","index":5,"n_rows":17,"n_cols":8,"rows_kept":17,"cut":false,"hidden":false,"merged":[[2,0,2,4],[4,0,4,7],[7,2,7,4],[9,2,9,3],[11,2,11,3],[13,2,13,3],[13,6,13,7]]}
[]
[]
["شركة المحمود لتصنيع المواد السائلة"]
[]
["بيانات الموظفين"]
[]
[]
[null,"اسم الموظف:","عبد الناصر",null,null,null,"رقم الموظف:",{"$f":"IFERROR(INDEX(Sheet1!$A:$A,MATCH($C$8,Sheet1!$B:$B,0)),\"\")","v":820005}]
[]
[null,"الإدارة:",{"$f":"IFERROR(INDEX(Sheet1!$C:$C,MATCH($C$8,Sheet1!$B:$B,0)),\"\")","v":"الإنتاج"}]
[]
[null,"الوظيفة:",{"$f":"IFERROR(INDEX(Sheet1!$D:$D,MATCH($C$8,Sheet1!$B:$B,0)),\"\")","v":"مشرف انتاج"}]
[]
[null,"الراتب :",{"$f":"IFERROR(INDEX(Sheet1!$E:$E,MATCH($C$8,Sheet1!$B:$B,0)),\"\")","v":1200},null,null,"تاريخ التعين:",{"$f":"IFERROR(INDEX(Sheet1!$F:$F,MATCH($C$8,Sheet1!$B:$B,0)),\"\")","v":"2013-06-03"}]
[]
[]
[null,"رئيس القسم ",null,null,null,null,"المدير"]

{"sheet":"شوقى","index":6,"n_rows":17,"n_cols":8,"rows_kept":17,"cut":false,"hidden":false,"merged":[[2,0,2,4],[4,0,4,7],[7,2,7,4],[9,2,9,3],[11,2,11,3],[13,2,13,3],[13,6,13,7]]}
[]
[]
["شركة المحمود لتصنيع المواد السائلة"]
[]
["بيانات الموظفين"]
[]
[]
[null,"اسم الموظف:","شوقى",null,null,null,"رقم الموظف:",{"$f":"IFERROR(INDEX(Sheet1!$A:$A,MATCH($C$8,Sheet1!$B:$B,0)),\"\")","v":820006}]
[]
[null,"الإدارة:",{"$f":"IFERROR(INDEX(Sheet1!$C:$C,MATCH($C$8,Sheet1!$B:$B,0)),\"\")","v":"الجودة"}]
[]
[null,"الوظيفة:",{"$f":"IFERROR(INDEX(Sheet1!$D:$D,MATCH($C$8,Sheet1!$B:$B,0)),\"\")","v":"مشرف جودة"}]
[]
[null,"الراتب :",{"$f":"IFERROR(INDEX(Sheet1!$E:$E,MATCH($C$8,Sheet1!$B:$B,0)),\"\")","v":600},null,null,"تاريخ التعين:",{"$f":"IFERROR(INDEX(Sheet1!$F:$F,MATCH($C$8,Sheet1!$B:$B,0)),\"\")","v":"2019-03-01"}]
[]
[]
[null,"رئيس القسم ",null,null,null,null,"المدير"]