{"text_format":"1","workbook":"xlsx","n_sheets":7,"sheets":["مجمع","تسجيل الاقساط","الاساسية","سداد قسط","كشف حساب","الرئيسية","ايصال"],"not_rendered":{"charts":0,"images":1,"macros":1,"external_links":0,"defined_names":6,"comments":1,"pivot_tables":0},"unopened":[],"bounds":{"document_bytes":16777216,"sheet_cells":100000,"rows_first":2000,"rows_last":500,"rows_between":2000,"halvings":0,"cell_chars":16384,"cell_head_chars":4096},"cells_cut":0,"cells_raw":0,"read":"whole","date_system":"1900"}

{"sheet":"مجمع","index":0,"n_rows":502,"n_cols":84,"rows_kept":502,"cut":false,"hidden":false,"merged":[[0,1,0,4]]}
[null,null,null,null,null,5,null,null,null,null,null,"تاريخ اليوم",{"$f":"TODAY()","v":"2019-10-11"}]
["الكود","اسم العميل","جملة المبلغ","مقدم","الباقى","تليفون العريس","ميعاد الحنة","ميعاد الدخلة\n ( طب العميل )","المطلوب عمله","مجموع المبالغ\n المسددة","الباقى \nلم يسدد","موقف الحنة","موقف الحنة \n( طب العميل )","موقف الدخلة","موقف الدخلة",null,null,null,null,null,null,"الاسم","المبلغ المقسط","عدد الاقساط","2018-01-01","2018-02-01","2018-03-01","2018-04-01","2018-05-01","2018-06-01","2018-07-01","2018-08-01","2018-09-01","2018-10-01","2018-11-01","2018-12-01","2019-01-01","2019-02-01","2019-03-01","2019-04-01","2019-05-01","2019-06-01","2019-07-01","2019-08-01","2019-09-01","2019-10-01","2019-11-01","2019-12-01","2020-01-01","2020-02-01","2020-03-01","2020-04-01","2020-05-01","2020-06-01","2020-07-01","2020-08-01","2020-09-01","2020-10-01","2020-11-01","2020-12-01","2021-01-01","2021-02-01","2021-03-01","2021-04-01","2021-05-01","2021-06-01","2021-07-01","2021-08-01","2021-09-01","2021-10-01","2021-11-01","2021-12-01","2022-01-01","2022-02-01","2022-03-01","2022-04-01","2022-05-01","2022-06-01","2022-07-01","2022-08-01","2022-09-01","2022-10-01","2022-11-01","2022-12-01"]
[{"$f":"الاساسية!A6","v":100},{"$f":"الاساسية!B6","v":"عوض محمد محمود"},{"$f":"الاساسية!C6","v":1000},{"$f":"الاساسية!D6","v":200},{"$f":"C3-D3","v":800},{"$f":"الاساسية!F6","v":2222222222},{"$f":"IF(B3=0,\"\",الاساسية!G6)","v":"26/سبتمبر/2019"},{"$f":"IF(B3=0,\"\",الاساسية!H6)","v":"27/سبتمبر/2019"},{"$f":"الاساسية!I6","v":"باببييبببييبيءللب"},{"$f":"SUMIF('تسجيل الاقساط'!B:B,مجمع!B3,'تسجيل الاقساط'!$C:$C)","v":0},{"$f":"E3-J3","v":800},{"$f":"IFERROR(G3-$M$1,\"\")","v":-15},{"$f":"IF(L3=0,\"انتهى الميعاد   \",IF(L3=1,\"باقى على ميعاد الحنة 1 يوم \",IF(L3=2,\"باقى على ميعاد الحنة  2 يومان\",\"\")))","v":""},{"$f":"IFERROR(H3-$M$1,\"\")","v":-14},{"$f":"IFERROR(IF(N3=0,\"باقى على ميعادانتهى الميعاد\",IF(N3=1,\"باقى على ميعادالدخلة 1 يوم \",IF(N3=2,\"باقى على ميعادالدخلة 2 يومان\",\"\"))),\"\")","v":""},null,null,null,null,null,null,{"$f":"B3","v":"عوض محمد محمود"},{"$f":"H3","v":"27/سبتمبر/2019"},{"$f":"I3","v":"باببييبببييبيءللب"},{"$f":"IF(AND($H3<>\"\",Y$2>=$J3,Y$2<=$K3),$H3/$I3,\"\")","v":""},"","","","","","","","","",{"$f":"IF(AND($H3<>\"\",AI$2>=$J3,AI$2<=$K3),$H3/$I3,\"\")","v":""},"","","","","","","","","",{"$f":"IF(AND($H3<>\"\",AS$2>=$J3,AS$2<=$K3),$H3/$I3,\"\")","v":""},"","","","","","","","","",{"$f":"IF(AND($H3<>\"\",BC$2>=$J3,BC$2<=$K3),$H3/$I3,\"\")","v":""},"","","","","","","","","",{"$f":"IF(AND($H3<>\"\",BM$2>=$J3,BM$2<=$K3),$H3/$I3,\"\")","v":""},"","","","","","","","","",{"$f":"IF(AND($H3<>\"\",BW$2>=$J3,BW$2<=$K3),$H3/$I3,\"\")","v":""},"","","","","","","","",""]
[{"$f":"الاساسية!A7","v":101},{"$f":"الاساسية!B7","v":"تببب"},{"$f":"الاساسية!C7","v":4},{"$f":"الاساسية!D7","v":3},{"$f":"C4-D4","v":1},{"$f":"الاساسية!F7","v":111},{"$f":"IF(B4=0,\"\",الاساسية!G7)","v":"05/أكتوبر/2019"},{"$f":"IF(B4=0,\"\",الاساسية!H7)","v":"06/أكتوبر/2019"},{"$f":"الاساسية!I7","v":101},{"$f":"SUMIF('تسجيل الاقساط'!B:B,مجمع!B4,'تسجيل الاقساط'!$C:$C)","v":0},{"$f":"E4-J4","v":1},{"$f":"IFERROR(G4-$M$1,\"\")","v":-6},{"$f":"IF(L4=0,\"انتهى الميعاد   \",IF(L4=1,\"باقى على ميعاد الحنة 1 يوم \",IF(L4=2,\"باقى على ميعاد الحنة  2 يومان\",\"\")))","v":""},{"$f":"IFERROR(H4-$M$1,\"\")","v":-5},{"$f":"IFERROR(IF(N4=0,\"باقى على ميعادانتهى الميعاد\",IF(N4=1,\"باقى على ميعادالدخلة 1 يوم \",IF(N4=2,\"باقى على ميعادالدخلة 2 يومان\",\"\"))),\"\")","v":""},null,null,null,null,null,null,"تببب","06/أكتوبر/2019",101,"","","","","","","","","","","","","","","","","","","","","","","","","","","","","","","","","","","","","","","","","","","","","","","","","","","","","","","","","","","",""]
[{"$f":"الاساسية!A8","v":102},{"$f":"الاساسية!B8","v":"awad"},{"$f":"الاساسية!C8","v":200},{"$f":"الاساسية!D8","v":100},100,{"$f":"الاساسية!F8","v":1234},{"$f":"IF(B5=0,\"\",الاساسية!G8)","v":"03/أكتوبر/2019"},{"$f":"IF(B5=0,\"\",الاساسية!H8)","v":"04/أكتوبر/2019"},{"$f":"الاساسية!I8","v":102},{"$f":"SUMIF('تسجيل الاقساط'!B:B,مجمع!B5,'تسجيل الاقساط'!$C:$C)","v":100},0,-8,"",-7,"",null,null,null,null,null,null,"awad","04/أكتوبر/2019",102,"","","","","","","","","","","","","","","","","","","","","","","","","","","","","","","","","","","","","","","","","","","","","","","","","","","","","","","","","","","",""]
[{"$f":"الاساسية!A9","v":0},{"$f":"الاساسية!B9","v":0},{"$f":"الاساسية!C9","v":0},{"$f":"الاساسية!D9","v":0},0,{"$f":"الاساسية!F9","v":0},{"$f":"IF(B6=0,\"\",الاساسية!G9)","v":""},{"$f":"IF(B6=0,\"\",الاساسية!H9)","v":""},{"$f":"الاساسية!I9","v":0},{"$f":"SUMIF('تسجيل الاقساط'!B:B,مجمع!B6,'تسجيل الاقساط'!$C:$C)","v":0},0,"","","","",null,null,null,null,null,null,0,"",0,null,{"$f":"IF(AND($H6<>\"\",Z$2>=$J6,Z$2<=$K6),$H6/$I6,\"\")","v":""},"","","","","","","","","",{"$f":"IF(AND($H6<>\"\",AJ$2>=$J6,AJ$2<=$K6),$H6/$I6,\"\")","v":""},"","","","","","","","","",{"$f":"IF(AND($H6<>\"\",AT$2>=$J6,AT$2<=$K6),$H6/$I6,\"\")","v":""},"","","","","","","","","",{"$f":"IF(AND($H6<>\"\",BD$2>=$J6,BD$2<=$K6),$H6/$I6,\"\")","v":""},"","","","","","","","","",{"$f":"IF(AND($H6<>\"\",BN$2>=$J6,BN$2<=$K6),$H6/$I6,\"\")","v":""},"","","","","","","","","",{"$f":"IF(AND($H6<>\"\",BX$2>=$J6,BX$2<=$K6),$H6/$I6,\"\")","v":""},"","","","","","","",""]
[{"$f":"الاساسية!A10","v":0},{"$f":"الاساسية!B10","v":0},{"$f":"الاساسية!C10","v":0},{"$f":"الاساسية!D10","v":0},0,{"$f":"الاساسية!F10","v":0},{"$f":"IF(B7=0,\"\",الاساسية!G10)","v":""},{"$f":"IF(B7=0,\"\",الاساسية!H10)","v":""},{"$f":"الاساسية!I10","v":0},{"$f":"SUMIF('تسجيل الاقساط'!B:B,مجمع!B7,'تسجيل الاقساط'!$C:$C)","v":0},{"$f":"E7-J7","v":0},"","","","",null,null,null,null,null,null,0,"",0,{"$f":"IF(AND($H7<>\"\",Y$2>=$J7,Y$2<=$K7),$H7/$I7,\"\")","v":""},"","","","","","","","","","","","","","","","","","","","","","","","","","","","","","","","","","","","","","","","","","","","","","","","","","","","","","","","","","",""]
[{"$f":"الاساسية!A11","v":0},{"$f":"الاساسية!B11","v":0},{"$f":"الاساسية!C11","v":0},{"$f":"الاساسية!D11","v":0},0,{"$f":"الاساسية!F11","v":0},{"$f":"IF(B8=0,\"\",الاساسية!G11)","v":""},{"$f":"IF(B8=0,\"\",الاساسية!H11)","v":""},{"$f":"الاساسية!I11","v":0},{"$f":"SUMIF('تسجيل الاقساط'!B:B,مجمع!B8,'تسجيل الاقساط'!$C:$C)","v":0},0,"","","","",null,null,null,null,null,null,0,"",0,"","","","","","","","","","","","","","","","","","","","","","","","","","","","","","","","","","","","","","","","","","","","","","","","","","","","","","","","","","","",""]
[{"$f":"الاساسية!A12","v":0},{"$f":"الاساسية!B12","v":0},{"$f":"الاساسية!C12","v":0},{"$f":"الاساسية!D12","v":0},0,{"$f":"الاساسية!F12","v":0},{"$f":"IF(B9=0,\"\",الاساسية!G12)","v":""},{"$f":"IF(B9=0,\"\",الاساسية!H12)","v":""},{"$f":"الاساسية!I12","v":0},{"$f":"SUMIF('تسجيل الاقساط'!B:B,مجمع!B9,'تسجيل الاقساط'!$C:$C)","v":0},0,"","","","",null,null,null,null,null,null,0,"",0,"","","","","","","","","","","","","","","","","","","","","","","","","","","","","","","","","","","","","","","","","","","","","","","","","","","","","","","","","","","",""]
[{"$f":"الاساسية!A13","v":0},{"$f":"الاساسية!B13","v":0},{"$f":"الاساسية!C13","v":0},{"$f":"الاساسية!D13","v":0},0,{"$f":"الاساسية!F13","v":0},{"$f":"IF(B10=0,\"\",الاساسية!G13)","v":""},{"$f":"IF(B10=0,\"\",الاساسية!H13)","v":""},{"$f":"الاساسية!I13","v":0},{"$f":"SUMIF('تسجيل الاقساط'!B:B,مجمع!B10,'تسجيل الاقساط'!$C:$C)","v":0},0,"","","","",null,null,null,null,null,null,0,"",0,"","","","","","","","","","","","","","","","","","","","","","","","","","","","","","","","","","","","","","","","","","","","","","","","","","","","","","","","","","","",""]
[{"$f":"الاساسية!A14","v":0},{"$f":"الاساسية!B14","v":0},{"$f":"الاساسية!C14","v":0},{"$f":"الاساسية!D14","v":0},0,{"$f":"الاساسية!F14","v":0},{"$f":"IF(B11=0,\"\",الاساسية!G14)","v":""},{"$f":"IF(B11=0,\"\",الاساسية!H14)","v":""},{"$f":"الاساسية!I14","v":0},{"$f":"SUMIF('تسجيل الاقساط'!B:B,مجمع!B11,'تسجيل الاقساط'!$C:$C)","v":0},0,"","","","",null,null,null,null,null,null,0,"",0,"","","","","","","","","","","","","","","","","","","","","","","","","","","","","","","","","","","","","","","","","","","","","","","","","","","","","","","","","","","",""]
[{"$f":"الاساسية!A15","v":0},{"$f":"الاساسية!B15","v":0},{"$f":"الاساسية!C15","v":0},{"$f":"الاساسية!D15","v":0},0,{"$f":"الاساسية!F15","v":0},{"$f":"IF(B12=0,\"\",الاساسية!G15)","v":""},{"$f":"IF(B12=0,\"\",الاساسية!H15)","v":""},{"$f":"الاساسية!I15","v":0},{"$f":"SUMIF('تسجيل الاقساط'!B:B,مجمع!B12,'تسجيل الاقساط'!$C:$C)","v":0},0,"","","","",null,null,null,null,null,null,0,"",0,"","","","","","","","","","","","","","","","","","","","","","","","","","","","","","","","","","","","","","","","","","","","","","","","","","","","","","","","","","","",""]
[{"$f":"الاساسية!A16","v":0},{"$f":"الاساسية!B16","v":0},{"$f":"الاساسية!C16","v":0},{"$f":"الاساسية!D16","v":0},0,{"$f":"الاساسية!F16","v":0},{"$f":"IF(B13=0,\"\",الاساسية!G16)","v":""},{"$f":"IF(B13=0,\"\",الاساسية!H16)","v":""},{"$f":"الاساسية!I16","v":0},{"$f":"SUMIF('تسجيل الاقساط'!B:B,مجمع!B13,'تسجيل الاقساط'!$C:$C)","v":0},0,"","","","",null,null,null,null,null,null,0,"",0,"","","","","","","","","","","","","","","","","","","","","","","","","","","","","","","","","","","","","","","","","","","","","","","","","","","","","","","","","","","",""]
[{"$f":"الاساسية!A17","v":0},{"$f":"الاساسية!B17","v":0},{"$f":"الاساسية!C17","v":0},{"$f":"الاساسية!D17","v":0},0,{"$f":"الاساسية!F17","v":0},{"$f":"IF(B14=0,\"\",الاساسية!G17)","v":""},{"$f":"IF(B14=0,\"\",الاساسية!H17)","v":""},{"$f":"الاساسية!I17","v":0},{"$f":"SUMIF('تسجيل الاقساط'!B:B,مجمع!B14,'تسجيل الاقساط'!$C:$C)","v":0},0,"","","","",null,null,null,null,null,null,0,"",0,"","","","","","","","","","","","","","","","","","","","","","","","","","","","","","","","","","","","","","","","","","","","","","","","","","","","","","","","","","","",""]
[{"$f":"الاساسية!A18","v":0},{"$f":"الاساسية!B18","v":0},{"$f":"الاساسية!C18","v":0},{"$f":"الاساسية!D18","v":0},0,{"$f":"الاساسية!F18","v":0},{"$f":"IF(B15=0,\"\",الاساسية!G18)","v":""},{"$f":"IF(B15=0,\"\",الاساسية!H18)","v":""},{"$f":"الاساسية!I18","v":0},{"$f":"SUMIF('تسجيل الاقساط'!B:B,مجمع!B15,'تسجيل الاقساط'!$C:$C)","v":0},0,"","","","",null,null,null,null,null,null,0,"",0,"","","","","","","","","","","","","","","","","","","","","","","","","","","","","","","","","","","","","","","","","","","","","","","","","","","","","","","","","","","",""]
[{"$f":"الاساسية!A19","v":0},{"$f":"الاساسية!B19","v":0},{"$f":"الاساسية!C19","v":0},{"$f":"الاساسية!D19","v":0},0,{"$f":"الاساسية!F19","v":0},{"$f":"IF(B16=0,\"\",الاساسية!G19)","v":""},{"$f":"IF(B16=0,\"\",الاساسية!H19)","v":""},{"$f":"الاساسية!I19","v":0},{"$f":"SUMIF('تسجيل الاقساط'!B:B,مجمع!B16,'تسجيل الاقساط'!$C:$C)","v":0},0,"","","","",null,null,null,null,null,null,0,"",0,"",{"$f":"IF(AND($H16<>\"\",Z$2>=$J16,Z$2<=$K16),$H16/$I16,\"\")","v":""},"","","","","","","","","",{"$f":"IF(AND($H16<>\"\",AJ$2>=$J16,AJ$2<=$K16),$H16/$I16,\"\")","v":""},"","","","","","","","","",{"$f":"IF(AND($H16<>\"\",AT$2>=$J16,AT$2<=$K16),$H16/$I16,\"\")","v":""},"","","","","","","","","",{"$f":"IF(AND($H16<>\"\",BD$2>=$J16,BD$2<=$K16),$H16/$I16,\"\")","v":""},"","","","","","","","","",{"$f":"IF(AND($H16<>\"\",BN$2>=$J16,BN$2<=$K16),$H16/$I16,\"\")","v":""},"","","","","","","","","",{"$f":"IF(AND($H16<>\"\",BX$2>=$J16,BX$2<=$K16),$H16/$I16,\"\")","v":""},"","","","","","","",""]
[{"$f":"الاساسية!A20","v":0},{"$f":"الاساسية!B20","v":0},{"$f":"الاساسية!C20","v":0},{"$f":"الاساسية!D20","v":0},0,{"$f":"الاساسية!F20","v":0},{"$f":"IF(B17=0,\"\",الاساسية!G20)","v":""},{"$f":"IF(B17=0,\"\",الاساسية!H20)","v":""},{"$f":"الاساسية!I20","v":0},{"$f":"SUMIF('تسجيل الاقساط'!B:B,مجمع!B17,'تسجيل الاقساط'!$C:$C)","v":0},0,"","","","",null,null,null,null,null,null,0,"",0,"","","","","","","","","","","","","","","","","","","","","","","","","","","","","","","","","","","","","","","","","","","","","","","","","","","","","","","","","","","",""]
[{"$f":"الاساسية!A21","v":0},{"$f":"الاساسية!B21","v":0},{"$f":"الاساسية!C21","v":0},{"$f":"الاساسية!D21","v":0},0,{"$f":"الاساسية!F21","v":0},{"$f":"IF(B18=0,\"\",الاساسية!G21)","v":""},{"$f":"IF(B18=0,\"\",الاساسية!H21)","v":""},{"$f":"الاساسية!I21","v":0},{"$f":"SUMIF('تسجيل الاقساط'!B:B,مجمع!B18,'تسجيل الاقساط'!$C:$C)","v":0},0,"","","","",null,null,null,null,null,null,0,"",0,"","","","","","","","","","","","","","","","","","","","","","","","","","","","","","","","","","","","","","","","","","","","","","","","","","","","","","","","","","","",""]
[{"$f":"الاساسية!A22","v":0},{"$f":"الاساسية!B22","v":0},{"$f":"الاساسية!C22","v":0},{"$f":"الاساسية!D22","v":0},0,{"$f":"الاساسية!F22","v":0},{"$f":"IF(B19=0,\"\",الاساسية!G22)","v":""},{"$f":"IF(B19=0,\"\",الاساسية!H22)","v":""},{"$f":"الاساسية!I22","v":0},{"$f":"SUMIF('تسجيل الاقساط'!B:B,مجمع!B19,'تسجيل الاقساط'!$C:$C)","v":0},0,"","","","",null,null,null,null,null,null,0,"",0,"","","","","","","","","","","","","","","","","","","","","","","","","","","","","","","","","","","","","","","","","","","","","","","","","","","","","","","","","","","",""]
[{"$f":"الاساسية!A23","v":0},{"$f":"الاساسية!B23","v":0},{"$f":"الاساسية!C23","v":0},{"$f":"الاساسية!D23","v":0},0,{"$f":"الاساسية!F23","v":0},{"$f":"IF(B20=0,\"\",الاساسية!G23)","v":""},{"$f":"IF(B20=0,\"\",الاساسية!H23)","v":""},{"$f":"الاساسية!I23","v":0},{"$f":"SUMIF('تسجيل الاقساط'!B:B,مجمع!B20,'تسجيل الاقساط'!$C:$C)","v":0},0,"","","","",null,null,null,null,null,null,0,"",0,"","","","","","","","","","","","","","","","","","","","","","","","","","","","","","","","","","","","","","","","","","","","","","","","","","","","","","","","","","","",""]
{"$rows_left_out":483}
{"sheet":"تسجيل الاقساط","index":1,"n_rows":7,"n_cols":8,"rows_kept":7,"cut":false,"hidden":false,"merged":[[1,2,1,3]]}
[null,null,null,null,null,null,null,15000]
[]
[]
["الرقم","الاسم","المبلغ","التاريخ",null,null,null,"عودة للرئيسية"]
[102,"awad",100,"2019-10-04"]
[200,"نادر",2000,"2019-09-29"]
[null,"",null,"2019-10-09"]

{"sheet":"الاساسية","index":2,"n_rows":8,"n_cols":9,"rows_kept":8,"cut":false,"hidden":false,"merged":[]}
[]
[null,null,null,null,null,null,null,null,{"$f":"MAX(A6:A506)","v":102}]
[]
[]
["الكود","الاسم","جملة المبلغ","المقدم","الباقى","تلليفون العريس","ميعاد الحنة","ميعاد اددخلة","المطلوب"]
[100,"عوض محمد محمود",1000,200,800,2222222222,"26/سبتمبر/2019","27/سبتمبر/2019","باببييبببييبيءللب"]
[101,"تببب",4,3,1,111,"05/أكتوبر/2019","06/أكتوبر/2019",101]
[102,"awad",200,100,100,1234,"03/أكتوبر/2019","04/أكتوبر/2019",102]

{"sheet":"سداد قسط","index":3,"n_rows":5,"n_cols":4,"rows_kept":5,"cut":false,"hidden":false,"merged":[]}
[]
[]
[]
["الرقم","الاسم","المبلغ","الشهر"]
[null,{"$f":"IFERROR(VLOOKUP($A$5,الاساسية!$A$6:$B$505,2,0),\"\")","v":""},null,{"$f":"TODAY()","v":"2019-10-11"}]

{"sheet":"كشف حساب","index":4,"n_rows":114,"n_cols":15,"rows_kept":114,"cut":false,"hidden":false,"merged":[[1,2,1,3],[4,2,4,3],[6,7,7,7],[6,8,7,8]]}
[]
[null,null,"كشف حساب عميل"]
[]
[null,"الرقم",100,null,{"$f":"TODAY()","v":"2019-10-11"}]
[null,"الاسم",{"$f":"IFERROR(VLOOKUP(C4,مجمع!$A$3:$P$505,2,FALSE),\"\")","v":"عوض محمد محمود"}]
[null,"جملة المبلغ","مقدم","الباقى","تليفون العميل"]
[null,{"$f":"IFERROR(VLOOKUP($C$4,مجمع!$A$3:$P$502,3,FALSE),\"\")","v":1000},{"$f":"IFERROR(VLOOKUP($C$4,مجمع!$A$3:$P$502,4,FALSE),\"\")","v":200},{"$f":"IFERROR(VLOOKUP($C$4,مجمع!$A$3:$P$502,5,FALSE),\"\")","v":800},{"$f":"IFERROR(VLOOKUP($C$4,مجمع!$A$3:$P$502,6,FALSE),\"\")","v":2222222222},null,null,null,null,null,null,null,null,null,"يناير2018"]
[null,null,null,null,null,null,null,null,null,null,null,null,null,null,"فبراير2018"]
[null,"ميعاد الحنة","ميعاد الدخلة","المطلوب عمله","مجموع المبالغ\n المسددة","الباقى \nلم يسدد",null,null,null,null,null,null,null,null,"مارس2018"]
[null,{"$f":"IFERROR(VLOOKUP($C$4,مجمع!$A$3:$P$502,7,FALSE),\"\")","v":"26/سبتمبر/2019"},{"$f":"IFERROR(VLOOKUP($C$4,مجمع!$A$3:$P$502,8,FALSE),\"\")","v":"27/سبتمبر/2019"},{"$f":"IFERROR(VLOOKUP($C$4,مجمع!$A$3:$P$502,9,FALSE),\"\")","v":"باببييبببييبيءللب"},{"$f":"IFERROR(VLOOKUP($C$4,مجمع!$A$3:$P$502,10,FALSE),\"\")","v":0},{"$f":"IFERROR(VLOOKUP($C$4,مجمع!$A$3:$P$502,11,FALSE),\"\")","v":800},null,null,null,null,null,null,null,null,"أبريل2018"]
[null,null,null,null,null,null,null,null,null,null,null,null,null,null,"مايو2018"]
[null,"موقف الحنة","موقف الحنة","موقف الدخلة","موقف الدخلة",null,null,null,null,null,null,null,null,null,"يونيو2018"]
[null,{"$f":"IFERROR(VLOOKUP($C$4,مجمع!$A$3:$P$502,12,FALSE),\"\")","v":-15},{"$f":"IFERROR(VLOOKUP($C$4,مجمع!$A$3:$P$502,13,FALSE),\"\")","v":""},{"$f":"IFERROR(VLOOKUP($C$4,مجمع!$A$3:$P$502,14,FALSE),\"\")","v":-14},{"$f":"IFERROR(VLOOKUP($C$4,مجمع!$A$3:$P$502,15,FALSE),\"\")","v":""},null,null,null,null,null,null,null,null,null,"يوليو2018"]
[null,null,null,null,null,null,null,null,null,null,null,null,null,null,"أغسطس2018"]
[null,null,null,null,null,null,null,null,null,null,null,null,null,null,"سبتمبر2018"]
[null,null,null,null,null,null,null,null,null,null,null,null,null,null,"أكتوبر2018"]
[null,null,null,null,null,null,null,null,null,null,null,null,null,null,"نوفمبر2018"]
[null,null,null,null,null,null,null,null,null,null,null,null,null,null,"ديسمبر2018"]
[null,null,null,null,null,null,null,null,null,null,null,null,null,null,"يناير2019"]
[null,null,null,null,null,null,null,null,null,null,null,null,null,null,"فبراير2019"]
{"$rows_left_out":95}
{"sheet":"الرئيسية","index":5,"n_rows":17,"n_cols":4,"rows_kept":17,"cut":false,"hidden":false,"merged":[[3,2,4,6],[6,3,6,5],[16,3,16,5]]}
[]
[]
[]
[null,null,"ستوديو الحرية"]
[]
[]
[null,"تعيمات",null,{"$f":"TODAY()","v":"2019-10-11"}]
[]
[]
[]
[]
[]
[]
[]
[]
[]
[null,null,null,"تصميم/ عوض كارو ت: 01111771092"]

{"sheet":"ايصال","index":6,"n_rows":10,"n_cols":5,"rows_kept":10,"cut":false,"hidden":false,"merged":[[9,3,9,6],[6,4,6,5],[7,4,7,5],[8,4,8,5]]}
[]
[]
[null,null,null,"ايصال إستلام نقدية"]
[]
[null,null,"استلمت أنا",{"$f":"الرئيسية!C4","v":"ستوديو الحرية"}]
[null,null,"من السيد /","عوض محمد محمود"]
[null,null,"مبلغ وقدره /",{"$f":"IFERROR(VLOOKUP(ايصال!$D$6,الاساسية!$B$6:$I$505,2,0),\"\")","v":1000},{"$f":"IFERROR(NoToTxt(D7,\"جنيه\",\"قرش\"),\"\")","v":"فقط  ألف جنيه"}]
[null,null,"من اجمالى /",{"$f":"IFERROR(VLOOKUP(ايصال!$D$6,الاساسية!$B$6:$I$505,3,0),\"\")","v":200},{"$f":"IFERROR(NoToTxt(D8,\"جنيه\",\"قرش\"),\"\")","v":"فقط مائتان جنيه"}]
[null,null,"وباقى عليه /",{"$f":"IFERROR(VLOOKUP(ايصال!$D$6,الاساسية!$B$6:$I$505,4,0),\"\")","v":800},{"$f":"IFERROR(NoToTxt(D9,\"جنيه\",\"قرش\"),\"\")","v":"فقط ثمانمائة جنيه"}]
[null,null,"وذك نظير",{"$f":"IFERROR(VLOOKUP(ايصال!$D$6,الاساسية!$B$6:$I$505,8,0),\"\")","v":"باببييبببييبيءللب"}]