{"text_format":"1","workbook":"xlsx","n_sheets":6,"sheets":["الموظفين","نموذج العهدة","ارشيف العهد","المبالغ المستلمه","كشف حساب","Sheet2"],"not_rendered":{"charts":0,"images":1,"macros":1,"external_links":0,"defined_names":0,"comments":0,"pivot_tables":0},"unopened":[],"bounds":{"document_bytes":16777216,"sheet_cells":100000,"rows_first":2000,"rows_last":500,"rows_between":2000,"halvings":0,"cell_chars":16384,"cell_head_chars":4096},"cells_cut":0,"cells_raw":0,"read":"whole","date_system":"1900"}

{"sheet":"الموظفين","index":0,"n_rows":10,"n_cols":9,"rows_kept":10,"cut":false,"hidden":false,"merged":[]}
[]
[]
["S.No","Petty Cash Holder","Location",null,null,null,"S.No","Petty Cash Holder","Location"]
["001","Eng.Mohamed Selim",null,null,null,null,1,"Tower 1"]
["002","Eng.Asaad",null,null,null,null,null,"Tower 2"]
["003","Eng.Osama Omraan",null,null,null,null,null,"Tower 3"]
["004","Eng.Eslam Nasr"]
["005","Mr.Mohamed Awad"]
["006","Mr.Hosam Abdelsalam"]
["007","Mr.Ramy Asker"]

{"sheet":"نموذج العهدة","index":1,"n_rows":38,"n_cols":9,"rows_kept":38,"cut":false,"hidden":true,"merged":[[3,2,3,6],[32,6,32,7],[34,6,34,7],[33,6,33,7],[5,3,5,4],[6,3,6,4],[7,3,7,4]]}
[]
[]
[]
[null,null,"Petty Cash"]
[]
[null,"Petty Cash #",null,"PC-001"]
[null,"Petty Date",null,{"$f":"IFERROR(VLOOKUP(D6,'ارشيف العهد'!A:C,2,FALSE),\"\")","v":"onknml"}]
[null,"Petty Cash Holder",null,{"$f":"IFERROR(VLOOKUP(D6,'ارشيف العهد'!A:C,3,FALSE),\"\")","v":"lnjkl"}]
[]
[]
["S.No","Supplier","Invoice #","Project","Description","Amount","VAT","Total Amount","Notes"]
[{"$f":"IF(B12=\"\",\"\",SUBTOTAL(3,B$12:B12))","v":1},{"$f":"IFERROR(INDEX('ارشيف العهد'!$A$4:$J$20000,SMALL(IF('ارشيف العهد'!$A$4:$J$20000=$D$6,ROW('ارشيف العهد'!$A$4:$J$20000)-ROW('ارشيف العهد'!$A$3:$J$3)),ROW(1:1)),MATCH($B$11,'ارشيف العهد'!$A$3:$J$3,0)),\"\")","v":"zzzzzzzzzzz"},{"$f":"IFERROR(INDEX('ارشيف العهد'!$A$4:$J$20000,SMALL(IF('ارشيف العهد'!$A$4:$J$20000=$D$6,ROW('ارشيف العهد'!$A$4:$J$20000)-ROW('ارشيف العهد'!$A$3:$J$3)),ROW(1:1)),MATCH($C$11,'ارشيف العهد'!$A$3:$J$3,0)),\"\")","v":1518},{"$f":"IFERROR(INDEX('ارشيف العهد'!$A$4:$J$20000,SMALL(IF('ارشيف العهد'!$A$4:$J$20000=$D$6,ROW('ارشيف العهد'!$A$4:$J$20000)-ROW('ارشيف العهد'!$A$3:$J$3)),ROW(1:1)),MATCH($D$11,'ارشيف العهد'!$A$3:$J$3,0)),\"\")","v":"T1"},{"$f":"IFERROR(INDEX('ارشيف العهد'!$A$4:$J$20000,SMALL(IF('ارشيف العهد'!$A$4:$J$20000=$D$6,ROW('ارشيف العهد'!$A$4:$J$20000)-ROW('ارشيف العهد'!$A$3:$J$3)),ROW(1:1)),MATCH($E$11,'ارشيف العهد'!$A$3:$J$3,0)),\"\")","v":"qqqqqq"},{"$f":"IFERROR(INDEX('ارشيف العهد'!$A$4:$J$20000,SMALL(IF('ارشيف العهد'!$A$4:$J$20000=$D$6,ROW('ارشيف العهد'!$A$4:$J$20000)-ROW('ارشيف العهد'!$A$3:$J$3)),ROW(1:1)),MATCH($F$11,'ارشيف العهد'!$A$3:$J$3,0)),\"\")","v":5},{"$f":"IFERROR(INDEX('ارشيف العهد'!$A$4:$J$20000,SMALL(IF('ارشيف العهد'!$A$4:$J$20000=$D$6,ROW('ارشيف العهد'!$A$4:$J$20000)-ROW('ارشيف العهد'!$A$3:$J$3)),ROW(1:1)),MATCH($G$11,'ارشيف العهد'!$A$3:$J$3,0)),\"\")","v":1},{"$f":"IFERROR(INDEX('ارشيف العهد'!$A$4:$J$20000,SMALL(IF('ارشيف العهد'!$A$4:$J$20000=$D$6,ROW('ارشيف العهد'!$A$4:$J$20000)-ROW('ارشيف العهد'!$A$3:$J$3)),ROW(1:1)),MATCH($H$11,'ارشيف العهد'!$A$3:$J$3,0)),\"\")","v":6}]
[{"$f":"IF(B13=\"\",\"\",SUBTOTAL(3,B$12:B13))","v":2},{"$f":"IFERROR(INDEX('ارشيف العهد'!$A$4:$J$20000,SMALL(IF('ارشيف العهد'!$A$4:$J$20000=$D$6,ROW('ارشيف العهد'!$A$4:$J$20000)-ROW('ارشيف العهد'!$A$3:$J$3)),ROW(2:2)),MATCH($B$11,'ارشيف العهد'!$A$3:$J$3,0)),\"\")","v":8153},{"$f":"IFERROR(INDEX('ارشيف العهد'!$A$4:$J$20000,SMALL(IF('ارشيف العهد'!$A$4:$J$20000=$D$6,ROW('ارشيف العهد'!$A$4:$J$20000)-ROW('ارشيف العهد'!$A$3:$J$3)),ROW(2:2)),MATCH($C$11,'ارشيف العهد'!$A$3:$J$3,0)),\"\")","v":8153},{"$f":"IFERROR(INDEX('ارشيف العهد'!$A$4:$J$20000,SMALL(IF('ارشيف العهد'!$A$4:$J$20000=$D$6,ROW('ارشيف العهد'!$A$4:$J$20000)-ROW('ارشيف العهد'!$A$3:$J$3)),ROW(2:2)),MATCH($D$11,'ارشيف العهد'!$A$3:$J$3,0)),\"\")","v":8153},{"$f":"IFERROR(INDEX('ارشيف العهد'!$A$4:$J$20000,SMALL(IF('ارشيف العهد'!$A$4:$J$20000=$D$6,ROW('ارشيف العهد'!$A$4:$J$20000)-ROW('ارشيف العهد'!$A$3:$J$3)),ROW(2:2)),MATCH($E$11,'ارشيف العهد'!$A$3:$J$3,0)),\"\")","v":8153},{"$f":"IFERROR(INDEX('ارشيف العهد'!$A$4:$J$20000,SMALL(IF('ارشيف العهد'!$A$4:$J$20000=$D$6,ROW('ارشيف العهد'!$A$4:$J$20000)-ROW('ارشيف العهد'!$A$3:$J$3)),ROW(2:2)),MATCH($F$11,'ارشيف العهد'!$A$3:$J$3,0)),\"\")","v":8153},{"$f":"IFERROR(INDEX('ارشيف العهد'!$A$4:$J$20000,SMALL(IF('ارشيف العهد'!$A$4:$J$20000=$D$6,ROW('ارشيف العهد'!$A$4:$J$20000)-ROW('ارشيف العهد'!$A$3:$J$3)),ROW(2:2)),MATCH($G$11,'ارشيف العهد'!$A$3:$J$3,0)),\"\")","v":8153},{"$f":"IFERROR(INDEX('ارشيف العهد'!$A$4:$J$20000,SMALL(IF('ارشيف العهد'!$A$4:$J$20000=$D$6,ROW('ارشيف العهد'!$A$4:$J$20000)-ROW('ارشيف العهد'!$A$3:$J$3)),ROW(2:2)),MATCH($H$11,'ارشيف العهد'!$A$3:$J$3,0)),\"\")","v":8153}]
[{"$f":"IF(B14=\"\",\"\",SUBTOTAL(3,B$12:B14))","v":3},{"$f":"IFERROR(INDEX('ارشيف العهد'!$A$4:$J$20000,SMALL(IF('ارشيف العهد'!$A$4:$J$20000=$D$6,ROW('ارشيف العهد'!$A$4:$J$20000)-ROW('ارشيف العهد'!$A$3:$J$3)),ROW(3:3)),MATCH($B$11,'ارشيف العهد'!$A$3:$J$3,0)),\"\")","v":8153},{"$f":"IFERROR(INDEX('ارشيف العهد'!$A$4:$J$20000,SMALL(IF('ارشيف العهد'!$A$4:$J$20000=$D$6,ROW('ارشيف العهد'!$A$4:$J$20000)-ROW('ارشيف العهد'!$A$3:$J$3)),ROW(3:3)),MATCH($C$11,'ارشيف العهد'!$A$3:$J$3,0)),\"\")","v":6153},{"$f":"IFERROR(INDEX('ارشيف العهد'!$A$4:$J$20000,SMALL(IF('ارشيف العهد'!$A$4:$J$20000=$D$6,ROW('ارشيف العهد'!$A$4:$J$20000)-ROW('ارشيف العهد'!$A$3:$J$3)),ROW(3:3)),MATCH($D$11,'ارشيف العهد'!$A$3:$J$3,0)),\"\")","v":8153},{"$f":"IFERROR(INDEX('ارشيف العهد'!$A$4:$J$20000,SMALL(IF('ارشيف العهد'!$A$4:$J$20000=$D$6,ROW('ارشيف العهد'!$A$4:$J$20000)-ROW('ارشيف العهد'!$A$3:$J$3)),ROW(3:3)),MATCH($E$11,'ارشيف العهد'!$A$3:$J$3,0)),\"\")","v":8153},{"$f":"IFERROR(INDEX('ارشيف العهد'!$A$4:$J$20000,SMALL(IF('ارشيف العهد'!$A$4:$J$20000=$D$6,ROW('ارشيف العهد'!$A$4:$J$20000)-ROW('ارشيف العهد'!$A$3:$J$3)),ROW(3:3)),MATCH($F$11,'ارشيف العهد'!$A$3:$J$3,0)),\"\")","v":8153},{"$f":"IFERROR(INDEX('ارشيف العهد'!$A$4:$J$20000,SMALL(IF('ارشيف العهد'!$A$4:$J$20000=$D$6,ROW('ارشيف العهد'!$A$4:$J$20000)-ROW('ارشيف العهد'!$A$3:$J$3)),ROW(3:3)),MATCH($G$11,'ارشيف العهد'!$A$3:$J$3,0)),\"\")","v":8153},{"$f":"IFERROR(INDEX('ارشيف العهد'!$A$4:$J$20000,SMALL(IF('ارشيف العهد'!$A$4:$J$20000=$D$6,ROW('ارشيف العهد'!$A$4:$J$20000)-ROW('ارشيف العهد'!$A$3:$J$3)),ROW(3:3)),MATCH($H$11,'ارشيف العهد'!$A$3:$J$3,0)),\"\")","v":8153}]
[{"$f":"IF(B15=\"\",\"\",SUBTOTAL(3,B$12:B15))","v":4},{"$f":"IFERROR(INDEX('ارشيف العهد'!$A$4:$J$20000,SMALL(IF('ارشيف العهد'!$A$4:$J$20000=$D$6,ROW('ارشيف العهد'!$A$4:$J$20000)-ROW('ارشيف العهد'!$A$3:$J$3)),ROW(4:4)),MATCH($B$11,'ارشيف العهد'!$A$3:$J$3,0)),\"\")","v":8153},{"$f":"IFERROR(INDEX('ارشيف العهد'!$A$4:$J$20000,SMALL(IF('ارشيف العهد'!$A$4:$J$20000=$D$6,ROW('ارشيف العهد'!$A$4:$J$20000)-ROW('ارشيف العهد'!$A$3:$J$3)),ROW(4:4)),MATCH($C$11,'ارشيف العهد'!$A$3:$J$3,0)),\"\")","v":962},{"$f":"IFERROR(INDEX('ارشيف العهد'!$A$4:$J$20000,SMALL(IF('ارشيف العهد'!$A$4:$J$20000=$D$6,ROW('ارشيف العهد'!$A$4:$J$20000)-ROW('ارشيف العهد'!$A$3:$J$3)),ROW(4:4)),MATCH($D$11,'ارشيف العهد'!$A$3:$J$3,0)),\"\")","v":8153},{"$f":"IFERROR(INDEX('ارشيف العهد'!$A$4:$J$20000,SMALL(IF('ارشيف العهد'!$A$4:$J$20000=$D$6,ROW('ارشيف العهد'!$A$4:$J$20000)-ROW('ارشيف العهد'!$A$3:$J$3)),ROW(4:4)),MATCH($E$11,'ارشيف العهد'!$A$3:$J$3,0)),\"\")","v":8153},{"$f":"IFERROR(INDEX('ارشيف العهد'!$A$4:$J$20000,SMALL(IF('ارشيف العهد'!$A$4:$J$20000=$D$6,ROW('ارشيف العهد'!$A$4:$J$20000)-ROW('ارشيف العهد'!$A$3:$J$3)),ROW(4:4)),MATCH($F$11,'ارشيف العهد'!$A$3:$J$3,0)),\"\")","v":8153},{"$f":"IFERROR(INDEX('ارشيف العهد'!$A$4:$J$20000,SMALL(IF('ارشيف العهد'!$A$4:$J$20000=$D$6,ROW('ارشيف العهد'!$A$4:$J$20000)-ROW('ارشيف العهد'!$A$3:$J$3)),ROW(4:4)),MATCH($G$11,'ارشيف العهد'!$A$3:$J$3,0)),\"\")","v":8153},{"$f":"IFERROR(INDEX('ارشيف العهد'!$A$4:$J$20000,SMALL(IF('ارشيف العهد'!$A$4:$J$20000=$D$6,ROW('ارشيف العهد'!$A$4:$J$20000)-ROW('ارشيف العهد'!$A$3:$J$3)),ROW(4:4)),MATCH($H$11,'ارشيف العهد'!$A$3:$J$3,0)),\"\")","v":8153}]
[{"$f":"IF(B16=\"\",\"\",SUBTOTAL(3,B$12:B16))","v":5},{"$f":"IFERROR(INDEX('ارشيف العهد'!$A$4:$J$20000,SMALL(IF('ارشيف العهد'!$A$4:$J$20000=$D$6,ROW('ارشيف العهد'!$A$4:$J$20000)-ROW('ارشيف العهد'!$A$3:$J$3)),ROW(5:5)),MATCH($B$11,'ارشيف العهد'!$A$3:$J$3,0)),\"\")","v":"bbbbbbbbbb"},{"$f":"IFERROR(INDEX('ارشيف العهد'!$A$4:$J$20000,SMALL(IF('ارشيف العهد'!$A$4:$J$20000=$D$6,ROW('ارشيف العهد'!$A$4:$J$20000)-ROW('ارشيف العهد'!$A$3:$J$3)),ROW(5:5)),MATCH($C$11,'ارشيف العهد'!$A$3:$J$3,0)),\"\")","v":61},{"$f":"IFERROR(INDEX('ارشيف العهد'!$A$4:$J$20000,SMALL(IF('ارشيف العهد'!$A$4:$J$20000=$D$6,ROW('ارشيف العهد'!$A$4:$J$20000)-ROW('ارشيف العهد'!$A$3:$J$3)),ROW(5:5)),MATCH($D$11,'ارشيف العهد'!$A$3:$J$3,0)),\"\")","v":"T1"},{"$f":"IFERROR(INDEX('ارشيف العهد'!$A$4:$J$20000,SMALL(IF('ارشيف العهد'!$A$4:$J$20000=$D$6,ROW('ارشيف العهد'!$A$4:$J$20000)-ROW('ارشيف العهد'!$A$3:$J$3)),ROW(5:5)),MATCH($E$11,'ارشيف العهد'!$A$3:$J$3,0)),\"\")","v":"tttttttttt"},{"$f":"IFERROR(INDEX('ارشيف العهد'!$A$4:$J$20000,SMALL(IF('ارشيف العهد'!$A$4:$J$20000=$D$6,ROW('ارشيف العهد'!$A$4:$J$20000)-ROW('ارشيف العهد'!$A$3:$J$3)),ROW(5:5)),MATCH($F$11,'ارشيف العهد'!$A$3:$J$3,0)),\"\")","v":25},{"$f":"IFERROR(INDEX('ارشيف العهد'!$A$4:$J$20000,SMALL(IF('ارشيف العهد'!$A$4:$J$20000=$D$6,ROW('ارشيف العهد'!$A$4:$J$20000)-ROW('ارشيف العهد'!$A$3:$J$3)),ROW(5:5)),MATCH($G$11,'ارشيف العهد'!$A$3:$J$3,0)),\"\")","v":5},{"$f":"IFERROR(INDEX('ارشيف العهد'!$A$4:$J$20000,SMALL(IF('ارشيف العهد'!$A$4:$J$20000=$D$6,ROW('ارشيف العهد'!$A$4:$J$20000)-ROW('ارشيف العهد'!$A$3:$J$3)),ROW(5:5)),MATCH($H$11,'ارشيف العهد'!$A$3:$J$3,0)),\"\")","v":30}]
[{"$f":"IF(B17=\"\",\"\",SUBTOTAL(3,B$12:B17))","v":6},{"$f":"IFERROR(INDEX('ارشيف العهد'!$A$4:$J$20000,SMALL(IF('ارشيف العهد'!$A$4:$J$20000=$D$6,ROW('ارشيف العهد'!$A$4:$J$20000)-ROW('ارشيف العهد'!$A$3:$J$3)),ROW(6:6)),MATCH($B$11,'ارشيف العهد'!$A$3:$J$3,0)),\"\")","v":"nnnnnnnnnnn"},{"$f":"IFERROR(INDEX('ارشيف العهد'!$A$4:$J$20000,SMALL(IF('ارشيف العهد'!$A$4:$J$20000=$D$6,ROW('ارشيف العهد'!$A$4:$J$20000)-ROW('ارشيف العهد'!$A$3:$J$3)),ROW(6:6)),MATCH($C$11,'ارشيف العهد'!$A$3:$J$3,0)),\"\")","v":631},{"$f":"IFERROR(INDEX('ارشيف العهد'!$A$4:$J$20000,SMALL(IF('ارشيف العهد'!$A$4:$J$20000=$D$6,ROW('ارشيف العهد'!$A$4:$J$20000)-ROW('ارشيف العهد'!$A$3:$J$3)),ROW(6:6)),MATCH($D$11,'ارشيف العهد'!$A$3:$J$3,0)),\"\")","v":"T1"},{"$f":"IFERROR(INDEX('ارشيف العهد'!$A$4:$J$20000,SMALL(IF('ارشيف العهد'!$A$4:$J$20000=$D$6,ROW('ارشيف العهد'!$A$4:$J$20000)-ROW('ارشيف العهد'!$A$3:$J$3)),ROW(6:6)),MATCH($E$11,'ارشيف العهد'!$A$3:$J$3,0)),\"\")","v":"yyyyyyyyyyyyy"},{"$f":"IFERROR(INDEX('ارشيف العهد'!$A$4:$J$20000,SMALL(IF('ارشيف العهد'!$A$4:$J$20000=$D$6,ROW('ارشيف العهد'!$A$4:$J$20000)-ROW('ارشيف العهد'!$A$3:$J$3)),ROW(6:6)),MATCH($F$11,'ارشيف العهد'!$A$3:$J$3,0)),\"\")","v":30},{"$f":"IFERROR(INDEX('ارشيف العهد'!$A$4:$J$20000,SMALL(IF('ارشيف العهد'!$A$4:$J$20000=$D$6,ROW('ارشيف العهد'!$A$4:$J$20000)-ROW('ارشيف العهد'!$A$3:$J$3)),ROW(6:6)),MATCH($G$11,'ارشيف العهد'!$A$3:$J$3,0)),\"\")","v":6},{"$f":"IFERROR(INDEX('ارشيف العهد'!$A$4:$J$20000,SMALL(IF('ارشيف العهد'!$A$4:$J$20000=$D$6,ROW('ارشيف العهد'!$A$4:$J$20000)-ROW('ارشيف العهد'!$A$3:$J$3)),ROW(6:6)),MATCH($H$11,'ارشيف العهد'!$A$3:$J$3,0)),\"\")","v":36}]
[{"$f":"IF(B18=\"\",\"\",SUBTOTAL(3,B$12:B18))","v":7},{"$f":"IFERROR(INDEX('ارشيف العهد'!$A$4:$J$20000,SMALL(IF('ارشيف العهد'!$A$4:$J$20000=$D$6,ROW('ارشيف العهد'!$A$4:$J$20000)-ROW('ارشيف العهد'!$A$3:$J$3)),ROW(7:7)),MATCH($B$11,'ارشيف العهد'!$A$3:$J$3,0)),\"\")","v":"mmmmmmmmmmmmm"},{"$f":"IFERROR(INDEX('ارشيف العهد'!$A$4:$J$20000,SMALL(IF('ارشيف العهد'!$A$4:$J$20000=$D$6,ROW('ارشيف العهد'!$A$4:$J$20000)-ROW('ارشيف العهد'!$A$3:$J$3)),ROW(7:7)),MATCH($C$11,'ارشيف العهد'!$A$3:$J$3,0)),\"\")","v":641},{"$f":"IFERROR(INDEX('ارشيف العهد'!$A$4:$J$20000,SMALL(IF('ارشيف العهد'!$A$4:$J$20000=$D$6,ROW('ارشيف العهد'!$A$4:$J$20000)-ROW('ارشيف العهد'!$A$3:$J$3)),ROW(7:7)),MATCH($D$11,'ارشيف العهد'!$A$3:$J$3,0)),\"\")","v":"T1"},{"$f":"IFERROR(INDEX('ارشيف العهد'!$A$4:$J$20000,SMALL(IF('ارشيف العهد'!$A$4:$J$20000=$D$6,ROW('ارشيف العهد'!$A$4:$J$20000)-ROW('ارشيف العهد'!$A$3:$J$3)),ROW(7:7)),MATCH($E$11,'ارشيف العهد'!$A$3:$J$3,0)),\"\")","v":"uuuuuuuuuuuuu"},{"$f":"IFERROR(INDEX('ارشيف العهد'!$A$4:$J$20000,SMALL(IF('ارشيف العهد'!$A$4:$J$20000=$D$6,ROW('ارشيف العهد'!$A$4:$J$20000)-ROW('ارشيف العهد'!$A$3:$J$3)),ROW(7:7)),MATCH($F$11,'ارشيف العهد'!$A$3:$J$3,0)),\"\")","v":35},{"$f":"IFERROR(INDEX('ارشيف العهد'!$A$4:$J$20000,SMALL(IF('ارشيف العهد'!$A$4:$J$20000=$D$6,ROW('ارشيف العهد'!$A$4:$J$20000)-ROW('ارشيف العهد'!$A$3:$J$3)),ROW(7:7)),MATCH($G$11,'ارشيف العهد'!$A$3:$J$3,0)),\"\")","v":7},{"$f":"IFERROR(INDEX('ارشيف العهد'!$A$4:$J$20000,SMALL(IF('ارشيف العهد'!$A$4:$J$20000=$D$6,ROW('ارشيف العهد'!$A$4:$J$20000)-ROW('ارشيف العهد'!$A$3:$J$3)),ROW(7:7)),MATCH($H$11,'ارشيف العهد'!$A$3:$J$3,0)),\"\")","v":42}]
[{"$f":"IF(B19=\"\",\"\",SUBTOTAL(3,B$12:B19))","v":8},{"$f":"IFERROR(INDEX('ارشيف العهد'!$A$4:$J$20000,SMALL(IF('ارشيف العهد'!$A$4:$J$20000=$D$6,ROW('ارشيف العهد'!$A$4:$J$20000)-ROW('ارشيف العهد'!$A$3:$J$3)),ROW(8:8)),MATCH($B$11,'ارشيف العهد'!$A$3:$J$3,0)),\"\")","v":"llllllllllllll"},{"$f":"IFERROR(INDEX('ارشيف العهد'!$A$4:$J$20000,SMALL(IF('ارشيف العهد'!$A$4:$J$20000=$D$6,ROW('ارشيف العهد'!$A$4:$J$20000)-ROW('ارشيف العهد'!$A$3:$J$3)),ROW(8:8)),MATCH($C$11,'ارشيف العهد'!$A$3:$J$3,0)),\"\")","v":6},{"$f":"IFERROR(INDEX('ارشيف العهد'!$A$4:$J$20000,SMALL(IF('ارشيف العهد'!$A$4:$J$20000=$D$6,ROW('ارشيف العهد'!$A$4:$J$20000)-ROW('ارشيف العهد'!$A$3:$J$3)),ROW(8:8)),MATCH($D$11,'ارشيف العهد'!$A$3:$J$3,0)),\"\")","v":"T1"},{"$f":"IFERROR(INDEX('ارشيف العهد'!$A$4:$J$20000,SMALL(IF('ارشيف العهد'!$A$4:$J$20000=$D$6,ROW('ارشيف العهد'!$A$4:$J$20000)-ROW('ارشيف العهد'!$A$3:$J$3)),ROW(8:8)),MATCH($E$11,'ارشيف العهد'!$A$3:$J$3,0)),\"\")","v":"iiiiiiiiiiiiii"},{"$f":"IFERROR(INDEX('ارشيف العهد'!$A$4:$J$20000,SMALL(IF('ارشيف العهد'!$A$4:$J$20000=$D$6,ROW('ارشيف العهد'!$A$4:$J$20000)-ROW('ارشيف العهد'!$A$3:$J$3)),ROW(8:8)),MATCH($F$11,'ارشيف العهد'!$A$3:$J$3,0)),\"\")","v":40},{"$f":"IFERROR(INDEX('ارشيف العهد'!$A$4:$J$20000,SMALL(IF('ارشيف العهد'!$A$4:$J$20000=$D$6,ROW('ارشيف العهد'!$A$4:$J$20000)-ROW('ارشيف العهد'!$A$3:$J$3)),ROW(8:8)),MATCH($G$11,'ارشيف العهد'!$A$3:$J$3,0)),\"\")","v":8},{"$f":"IFERROR(INDEX('ارشيف العهد'!$A$4:$J$20000,SMALL(IF('ارشيف العهد'!$A$4:$J$20000=$D$6,ROW('ارشيف العهد'!$A$4:$J$20000)-ROW('ارشيف العهد'!$A$3:$J$3)),ROW(8:8)),MATCH($H$11,'ارشيف العهد'!$A$3:$J$3,0)),\"\")","v":48}]
[{"$f":"IF(B20=\"\",\"\",SUBTOTAL(3,B$12:B20))","v":9},{"$f":"IFERROR(INDEX('ارشيف العهد'!$A$4:$J$20000,SMALL(IF('ارشيف العهد'!$A$4:$J$20000=$D$6,ROW('ارشيف العهد'!$A$4:$J$20000)-ROW('ارشيف العهد'!$A$3:$J$3)),ROW(9:9)),MATCH($B$11,'ارشيف العهد'!$A$3:$J$3,0)),\"\")","v":"kkkkkkkkk"},{"$f":"IFERROR(INDEX('ارشيف العهد'!$A$4:$J$20000,SMALL(IF('ارشيف العهد'!$A$4:$J$20000=$D$6,ROW('ارشيف العهد'!$A$4:$J$20000)-ROW('ارشيف العهد'!$A$3:$J$3)),ROW(9:9)),MATCH($C$11,'ارشيف العهد'!$A$3:$J$3,0)),\"\")","v":63},{"$f":"IFERROR(INDEX('ارشيف العهد'!$A$4:$J$20000,SMALL(IF('ارشيف العهد'!$A$4:$J$20000=$D$6,ROW('ارشيف العهد'!$A$4:$J$20000)-ROW('ارشيف العهد'!$A$3:$J$3)),ROW(9:9)),MATCH($D$11,'ارشيف العهد'!$A$3:$J$3,0)),\"\")","v":"T1"},{"$f":"IFERROR(INDEX('ارشيف العهد'!$A$4:$J$20000,SMALL(IF('ارشيف العهد'!$A$4:$J$20000=$D$6,ROW('ارشيف العهد'!$A$4:$J$20000)-ROW('ارشيف العهد'!$A$3:$J$3)),ROW(9:9)),MATCH($E$11,'ارشيف العهد'!$A$3:$J$3,0)),\"\")","v":"oooooooooo"},{"$f":"IFERROR(INDEX('ارشيف العهد'!$A$4:$J$20000,SMALL(IF('ارشيف العهد'!$A$4:$J$20000=$D$6,ROW('ارشيف العهد'!$A$4:$J$20000)-ROW('ارشيف العهد'!$A$3:$J$3)),ROW(9:9)),MATCH($F$11,'ارشيف العهد'!$A$3:$J$3,0)),\"\")","v":45},{"$f":"IFERROR(INDEX('ارشيف العهد'!$A$4:$J$20000,SMALL(IF('ارشيف العهد'!$A$4:$J$20000=$D$6,ROW('ارشيف العهد'!$A$4:$J$20000)-ROW('ارشيف العهد'!$A$3:$J$3)),ROW(9:9)),MATCH($G$11,'ارشيف العهد'!$A$3:$J$3,0)),\"\")","v":9},{"$f":"IFERROR(INDEX('ارشيف العهد'!$A$4:$J$20000,SMALL(IF('ارشيف العهد'!$A$4:$J$20000=$D$6,ROW('ارشيف العهد'!$A$4:$J$20000)-ROW('ارشيف العهد'!$A$3:$J$3)),ROW(9:9)),MATCH($H$11,'ارشيف العهد'!$A$3:$J$3,0)),\"\")","v":54}]
[{"$f":"IF(B21=\"\",\"\",SUBTOTAL(3,B$12:B21))","v":10},{"$f":"IFERROR(INDEX('ارشيف العهد'!$A$4:$J$20000,SMALL(IF('ارشيف العهد'!$A$4:$J$20000=$D$6,ROW('ارشيف العهد'!$A$4:$J$20000)-ROW('ارشيف العهد'!$A$3:$J$3)),ROW(10:10)),MATCH($B$11,'ارشيف العهد'!$A$3:$J$3,0)),\"\")","v":"jjjjjjjjjjj"},{"$f":"IFERROR(INDEX('ارشيف العهد'!$A$4:$J$20000,SMALL(IF('ارشيف العهد'!$A$4:$J$20000=$D$6,ROW('ارشيف العهد'!$A$4:$J$20000)-ROW('ارشيف العهد'!$A$3:$J$3)),ROW(10:10)),MATCH($C$11,'ارشيف العهد'!$A$3:$J$3,0)),\"\")","v":6135},{"$f":"IFERROR(INDEX('ارشيف العهد'!$A$4:$J$20000,SMALL(IF('ارشيف العهد'!$A$4:$J$20000=$D$6,ROW('ارشيف العهد'!$A$4:$J$20000)-ROW('ارشيف العهد'!$A$3:$J$3)),ROW(10:10)),MATCH($D$11,'ارشيف العهد'!$A$3:$J$3,0)),\"\")","v":"T2"},{"$f":"IFERROR(INDEX('ارشيف العهد'!$A$4:$J$20000,SMALL(IF('ارشيف العهد'!$A$4:$J$20000=$D$6,ROW('ارشيف العهد'!$A$4:$J$20000)-ROW('ارشيف العهد'!$A$3:$J$3)),ROW(10:10)),MATCH($E$11,'ارشيف العهد'!$A$3:$J$3,0)),\"\")","v":"ppppppppp"},{"$f":"IFERROR(INDEX('ارشيف العهد'!$A$4:$J$20000,SMALL(IF('ارشيف العهد'!$A$4:$J$20000=$D$6,ROW('ارشيف العهد'!$A$4:$J$20000)-ROW('ارشيف العهد'!$A$3:$J$3)),ROW(10:10)),MATCH($F$11,'ارشيف العهد'!$A$3:$J$3,0)),\"\")","v":50},{"$f":"IFERROR(INDEX('ارشيف العهد'!$A$4:$J$20000,SMALL(IF('ارشيف العهد'!$A$4:$J$20000=$D$6,ROW('ارشيف العهد'!$A$4:$J$20000)-ROW('ارشيف العهد'!$A$3:$J$3)),ROW(10:10)),MATCH($G$11,'ارشيف العهد'!$A$3:$J$3,0)),\"\")","v":10},{"$f":"IFERROR(INDEX('ارشيف العهد'!$A$4:$J$20000,SMALL(IF('ارشيف العهد'!$A$4:$J$20000=$D$6,ROW('ارشيف العهد'!$A$4:$J$20000)-ROW('ارشيف العهد'!$A$3:$J$3)),ROW(10:10)),MATCH($H$11,'ارشيف العهد'!$A$3:$J$3,0)),\"\")","v":60}]
[{"$f":"IF(B22=\"\",\"\",SUBTOTAL(3,B$12:B22))","v":11},{"$f":"IFERROR(INDEX('ارشيف العهد'!$A$4:$J$20000,SMALL(IF('ارشيف العهد'!$A$4:$J$20000=$D$6,ROW('ارشيف العهد'!$A$4:$J$20000)-ROW('ارشيف العهد'!$A$3:$J$3)),ROW(11:11)),MATCH($B$11,'ارشيف العهد'!$A$3:$J$3,0)),\"\")","v":"hhhhhhhhhhhh"},{"$f":"IFERROR(INDEX('ارشيف العهد'!$A$4:$J$20000,SMALL(IF('ارشيف العهد'!$A$4:$J$20000=$D$6,ROW('ارشيف العهد'!$A$4:$J$20000)-ROW('ارشيف العهد'!$A$3:$J$3)),ROW(11:11)),MATCH($C$11,'ارشيف العهد'!$A$3:$J$3,0)),\"\")","v":6135},{"$f":"IFERROR(INDEX('ارشيف العهد'!$A$4:$J$20000,SMALL(IF('ارشيف العهد'!$A$4:$J$20000=$D$6,ROW('ارشيف العهد'!$A$4:$J$20000)-ROW('ارشيف العهد'!$A$3:$J$3)),ROW(11:11)),MATCH($D$11,'ارشيف العهد'!$A$3:$J$3,0)),\"\")","v":"T2"},{"$f":"IFERROR(INDEX('ارشيف العهد'!$A$4:$J$20000,SMALL(IF('ارشيف العهد'!$A$4:$J$20000=$D$6,ROW('ارشيف العهد'!$A$4:$J$20000)-ROW('ارشيف العهد'!$A$3:$J$3)),ROW(11:11)),MATCH($E$11,'ارشيف العهد'!$A$3:$J$3,0)),\"\")","v":"[[[[[[[[[["},{"$f":"IFERROR(INDEX('ارشيف العهد'!$A$4:$J$20000,SMALL(IF('ارشيف العهد'!$A$4:$J$20000=$D$6,ROW('ارشيف العهد'!$A$4:$J$20000)-ROW('ارشيف العهد'!$A$3:$J$3)),ROW(11:11)),MATCH($F$11,'ارشيف العهد'!$A$3:$J$3,0)),\"\")","v":55},{"$f":"IFERROR(INDEX('ارشيف العهد'!$A$4:$J$20000,SMALL(IF('ارشيف العهد'!$A$4:$J$20000=$D$6,ROW('ارشيف العهد'!$A$4:$J$20000)-ROW('ارشيف العهد'!$A$3:$J$3)),ROW(11:11)),MATCH($G$11,'ارشيف العهد'!$A$3:$J$3,0)),\"\")","v":11},{"$f":"IFERROR(INDEX('ارشيف العهد'!$A$4:$J$20000,SMALL(IF('ارشيف العهد'!$A$4:$J$20000=$D$6,ROW('ارشيف العهد'!$A$4:$J$20000)-ROW('ارشيف العهد'!$A$3:$J$3)),ROW(11:11)),MATCH($H$11,'ارشيف العهد'!$A$3:$J$3,0)),\"\")","v":66}]
[{"$f":"IF(B23=\"\",\"\",SUBTOTAL(3,B$12:B23))","v":12},{"$f":"IFERROR(INDEX('ارشيف العهد'!$A$4:$J$20000,SMALL(IF('ارشيف العهد'!$A$4:$J$20000=$D$6,ROW('ارشيف العهد'!$A$4:$J$20000)-ROW('ارشيف العهد'!$A$3:$J$3)),ROW(12:12)),MATCH($B$11,'ارشيف العهد'!$A$3:$J$3,0)),\"\")","v":"gggggggggg"},{"$f":"IFERROR(INDEX('ارشيف العهد'!$A$4:$J$20000,SMALL(IF('ارشيف العهد'!$A$4:$J$20000=$D$6,ROW('ارشيف العهد'!$A$4:$J$20000)-ROW('ارشيف العهد'!$A$3:$J$3)),ROW(12:12)),MATCH($C$11,'ارشيف العهد'!$A$3:$J$3,0)),\"\")","v":61},{"$f":"IFERROR(INDEX('ارشيف العهد'!$A$4:$J$20000,SMALL(IF('ارشيف العهد'!$A$4:$J$20000=$D$6,ROW('ارشيف العهد'!$A$4:$J$20000)-ROW('ارشيف العهد'!$A$3:$J$3)),ROW(12:12)),MATCH($D$11,'ارشيف العهد'!$A$3:$J$3,0)),\"\")","v":"T2"},{"$f":"IFERROR(INDEX('ارشيف العهد'!$A$4:$J$20000,SMALL(IF('ارشيف العهد'!$A$4:$J$20000=$D$6,ROW('ارشيف العهد'!$A$4:$J$20000)-ROW('ارشيف العهد'!$A$3:$J$3)),ROW(12:12)),MATCH($E$11,'ارشيف العهد'!$A$3:$J$3,0)),\"\")","v":"''''''''''"},{"$f":"IFERROR(INDEX('ارشيف العهد'!$A$4:$J$20000,SMALL(IF('ارشيف العهد'!$A$4:$J$20000=$D$6,ROW('ارشيف العهد'!$A$4:$J$20000)-ROW('ارشيف العهد'!$A$3:$J$3)),ROW(12:12)),MATCH($F$11,'ارشيف العهد'!$A$3:$J$3,0)),\"\")","v":60},{"$f":"IFERROR(INDEX('ارشيف العهد'!$A$4:$J$20000,SMALL(IF('ارشيف العهد'!$A$4:$J$20000=$D$6,ROW('ارشيف العهد'!$A$4:$J$20000)-ROW('ارشيف العهد'!$A$3:$J$3)),ROW(12:12)),MATCH($G$11,'ارشيف العهد'!$A$3:$J$3,0)),\"\")","v":12},{"$f":"IFERROR(INDEX('ارشيف العهد'!$A$4:$J$20000,SMALL(IF('ارشيف العهد'!$A$4:$J$20000=$D$6,ROW('ارشيف العهد'!$A$4:$J$20000)-ROW('ارشيف العهد'!$A$3:$J$3)),ROW(12:12)),MATCH($H$11,'ارشيف العهد'!$A$3:$J$3,0)),\"\")","v":72}]
[{"$f":"IF(B24=\"\",\"\",SUBTOTAL(3,B$12:B24))","v":13},{"$f":"IFERROR(INDEX('ارشيف العهد'!$A$4:$J$20000,SMALL(IF('ارشيف العهد'!$A$4:$J$20000=$D$6,ROW('ارشيف العهد'!$A$4:$J$20000)-ROW('ارشيف العهد'!$A$3:$J$3)),ROW(13:13)),MATCH($B$11,'ارشيف العهد'!$A$3:$J$3,0)),\"\")","v":"ffffffffff"},{"$f":"IFERROR(INDEX('ارشيف العهد'!$A$4:$J$20000,SMALL(IF('ارشيف العهد'!$A$4:$J$20000=$D$6,ROW('ارشيف العهد'!$A$4:$J$20000)-ROW('ارشيف العهد'!$A$3:$J$3)),ROW(13:13)),MATCH($C$11,'ارشيف العهد'!$A$3:$J$3,0)),\"\")","v":6153},{"$f":"IFERROR(INDEX('ارشيف العهد'!$A$4:$J$20000,SMALL(IF('ارشيف العهد'!$A$4:$J$20000=$D$6,ROW('ارشيف العهد'!$A$4:$J$20000)-ROW('ارشيف العهد'!$A$3:$J$3)),ROW(13:13)),MATCH($D$11,'ارشيف العهد'!$A$3:$J$3,0)),\"\")","v":"T2"},{"$f":"IFERROR(INDEX('ارشيف العهد'!$A$4:$J$20000,SMALL(IF('ارشيف العهد'!$A$4:$J$20000=$D$6,ROW('ارشيف العهد'!$A$4:$J$20000)-ROW('ارشيف العهد'!$A$3:$J$3)),ROW(13:13)),MATCH($E$11,'ارشيف العهد'!$A$3:$J$3,0)),\"\")","v":";;;;;;;;;;"},{"$f":"IFERROR(INDEX('ارشيف العهد'!$A$4:$J$20000,SMALL(IF('ارشيف العهد'!$A$4:$J$20000=$D$6,ROW('ارشيف العهد'!$A$4:$J$20000)-ROW('ارشيف العهد'!$A$3:$J$3)),ROW(13:13)),MATCH($F$11,'ارشيف العهد'!$A$3:$J$3,0)),\"\")","v":65},{"$f":"IFERROR(INDEX('ارشيف العهد'!$A$4:$J$20000,SMALL(IF('ارشيف العهد'!$A$4:$J$20000=$D$6,ROW('ارشيف العهد'!$A$4:$J$20000)-ROW('ارشيف العهد'!$A$3:$J$3)),ROW(13:13)),MATCH($G$11,'ارشيف العهد'!$A$3:$J$3,0)),\"\")","v":13},{"$f":"IFERROR(INDEX('ارشيف العهد'!$A$4:$J$20000,SMALL(IF('ارشيف العهد'!$A$4:$J$20000=$D$6,ROW('ارشيف العهد'!$A$4:$J$20000)-ROW('ارشيف العهد'!$A$3:$J$3)),ROW(13:13)),MATCH($H$11,'ارشيف العهد'!$A$3:$J$3,0)),\"\")","v":78}]
[{"$f":"IF(B25=\"\",\"\",SUBTOTAL(3,B$12:B25))","v":14},{"$f":"IFERROR(INDEX('ارشيف العهد'!$A$4:$J$20000,SMALL(IF('ارشيف العهد'!$A$4:$J$20000=$D$6,ROW('ارشيف العهد'!$A$4:$J$20000)-ROW('ارشيف العهد'!$A$3:$J$3)),ROW(14:14)),MATCH($B$11,'ارشيف العهد'!$A$3:$J$3,0)),\"\")","v":"ddddddddd"},{"$f":"IFERROR(INDEX('ارشيف العهد'!$A$4:$J$20000,SMALL(IF('ارشيف العهد'!$A$4:$J$20000=$D$6,ROW('ارشيف العهد'!$A$4:$J$20000)-ROW('ارشيف العهد'!$A$3:$J$3)),ROW(14:14)),MATCH($C$11,'ارشيف العهد'!$A$3:$J$3,0)),\"\")","v":63},{"$f":"IFERROR(INDEX('ارشيف العهد'!$A$4:$J$20000,SMALL(IF('ارشيف العهد'!$A$4:$J$20000=$D$6,ROW('ارشيف العهد'!$A$4:$J$20000)-ROW('ارشيف العهد'!$A$3:$J$3)),ROW(14:14)),MATCH($D$11,'ارشيف العهد'!$A$3:$J$3,0)),\"\")","v":"T2"},{"$f":"IFERROR(INDEX('ارشيف العهد'!$A$4:$J$20000,SMALL(IF('ارشيف العهد'!$A$4:$J$20000=$D$6,ROW('ارشيف العهد'!$A$4:$J$20000)-ROW('ارشيف العهد'!$A$3:$J$3)),ROW(14:14)),MATCH($E$11,'ارشيف العهد'!$A$3:$J$3,0)),\"\")","v":"llllllllllll"},{"$f":"IFERROR(INDEX('ارشيف العهد'!$A$4:$J$20000,SMALL(IF('ارشيف العهد'!$A$4:$J$20000=$D$6,ROW('ارشيف العهد'!$A$4:$J$20000)-ROW('ارشيف العهد'!$A$3:$J$3)),ROW(14:14)),MATCH($F$11,'ارشيف العهد'!$A$3:$J$3,0)),\"\")","v":70},{"$f":"IFERROR(INDEX('ارشيف العهد'!$A$4:$J$20000,SMALL(IF('ارشيف العهد'!$A$4:$J$20000=$D$6,ROW('ارشيف العهد'!$A$4:$J$20000)-ROW('ارشيف العهد'!$A$3:$J$3)),ROW(14:14)),MATCH($G$11,'ارشيف العهد'!$A$3:$J$3,0)),\"\")","v":14},{"$f":"IFERROR(INDEX('ارشيف العهد'!$A$4:$J$20000,SMALL(IF('ارشيف العهد'!$A$4:$J$20000=$D$6,ROW('ارشيف العهد'!$A$4:$J$20000)-ROW('ارشيف العهد'!$A$3:$J$3)),ROW(14:14)),MATCH($H$11,'ارشيف العهد'!$A$3:$J$3,0)),\"\")","v":84}]
[{"$f":"IF(B26=\"\",\"\",SUBTOTAL(3,B$12:B26))","v":15},{"$f":"IFERROR(INDEX('ارشيف العهد'!$A$4:$J$20000,SMALL(IF('ارشيف العهد'!$A$4:$J$20000=$D$6,ROW('ارشيف العهد'!$A$4:$J$20000)-ROW('ارشيف العهد'!$A$3:$J$3)),ROW(15:15)),MATCH($B$11,'ارشيف العهد'!$A$3:$J$3,0)),\"\")","v":"ssssssssssss"},{"$f":"IFERROR(INDEX('ارشيف العهد'!$A$4:$J$20000,SMALL(IF('ارشيف العهد'!$A$4:$J$20000=$D$6,ROW('ارشيف العهد'!$A$4:$J$20000)-ROW('ارشيف العهد'!$A$3:$J$3)),ROW(15:15)),MATCH($C$11,'ارشيف العهد'!$A$3:$J$3,0)),\"\")","v":613},{"$f":"IFERROR(INDEX('ارشيف العهد'!$A$4:$J$20000,SMALL(IF('ارشيف العهد'!$A$4:$J$20000=$D$6,ROW('ارشيف العهد'!$A$4:$J$20000)-ROW('ارشيف العهد'!$A$3:$J$3)),ROW(15:15)),MATCH($D$11,'ارشيف العهد'!$A$3:$J$3,0)),\"\")","v":"T2"},{"$f":"IFERROR(INDEX('ارشيف العهد'!$A$4:$J$20000,SMALL(IF('ارشيف العهد'!$A$4:$J$20000=$D$6,ROW('ارشيف العهد'!$A$4:$J$20000)-ROW('ارشيف العهد'!$A$3:$J$3)),ROW(15:15)),MATCH($E$11,'ارشيف العهد'!$A$3:$J$3,0)),\"\")","v":"kkkkkkkkkk"},{"$f":"IFERROR(INDEX('ارشيف العهد'!$A$4:$J$20000,SMALL(IF('ارشيف العهد'!$A$4:$J$20000=$D$6,ROW('ارشيف العهد'!$A$4:$J$20000)-ROW('ارشيف العهد'!$A$3:$J$3)),ROW(15:15)),MATCH($F$11,'ارشيف العهد'!$A$3:$J$3,0)),\"\")","v":75},{"$f":"IFERROR(INDEX('ارشيف العهد'!$A$4:$J$20000,SMALL(IF('ارشيف العهد'!$A$4:$J$20000=$D$6,ROW('ارشيف العهد'!$A$4:$J$20000)-ROW('ارشيف العهد'!$A$3:$J$3)),ROW(15:15)),MATCH($G$11,'ارشيف العهد'!$A$3:$J$3,0)),\"\")","v":15},{"$f":"IFERROR(INDEX('ارشيف العهد'!$A$4:$J$20000,SMALL(IF('ارشيف العهد'!$A$4:$J$20000=$D$6,ROW('ارشيف العهد'!$A$4:$J$20000)-ROW('ارشيف العهد'!$A$3:$J$3)),ROW(15:15)),MATCH($H$11,'ارشيف العهد'!$A$3:$J$3,0)),\"\")","v":90}]
[{"$f":"IF(B27=\"\",\"\",SUBTOTAL(3,B$12:B27))","v":16},{"$f":"IFERROR(INDEX('ارشيف العهد'!$A$4:$J$20000,SMALL(IF('ارشيف العهد'!$A$4:$J$20000=$D$6,ROW('ارشيف العهد'!$A$4:$J$20000)-ROW('ارشيف العهد'!$A$3:$J$3)),ROW(16:16)),MATCH($B$11,'ارشيف العهد'!$A$3:$J$3,0)),\"\")","v":"aaaaaaaaa"},{"$f":"IFERROR(INDEX('ارشيف العهد'!$A$4:$J$20000,SMALL(IF('ارشيف العهد'!$A$4:$J$20000=$D$6,ROW('ارشيف العهد'!$A$4:$J$20000)-ROW('ارشيف العهد'!$A$3:$J$3)),ROW(16:16)),MATCH($C$11,'ارشيف العهد'!$A$3:$J$3,0)),\"\")","v":613},{"$f":"IFERROR(INDEX('ارشيف العهد'!$A$4:$J$20000,SMALL(IF('ارشيف العهد'!$A$4:$J$20000=$D$6,ROW('ارشيف العهد'!$A$4:$J$20000)-ROW('ارشيف العهد'!$A$3:$J$3)),ROW(16:16)),MATCH($D$11,'ارشيف العهد'!$A$3:$J$3,0)),\"\")","v":"T2"},{"$f":"IFERROR(INDEX('ارشيف العهد'!$A$4:$J$20000,SMALL(IF('ارشيف العهد'!$A$4:$J$20000=$D$6,ROW('ارشيف العهد'!$A$4:$J$20000)-ROW('ارشيف العهد'!$A$3:$J$3)),ROW(16:16)),MATCH($E$11,'ارشيف العهد'!$A$3:$J$3,0)),\"\")","v":"jjjjjjjjjjjjjj"},{"$f":"IFERROR(INDEX('ارشيف العهد'!$A$4:$J$20000,SMALL(IF('ارشيف العهد'!$A$4:$J$20000=$D$6,ROW('ارشيف العهد'!$A$4:$J$20000)-ROW('ارشيف العهد'!$A$3:$J$3)),ROW(16:16)),MATCH($F$11,'ارشيف العهد'!$A$3:$J$3,0)),\"\")","v":80},{"$f":"IFERROR(INDEX('ارشيف العهد'!$A$4:$J$20000,SMALL(IF('ارشيف العهد'!$A$4:$J$20000=$D$6,ROW('ارشيف العهد'!$A$4:$J$20000)-ROW('ارشيف العهد'!$A$3:$J$3)),ROW(16:16)),MATCH($G$11,'ارشيف العهد'!$A$3:$J$3,0)),\"\")","v":16},{"$f":"IFERROR(INDEX('ارشيف العهد'!$A$4:$J$20000,SMALL(IF('ارشيف العهد'!$A$4:$J$20000=$D$6,ROW('ارشيف العهد'!$A$4:$J$20000)-ROW('ارشيف العهد'!$A$3:$J$3)),ROW(16:16)),MATCH($H$11,'ارشيف العهد'!$A$3:$J$3,0)),\"\")","v":96}]
[{"$f":"IF(B28=\"\",\"\",SUBTOTAL(3,B$12:B28))","v":17},{"$f":"IFERROR(INDEX('ارشيف العهد'!$A$4:$J$20000,SMALL(IF('ارشيف العهد'!$A$4:$J$20000=$D$6,ROW('ارشيف العهد'!$A$4:$J$20000)-ROW('ارشيف العهد'!$A$3:$J$3)),ROW(17:17)),MATCH($B$11,'ارشيف العهد'!$A$3:$J$3,0)),\"\")","v":0},{"$f":"IFERROR(INDEX('ارشيف العهد'!$A$4:$J$20000,SMALL(IF('ارشيف العهد'!$A$4:$J$20000=$D$6,ROW('ارشيف العهد'!$A$4:$J$20000)-ROW('ارشيف العهد'!$A$3:$J$3)),ROW(17:17)),MATCH($C$11,'ارشيف العهد'!$A$3:$J$3,0)),\"\")","v":0},{"$f":"IFERROR(INDEX('ارشيف العهد'!$A$4:$J$20000,SMALL(IF('ارشيف العهد'!$A$4:$J$20000=$D$6,ROW('ارشيف العهد'!$A$4:$J$20000)-ROW('ارشيف العهد'!$A$3:$J$3)),ROW(17:17)),MATCH($D$11,'ارشيف العهد'!$A$3:$J$3,0)),\"\")","v":0},{"$f":"IFERROR(INDEX('ارشيف العهد'!$A$4:$J$20000,SMALL(IF('ارشيف العهد'!$A$4:$J$20000=$D$6,ROW('ارشيف العهد'!$A$4:$J$20000)-ROW('ارشيف العهد'!$A$3:$J$3)),ROW(17:17)),MATCH($E$11,'ارشيف العهد'!$A$3:$J$3,0)),\"\")","v":0},{"$f":"IFERROR(INDEX('ارشيف العهد'!$A$4:$J$20000,SMALL(IF('ارشيف العهد'!$A$4:$J$20000=$D$6,ROW('ارشيف العهد'!$A$4:$J$20000)-ROW('ارشيف العهد'!$A$3:$J$3)),ROW(17:17)),MATCH($F$11,'ارشيف العهد'!$A$3:$J$3,0)),\"\")","v":0},{"$f":"IFERROR(INDEX('ارشيف العهد'!$A$4:$J$20000,SMALL(IF('ارشيف العهد'!$A$4:$J$20000=$D$6,ROW('ارشيف العهد'!$A$4:$J$20000)-ROW('ارشيف العهد'!$A$3:$J$3)),ROW(17:17)),MATCH($G$11,'ارشيف العهد'!$A$3:$J$3,0)),\"\")","v":0},{"$f":"IFERROR(INDEX('ارشيف العهد'!$A$4:$J$20000,SMALL(IF('ارشيف العهد'!$A$4:$J$20000=$D$6,ROW('ارشيف العهد'!$A$4:$J$20000)-ROW('ارشيف العهد'!$A$3:$J$3)),ROW(17:17)),MATCH($H$11,'ارشيف العهد'!$A$3:$J$3,0)),\"\")","v":0}]
[{"$f":"IF(B29=\"\",\"\",SUBTOTAL(3,B$12:B29))","v":""},{"$f":"IFERROR(INDEX('ارشيف العهد'!$A$4:$J$20000,SMALL(IF('ارشيف العهد'!$A$4:$J$20000=$D$6,ROW('ارشيف العهد'!$A$4:$J$20000)-ROW('ارشيف العهد'!$A$3:$J$3)),ROW(18:18)),MATCH($B$11,'ارشيف العهد'!$A$3:$J$3,0)),\"\")","v":""},{"$f":"IFERROR(INDEX('ارشيف العهد'!$A$4:$J$20000,SMALL(IF('ارشيف العهد'!$A$4:$J$20000=$D$6,ROW('ارشيف العهد'!$A$4:$J$20000)-ROW('ارشيف العهد'!$A$3:$J$3)),ROW(18:18)),MATCH($C$11,'ارشيف العهد'!$A$3:$J$3,0)),\"\")","v":""},{"$f":"IFERROR(INDEX('ارشيف العهد'!$A$4:$J$20000,SMALL(IF('ارشيف العهد'!$A$4:$J$20000=$D$6,ROW('ارشيف العهد'!$A$4:$J$20000)-ROW('ارشيف العهد'!$A$3:$J$3)),ROW(18:18)),MATCH($D$11,'ارشيف العهد'!$A$3:$J$3,0)),\"\")","v":""},{"$f":"IFERROR(INDEX('ارشيف العهد'!$A$4:$J$20000,SMALL(IF('ارشيف العهد'!$A$4:$J$20000=$D$6,ROW('ارشيف العهد'!$A$4:$J$20000)-ROW('ارشيف العهد'!$A$3:$J$3)),ROW(18:18)),MATCH($E$11,'ارشيف العهد'!$A$3:$J$3,0)),\"\")","v":""},{"$f":"IFERROR(INDEX('ارشيف العهد'!$A$4:$J$20000,SMALL(IF('ارشيف العهد'!$A$4:$J$20000=$D$6,ROW('ارشيف العهد'!$A$4:$J$20000)-ROW('ارشيف العهد'!$A$3:$J$3)),ROW(18:18)),MATCH($F$11,'ارشيف العهد'!$A$3:$J$3,0)),\"\")","v":""},{"$f":"IFERROR(INDEX('ارشيف العهد'!$A$4:$J$20000,SMALL(IF('ارشيف العهد'!$A$4:$J$20000=$D$6,ROW('ارشيف العهد'!$A$4:$J$20000)-ROW('ارشيف العهد'!$A$3:$J$3)),ROW(18:18)),MATCH($G$11,'ارشيف العهد'!$A$3:$J$3,0)),\"\")","v":""},{"$f":"IFERROR(INDEX('ارشيف العهد'!$A$4:$J$20000,SMALL(IF('ارشيف العهد'!$A$4:$J$20000=$D$6,ROW('ارشيف العهد'!$A$4:$J$20000)-ROW('ارشيف العهد'!$A$3:$J$3)),ROW(18:18)),MATCH($H$11,'ارشيف العهد'!$A$3:$J$3,0)),\"\")","v":""}]
[{"$f":"IF(B30=\"\",\"\",SUBTOTAL(3,B$12:B30))","v":""},{"$f":"IFERROR(INDEX('ارشيف العهد'!$A$4:$J$20000,SMALL(IF('ارشيف العهد'!$A$4:$J$20000=$D$6,ROW('ارشيف العهد'!$A$4:$J$20000)-ROW('ارشيف العهد'!$A$3:$J$3)),ROW(19:19)),MATCH($B$11,'ارشيف العهد'!$A$3:$J$3,0)),\"\")","v":""},{"$f":"IFERROR(INDEX('ارشيف العهد'!$A$4:$J$20000,SMALL(IF('ارشيف العهد'!$A$4:$J$20000=$D$6,ROW('ارشيف العهد'!$A$4:$J$20000)-ROW('ارشيف العهد'!$A$3:$J$3)),ROW(19:19)),MATCH($C$11,'ارشيف العهد'!$A$3:$J$3,0)),\"\")","v":""},{"$f":"IFERROR(INDEX('ارشيف العهد'!$A$4:$J$20000,SMALL(IF('ارشيف العهد'!$A$4:$J$20000=$D$6,ROW('ارشيف العهد'!$A$4:$J$20000)-ROW('ارشيف العهد'!$A$3:$J$3)),ROW(19:19)),MATCH($D$11,'ارشيف العهد'!$A$3:$J$3,0)),\"\")","v":""},{"$f":"IFERROR(INDEX('ارشيف العهد'!$A$4:$J$20000,SMALL(IF('ارشيف العهد'!$A$4:$J$20000=$D$6,ROW('ارشيف العهد'!$A$4:$J$20000)-ROW('ارشيف العهد'!$A$3:$J$3)),ROW(19:19)),MATCH($E$11,'ارشيف العهد'!$A$3:$J$3,0)),\"\")","v":""},{"$f":"IFERROR(INDEX('ارشيف العهد'!$A$4:$J$20000,SMALL(IF('ارشيف العهد'!$A$4:$J$20000=$D$6,ROW('ارشيف العهد'!$A$4:$J$20000)-ROW('ارشيف العهد'!$A$3:$J$3)),ROW(19:19)),MATCH($F$11,'ارشيف العهد'!$A$3:$J$3,0)),\"\")","v":""},{"$f":"IFERROR(INDEX('ارشيف العهد'!$A$4:$J$20000,SMALL(IF('ارشيف العهد'!$A$4:$J$20000=$D$6,ROW('ارشيف العهد'!$A$4:$J$20000)-ROW('ارشيف العهد'!$A$3:$J$3)),ROW(19:19)),MATCH($G$11,'ارشيف العهد'!$A$3:$J$3,0)),\"\")","v":""},{"$f":"IFERROR(INDEX('ارشيف العهد'!$A$4:$J$20000,SMALL(IF('ارشيف العهد'!$A$4:$J$20000=$D$6,ROW('ارشيف العهد'!$A$4:$J$20000)-ROW('ارشيف العهد'!$A$3:$J$3)),ROW(19:19)),MATCH($H$11,'ارشيف العهد'!$A$3:$J$3,0)),\"\")","v":""}]
[{"$f":"IF(B31=\"\",\"\",SUBTOTAL(3,B$12:B31))","v":""},{"$f":"IFERROR(INDEX('ارشيف العهد'!$A$4:$J$20000,SMALL(IF('ارشيف العهد'!$A$4:$J$20000=$D$6,ROW('ارشيف العهد'!$A$4:$J$20000)-ROW('ارشيف العهد'!$A$3:$J$3)),ROW(20:20)),MATCH($B$11,'ارشيف العهد'!$A$3:$J$3,0)),\"\")","v":""},{"$f":"IFERROR(INDEX('ارشيف العهد'!$A$4:$J$20000,SMALL(IF('ارشيف العهد'!$A$4:$J$20000=$D$6,ROW('ارشيف العهد'!$A$4:$J$20000)-ROW('ارشيف العهد'!$A$3:$J$3)),ROW(20:20)),MATCH($C$11,'ارشيف العهد'!$A$3:$J$3,0)),\"\")","v":""},{"$f":"IFERROR(INDEX('ارشيف العهد'!$A$4:$J$20000,SMALL(IF('ارشيف العهد'!$A$4:$J$20000=$D$6,ROW('ارشيف العهد'!$A$4:$J$20000)-ROW('ارشيف العهد'!$A$3:$J$3)),ROW(20:20)),MATCH($D$11,'ارشيف العهد'!$A$3:$J$3,0)),\"\")","v":""},{"$f":"IFERROR(INDEX('ارشيف العهد'!$A$4:$J$20000,SMALL(IF('ارشيف العهد'!$A$4:$J$20000=$D$6,ROW('ارشيف العهد'!$A$4:$J$20000)-ROW('ارشيف العهد'!$A$3:$J$3)),ROW(20:20)),MATCH($E$11,'ارشيف العهد'!$A$3:$J$3,0)),\"\")","v":""},{"$f":"IFERROR(INDEX('ارشيف العهد'!$A$4:$J$20000,SMALL(IF('ارشيف العهد'!$A$4:$J$20000=$D$6,ROW('ارشيف العهد'!$A$4:$J$20000)-ROW('ارشيف العهد'!$A$3:$J$3)),ROW(20:20)),MATCH($F$11,'ارشيف العهد'!$A$3:$J$3,0)),\"\")","v":""},{"$f":"IFERROR(INDEX('ارشيف العهد'!$A$4:$J$20000,SMALL(IF('ارشيف العهد'!$A$4:$J$20000=$D$6,ROW('ارشيف العهد'!$A$4:$J$20000)-ROW('ارشيف العهد'!$A$3:$J$3)),ROW(20:20)),MATCH($G$11,'ارشيف العهد'!$A$3:$J$3,0)),\"\")","v":""},{"$f":"IFERROR(INDEX('ارشيف العهد'!$A$4:$J$20000,SMALL(IF('ارشيف العهد'!$A$4:$J$20000=$D$6,ROW('ارشيف العهد'!$A$4:$J$20000)-ROW('ارشيف العهد'!$A$3:$J$3)),ROW(20:20)),MATCH($H$11,'ارشيف العهد'!$A$3:$J$3,0)),\"\")","v":""}]
[]
[null,null,null,null,"Amount",null,{"$f":"SUM($F$12:$F$31)","v":25094}]
[null,null,null,null,"VAT",null,{"$f":"SUM($G$12:$G$31)","v":24586}]
[null,null,null,null,"Total Amount",null,{"$f":"SUM($H$12:$H$31)","v":25221}]
[]
[]
[null,"Petty Cash Holder / Signature",null,null,null,null,"Projects Manager / Signature"]

{"sheet":"ارشيف العهد","index":2,"n_rows":20,"n_cols":11,"rows_kept":20,"cut":false,"hidden":false,"merged":[]}
[]
[]
["Petty Cash #","Date","Petty Cash Holder","Invoice #","Supplier","Project","Description","Amount","VAT","Total Amount","Notes"]
["PC-001","onknml","lnjkl",1518,"zzzzzzzzzzz","T1","qqqqqq",5,1,6]
["PC-001","onknml","lnjkl",8153,8153,8153,8153,8153,8153,8153]
["PC-001","onknml","lnjkl",6153,8153,8153,8153,8153,8153,8153]
["PC-001","onknml","lnjkl",962,8153,8153,8153,8153,8153,8153]
["PC-001","onknml","lnjkl",61,"bbbbbbbbbb","T1","tttttttttt",25,5,30]
["PC-001","onknml","lnjkl",631,"nnnnnnnnnnn","T1","yyyyyyyyyyyyy",30,6,36]
["PC-001","onknml","lnjkl",641,"mmmmmmmmmmmmm","T1","uuuuuuuuuuuuu",35,7,42]
["PC-001","onknml","lnjkl",6,"llllllllllllll","T1","iiiiiiiiiiiiii",40,8,48]
["PC-001","onknml","lnjkl",63,"kkkkkkkkk","T1","oooooooooo",45,9,54]
["PC-001","onknml","lnjkl",6135,"jjjjjjjjjjj","T2","ppppppppp",50,10,60]
["PC-001","onknml","lnjkl",6135,"hhhhhhhhhhhh","T2","[[[[[[[[[[",55,11,66]
["PC-001","onknml","lnjkl",61,"gggggggggg","T2","''''''''''",60,12,72]
["PC-001","onknml","lnjkl",6153,"ffffffffff","T2",";;;;;;;;;;",65,13,78]
["PC-001","onknml","lnjkl",63,"ddddddddd","T2","llllllllllll",70,14,84]
["PC-001","onknml","lnjkl",613,"ssssssssssss","T2","kkkkkkkkkk",75,15,90]
["PC-001","onknml","lnjkl",613,"aaaaaaaaa","T2","jjjjjjjjjjjjjj",80,16,96]
["PC-001","onknml","lnjkl"]

{"sheet":"المبالغ المستلمه","index":3,"n_rows":3,"n_cols":7,"rows_kept":3,"cut":false,"hidden":false,"merged":[]}
[]
[]
["S.No","Petty Cash Holder","Date","Petty Cash Code","Description","Amount","Notes"]

{"sheet":"كشف حساب","index":4,"n_rows":6,"n_cols":7,"rows_kept":6,"cut":false,"hidden":false,"merged":[]}
[]
[]
[null,"Petty Cash Holder"]
[]
[]
["S.No","Petty Cash Code","Date","Project","Amount","Receiving","Balance"]

{"sheet":"Sheet2","index":5,"n_rows":166,"n_cols":22,"rows_kept":166,"cut":false,"hidden":true,"merged":[]}
[null,null,null,null,null,null,"Inv #","Supp","Proj","Des","Am","V","T"]
["Txt7",".Value=\"\"",{"$f":"A2&B2","v":"Txt7.Value=\"\""}]
["Txt14",".Value=\"\"",{"$f":"A3&B3","v":"Txt14.Value=\"\""},null,null,null,"Txt1","Txt2","Txt3","Txt4","Txt5","Txt6","Txt7","Txt7.Value = Val(Txt5) + Val(Txt6)",null,"Txt1.Value=\"\"","Txt2.Value=\"\"","Txt3.Value=\"\"","Txt4.Value=\"\"","Txt5.Value=\"\"","Txt6.Value=\"\"","Txt7.Value=\"\""]
["Txt21",".Value=\"\"","Txt21.Value=\"\"",null,null,null,"Txt8","Txt9","Txt10","Txt11","Txt12","Txt13","Txt14","Txt14.Value = Val(Txt12) + Val(Txt13)",null,"Txt8.Value=\"\"","Txt9.Value=\"\"","Txt10.Value=\"\"","Txt11.Value=\"\"","Txt12.Value=\"\"","Txt13.Value=\"\"","Txt14.Value=\"\""]
["Txt28",".Value=\"\"","Txt28.Value=\"\"",null,null,null,"Txt15","Txt16","Txt17","Txt18","Txt19","Txt20","Txt21","Txt21.Value = Val(Txt19) + Val(Txt20)",null,"Txt15.Value=\"\"","Txt16.Value=\"\"","Txt17.Value=\"\"","Txt18.Value=\"\"","Txt19.Value=\"\"","Txt20.Value=\"\"","Txt21.Value=\"\""]
["Txt35",".Value=\"\"","Txt35.Value=\"\"",null,null,null,"Txt22","Txt23","Txt24","Txt25","Txt26","Txt27","Txt28","Txt28.Value = Val(Txt26) + Val(Txt27)",null,"Txt22.Value=\"\"","Txt23.Value=\"\"","Txt24.Value=\"\"","Txt25.Value=\"\"","Txt26.Value=\"\"","Txt27.Value=\"\"","Txt28.Value=\"\""]
["Txt42",".Value=\"\"","Txt42.Value=\"\"",null,null,null,"Txt29","Txt30","Txt31","Txt32","Txt33","Txt34","Txt35","Txt35.Value = Val(Txt33) + Val(Txt34)",null,"Txt29.Value=\"\"","Txt30.Value=\"\"","Txt31.Value=\"\"","Txt32.Value=\"\"","Txt33.Value=\"\"","Txt34.Value=\"\"","Txt35.Value=\"\""]
["Txt49",".Value=\"\"","Txt49.Value=\"\"",null,null,null,"Txt36","Txt37","Txt38","Txt39","Txt40","Txt41","Txt42","Txt42.Value = Val(Txt40) + Val(Txt41)",null,"Txt36.Value=\"\"","Txt37.Value=\"\"","Txt38.Value=\"\"","Txt39.Value=\"\"","Txt40.Value=\"\"","Txt41.Value=\"\"","Txt42.Value=\"\""]
["Txt56",".Value=\"\"","Txt56.Value=\"\"",null,null,null,"Txt43","Txt44","Txt45","Txt46","Txt47","Txt48","Txt49","Txt49.Value = Val(Txt47) + Val(Txt48)",null,"Txt43.Value=\"\"","Txt44.Value=\"\"","Txt45.Value=\"\"","Txt46.Value=\"\"","Txt47.Value=\"\"","Txt48.Value=\"\"","Txt49.Value=\"\""]
["Txt63",".Value=\"\"","Txt63.Value=\"\"",null,null,null,"Txt50","Txt51","Txt52","Txt53","Txt54","Txt55","Txt56","Txt56.Value = Val(Txt54) + Val(Txt55)",null,"Txt50.Value=\"\"","Txt51.Value=\"\"","Txt52.Value=\"\"","Txt53.Value=\"\"","Txt54.Value=\"\"","Txt55.Value=\"\"","Txt56.Value=\"\""]
["Txt70",".Value=\"\"","Txt70.Value=\"\"",null,null,null,"Txt57","Txt58","Txt59","Txt60","Txt61","Txt62","Txt63","Txt63.Value = Val(Txt61) + Val(Txt62)",null,"Txt57.Value=\"\"","Txt58.Value=\"\"","Txt59.Value=\"\"","Txt60.Value=\"\"","Txt61.Value=\"\"","Txt62.Value=\"\"","Txt63.Value=\"\""]
["Txt77",".Value=\"\"","Txt77.Value=\"\"",null,null,null,"Txt64","Txt65","Txt66","Txt67","Txt68","Txt69","Txt70","Txt70.Value = Val(Txt68) + Val(Txt69)",null,"Txt64.Value=\"\"","Txt65.Value=\"\"","Txt66.Value=\"\"","Txt67.Value=\"\"","Txt68.Value=\"\"","Txt69.Value=\"\"","Txt70.Value=\"\""]
["Txt84",".Value=\"\"","Txt84.Value=\"\"",null,null,null,"Txt71","Txt72","Txt73","Txt74","Txt75","Txt76","Txt77","Txt77.Value = Val(Txt75) + Val(Txt76)",null,"Txt71.Value=\"\"","Txt72.Value=\"\"","Txt73.Value=\"\"","Txt74.Value=\"\"","Txt75.Value=\"\"","Txt76.Value=\"\"","Txt77.Value=\"\""]
["Txt91",".Value=\"\"","Txt91.Value=\"\"",null,null,null,"Txt78","Txt79","Txt80","Txt81","Txt82","Txt83","Txt84","Txt84.Value = Val(Txt82) + Val(Txt83)",null,"Txt78.Value=\"\"","Txt79.Value=\"\"","Txt80.Value=\"\"","Txt81.Value=\"\"","Txt82.Value=\"\"","Txt83.Value=\"\"","Txt84.Value=\"\""]
["Txt98",".Value=\"\"","Txt98.Value=\"\"",null,null,null,"Txt85","Txt86","Txt87","Txt88","Txt89","Txt90","Txt91","Txt91.Value = Val(Txt89) + Val(Txt90)",null,"Txt85.Value=\"\"","Txt86.Value=\"\"","Txt87.Value=\"\"","Txt88.Value=\"\"","Txt89.Value=\"\"","Txt90.Value=\"\"","Txt91.Value=\"\""]
["Txt105",".Value=\"\"","Txt105.Value=\"\"",null,null,null,"Txt92","Txt93","Txt94","Txt95","Txt96","Txt97","Txt98","Txt98.Value = Val(Txt96) + Val(Txt97)",null,"Txt92.Value=\"\"","Txt93.Value=\"\"","Txt94.Value=\"\"","Txt95.Value=\"\"","Txt96.Value=\"\"","Txt97.Value=\"\"","Txt98.Value=\"\""]
["Txt112",".Value=\"\"","Txt112.Value=\"\"",null,null,null,"Txt99","Txt100","Txt101","Txt102","Txt103","Txt104","Txt105","Txt105.Value = Val(Txt103) + Val(Txt104)",null,"Txt99.Value=\"\"","Txt100.Value=\"\"","Txt101.Value=\"\"","Txt102.Value=\"\"","Txt103.Value=\"\"","Txt104.Value=\"\"","Txt105.Value=\"\""]
["Txt119",".Value=\"\"","Txt119.Value=\"\"",null,null,null,"Txt106","Txt107","Txt108","Txt109","Txt110","Txt111","Txt112","Txt112.Value = Val(Txt110) + Val(Txt111)",null,"Txt106.Value=\"\"","Txt107.Value=\"\"","Txt108.Value=\"\"","Txt109.Value=\"\"","Txt110.Value=\"\"","Txt111.Value=\"\"","Txt112.Value=\"\""]
["Txt126",".Value=\"\"","Txt126.Value=\"\"",null,null,null,"Txt113","Txt114","Txt115","Txt116","Txt117","Txt118","Txt119","Txt119.Value = Val(Txt117) + Val(Txt118)",null,"Txt113.Value=\"\"","Txt114.Value=\"\"","Txt115.Value=\"\"","Txt116.Value=\"\"","Txt117.Value=\"\"","Txt118.Value=\"\"","Txt119.Value=\"\""]
["Txt133",".Value=\"\"","Txt133.Value=\"\"",null,null,null,"Txt120","Txt121","Txt122","Txt123","Txt124","Txt125","Txt126","Txt126.Value = Val(Txt124) + Val(Txt125)",null,"Txt120.Value=\"\"","Txt121.Value=\"\"","Txt122.Value=\"\"","Txt123.Value=\"\"","Txt124.Value=\"\"","Txt125.Value=\"\"","Txt126.Value=\"\""]
[null,null,null,null,null,null,"Txt127","Txt128","Txt129","Txt130","Txt131","Txt132","Txt133","Txt133.Value = Val(Txt131) + Val(Txt132)",null,"Txt127.Value=\"\"","Txt128.Value=\"\"","Txt129.Value=\"\"","Txt130.Value=\"\"","Txt131.Value=\"\"","Txt132.Value=\"\"","Txt133.Value=\"\""]
[]
[]
[]
["Dim Ary"]
["Dim LR As Long"]
["Dim Adr As String"]
["Dim c As Integer"]
["Ary = Array(Me.TextBox1.Value, Me.TextBox2.Value, Me.TextBox3.Value, Me.TextBox4.Value, Me.TextBox5.Value, Me.ComboBox1.Value)"]
["With Sheet1"]
["LR = .Cells(.Rows.Count, \"B\").End(xlUp).Row + 1"]
["End With"]
[]
[]
["Application.ScreenUpdating = False"]
["Dim LR As Long"]
["Dim ws As Worksheet"]
["Set ws = Worksheets(\"Sheet1\")"]
["LR = ws.Cells(Rows.Count, 6).End(xlUp).Offset(1, 0).Row"]
["If Trim(Me.TextBox3.Value) = \"\" Then"]
["Me.TextBox1.SetFocus"]
["MsgBox (\"ãä ÝÖáß .Þã ÈÅÏÎÇá ÇáÈíÇäÇÊ ÈÔßá ÕÍíÍ\")"]
["Exit Sub"]
["End If"]
["If Trim(Me.B1.Value) = \"\" Then"]
["Me.TextBox1.SetFocus"]
["MsgBox (\"ãä ÝÖáß .Þã ÈÅÏÎÇá ÇáÈíÇäÇÊ ÈÔßá ÕÍíÍ\")"]
["Exit Sub"]
["End If"]
[]
["ws.Cells(LR, 7).Value = Me.A1.Value"]
["ws.Cells(LR, 8).Value = Me.B1.Value"]
["ws.Cells(LR, 9).Value = Me.C1.Value"]
["ws.Cells(LR, 10).Value = Me.D1.Value"]
["ws.Cells(LR, 11).Value = Me.E1.Value"]
[]
["ws.Cells(LR + 1, 7).Value = Me.A2.Value"]
["ws.Cells(LR + 1, 8).Value = Me.B2.Value"]
["ws.Cells(LR + 1, 9).Value = Me.C2.Value"]
["ws.Cells(LR + 1, 10).Value = Me.D2.Value"]
["ws.Cells(LR + 1, 11).Value = Me.E2.Value"]
[]
["ws.Cells(LR + 2, 7).Value = Me.A3.Value"]
["ws.Cells(LR + 2, 8).Value = Me.B3.Value"]
["ws.Cells(LR + 2, 9).Value = Me.C3.Value"]
["ws.Cells(LR + 2, 10).Value = Me.D3.Value"]
["ws.Cells(LR + 2, 11).Value = Me.E3.Value"]
[]
["ws.Cells(LR + 3, 7).Value = Me.A4.Value"]
["ws.Cells(LR + 3, 8).Value = Me.B4.Value"]
["ws.Cells(LR + 3, 9).Value = Me.C4.Value"]
["ws.Cells(LR + 3, 10).Value = Me.D4.Value"]
["ws.Cells(LR + 3, 11).Value = Me.E4.Value"]
[]
[]
[]
["ws.Cells(LR, 1).Value = Me.TextBox1.Value"]
["ws.Cells(LR, 2).Value = Me.TextBox2.Value"]
[]
["ws.Cells(LR, 3).Value = Me.TextBox3.Value"]
["ws.Cells(LR, 4).Value = Me.TextBox4.Value"]
["ws.Cells(LR, 5).Value = Me.TextBox5.Value"]
["ws.Cells(LR, 6).Value = Me.ComboBox1.Value"]
[]
["If B2 <> \"\" Then"]
["ws.Cells(LR + 1, 1).Value = Me.TextBox1.Value"]
["ws.Cells(LR + 1, 2).Value = Me.TextBox2.Value"]
["ws.Cells(LR + 1, 3).Value = Me.TextBox3.Value"]
["ws.Cells(LR + 1, 4).Value = Me.TextBox4.Value"]
["ws.Cells(LR + 1, 5).Value = Me.TextBox5.Value"]
["ws.Cells(LR + 1, 6).Value = Me.ComboBox1.Value"]
["End If"]
[]
["If B3 <> \"\" Then"]
["ws.Cells(LR + 2, 1).Value = Me.TextBox1.Value"]
["ws.Cells(LR + 2, 2).Value = Me.TextBox2.Value"]
["ws.Cells(LR + 2, 3).Value = Me.TextBox3.Value"]
["ws.Cells(LR + 2, 4).Value = Me.TextBox4.Value"]
["ws.Cells(LR + 2, 5).Value = Me.TextBox5.Value"]
["ws.Cells(LR + 2, 6).Value = Me.ComboBox1.Value"]
["End If"]
[]
["If B4 <> \"\" Then"]
["ws.Cells(LR + 3, 1).Value = Me.TextBox1.Value"]
["ws.Cells(LR + 3, 2).Value = Me.TextBox2.Value"]
["ws.Cells(LR + 3, 3).Value = Me.TextBox3.Value"]
["ws.Cells(LR + 3, 4).Value = Me.TextBox4.Value"]
["ws.Cells(LR + 3, 5).Value = Me.TextBox5.Value"]
["ws.Cells(LR + 3, 6).Value = Me.ComboBox1.Value"]
["End If"]
[]
["If B5 <> \"\" Then"]
["ws.Cells(LR + 4, 1).Value = Me.TextBox1.Value"]
["ws.Cells(LR + 4, 2).Value = Me.TextBox2.Value"]
["ws.Cells(LR + 4, 3).Value = Me.TextBox3.Value"]
["ws.Cells(LR + 4, 4).Value = Me.TextBox4.Value"]
["ws.Cells(LR + 4, 5).Value = Me.TextBox5.Value"]
["ws.Cells(LR + 4, 6).Value = Me.ComboBox1.Value"]
["End If"]
[]
["TextBox1.Value = \"\""]
["TextBox2.Value = \"\""]
["TextBox3.Value = \"\""]
["TextBox4.Value = \"\""]
["TextBox5.Value = \"\""]
["ComboBox1.Value = \"\""]
["'====="]
["A1.Value = \"\""]
["A2.Value = \"\""]
["A3.Value = \"\""]
["A4.Value = \"\""]
["A5.Value = \"\""]
["'====="]
["B1.Value = \"\""]
["B2.Value = \"\""]
["B3.Value = \"\""]
["B4.Value = \"\""]
["B5.Value = \"\""]
["'====="]
["C1.Value = \"\""]
["C2.Value = \"\""]
["C3.Value = \"\""]
["C4.Value = \"\""]
["C5.Value = \"\""]
["'====="]
["D1.Value = \"\""]
["D2.Value = \"\""]
["D3.Value = \"\""]
["D4.Value = \"\""]
["D5.Value = \"\""]
["'====="]
["E1.Value = \"\""]
["E2.Value = \"\""]
["E3.Value = \"\""]
["E4.Value = \"\""]
["E5.Value = \"\""]
["'================================================="]
["Application.ScreenUpdating = True"]
["'ÇáÓØÑ ÇáÓÇÈÞ äÞæã ÈæÖÚå Ýí äåÇíÉ ÇáßæÏ ááÍÕæá Úáí ÇÞÕí ÇÏÇÁ ããßä ááßæÏ"]
["'(True )ÍíË Êã ÅÓÊÎÏÇãå Ýí äåÇíÉ ÇáßæÏ áÇäå ÚäÏ ÊÔÛíáå"]
["'(ScreenUpdating)íÚãá Úáí ÊÍÏíË ÇáÔÇÔÉ æÇáÍÓÇÈÇÊ"]
["'æßÐáß áÇíÞÇÝ ÇáÇåÊÒÇÒÇÊ ááÔÇÔÉ ÚäÏ ÌáÈ ÇáÈíÇäÇÊ"]
["'æåæ ÊÔÛíá áå ÈÚÏ ÇØÝÇÄå Ýí ÈÏÇíÉ ÇáßæÏ ßãÇ ÓÈÞ ÊæÖíÍå"]
["'======================================================"]
["'äåÇíÉ ÇáãåãÉ ááßæÏ"]
["End Sub"]