{"text_format":"1","workbook":"xlsx","n_sheets":6,"sheets":["نهاية السنة دور اول خامس أ","نهاية السنة دور ثاني خامس أ","التلاميذ والقيود ","نهاية السنة دور اول خامس ب","نهاية السنة دور ثاني خامس ب","المكملون"],"not_rendered":{"charts":0,"images":0,"macros":1,"external_links":2,"defined_names":39,"comments":0,"pivot_tables":0},"unopened":[],"bounds":{"document_bytes":16777216,"sheet_cells":100000,"rows_first":2000,"rows_last":500,"rows_between":2000,"halvings":0,"cell_chars":16384,"cell_head_chars":4096},"cells_cut":0,"cells_raw":0,"read":"whole","date_system":"1900"}

{"sheet":"نهاية السنة دور اول خامس أ","index":0,"n_rows":63,"n_cols":23,"rows_kept":63,"cut":false,"hidden":false,"merged":[[3,11,3,12],[0,0,0,2],[0,14,0,15],[1,0,1,2],[1,14,1,15],[2,0,2,16],[56,1,56,2],[56,3,56,10],[57,1,57,2],[57,3,57,10],[58,1,58,2],[58,3,58,10],[62,1,62,2],[62,3,62,10],[59,1,59,2],[59,3,59,10],[60,1,60,2],[60,3,60,10],[61,1,61,2],[61,3,61,10]]}
["أدارة مدرسة المناذرة",null,null,null,null,null,null,null,null,null,null,null,null,null,"الصف",null,"الخامس أ"]
["   الابتدائية للبنات",null,null,null,null,null,null,null,null,null,null,null,null,null,"الدور",null,"الأول"]
["للعام الدراسي 2019 - 2020"]
[null,null,null,null,null,null,null,null,null,null,null,"المجموع"]
["ت","رقم القيد","اسم التلميذ","التربية الإسلامية","اللغة العربية","اللغة الإنكليزية","الرياضيات","العلوم","الاجتماعيات","التربية الفنية","التربية الرياضية","رقما","كتابة","النتيجة","الدروس التي اكمل فيها",null,null,null,"المكملون","الناجحون","الراسبون",null,"الدروس التي رسب فيها"]
[1,{"$f":"'[1]التلاميذ والقيود '!B3","v":2787},{"$f":"INDEX('[1]التلاميذ والقيود '!C3,1,1)","v":"آمنه حسين علوان"},100,99,88,77,66,66,60,50,{"$f":"IF(OR(N6=\"ناجح\",N6=\"راسب\"),SUM(D6:K6),\"\")","v":606},{"$f":"IFERROR(IF(L6=100,\"مائة درجة\",B_Only(L6,1,1,2,\"\",\"\",\"\")),\"\")","v":""},{"$f":"IF(D6:K6=\"\",\"\",IF(COUNTIF(D6:K6,\"غ\")+COUNTIF(D6:K6,\"<50\")=0,\"ناجح\",IF(COUNTIF(D6:K6,\"غ\")+COUNTIF(D6:K6,\"<50\")<=3,\"مكمل\",IF(COUNTIF(D6:K6,\"غ\")+COUNTIF(D6:K6,\"<50\")>=4,\"راسب\"))))","v":"ناجح"},{"$f":"IF(N6=\"\",\"\",IF(OR(D6<50,D6=\"غ\"),D$5,\"\")&\" \"&IF(OR(E6<50,E6=\"غ\"),E$5,\"\")&\" \"&IF(OR(F6<50,F6=\"غ\"),F$5,\"\")&\" \"&IF(OR(G6<50,G6=\"غ\"),G$5,\" \")&\" \"&IF(OR(H6<50,H6=\"غ\"),H$5,\"\")&\" \"&IF(OR(I6<50,I6=\"غ\"),I$5,\"\")&\" \"&IF(OR(J6<50,J6=\"غ\"),J$5,\"\")&\" \"&IF(OR(K6<50,K6=\"غ\"),K$5,\"\"))","v":"        "},null,null,null,{"$f":"IF(N6=\"مكمل\",1,\"\")","v":""},{"$f":"IF(N6=\"ناجح\",2,\"\")","v":2},{"$f":"IF(N6=\"راسب\",3,\"\")","v":""}]
[2,{"$f":"'[1]التلاميذ والقيود '!B4","v":2373},{"$f":"INDEX('[1]التلاميذ والقيود '!C4,1,1)","v":"آمنه قاسم ثجيل"},10,3,3,4,6,5,10,10,{"$f":"IF(OR(N7=\"ناجح\",N7=\"راسب\"),SUM(D7:K7),\"\")","v":51},{"$f":"IFERROR(IF(L7=100,\"مائة درجة\",B_Only(L7,1,1,2,\"\",\"\",\"\")),\"\")","v":""},{"$f":"IF(D7:K7=\"\",\"\",IF(COUNTIF(D7:K7,\"غ\")+COUNTIF(D7:K7,\"<50\")=0,\"ناجح\",IF(COUNTIF(D7:K7,\"غ\")+COUNTIF(D7:K7,\"<50\")<=3,\"مكمل\",IF(COUNTIF(D7:K7,\"غ\")+COUNTIF(D7:K7,\"<50\")>=4,\"راسب\"))))","v":"راسب"},{"$f":"IF(N7=\"\",\"\",IF(OR(D7<50,D7=\"غ\"),D$5,\"\")&\" \"&IF(OR(E7<50,E7=\"غ\"),E$5,\"\")&\" \"&IF(OR(F7<50,F7=\"غ\"),F$5,\"\")&\" \"&IF(OR(G7<50,G7=\"غ\"),G$5,\" \")&\" \"&IF(OR(H7<50,H7=\"غ\"),H$5,\"\")&\" \"&IF(OR(I7<50,I7=\"غ\"),I$5,\"\")&\" \"&IF(OR(J7<50,J7=\"غ\"),J$5,\"\")&\" \"&IF(OR(K7<50,K7=\"غ\"),K$5,\"\"))","v":"التربية الإسلامية اللغة العربية اللغة الإنكليزية الرياضيات العلوم الاجتماعيات التربية الفنية التربية الرياضية"},null,null,null,{"$f":"IF(N7=\"مكمل\",1,\"\")","v":""},{"$f":"IF(N7=\"ناجح\",2,\"\")","v":""},{"$f":"IF(N7=\"راسب\",3,\"\")","v":3}]
[3,{"$f":"'[1]التلاميذ والقيود '!B5","v":2430},{"$f":"INDEX('[1]التلاميذ والقيود '!C5,1,1)","v":"ايمان محمد مجبل"},80,50,80,66,55,50,50,60,491,{"$f":"IFERROR(IF(L8=100,\"مائة درجة\",B_Only(L8,1,1,2,\"\",\"\",\"\")),\"\")","v":""},{"$f":"IF(D8:K8=\"\",\"\",IF(COUNTIF(D8:K8,\"غ\")+COUNTIF(D8:K8,\"<50\")=0,\"ناجح\",IF(COUNTIF(D8:K8,\"غ\")+COUNTIF(D8:K8,\"<50\")<=3,\"مكمل\",IF(COUNTIF(D8:K8,\"غ\")+COUNTIF(D8:K8,\"<50\")>=4,\"راسب\"))))","v":"ناجح"},"        ",null,null,null,"",2,""]
[4,{"$f":"'[1]التلاميذ والقيود '!B6","v":2348},{"$f":"INDEX('[1]التلاميذ والقيود '!C6,1,1)","v":"آيه احمد جبار"},4,"غ",50,50,50,50,50,50,"",{"$f":"IFERROR(IF(L9=100,\"مائة درجة\",B_Only(L9,1,1,2,\"\",\"\",\"\")),\"\")","v":""},{"$f":"IF(D9:K9=\"\",\"\",IF(COUNTIF(D9:K9,\"غ\")+COUNTIF(D9:K9,\"<50\")=0,\"ناجح\",IF(COUNTIF(D9:K9,\"غ\")+COUNTIF(D9:K9,\"<50\")<=3,\"مكمل\",IF(COUNTIF(D9:K9,\"غ\")+COUNTIF(D9:K9,\"<50\")>=4,\"راسب\"))))","v":"مكمل"},"التربية الإسلامية اللغة العربية       ",null,null,null,1,"",""]
[5,{"$f":"'[1]التلاميذ والقيود '!B7","v":2539},{"$f":"INDEX('[1]التلاميذ والقيود '!C7,1,1)","v":"آيه حسين حسن"},10,null,null,null,null,null,3,4,"",{"$f":"IFERROR(IF(L10=100,\"مائة درجة\",B_Only(L10,1,1,2,\"\",\"\",\"\")),\"\")","v":""},{"$f":"IF(D10:K10=\"\",\"\",IF(COUNTIF(D10:K10,\"غ\")+COUNTIF(D10:K10,\"<50\")=0,\"ناجح\",IF(COUNTIF(D10:K10,\"غ\")+COUNTIF(D10:K10,\"<50\")<=3,\"مكمل\",IF(COUNTIF(D10:K10,\"غ\")+COUNTIF(D10:K10,\"<50\")>=4,\"راسب\"))))","v":"مكمل"},"التربية الإسلامية اللغة العربية اللغة الإنكليزية الرياضيات العلوم الاجتماعيات التربية الفنية التربية الرياضية",null,null,null,1,"",""]
{"$rows_left_out":54}
{"sheet":"نهاية السنة دور ثاني خامس أ","index":1,"n_rows":62,"n_cols":21,"rows_kept":62,"cut":false,"hidden":false,"merged":[[3,11,3,12],[0,0,0,2],[0,14,0,15],[1,0,1,2],[1,14,1,15],[2,0,2,16],[56,1,56,2],[56,3,56,10],[57,1,57,2],[57,3,57,10],[58,1,58,2],[58,3,58,10],[59,1,59,2],[59,3,59,10],[60,1,60,2],[60,3,60,10],[61,1,61,2],[61,3,61,10]]}
["أدارة مدرسة المناذرة",null,null,null,null,null,null,null,null,null,null,null,null,null,"الصف",null,"الخامس أ"]
["   الابتدائية للبنات",null,null,null,null,null,null,null,null,null,null,null,null,null,"الدور",null,"الثاني"]
["للعام الدراسي 2019 - 2020"]
[null,null,null,null,null,null,null,null,null,null,null,"المجموع"]
["ت","رقم القيد","اسم التلميذ","التربية الإسلامية","اللغة العربية","اللغة الإنكليزية","الرياضيات","العلوم","الاجتماعيات","التربية الفنية","التربية الرياضية","رقما","كتابة","النتيجة","الملاحظات",null,null,"احد التفقيط اختر اي منها",null,"الناجحون","الراسبون"]
[1,{"$f":"'[1]التلاميذ والقيود '!B3","v":2787},{"$f":"'[1]التلاميذ والقيود '!C3","v":"آمنه حسين علوان"},77,89,75,75,2,50,50,50,{"$f":"IF(OR(N6=\"ناجح\",N6=\"راسب\"),SUM(D6:K6),\"\")","v":468},{"$f":"IFERROR(IF(L6=100,\"مائة درجة\",B_Only(L6,1,1,2,\"\",\"\",\"\")),\"\")","v":""},{"$f":"IF(D6:K6=\"\",\"\",IF(COUNTIF(D6:K6,\"غ\")+COUNTIF(D6:K6,\"<50\")=0,\"ناجح\",IF(COUNTIF(D6:K6,\"غ\")+COUNTIF(D6:K6,\"<50\")>=1,\"راسب\")))","v":"راسب"},null,null,null,{"$f":"IFERROR(IF(K6=\"\",\"\",IF(K6=0,\"صفر\",n2t(K6))),\"\")","v":""},null,{"$f":"IF(N6=\"ناجح\",2,\"\")","v":""},{"$f":"IF(N6=\"راسب\",3,\"\")","v":3}]
[2,{"$f":"'[1]التلاميذ والقيود '!B4","v":2373},{"$f":"'[1]التلاميذ والقيود '!C4","v":"آمنه قاسم ثجيل"},66,77,82,55,55,22,44,55,{"$f":"IF(OR(N7=\"ناجح\",N7=\"راسب\"),SUM(D7:K7),\"\")","v":456},{"$f":"IFERROR(IF(L7=100,\"مائة درجة\",B_Only(L7,1,1,2,\"\",\"\",\"\")),\"\")","v":""},{"$f":"IF(D7:K7=\"\",\"\",IF(COUNTIF(D7:K7,\"غ\")+COUNTIF(D7:K7,\"<50\")=0,\"ناجح\",IF(COUNTIF(D7:K7,\"غ\")+COUNTIF(D7:K7,\"<50\")>=1,\"راسب\")))","v":"راسب"},null,null,null,{"$f":"IFERROR(IF(K7=\"\",\"\",IF(K7=0,\"صفر\",n2t(K7))),\"\")","v":""},null,{"$f":"IF(N7=\"ناجح\",2,\"\")","v":""},{"$f":"IF(N7=\"راسب\",3,\"\")","v":3}]
[3,{"$f":"'[1]التلاميذ والقيود '!B5","v":2430},{"$f":"'[1]التلاميذ والقيود '!C5","v":"ايمان محمد مجبل"},99,100,55,63,78,54,33,99,581,{"$f":"IFERROR(IF(L8=100,\"مائة درجة\",B_Only(L8,1,1,2,\"\",\"\",\"\")),\"\")","v":""},{"$f":"IF(D8:K8=\"\",\"\",IF(COUNTIF(D8:K8,\"غ\")+COUNTIF(D8:K8,\"<50\")=0,\"ناجح\",IF(COUNTIF(D8:K8,\"غ\")+COUNTIF(D8:K8,\"<50\")>=1,\"راسب\")))","v":"راسب"},null,null,null,{"$f":"IFERROR(IF(K8=\"\",\"\",IF(K8=0,\"صفر\",n2t(K8))),\"\")","v":""},null,"",3]
[4,{"$f":"'[1]التلاميذ والقيود '!B6","v":2348},{"$f":"'[1]التلاميذ والقيود '!C6","v":"آيه احمد جبار"},88,99,57,65,66,51,88,91,605,{"$f":"IFERROR(IF(L9=100,\"مائة درجة\",B_Only(L9,1,1,2,\"\",\"\",\"\")),\"\")","v":""},{"$f":"IF(D9:K9=\"\",\"\",IF(COUNTIF(D9:K9,\"غ\")+COUNTIF(D9:K9,\"<50\")=0,\"ناجح\",IF(COUNTIF(D9:K9,\"غ\")+COUNTIF(D9:K9,\"<50\")>=1,\"راسب\")))","v":"ناجح"},null,null,null,{"$f":"IFERROR(IF(K9=\"\",\"\",IF(K9=0,\"صفر\",n2t(K9))),\"\")","v":""},null,2,""]
[5,{"$f":"'[1]التلاميذ والقيود '!B7","v":2539},{"$f":"'[1]التلاميذ والقيود '!C7","v":"آيه حسين حسن"},77,98,"غ","غ",54,48,77,83,437,{"$f":"IFERROR(IF(L10=100,\"مائة درجة\",B_Only(L10,1,1,2,\"\",\"\",\"\")),\"\")","v":""},{"$f":"IF(D10:K10=\"\",\"\",IF(COUNTIF(D10:K10,\"غ\")+COUNTIF(D10:K10,\"<50\")=0,\"ناجح\",IF(COUNTIF(D10:K10,\"غ\")+COUNTIF(D10:K10,\"<50\")>=1,\"راسب\")))","v":"راسب"},null,null,null,{"$f":"IFERROR(IF(K10=\"\",\"\",IF(K10=0,\"صفر\",n2t(K10))),\"\")","v":""},null,"",3]
{"$rows_left_out":53}
{"sheet":"التلاميذ والقيود ","index":2,"n_rows":52,"n_cols":7,"rows_kept":52,"cut":false,"hidden":false,"merged":[]}
["الخامس أ",null,null,null,"الخامس ب"]
["ت","رقم القيد","اسم التلميذ",null,"ت","رقم القيد","اسم التلميذ"]
[{"$f":"IF(C3<>\"\",1,\"\")","v":1},2787,"آمنه حسين علوان",null,{"$f":"IF(G3<>\"\",1,\"\")","v":1},2438,"الاء سعد محمد"]
[{"$f":"IF(C4<>\"\",A3+1,\"\")","v":2},2373,"آمنه قاسم ثجيل",null,{"$f":"IF(G4<>\"\",E3+1,\"\")","v":2},2889,"اسينات علي حسين"]
[{"$f":"IF(C5<>\"\",A4+1,\"\")","v":3},2430,"ايمان محمد مجبل",null,{"$f":"IF(G5<>\"\",E4+1,\"\")","v":3},2565,"ايه مصطفى خير الله"]
[4,2348,"آيه احمد جبار",null,4,2521,"جنات عادل فاضل"]
[5,2539,"آيه حسين حسن",null,5,2515,"جنه علي خلف"]
[6,2561,"آيه علي كاظم",null,6,2534,"حوراء ضياء هادي"]
[7,2417,"براء سليم مجيد",null,7,2538,"دينا حسين علي"]
[8,2445,"بنين احمد أسعد",null,8,2403,"راويه رعد حميد"]
{"$rows_left_out":43}
{"sheet":"نهاية السنة دور اول خامس ب","index":3,"n_rows":63,"n_cols":23,"rows_kept":63,"cut":false,"hidden":false,"merged":[[3,11,3,12],[0,0,0,2],[0,14,0,15],[1,0,1,2],[1,14,1,15],[2,0,2,16],[56,1,56,2],[56,3,56,10],[57,1,57,2],[57,3,57,10],[58,1,58,2],[58,3,58,10],[62,1,62,2],[62,3,62,10],[59,1,59,2],[59,3,59,10],[60,1,60,2],[60,3,60,10],[61,1,61,2],[61,3,61,10]]}
["أدارة مدرسة المناذرة",null,null,null,null,null,null,null,null,null,null,null,null,null,"الصف",null,"الخامس ب"]
["   الابتدائية للبنات",null,null,null,null,null,null,null,null,null,null,null,null,null,"الدور",null,"الأول"]
["للعام الدراسي 2019 - 2020"]
[null,null,null,null,null,null,null,null,null,null,null,"المجموع",null,"النتيجة"]
["ت","رقم القيد","اسم التلميذ","التربية الإسلامية","اللغة العربية","اللغة الإنكليزية","الرياضيات","العلوم","الاجتماعيات","التربية الفنية","التربية الرياضية","رقما","كتابة","النتيجة","الدروس التي اكمل فيها",null,null,null,"المكملون","الناجحون","الراسبون",null,"الدروس التي رسب فيها"]
[1,{"$f":"'[1]التلاميذ والقيود '!F3","v":2438},{"$f":"'[1]التلاميذ والقيود '!G3","v":"الاء سعد محمد"},88,90,70,70,80,90,100,50,{"$f":"IF(OR(N6=\"ناجح\",N6=\"راسب\"),SUM(D6:K6),\"\")","v":638},{"$f":"IFERROR(IF(L6=100,\"مائة درجة\",B_Only(L6,1,1,2,\"\",\"\",\"\")),\"\")","v":""},{"$f":"IF(D6:K6=\"\",\"\",IF(COUNTIF(D6:K6,\"غ\")+COUNTIF(D6:K6,\"<50\")=0,\"ناجح\",IF(COUNTIF(D6:K6,\"غ\")+COUNTIF(D6:K6,\"<50\")<=3,\"مكمل\",IF(COUNTIF(D6:K6,\"غ\")+COUNTIF(D6:K6,\"<50\")>=4,\"راسب\"))))","v":"ناجح"},{"$f":"IF(N6=\"\",\"\",IF(OR(D6<50,D6=\"غ\"),D$5,\"\")&\" \"&IF(OR(E6<50,E6=\"غ\"),E$5,\"\")&\" \"&IF(OR(F6<50,F6=\"غ\"),F$5,\"\")&\" \"&IF(OR(G6<50,G6=\"غ\"),G$5,\" \")&\" \"&IF(OR(H6<50,H6=\"غ\"),H$5,\"\")&\" \"&IF(OR(I6<50,I6=\"غ\"),I$5,\"\")&\" \"&IF(OR(J6<50,J6=\"غ\"),J$5,\"\")&\" \"&IF(OR(K6<50,K6=\"غ\"),K$5,\"\"))","v":"        "},null,null,null,{"$f":"IF(N6=\"مكمل\",1,\"\")","v":""},{"$f":"IF(N6=\"ناجح\",2,\"\")","v":2},{"$f":"IF(N6=\"راسب\",3,\"\")","v":""}]
[2,{"$f":"'[1]التلاميذ والقيود '!F4","v":2889},{"$f":"'[1]التلاميذ والقيود '!G4","v":"اسينات علي حسين"},10,3,3,4,6,5,10,10,{"$f":"IF(OR(N7=\"ناجح\",N7=\"راسب\"),SUM(D7:K7),\"\")","v":51},{"$f":"IFERROR(IF(L7=100,\"مائة درجة\",B_Only(L7,1,1,2,\"\",\"\",\"\")),\"\")","v":""},{"$f":"IF(D7:K7=\"\",\"\",IF(COUNTIF(D7:K7,\"غ\")+COUNTIF(D7:K7,\"<50\")=0,\"ناجح\",IF(COUNTIF(D7:K7,\"غ\")+COUNTIF(D7:K7,\"<50\")<=3,\"مكمل\",IF(COUNTIF(D7:K7,\"غ\")+COUNTIF(D7:K7,\"<50\")>=4,\"راسب\"))))","v":"راسب"},{"$f":"IF(N7=\"\",\"\",IF(OR(D7<50,D7=\"غ\"),D$5,\"\")&\" \"&IF(OR(E7<50,E7=\"غ\"),E$5,\"\")&\" \"&IF(OR(F7<50,F7=\"غ\"),F$5,\"\")&\" \"&IF(OR(G7<50,G7=\"غ\"),G$5,\" \")&\" \"&IF(OR(H7<50,H7=\"غ\"),H$5,\"\")&\" \"&IF(OR(I7<50,I7=\"غ\"),I$5,\"\")&\" \"&IF(OR(J7<50,J7=\"غ\"),J$5,\"\")&\" \"&IF(OR(K7<50,K7=\"غ\"),K$5,\"\"))","v":"التربية الإسلامية اللغة العربية اللغة الإنكليزية الرياضيات العلوم الاجتماعيات التربية الفنية التربية الرياضية"},null,null,null,{"$f":"IF(N7=\"مكمل\",1,\"\")","v":""},{"$f":"IF(N7=\"ناجح\",2,\"\")","v":""},{"$f":"IF(N7=\"راسب\",3,\"\")","v":3}]
[3,{"$f":"'[1]التلاميذ والقيود '!F5","v":2565},{"$f":"'[1]التلاميذ والقيود '!G5","v":"ايه مصطفى خير الله"},10,5,5,2,5,null,1,10,38,{"$f":"IFERROR(IF(L8=100,\"مائة درجة\",B_Only(L8,1,1,2,\"\",\"\",\"\")),\"\")","v":""},{"$f":"IF(D8:K8=\"\",\"\",IF(COUNTIF(D8:K8,\"غ\")+COUNTIF(D8:K8,\"<50\")=0,\"ناجح\",IF(COUNTIF(D8:K8,\"غ\")+COUNTIF(D8:K8,\"<50\")<=3,\"مكمل\",IF(COUNTIF(D8:K8,\"غ\")+COUNTIF(D8:K8,\"<50\")>=4,\"راسب\"))))","v":"راسب"},"التربية الإسلامية اللغة العربية اللغة الإنكليزية الرياضيات العلوم الاجتماعيات التربية الفنية التربية الرياضية",null,null,null,"","",3]
[4,{"$f":"'[1]التلاميذ والقيود '!F6","v":2521},{"$f":"'[1]التلاميذ والقيود '!G6","v":"جنات عادل فاضل"},50,55,55,50,50,50,50,55,415,{"$f":"IFERROR(IF(L9=100,\"مائة درجة\",B_Only(L9,1,1,2,\"\",\"\",\"\")),\"\")","v":""},{"$f":"IF(D9:K9=\"\",\"\",IF(COUNTIF(D9:K9,\"غ\")+COUNTIF(D9:K9,\"<50\")=0,\"ناجح\",IF(COUNTIF(D9:K9,\"غ\")+COUNTIF(D9:K9,\"<50\")<=3,\"مكمل\",IF(COUNTIF(D9:K9,\"غ\")+COUNTIF(D9:K9,\"<50\")>=4,\"راسب\"))))","v":"ناجح"},{"$f":"IF(N9=\"\",\"\",IF(OR(D9<50,D9=\"غ\"),D$5,\"\")&\" \"&IF(OR(E9<50,E9=\"غ\"),E$5,\"\")&\" \"&IF(OR(F9<50,F9=\"غ\"),F$5,\"\")&\" \"&IF(OR(G9<50,G9=\"غ\"),G$5,\" \")&\" \"&IF(OR(H9<50,H9=\"غ\"),H$5,\"\")&\" \"&IF(OR(I9<50,I9=\"غ\"),I$5,\"\")&\" \"&IF(OR(J9<50,J9=\"غ\"),J$5,\"\")&\" \"&IF(OR(K9<50,K9=\"غ\"),K$5,\"\"))","v":"        "},null,null,null,"",2,""]
[5,{"$f":"'[1]التلاميذ والقيود '!F7","v":2515},{"$f":"'[1]التلاميذ والقيود '!G7","v":"جنه علي خلف"},10,null,null,null,null,null,3,4,"",{"$f":"IFERROR(IF(L10=100,\"مائة درجة\",B_Only(L10,1,1,2,\"\",\"\",\"\")),\"\")","v":""},{"$f":"IF(D10:K10=\"\",\"\",IF(COUNTIF(D10:K10,\"غ\")+COUNTIF(D10:K10,\"<50\")=0,\"ناجح\",IF(COUNTIF(D10:K10,\"غ\")+COUNTIF(D10:K10,\"<50\")<=3,\"مكمل\",IF(COUNTIF(D10:K10,\"غ\")+COUNTIF(D10:K10,\"<50\")>=4,\"راسب\"))))","v":"مكمل"},{"$f":"IF(N10=\"\",\"\",IF(OR(D10<50,D10=\"غ\"),D$5,\"\")&\" \"&IF(OR(E10<50,E10=\"غ\"),E$5,\"\")&\" \"&IF(OR(F10<50,F10=\"غ\"),F$5,\"\")&\" \"&IF(OR(G10<50,G10=\"غ\"),G$5,\" \")&\" \"&IF(OR(H10<50,H10=\"غ\"),H$5,\"\")&\" \"&IF(OR(I10<50,I10=\"غ\"),I$5,\"\")&\" \"&IF(OR(J10<50,J10=\"غ\"),J$5,\"\")&\" \"&IF(OR(K10<50,K10=\"غ\"),K$5,\"\"))","v":"التربية الإسلامية اللغة العربية اللغة الإنكليزية الرياضيات العلوم الاجتماعيات التربية الفنية التربية الرياضية"},null,null,null,1,"",""]
{"$rows_left_out":54}
{"sheet":"نهاية السنة دور ثاني خامس ب","index":4,"n_rows":62,"n_cols":21,"rows_kept":62,"cut":false,"hidden":false,"merged":[[3,11,3,12],[0,0,0,2],[0,14,0,15],[1,0,1,2],[1,14,1,15],[2,0,2,16],[56,1,56,2],[56,3,56,10],[57,1,57,2],[57,3,57,10],[58,1,58,2],[58,3,58,10],[59,1,59,2],[59,3,59,10],[60,1,60,2],[60,3,60,10],[61,1,61,2],[61,3,61,10]]}
["أدارة مدرسة المناذرة",null,null,null,null,null,null,null,null,null,null,null,null,null,"الصف",null,"الخامس ب"]
["   الابتدائية للبنات",null,null,null,null,null,null,null,null,null,null,null,null,null,"الدور",null,"الثاني"]
["للعام الدراسي 2019 - 2020"]
[null,null,null,null,null,null,null,null,null,null,null,"المجموع"]
["ت","رقم القيد","اسم التلميذ","التربية الإسلامية","اللغة العربية","اللغة الإنكليزية","الرياضيات","العلوم","الاجتماعيات","التربية الفنية","التربية الرياضية","رقما","كتابة","النتيجة","الملاحظات",null,null,"احد التفقيط اختر اي منها",null,"الناجحون","الراسبون"]
[1,{"$f":"'[1]التلاميذ والقيود '!F3","v":2438},{"$f":"'[1]التلاميذ والقيود '!G3","v":"الاء سعد محمد"},77,89,75,75,2,50,50,50,{"$f":"IF(OR(N6=\"ناجح\",N6=\"راسب\"),SUM(D6:K6),\"\")","v":468},{"$f":"IFERROR(IF(L6=100,\"مائة درجة\",B_Only(L6,1,1,2,\"\",\"\",\"\")),\"\")","v":""},{"$f":"IF(D6:K6=\"\",\"\",IF(COUNTIF(D6:K6,\"غ\")+COUNTIF(D6:K6,\"<50\")=0,\"ناجح\",IF(COUNTIF(D6:K6,\"غ\")+COUNTIF(D6:K6,\"<50\")>=1,\"راسب\")))","v":"راسب"},null,null,null,{"$f":"IFERROR(IF(K6=\"\",\"\",IF(K6=0,\"صفر\",n2t(K6))),\"\")","v":""},null,{"$f":"IF(N6=\"ناجح\",2,\"\")","v":""},{"$f":"IF(N6=\"راسب\",3,\"\")","v":3}]
[2,{"$f":"'[1]التلاميذ والقيود '!F4","v":2889},{"$f":"'[1]التلاميذ والقيود '!G4","v":"اسينات علي حسين"},66,77,82,55,55,22,44,55,{"$f":"IF(OR(N7=\"ناجح\",N7=\"راسب\"),SUM(D7:K7),\"\")","v":456},{"$f":"IFERROR(IF(L7=100,\"مائة درجة\",B_Only(L7,1,1,2,\"\",\"\",\"\")),\"\")","v":""},{"$f":"IF(D7:K7=\"\",\"\",IF(COUNTIF(D7:K7,\"غ\")+COUNTIF(D7:K7,\"<50\")=0,\"ناجح\",IF(COUNTIF(D7:K7,\"غ\")+COUNTIF(D7:K7,\"<50\")>=1,\"راسب\")))","v":"راسب"},null,null,null,{"$f":"IFERROR(IF(K7=\"\",\"\",IF(K7=0,\"صفر\",n2t(K7))),\"\")","v":""},null,{"$f":"IF(N7=\"ناجح\",2,\"\")","v":""},{"$f":"IF(N7=\"راسب\",3,\"\")","v":3}]
[3,{"$f":"'[1]التلاميذ والقيود '!F5","v":2565},{"$f":"'[1]التلاميذ والقيود '!G5","v":"ايه مصطفى خير الله"},99,100,55,63,78,54,33,99,581,{"$f":"IFERROR(IF(L8=100,\"مائة درجة\",B_Only(L8,1,1,2,\"\",\"\",\"\")),\"\")","v":""},{"$f":"IF(D8:K8=\"\",\"\",IF(COUNTIF(D8:K8,\"غ\")+COUNTIF(D8:K8,\"<50\")=0,\"ناجح\",IF(COUNTIF(D8:K8,\"غ\")+COUNTIF(D8:K8,\"<50\")>=1,\"راسب\")))","v":"راسب"},null,null,null,{"$f":"IFERROR(IF(K8=\"\",\"\",IF(K8=0,\"صفر\",n2t(K8))),\"\")","v":""},null,"",3]
[4,{"$f":"'[1]التلاميذ والقيود '!F6","v":2521},{"$f":"'[1]التلاميذ والقيود '!G6","v":"جنات عادل فاضل"},88,99,57,65,66,51,88,91,605,{"$f":"IFERROR(IF(L9=100,\"مائة درجة\",B_Only(L9,1,1,2,\"\",\"\",\"\")),\"\")","v":""},{"$f":"IF(D9:K9=\"\",\"\",IF(COUNTIF(D9:K9,\"غ\")+COUNTIF(D9:K9,\"<50\")=0,\"ناجح\",IF(COUNTIF(D9:K9,\"غ\")+COUNTIF(D9:K9,\"<50\")>=1,\"راسب\")))","v":"ناجح"},null,null,null,{"$f":"IFERROR(IF(K9=\"\",\"\",IF(K9=0,\"صفر\",n2t(K9))),\"\")","v":""},null,2,""]
[5,{"$f":"'[1]التلاميذ والقيود '!F7","v":2515},{"$f":"'[1]التلاميذ والقيود '!G7","v":"جنه علي خلف"},77,98,"غ","غ",54,48,77,83,437,{"$f":"IFERROR(IF(L10=100,\"مائة درجة\",B_Only(L10,1,1,2,\"\",\"\",\"\")),\"\")","v":""},{"$f":"IF(D10:K10=\"\",\"\",IF(COUNTIF(D10:K10,\"غ\")+COUNTIF(D10:K10,\"<50\")=0,\"ناجح\",IF(COUNTIF(D10:K10,\"غ\")+COUNTIF(D10:K10,\"<50\")>=1,\"راسب\")))","v":"راسب"},null,null,null,{"$f":"IFERROR(IF(K10=\"\",\"\",IF(K10=0,\"صفر\",n2t(K10))),\"\")","v":""},null,"",3]
{"$rows_left_out":53}
{"sheet":"المكملون","index":5,"n_rows":7,"n_cols":7,"rows_kept":7,"cut":false,"hidden":false,"merged":[[5,0,5,6]]}
[]
[]
[]
[]
[]
[" المكملون في الصف الخامس أ + ب"]
["ت","رقم القيد","اسم التلميذ","الدروس التي اكمل فيها","درجة الدور الأول","درجة الدور الثاني","النتيجة"]