{"text_format":"1","workbook":"xlsx","n_sheets":2,"sheets":["data","بيان توضيحي "],"not_rendered":{"charts":0,"images":0,"macros":0,"external_links":0,"defined_names":0,"comments":0,"pivot_tables":0},"unopened":[],"bounds":{"document_bytes":16777216,"sheet_cells":100000,"rows_first":2000,"rows_last":500,"rows_between":2000,"halvings":0,"cell_chars":16384,"cell_head_chars":4096},"cells_cut":0,"cells_raw":0,"read":"whole","date_system":"1900"}

{"sheet":"data","index":0,"n_rows":6,"n_cols":6,"rows_kept":6,"cut":false,"hidden":false,"merged":[]}
["المنتج","عدد القطع","السعر","الاجمالي ","الملاحظات ","اسم العميل"]
[1,5,100,{"$f":"C2*B2","v":500},null,"محمود"]
[1,6,400,{"$f":"C3*B3","v":2400},null,"محمد "]
[1,7,500,3500,null,"حسن"]
[1,5,300,1500,null,"محمود"]
[1,9,200,1800,null,"محمد "]

{"sheet":"بيان توضيحي ","index":1,"n_rows":20,"n_cols":6,"rows_kept":20,"cut":false,"hidden":false,"merged":[]}
["المنتج","عدد القطع","السعر","الاجمالي ","الملاحظات ","اسم العميل"]
[{"$f":"IFERROR(INDEX(data!$A:$A,SMALL(IF(data!$F:$F=$F$2,ROW(A$2:A$5000)-ROW(A$2)+1),ROWS($A$2:A2))),\"\")","v":1},{"$f":"IFERROR(INDEX(data!$B:$B,SMALL(IF(data!$F:$F=$F$2,ROW(B$2:B$5000)-ROW(B$2)+1),ROWS($A$2:B2))),\"\")","v":5},{"$f":"IFERROR(INDEX(data!$C:$C,SMALL(IF(data!$F:$F=$F$2,ROW(C$2:C$5000)-ROW(C$2)+1),ROWS($A$2:C2))),\"\")","v":100},{"$f":"IFERROR(INDEX(data!$D:$D,SMALL(IF(data!$F:$F=$F$2,ROW(D$2:D$5000)-ROW(D$2)+1),ROWS($A$2:D2))),\"\")","v":500},{"$f":"IFERROR(INDEX(data!$E:$E,SMALL(IF(data!$F:$F=$F$2,ROW(E$2:E$5000)-ROW(E$2)+1),ROWS($A$2:E2))),\"\")","v":0},"محمود"]
[{"$f":"IFERROR(INDEX(data!$A:$A,SMALL(IF(data!$F:$F=$F$2,ROW(A$2:A$5000)-ROW(A$2)+1),ROWS($A$2:A3))),\"\")","v":1},{"$f":"IFERROR(INDEX(data!$B:$B,SMALL(IF(data!$F:$F=$F$2,ROW(B$2:B$5000)-ROW(B$2)+1),ROWS($A$2:B3))),\"\")","v":5},{"$f":"IFERROR(INDEX(data!$C:$C,SMALL(IF(data!$F:$F=$F$2,ROW(C$2:C$5000)-ROW(C$2)+1),ROWS($A$2:C3))),\"\")","v":300},{"$f":"IFERROR(INDEX(data!$D:$D,SMALL(IF(data!$F:$F=$F$2,ROW(D$2:D$5000)-ROW(D$2)+1),ROWS($A$2:D3))),\"\")","v":1500},{"$f":"IFERROR(INDEX(data!$E:$E,SMALL(IF(data!$F:$F=$F$2,ROW(E$2:E$5000)-ROW(E$2)+1),ROWS($A$2:E3))),\"\")","v":0}]
[{"$f":"IFERROR(INDEX(data!$A:$A,SMALL(IF(data!$F:$F=$F$2,ROW(A$2:A$5000)-ROW(A$2)+1),ROWS($A$2:A4))),\"\")","v":""},{"$f":"IFERROR(INDEX(data!$B:$B,SMALL(IF(data!$F:$F=$F$2,ROW(B$2:B$5000)-ROW(B$2)+1),ROWS($A$2:B4))),\"\")","v":""},{"$f":"IFERROR(INDEX(data!$C:$C,SMALL(IF(data!$F:$F=$F$2,ROW(C$2:C$5000)-ROW(C$2)+1),ROWS($A$2:C4))),\"\")","v":""},{"$f":"IFERROR(INDEX(data!$D:$D,SMALL(IF(data!$F:$F=$F$2,ROW(D$2:D$5000)-ROW(D$2)+1),ROWS($A$2:D4))),\"\")","v":""},{"$f":"IFERROR(INDEX(data!$E:$E,SMALL(IF(data!$F:$F=$F$2,ROW(E$2:E$5000)-ROW(E$2)+1),ROWS($A$2:E4))),\"\")","v":""}]
[{"$f":"IFERROR(INDEX(data!$A:$A,SMALL(IF(data!$F:$F=$F$2,ROW(A$2:A$5000)-ROW(A$2)+1),ROWS($A$2:A5))),\"\")","v":""},{"$f":"IFERROR(INDEX(data!$B:$B,SMALL(IF(data!$F:$F=$F$2,ROW(B$2:B$5000)-ROW(B$2)+1),ROWS($A$2:B5))),\"\")","v":""},{"$f":"IFERROR(INDEX(data!$C:$C,SMALL(IF(data!$F:$F=$F$2,ROW(C$2:C$5000)-ROW(C$2)+1),ROWS($A$2:C5))),\"\")","v":""},{"$f":"IFERROR(INDEX(data!$D:$D,SMALL(IF(data!$F:$F=$F$2,ROW(D$2:D$5000)-ROW(D$2)+1),ROWS($A$2:D5))),\"\")","v":""},{"$f":"IFERROR(INDEX(data!$E:$E,SMALL(IF(data!$F:$F=$F$2,ROW(E$2:E$5000)-ROW(E$2)+1),ROWS($A$2:E5))),\"\")","v":""}]
[{"$f":"IFERROR(INDEX(data!$A:$A,SMALL(IF(data!$F:$F=$F$2,ROW(A$2:A$5000)-ROW(A$2)+1),ROWS($A$2:A6))),\"\")","v":""},{"$f":"IFERROR(INDEX(data!$B:$B,SMALL(IF(data!$F:$F=$F$2,ROW(B$2:B$5000)-ROW(B$2)+1),ROWS($A$2:B6))),\"\")","v":""},{"$f":"IFERROR(INDEX(data!$C:$C,SMALL(IF(data!$F:$F=$F$2,ROW(C$2:C$5000)-ROW(C$2)+1),ROWS($A$2:C6))),\"\")","v":""},{"$f":"IFERROR(INDEX(data!$D:$D,SMALL(IF(data!$F:$F=$F$2,ROW(D$2:D$5000)-ROW(D$2)+1),ROWS($A$2:D6))),\"\")","v":""},{"$f":"IFERROR(INDEX(data!$E:$E,SMALL(IF(data!$F:$F=$F$2,ROW(E$2:E$5000)-ROW(E$2)+1),ROWS($A$2:E6))),\"\")","v":""}]
[{"$f":"IFERROR(INDEX(data!$A:$A,SMALL(IF(data!$F:$F=$F$2,ROW(A$2:A$5000)-ROW(A$2)+1),ROWS($A$2:A7))),\"\")","v":""},{"$f":"IFERROR(INDEX(data!$B:$B,SMALL(IF(data!$F:$F=$F$2,ROW(B$2:B$5000)-ROW(B$2)+1),ROWS($A$2:B7))),\"\")","v":""},{"$f":"IFERROR(INDEX(data!$C:$C,SMALL(IF(data!$F:$F=$F$2,ROW(C$2:C$5000)-ROW(C$2)+1),ROWS($A$2:C7))),\"\")","v":""},{"$f":"IFERROR(INDEX(data!$D:$D,SMALL(IF(data!$F:$F=$F$2,ROW(D$2:D$5000)-ROW(D$2)+1),ROWS($A$2:D7))),\"\")","v":""},{"$f":"IFERROR(INDEX(data!$E:$E,SMALL(IF(data!$F:$F=$F$2,ROW(E$2:E$5000)-ROW(E$2)+1),ROWS($A$2:E7))),\"\")","v":""}]
[{"$f":"IFERROR(INDEX(data!$A:$A,SMALL(IF(data!$F:$F=$F$2,ROW(A$2:A$5000)-ROW(A$2)+1),ROWS($A$2:A8))),\"\")","v":""},{"$f":"IFERROR(INDEX(data!$B:$B,SMALL(IF(data!$F:$F=$F$2,ROW(B$2:B$5000)-ROW(B$2)+1),ROWS($A$2:B8))),\"\")","v":""},{"$f":"IFERROR(INDEX(data!$C:$C,SMALL(IF(data!$F:$F=$F$2,ROW(C$2:C$5000)-ROW(C$2)+1),ROWS($A$2:C8))),\"\")","v":""},{"$f":"IFERROR(INDEX(data!$D:$D,SMALL(IF(data!$F:$F=$F$2,ROW(D$2:D$5000)-ROW(D$2)+1),ROWS($A$2:D8))),\"\")","v":""},{"$f":"IFERROR(INDEX(data!$E:$E,SMALL(IF(data!$F:$F=$F$2,ROW(E$2:E$5000)-ROW(E$2)+1),ROWS($A$2:E8))),\"\")","v":""}]
["المنتج","عدد القطع","السعر","الاجمالي ","الملاحظات ","اسم العميل"]
[{"$f":"IFERROR(INDEX(data!$A:$A,SMALL(IF(data!$F:$F=$F$10,ROW(A$2:A$5000)-ROW(A$2)+1),ROWS($A$10:A10))),\"\")","v":1},{"$f":"IFERROR(INDEX(data!$B:$B,SMALL(IF(data!$F:$F=$F$10,ROW(B$2:B$5000)-ROW(B$2)+1),ROWS($A$10:B10))),\"\")","v":6},{"$f":"IFERROR(INDEX(data!$C:$C,SMALL(IF(data!$F:$F=$F$10,ROW(C$2:C$5000)-ROW(C$2)+1),ROWS($A$10:C10))),\"\")","v":400},{"$f":"IFERROR(INDEX(data!$D:$D,SMALL(IF(data!$F:$F=$F$10,ROW(D$2:D$5000)-ROW(D$2)+1),ROWS($A$10:D10))),\"\")","v":2400},{"$f":"IFERROR(INDEX(data!$E:$E,SMALL(IF(data!$F:$F=$F$10,ROW(E$2:E$5000)-ROW(E$2)+1),ROWS($A$10:E10))),\"\")","v":0},"محمد "]
[{"$f":"IFERROR(INDEX(data!$A:$A,SMALL(IF(data!$F:$F=$F$10,ROW(A$2:A$5000)-ROW(A$2)+1),ROWS($A$10:A11))),\"\")","v":1},{"$f":"IFERROR(INDEX(data!$B:$B,SMALL(IF(data!$F:$F=$F$10,ROW(B$2:B$5000)-ROW(B$2)+1),ROWS($A$10:B11))),\"\")","v":9},{"$f":"IFERROR(INDEX(data!$C:$C,SMALL(IF(data!$F:$F=$F$10,ROW(C$2:C$5000)-ROW(C$2)+1),ROWS($A$10:C11))),\"\")","v":200},{"$f":"IFERROR(INDEX(data!$D:$D,SMALL(IF(data!$F:$F=$F$10,ROW(D$2:D$5000)-ROW(D$2)+1),ROWS($A$10:D11))),\"\")","v":1800},{"$f":"IFERROR(INDEX(data!$E:$E,SMALL(IF(data!$F:$F=$F$10,ROW(E$2:E$5000)-ROW(E$2)+1),ROWS($A$10:E11))),\"\")","v":0}]
[{"$f":"IFERROR(INDEX(data!$A:$A,SMALL(IF(data!$F:$F=$F$10,ROW(A$2:A$5000)-ROW(A$2)+1),ROWS($A$10:A12))),\"\")","v":""},{"$f":"IFERROR(INDEX(data!$B:$B,SMALL(IF(data!$F:$F=$F$10,ROW(B$2:B$5000)-ROW(B$2)+1),ROWS($A$10:B12))),\"\")","v":""},{"$f":"IFERROR(INDEX(data!$C:$C,SMALL(IF(data!$F:$F=$F$10,ROW(C$2:C$5000)-ROW(C$2)+1),ROWS($A$10:C12))),\"\")","v":""},{"$f":"IFERROR(INDEX(data!$D:$D,SMALL(IF(data!$F:$F=$F$10,ROW(D$2:D$5000)-ROW(D$2)+1),ROWS($A$10:D12))),\"\")","v":""},{"$f":"IFERROR(INDEX(data!$E:$E,SMALL(IF(data!$F:$F=$F$10,ROW(E$2:E$5000)-ROW(E$2)+1),ROWS($A$10:E12))),\"\")","v":""}]
[{"$f":"IFERROR(INDEX(data!$A:$A,SMALL(IF(data!$F:$F=$F$10,ROW(A$2:A$5000)-ROW(A$2)+1),ROWS($A$10:A13))),\"\")","v":""},{"$f":"IFERROR(INDEX(data!$B:$B,SMALL(IF(data!$F:$F=$F$10,ROW(B$2:B$5000)-ROW(B$2)+1),ROWS($A$10:B13))),\"\")","v":""},{"$f":"IFERROR(INDEX(data!$C:$C,SMALL(IF(data!$F:$F=$F$10,ROW(C$2:C$5000)-ROW(C$2)+1),ROWS($A$10:C13))),\"\")","v":""},{"$f":"IFERROR(INDEX(data!$D:$D,SMALL(IF(data!$F:$F=$F$10,ROW(D$2:D$5000)-ROW(D$2)+1),ROWS($A$10:D13))),\"\")","v":""},{"$f":"IFERROR(INDEX(data!$E:$E,SMALL(IF(data!$F:$F=$F$10,ROW(E$2:E$5000)-ROW(E$2)+1),ROWS($A$10:E13))),\"\")","v":""}]
[{"$f":"IFERROR(INDEX(data!$A:$A,SMALL(IF(data!$F:$F=$F$10,ROW(A$2:A$5000)-ROW(A$2)+1),ROWS($A$10:A14))),\"\")","v":""},{"$f":"IFERROR(INDEX(data!$B:$B,SMALL(IF(data!$F:$F=$F$10,ROW(B$2:B$5000)-ROW(B$2)+1),ROWS($A$10:B14))),\"\")","v":""},{"$f":"IFERROR(INDEX(data!$C:$C,SMALL(IF(data!$F:$F=$F$10,ROW(C$2:C$5000)-ROW(C$2)+1),ROWS($A$10:C14))),\"\")","v":""},{"$f":"IFERROR(INDEX(data!$D:$D,SMALL(IF(data!$F:$F=$F$10,ROW(D$2:D$5000)-ROW(D$2)+1),ROWS($A$10:D14))),\"\")","v":""},{"$f":"IFERROR(INDEX(data!$E:$E,SMALL(IF(data!$F:$F=$F$10,ROW(E$2:E$5000)-ROW(E$2)+1),ROWS($A$10:E14))),\"\")","v":""}]
["المنتج","عدد القطع","السعر","الاجمالي ","الملاحظات ","اسم العميل"]
[{"$f":"IFERROR(INDEX(data!$A:$A,SMALL(IF(data!$F:$F=$F$16,ROW(A$2:A$5000)-ROW(A$2)+1),ROWS($A$16:A16))),\"\")","v":1},{"$f":"IFERROR(INDEX(data!$B:$B,SMALL(IF(data!$F:$F=$F$16,ROW(B$2:B$5000)-ROW(B$2)+1),ROWS($A$16:B16))),\"\")","v":7},{"$f":"IFERROR(INDEX(data!$C:$C,SMALL(IF(data!$F:$F=$F$16,ROW(C$2:C$5000)-ROW(C$2)+1),ROWS($A$16:C16))),\"\")","v":500},{"$f":"IFERROR(INDEX(data!$D:$D,SMALL(IF(data!$F:$F=$F$16,ROW(D$2:D$5000)-ROW(D$2)+1),ROWS($A$16:D16))),\"\")","v":3500},{"$f":"IFERROR(INDEX(data!$E:$E,SMALL(IF(data!$F:$F=$F$16,ROW(E$2:E$5000)-ROW(E$2)+1),ROWS($A$16:E16))),\"\")","v":0},"حسن"]
[{"$f":"IFERROR(INDEX(data!$A:$A,SMALL(IF(data!$F:$F=$F$16,ROW(A$2:A$5000)-ROW(A$2)+1),ROWS($A$16:A17))),\"\")","v":""},{"$f":"IFERROR(INDEX(data!$B:$B,SMALL(IF(data!$F:$F=$F$16,ROW(B$2:B$5000)-ROW(B$2)+1),ROWS($A$16:B17))),\"\")","v":""},{"$f":"IFERROR(INDEX(data!$C:$C,SMALL(IF(data!$F:$F=$F$16,ROW(C$2:C$5000)-ROW(C$2)+1),ROWS($A$16:C17))),\"\")","v":""},{"$f":"IFERROR(INDEX(data!$D:$D,SMALL(IF(data!$F:$F=$F$16,ROW(D$2:D$5000)-ROW(D$2)+1),ROWS($A$16:D17))),\"\")","v":""},{"$f":"IFERROR(INDEX(data!$E:$E,SMALL(IF(data!$F:$F=$F$16,ROW(E$2:E$5000)-ROW(E$2)+1),ROWS($A$16:E17))),\"\")","v":""}]
[{"$f":"IFERROR(INDEX(data!$A:$A,SMALL(IF(data!$F:$F=$F$16,ROW(A$2:A$5000)-ROW(A$2)+1),ROWS($A$16:A18))),\"\")","v":""},{"$f":"IFERROR(INDEX(data!$B:$B,SMALL(IF(data!$F:$F=$F$16,ROW(B$2:B$5000)-ROW(B$2)+1),ROWS($A$16:B18))),\"\")","v":""},{"$f":"IFERROR(INDEX(data!$C:$C,SMALL(IF(data!$F:$F=$F$16,ROW(C$2:C$5000)-ROW(C$2)+1),ROWS($A$16:C18))),\"\")","v":""},{"$f":"IFERROR(INDEX(data!$D:$D,SMALL(IF(data!$F:$F=$F$16,ROW(D$2:D$5000)-ROW(D$2)+1),ROWS($A$16:D18))),\"\")","v":""},{"$f":"IFERROR(INDEX(data!$E:$E,SMALL(IF(data!$F:$F=$F$16,ROW(E$2:E$5000)-ROW(E$2)+1),ROWS($A$16:E18))),\"\")","v":""}]
[{"$f":"IFERROR(INDEX(data!$A:$A,SMALL(IF(data!$F:$F=$F$16,ROW(A$2:A$5000)-ROW(A$2)+1),ROWS($A$16:A19))),\"\")","v":""},{"$f":"IFERROR(INDEX(data!$B:$B,SMALL(IF(data!$F:$F=$F$16,ROW(B$2:B$5000)-ROW(B$2)+1),ROWS($A$16:B19))),\"\")","v":""},{"$f":"IFERROR(INDEX(data!$C:$C,SMALL(IF(data!$F:$F=$F$16,ROW(C$2:C$5000)-ROW(C$2)+1),ROWS($A$16:C19))),\"\")","v":""},{"$f":"IFERROR(INDEX(data!$D:$D,SMALL(IF(data!$F:$F=$F$16,ROW(D$2:D$5000)-ROW(D$2)+1),ROWS($A$16:D19))),\"\")","v":""},{"$f":"IFERROR(INDEX(data!$E:$E,SMALL(IF(data!$F:$F=$F$16,ROW(E$2:E$5000)-ROW(E$2)+1),ROWS($A$16:E19))),\"\")","v":""}]
[{"$f":"IFERROR(INDEX(data!$A:$A,SMALL(IF(data!$F:$F=$F$16,ROW(A$2:A$5000)-ROW(A$2)+1),ROWS($A$16:A20))),\"\")","v":""},{"$f":"IFERROR(INDEX(data!$B:$B,SMALL(IF(data!$F:$F=$F$16,ROW(B$2:B$5000)-ROW(B$2)+1),ROWS($A$16:B20))),\"\")","v":""},{"$f":"IFERROR(INDEX(data!$C:$C,SMALL(IF(data!$F:$F=$F$16,ROW(C$2:C$5000)-ROW(C$2)+1),ROWS($A$16:C20))),\"\")","v":""},{"$f":"IFERROR(INDEX(data!$D:$D,SMALL(IF(data!$F:$F=$F$16,ROW(D$2:D$5000)-ROW(D$2)+1),ROWS($A$16:D20))),\"\")","v":""},{"$f":"IFERROR(INDEX(data!$E:$E,SMALL(IF(data!$F:$F=$F$16,ROW(E$2:E$5000)-ROW(E$2)+1),ROWS($A$16:E20))),\"\")","v":""}]