{"text_format":"1","workbook":"xlsx","n_sheets":2,"sheets":["الرئيسية ","Sheet2"],"not_rendered":{"charts":0,"images":0,"macros":1,"external_links":0,"defined_names":0,"comments":1,"pivot_tables":0},"unopened":[],"bounds":{"document_bytes":16777216,"sheet_cells":100000,"rows_first":2000,"rows_last":500,"rows_between":2000,"halvings":0,"cell_chars":16384,"cell_head_chars":4096},"cells_cut":0,"cells_raw":0,"read":"whole","date_system":"1900"}

{"sheet":"الرئيسية ","index":0,"n_rows":4,"n_cols":9,"rows_kept":4,"cut":false,"hidden":false,"merged":[]}
["رقم الشهادة","اللقب","الاسم ","تاريخ الخروج","السنة الدراسية ","المستوى","تاريخ الميلاد","مكان الميلاد","القسم "]
[1,"Mohamed","Said","2019-01-06",2019,152,"2019-10-01","القاهرة",221150]
[2,"Amr","Ahmed","2019-07-01"]
[3,"أحمد","شنافي","1973-09-12"]

{"sheet":"Sheet2","index":1,"n_rows":32,"n_cols":11,"rows_kept":32,"cut":false,"hidden":false,"merged":[[0,3,0,8],[2,3,2,8],[3,8,3,9],[3,10,3,11],[4,0,4,2],[4,4,4,6],[19,0,19,2],[19,4,19,8],[5,0,5,2],[5,4,5,6],[7,0,7,2],[7,4,7,6],[13,0,13,2],[13,4,13,8],[27,9,27,11],[29,8,29,10],[31,7,31,9],[9,3,11,8],[21,1,21,7],[23,0,23,2],[23,4,23,8],[25,0,25,3],[25,4,25,8],[27,0,27,3],[27,4,27,5],[27,7,27,8],[15,0,15,2],[15,4,15,8],[17,0,17,2],[17,4,17,8]]}
[null,null,null,"الجمهورية الجزائرية الديمقراطية الشعبية "]
[]
[null,null,null,"وزارة التربية الوطنيـــــــــة "]
[null,null,null,null,null,null,null,null,"السنـــــة الدراسيـــة ",null,"1996/1997"]
["مديرية التربيـــة ",null,null,null,"الاغــواط"]
["متوسطـــــــــــة ",null,null,null,"سماعيني معمر تاجرونة "]
[]
["الرقم التسجيل ",null,null,null,1]
[]
[null,null,null,"شهـــــادة مدرسيـــــــة "]
[]
[]
[]
["اللقـــــــــــب ",null,null,null,{"$f":"VLOOKUP(E8,'الرئيسية '!A2:I1001,2,0)","v":"Mohamed"}]
[]
["الاســـــــم ",null,null,null,{"$f":"VLOOKUP(E8,'الرئيسية '!A2:I1001,3,0)","v":"Said"}]
[]
["تاريخ الميلاد",null,null,null,{"$f":"VLOOKUP(E8,'الرئيسية '!A2:I1001,7,0)","v":"2019-10-01"}]
[]
["مكـــــــــان الميلاد",null,null,null,{"$f":"VLOOKUP(E8,'الرئيسية '!A2:I1001,8,0)","v":"القاهرة"}]
[]
[null,"تابــــــع (ة) دروس (ها) بالمؤسســـــــــــــــــــــــة "]
[]
["خلال السنة الدراسية ",null,null,null,"1994/1995"]
[]
["بالقســــــــــــــــــــــــم ",null,null,null,"الثامنة أساسي "]
[]
["رقم التسجيـــــــــــل ",null,null,null,{"$f":"VLOOKUP(E8,'الرئيسية '!A2:I1001,1,0)","v":1},null,null,"تاريخ الخروج",null,{"$f":"VLOOKUP(E8,'الرئيسية '!A2:I1001,4,0)","v":"2019-01-06"}]
[]
[null,null,null,null,null,null,"حرر بــــــ  ","تاجرونـــة ",{"$f":"TODAY()","v":"2019-12-07"}]
[]
[null,null,null,null,null,null,null,"مدير المؤسســـــــــــة "]