{"text_format":"1","workbook":"xlsx","n_sheets":2,"sheets":["data","ورقة1"],"not_rendered":{"charts":0,"images":0,"macros":1,"external_links":0,"defined_names":0,"comments":0,"pivot_tables":0},"unopened":[],"bounds":{"document_bytes":16777216,"sheet_cells":100000,"rows_first":2000,"rows_last":500,"rows_between":2000,"halvings":0,"cell_chars":16384,"cell_head_chars":4096},"cells_cut":0,"cells_raw":0,"read":"whole","date_system":"1900"}

{"sheet":"data","index":0,"n_rows":4,"n_cols":32,"rows_kept":4,"cut":false,"hidden":false,"merged":[]}
["الرقم ","خانة 1","خانة 2","خانة 3","خانة 4","خانة 5","خانة 6","خانة 7","خانة 8","خانة 9","خانة 10","خانة 11","خانة 12","خانة 13","خانة 14","خانة 15","خانة 16","خانة 17","خانة 18","خانة 19","خانة 20","خانة 21","خانة 22","خانة 23","خانة 24","خانة 25","خانة 26","خانة 27","خانة 28","خانة 29","خانة 30","خانة 31"]
[1,100,200,300,400,500,600,700,800,900,1000,1100,1200,1300,1400,1500,1600,1700,1800,1900,2000,2100,2200,2300,2400,2500,2600,2700,2800,2900,3000,3100]
[2,200,400,600,800,1000,1200,1400,1600,1800,2000,2200,2400,2600,2800,3000,3200,3400,3600,3800,4000,4200,4400,4600,4800,5000,5200,5400,5600,5800,6000,6200]
[3,6500]

{"sheet":"ورقة1","index":1,"n_rows":23,"n_cols":32,"rows_kept":23,"cut":false,"hidden":false,"merged":[]}
[]
[]
[]
[]
[null,"خانة 1","خانة 2","خانة 3","خانة 4","خانة 5","خانة 6","خانة 7","خانة 8","خانة 9","خانة 10","خانة 11","خانة 12","خانة 13","خانة 14","خانة 15","خانة 16","خانة 17","خانة 18","خانة 19","خانة 20","خانة 21","خانة 22","خانة 23","خانة 24","خانة 25","خانة 26","خانة 27","خانة 28","خانة 29","خانة 30","خانة 31"]
[1,{"$f":"IFERROR(VLOOKUP($A6,data!$A$2:$AF$500,MATCH(B$5,data!$A$1:$AF$1,0),0),\"\")","v":100},{"$f":"IFERROR(VLOOKUP($A6,data!$A$2:$AF$500,MATCH(C$5,data!$A$1:$AF$1,0),0),\"\")","v":200},{"$f":"IFERROR(VLOOKUP($A6,data!$A$2:$AF$500,MATCH(D$5,data!$A$1:$AF$1,0),0),\"\")","v":300},{"$f":"IFERROR(VLOOKUP($A6,data!$A$2:$AF$500,MATCH(E$5,data!$A$1:$AF$1,0),0),\"\")","v":400},{"$f":"IFERROR(VLOOKUP($A6,data!$A$2:$AF$500,MATCH(F$5,data!$A$1:$AF$1,0),0),\"\")","v":500},{"$f":"IFERROR(VLOOKUP($A6,data!$A$2:$AF$500,MATCH(G$5,data!$A$1:$AF$1,0),0),\"\")","v":600},{"$f":"IFERROR(VLOOKUP($A6,data!$A$2:$AF$500,MATCH(H$5,data!$A$1:$AF$1,0),0),\"\")","v":700},{"$f":"IFERROR(VLOOKUP($A6,data!$A$2:$AF$500,MATCH(I$5,data!$A$1:$AF$1,0),0),\"\")","v":800},{"$f":"IFERROR(VLOOKUP($A6,data!$A$2:$AF$500,MATCH(J$5,data!$A$1:$AF$1,0),0),\"\")","v":900},{"$f":"IFERROR(VLOOKUP($A6,data!$A$2:$AF$500,MATCH(K$5,data!$A$1:$AF$1,0),0),\"\")","v":1000},{"$f":"IFERROR(VLOOKUP($A6,data!$A$2:$AF$500,MATCH(L$5,data!$A$1:$AF$1,0),0),\"\")","v":1100},{"$f":"IFERROR(VLOOKUP($A6,data!$A$2:$AF$500,MATCH(M$5,data!$A$1:$AF$1,0),0),\"\")","v":1200},{"$f":"IFERROR(VLOOKUP($A6,data!$A$2:$AF$500,MATCH(N$5,data!$A$1:$AF$1,0),0),\"\")","v":1300},{"$f":"IFERROR(VLOOKUP($A6,data!$A$2:$AF$500,MATCH(O$5,data!$A$1:$AF$1,0),0),\"\")","v":1400},{"$f":"IFERROR(VLOOKUP($A6,data!$A$2:$AF$500,MATCH(P$5,data!$A$1:$AF$1,0),0),\"\")","v":1500},{"$f":"IFERROR(VLOOKUP($A6,data!$A$2:$AF$500,MATCH(Q$5,data!$A$1:$AF$1,0),0),\"\")","v":1600},{"$f":"IFERROR(VLOOKUP($A6,data!$A$2:$AF$500,MATCH(R$5,data!$A$1:$AF$1,0),0),\"\")","v":1700},{"$f":"IFERROR(VLOOKUP($A6,data!$A$2:$AF$500,MATCH(S$5,data!$A$1:$AF$1,0),0),\"\")","v":1800},{"$f":"IFERROR(VLOOKUP($A6,data!$A$2:$AF$500,MATCH(T$5,data!$A$1:$AF$1,0),0),\"\")","v":1900},{"$f":"IFERROR(VLOOKUP($A6,data!$A$2:$AF$500,MATCH(U$5,data!$A$1:$AF$1,0),0),\"\")","v":2000},{"$f":"IFERROR(VLOOKUP($A6,data!$A$2:$AF$500,MATCH(V$5,data!$A$1:$AF$1,0),0),\"\")","v":2100},{"$f":"IFERROR(VLOOKUP($A6,data!$A$2:$AF$500,MATCH(W$5,data!$A$1:$AF$1,0),0),\"\")","v":2200},{"$f":"IFERROR(VLOOKUP($A6,data!$A$2:$AF$500,MATCH(X$5,data!$A$1:$AF$1,0),0),\"\")","v":2300},{"$f":"IFERROR(VLOOKUP($A6,data!$A$2:$AF$500,MATCH(Y$5,data!$A$1:$AF$1,0),0),\"\")","v":2400},{"$f":"IFERROR(VLOOKUP($A6,data!$A$2:$AF$500,MATCH(Z$5,data!$A$1:$AF$1,0),0),\"\")","v":2500},{"$f":"IFERROR(VLOOKUP($A6,data!$A$2:$AF$500,MATCH(AA$5,data!$A$1:$AF$1,0),0),\"\")","v":2600},{"$f":"IFERROR(VLOOKUP($A6,data!$A$2:$AF$500,MATCH(AB$5,data!$A$1:$AF$1,0),0),\"\")","v":2700},{"$f":"IFERROR(VLOOKUP($A6,data!$A$2:$AF$500,MATCH(AC$5,data!$A$1:$AF$1,0),0),\"\")","v":2800},{"$f":"IFERROR(VLOOKUP($A6,data!$A$2:$AF$500,MATCH(AD$5,data!$A$1:$AF$1,0),0),\"\")","v":2900},{"$f":"IFERROR(VLOOKUP($A6,data!$A$2:$AF$500,MATCH(AE$5,data!$A$1:$AF$1,0),0),\"\")","v":3000},{"$f":"IFERROR(VLOOKUP($A6,data!$A$2:$AF$500,MATCH(AF$5,data!$A$1:$AF$1,0),0),\"\")","v":3100}]
[2,{"$f":"IFERROR(VLOOKUP($A7,data!$A$2:$AF$500,MATCH(B$5,data!$A$1:$AF$1,0),0),\"\")","v":200},{"$f":"IFERROR(VLOOKUP($A7,data!$A$2:$AF$500,MATCH(C$5,data!$A$1:$AF$1,0),0),\"\")","v":400},{"$f":"IFERROR(VLOOKUP($A7,data!$A$2:$AF$500,MATCH(D$5,data!$A$1:$AF$1,0),0),\"\")","v":600},{"$f":"IFERROR(VLOOKUP($A7,data!$A$2:$AF$500,MATCH(E$5,data!$A$1:$AF$1,0),0),\"\")","v":800},{"$f":"IFERROR(VLOOKUP($A7,data!$A$2:$AF$500,MATCH(F$5,data!$A$1:$AF$1,0),0),\"\")","v":1000},{"$f":"IFERROR(VLOOKUP($A7,data!$A$2:$AF$500,MATCH(G$5,data!$A$1:$AF$1,0),0),\"\")","v":1200},{"$f":"IFERROR(VLOOKUP($A7,data!$A$2:$AF$500,MATCH(H$5,data!$A$1:$AF$1,0),0),\"\")","v":1400},{"$f":"IFERROR(VLOOKUP($A7,data!$A$2:$AF$500,MATCH(I$5,data!$A$1:$AF$1,0),0),\"\")","v":1600},{"$f":"IFERROR(VLOOKUP($A7,data!$A$2:$AF$500,MATCH(J$5,data!$A$1:$AF$1,0),0),\"\")","v":1800},{"$f":"IFERROR(VLOOKUP($A7,data!$A$2:$AF$500,MATCH(K$5,data!$A$1:$AF$1,0),0),\"\")","v":2000},{"$f":"IFERROR(VLOOKUP($A7,data!$A$2:$AF$500,MATCH(L$5,data!$A$1:$AF$1,0),0),\"\")","v":2200},{"$f":"IFERROR(VLOOKUP($A7,data!$A$2:$AF$500,MATCH(M$5,data!$A$1:$AF$1,0),0),\"\")","v":2400},{"$f":"IFERROR(VLOOKUP($A7,data!$A$2:$AF$500,MATCH(N$5,data!$A$1:$AF$1,0),0),\"\")","v":2600},{"$f":"IFERROR(VLOOKUP($A7,data!$A$2:$AF$500,MATCH(O$5,data!$A$1:$AF$1,0),0),\"\")","v":2800},{"$f":"IFERROR(VLOOKUP($A7,data!$A$2:$AF$500,MATCH(P$5,data!$A$1:$AF$1,0),0),\"\")","v":3000},{"$f":"IFERROR(VLOOKUP($A7,data!$A$2:$AF$500,MATCH(Q$5,data!$A$1:$AF$1,0),0),\"\")","v":3200},{"$f":"IFERROR(VLOOKUP($A7,data!$A$2:$AF$500,MATCH(R$5,data!$A$1:$AF$1,0),0),\"\")","v":3400},{"$f":"IFERROR(VLOOKUP($A7,data!$A$2:$AF$500,MATCH(S$5,data!$A$1:$AF$1,0),0),\"\")","v":3600},{"$f":"IFERROR(VLOOKUP($A7,data!$A$2:$AF$500,MATCH(T$5,data!$A$1:$AF$1,0),0),\"\")","v":3800},{"$f":"IFERROR(VLOOKUP($A7,data!$A$2:$AF$500,MATCH(U$5,data!$A$1:$AF$1,0),0),\"\")","v":4000},{"$f":"IFERROR(VLOOKUP($A7,data!$A$2:$AF$500,MATCH(V$5,data!$A$1:$AF$1,0),0),\"\")","v":4200},{"$f":"IFERROR(VLOOKUP($A7,data!$A$2:$AF$500,MATCH(W$5,data!$A$1:$AF$1,0),0),\"\")","v":4400},{"$f":"IFERROR(VLOOKUP($A7,data!$A$2:$AF$500,MATCH(X$5,data!$A$1:$AF$1,0),0),\"\")","v":4600},{"$f":"IFERROR(VLOOKUP($A7,data!$A$2:$AF$500,MATCH(Y$5,data!$A$1:$AF$1,0),0),\"\")","v":4800},{"$f":"IFERROR(VLOOKUP($A7,data!$A$2:$AF$500,MATCH(Z$5,data!$A$1:$AF$1,0),0),\"\")","v":5000},{"$f":"IFERROR(VLOOKUP($A7,data!$A$2:$AF$500,MATCH(AA$5,data!$A$1:$AF$1,0),0),\"\")","v":5200},{"$f":"IFERROR(VLOOKUP($A7,data!$A$2:$AF$500,MATCH(AB$5,data!$A$1:$AF$1,0),0),\"\")","v":5400},{"$f":"IFERROR(VLOOKUP($A7,data!$A$2:$AF$500,MATCH(AC$5,data!$A$1:$AF$1,0),0),\"\")","v":5600},{"$f":"IFERROR(VLOOKUP($A7,data!$A$2:$AF$500,MATCH(AD$5,data!$A$1:$AF$1,0),0),\"\")","v":5800},{"$f":"IFERROR(VLOOKUP($A7,data!$A$2:$AF$500,MATCH(AE$5,data!$A$1:$AF$1,0),0),\"\")","v":6000},{"$f":"IFERROR(VLOOKUP($A7,data!$A$2:$AF$500,MATCH(AF$5,data!$A$1:$AF$1,0),0),\"\")","v":6200}]
[3,{"$f":"IFERROR(VLOOKUP($A8,data!$A$2:$AF$500,MATCH(B$5,data!$A$1:$AF$1,0),0),\"\")","v":6500},{"$f":"IFERROR(VLOOKUP($A8,data!$A$2:$AF$500,MATCH(C$5,data!$A$1:$AF$1,0),0),\"\")","v":0},{"$f":"IFERROR(VLOOKUP($A8,data!$A$2:$AF$500,MATCH(D$5,data!$A$1:$AF$1,0),0),\"\")","v":0},{"$f":"IFERROR(VLOOKUP($A8,data!$A$2:$AF$500,MATCH(E$5,data!$A$1:$AF$1,0),0),\"\")","v":0},{"$f":"IFERROR(VLOOKUP($A8,data!$A$2:$AF$500,MATCH(F$5,data!$A$1:$AF$1,0),0),\"\")","v":0},{"$f":"IFERROR(VLOOKUP($A8,data!$A$2:$AF$500,MATCH(G$5,data!$A$1:$AF$1,0),0),\"\")","v":0},{"$f":"IFERROR(VLOOKUP($A8,data!$A$2:$AF$500,MATCH(H$5,data!$A$1:$AF$1,0),0),\"\")","v":0},{"$f":"IFERROR(VLOOKUP($A8,data!$A$2:$AF$500,MATCH(I$5,data!$A$1:$AF$1,0),0),\"\")","v":0},{"$f":"IFERROR(VLOOKUP($A8,data!$A$2:$AF$500,MATCH(J$5,data!$A$1:$AF$1,0),0),\"\")","v":0},{"$f":"IFERROR(VLOOKUP($A8,data!$A$2:$AF$500,MATCH(K$5,data!$A$1:$AF$1,0),0),\"\")","v":0},{"$f":"IFERROR(VLOOKUP($A8,data!$A$2:$AF$500,MATCH(L$5,data!$A$1:$AF$1,0),0),\"\")","v":0},{"$f":"IFERROR(VLOOKUP($A8,data!$A$2:$AF$500,MATCH(M$5,data!$A$1:$AF$1,0),0),\"\")","v":0},{"$f":"IFERROR(VLOOKUP($A8,data!$A$2:$AF$500,MATCH(N$5,data!$A$1:$AF$1,0),0),\"\")","v":0},{"$f":"IFERROR(VLOOKUP($A8,data!$A$2:$AF$500,MATCH(O$5,data!$A$1:$AF$1,0),0),\"\")","v":0},{"$f":"IFERROR(VLOOKUP($A8,data!$A$2:$AF$500,MATCH(P$5,data!$A$1:$AF$1,0),0),\"\")","v":0},{"$f":"IFERROR(VLOOKUP($A8,data!$A$2:$AF$500,MATCH(Q$5,data!$A$1:$AF$1,0),0),\"\")","v":0},{"$f":"IFERROR(VLOOKUP($A8,data!$A$2:$AF$500,MATCH(R$5,data!$A$1:$AF$1,0),0),\"\")","v":0},{"$f":"IFERROR(VLOOKUP($A8,data!$A$2:$AF$500,MATCH(S$5,data!$A$1:$AF$1,0),0),\"\")","v":0},{"$f":"IFERROR(VLOOKUP($A8,data!$A$2:$AF$500,MATCH(T$5,data!$A$1:$AF$1,0),0),\"\")","v":0},{"$f":"IFERROR(VLOOKUP($A8,data!$A$2:$AF$500,MATCH(U$5,data!$A$1:$AF$1,0),0),\"\")","v":0},{"$f":"IFERROR(VLOOKUP($A8,data!$A$2:$AF$500,MATCH(V$5,data!$A$1:$AF$1,0),0),\"\")","v":0},{"$f":"IFERROR(VLOOKUP($A8,data!$A$2:$AF$500,MATCH(W$5,data!$A$1:$AF$1,0),0),\"\")","v":0},{"$f":"IFERROR(VLOOKUP($A8,data!$A$2:$AF$500,MATCH(X$5,data!$A$1:$AF$1,0),0),\"\")","v":0},{"$f":"IFERROR(VLOOKUP($A8,data!$A$2:$AF$500,MATCH(Y$5,data!$A$1:$AF$1,0),0),\"\")","v":0},{"$f":"IFERROR(VLOOKUP($A8,data!$A$2:$AF$500,MATCH(Z$5,data!$A$1:$AF$1,0),0),\"\")","v":0},{"$f":"IFERROR(VLOOKUP($A8,data!$A$2:$AF$500,MATCH(AA$5,data!$A$1:$AF$1,0),0),\"\")","v":0},{"$f":"IFERROR(VLOOKUP($A8,data!$A$2:$AF$500,MATCH(AB$5,data!$A$1:$AF$1,0),0),\"\")","v":0},{"$f":"IFERROR(VLOOKUP($A8,data!$A$2:$AF$500,MATCH(AC$5,data!$A$1:$AF$1,0),0),\"\")","v":0},{"$f":"IFERROR(VLOOKUP($A8,data!$A$2:$AF$500,MATCH(AD$5,data!$A$1:$AF$1,0),0),\"\")","v":0},{"$f":"IFERROR(VLOOKUP($A8,data!$A$2:$AF$500,MATCH(AE$5,data!$A$1:$AF$1,0),0),\"\")","v":0},{"$f":"IFERROR(VLOOKUP($A8,data!$A$2:$AF$500,MATCH(AF$5,data!$A$1:$AF$1,0),0),\"\")","v":0}]
[null,{"$f":"IFERROR(VLOOKUP($A9,data!$A$2:$AF$500,MATCH(B$5,data!$A$1:$AF$1,0),0),\"\")","v":""},{"$f":"IFERROR(VLOOKUP($A9,data!$A$2:$AF$500,MATCH(C$5,data!$A$1:$AF$1,0),0),\"\")","v":""},{"$f":"IFERROR(VLOOKUP($A9,data!$A$2:$AF$500,MATCH(D$5,data!$A$1:$AF$1,0),0),\"\")","v":""},{"$f":"IFERROR(VLOOKUP($A9,data!$A$2:$AF$500,MATCH(E$5,data!$A$1:$AF$1,0),0),\"\")","v":""},{"$f":"IFERROR(VLOOKUP($A9,data!$A$2:$AF$500,MATCH(F$5,data!$A$1:$AF$1,0),0),\"\")","v":""},{"$f":"IFERROR(VLOOKUP($A9,data!$A$2:$AF$500,MATCH(G$5,data!$A$1:$AF$1,0),0),\"\")","v":""},{"$f":"IFERROR(VLOOKUP($A9,data!$A$2:$AF$500,MATCH(H$5,data!$A$1:$AF$1,0),0),\"\")","v":""},{"$f":"IFERROR(VLOOKUP($A9,data!$A$2:$AF$500,MATCH(I$5,data!$A$1:$AF$1,0),0),\"\")","v":""},{"$f":"IFERROR(VLOOKUP($A9,data!$A$2:$AF$500,MATCH(J$5,data!$A$1:$AF$1,0),0),\"\")","v":""},{"$f":"IFERROR(VLOOKUP($A9,data!$A$2:$AF$500,MATCH(K$5,data!$A$1:$AF$1,0),0),\"\")","v":""},{"$f":"IFERROR(VLOOKUP($A9,data!$A$2:$AF$500,MATCH(L$5,data!$A$1:$AF$1,0),0),\"\")","v":""},{"$f":"IFERROR(VLOOKUP($A9,data!$A$2:$AF$500,MATCH(M$5,data!$A$1:$AF$1,0),0),\"\")","v":""},{"$f":"IFERROR(VLOOKUP($A9,data!$A$2:$AF$500,MATCH(N$5,data!$A$1:$AF$1,0),0),\"\")","v":""},{"$f":"IFERROR(VLOOKUP($A9,data!$A$2:$AF$500,MATCH(O$5,data!$A$1:$AF$1,0),0),\"\")","v":""},{"$f":"IFERROR(VLOOKUP($A9,data!$A$2:$AF$500,MATCH(P$5,data!$A$1:$AF$1,0),0),\"\")","v":""},{"$f":"IFERROR(VLOOKUP($A9,data!$A$2:$AF$500,MATCH(Q$5,data!$A$1:$AF$1,0),0),\"\")","v":""},{"$f":"IFERROR(VLOOKUP($A9,data!$A$2:$AF$500,MATCH(R$5,data!$A$1:$AF$1,0),0),\"\")","v":""},{"$f":"IFERROR(VLOOKUP($A9,data!$A$2:$AF$500,MATCH(S$5,data!$A$1:$AF$1,0),0),\"\")","v":""},{"$f":"IFERROR(VLOOKUP($A9,data!$A$2:$AF$500,MATCH(T$5,data!$A$1:$AF$1,0),0),\"\")","v":""},{"$f":"IFERROR(VLOOKUP($A9,data!$A$2:$AF$500,MATCH(U$5,data!$A$1:$AF$1,0),0),\"\")","v":""},{"$f":"IFERROR(VLOOKUP($A9,data!$A$2:$AF$500,MATCH(V$5,data!$A$1:$AF$1,0),0),\"\")","v":""},{"$f":"IFERROR(VLOOKUP($A9,data!$A$2:$AF$500,MATCH(W$5,data!$A$1:$AF$1,0),0),\"\")","v":""},{"$f":"IFERROR(VLOOKUP($A9,data!$A$2:$AF$500,MATCH(X$5,data!$A$1:$AF$1,0),0),\"\")","v":""},{"$f":"IFERROR(VLOOKUP($A9,data!$A$2:$AF$500,MATCH(Y$5,data!$A$1:$AF$1,0),0),\"\")","v":""},{"$f":"IFERROR(VLOOKUP($A9,data!$A$2:$AF$500,MATCH(Z$5,data!$A$1:$AF$1,0),0),\"\")","v":""},{"$f":"IFERROR(VLOOKUP($A9,data!$A$2:$AF$500,MATCH(AA$5,data!$A$1:$AF$1,0),0),\"\")","v":""},{"$f":"IFERROR(VLOOKUP($A9,data!$A$2:$AF$500,MATCH(AB$5,data!$A$1:$AF$1,0),0),\"\")","v":""},{"$f":"IFERROR(VLOOKUP($A9,data!$A$2:$AF$500,MATCH(AC$5,data!$A$1:$AF$1,0),0),\"\")","v":""},{"$f":"IFERROR(VLOOKUP($A9,data!$A$2:$AF$500,MATCH(AD$5,data!$A$1:$AF$1,0),0),\"\")","v":""},{"$f":"IFERROR(VLOOKUP($A9,data!$A$2:$AF$500,MATCH(AE$5,data!$A$1:$AF$1,0),0),\"\")","v":""},{"$f":"IFERROR(VLOOKUP($A9,data!$A$2:$AF$500,MATCH(AF$5,data!$A$1:$AF$1,0),0),\"\")","v":""}]
[null,{"$f":"IFERROR(VLOOKUP($A10,data!$A$2:$AF$500,MATCH(B$5,data!$A$1:$AF$1,0),0),\"\")","v":""},{"$f":"IFERROR(VLOOKUP($A10,data!$A$2:$AF$500,MATCH(C$5,data!$A$1:$AF$1,0),0),\"\")","v":""},{"$f":"IFERROR(VLOOKUP($A10,data!$A$2:$AF$500,MATCH(D$5,data!$A$1:$AF$1,0),0),\"\")","v":""},{"$f":"IFERROR(VLOOKUP($A10,data!$A$2:$AF$500,MATCH(E$5,data!$A$1:$AF$1,0),0),\"\")","v":""},{"$f":"IFERROR(VLOOKUP($A10,data!$A$2:$AF$500,MATCH(F$5,data!$A$1:$AF$1,0),0),\"\")","v":""},{"$f":"IFERROR(VLOOKUP($A10,data!$A$2:$AF$500,MATCH(G$5,data!$A$1:$AF$1,0),0),\"\")","v":""},{"$f":"IFERROR(VLOOKUP($A10,data!$A$2:$AF$500,MATCH(H$5,data!$A$1:$AF$1,0),0),\"\")","v":""},{"$f":"IFERROR(VLOOKUP($A10,data!$A$2:$AF$500,MATCH(I$5,data!$A$1:$AF$1,0),0),\"\")","v":""},{"$f":"IFERROR(VLOOKUP($A10,data!$A$2:$AF$500,MATCH(J$5,data!$A$1:$AF$1,0),0),\"\")","v":""},{"$f":"IFERROR(VLOOKUP($A10,data!$A$2:$AF$500,MATCH(K$5,data!$A$1:$AF$1,0),0),\"\")","v":""},{"$f":"IFERROR(VLOOKUP($A10,data!$A$2:$AF$500,MATCH(L$5,data!$A$1:$AF$1,0),0),\"\")","v":""},{"$f":"IFERROR(VLOOKUP($A10,data!$A$2:$AF$500,MATCH(M$5,data!$A$1:$AF$1,0),0),\"\")","v":""},{"$f":"IFERROR(VLOOKUP($A10,data!$A$2:$AF$500,MATCH(N$5,data!$A$1:$AF$1,0),0),\"\")","v":""},{"$f":"IFERROR(VLOOKUP($A10,data!$A$2:$AF$500,MATCH(O$5,data!$A$1:$AF$1,0),0),\"\")","v":""},{"$f":"IFERROR(VLOOKUP($A10,data!$A$2:$AF$500,MATCH(P$5,data!$A$1:$AF$1,0),0),\"\")","v":""},{"$f":"IFERROR(VLOOKUP($A10,data!$A$2:$AF$500,MATCH(Q$5,data!$A$1:$AF$1,0),0),\"\")","v":""},{"$f":"IFERROR(VLOOKUP($A10,data!$A$2:$AF$500,MATCH(R$5,data!$A$1:$AF$1,0),0),\"\")","v":""},{"$f":"IFERROR(VLOOKUP($A10,data!$A$2:$AF$500,MATCH(S$5,data!$A$1:$AF$1,0),0),\"\")","v":""},{"$f":"IFERROR(VLOOKUP($A10,data!$A$2:$AF$500,MATCH(T$5,data!$A$1:$AF$1,0),0),\"\")","v":""},{"$f":"IFERROR(VLOOKUP($A10,data!$A$2:$AF$500,MATCH(U$5,data!$A$1:$AF$1,0),0),\"\")","v":""},{"$f":"IFERROR(VLOOKUP($A10,data!$A$2:$AF$500,MATCH(V$5,data!$A$1:$AF$1,0),0),\"\")","v":""},{"$f":"IFERROR(VLOOKUP($A10,data!$A$2:$AF$500,MATCH(W$5,data!$A$1:$AF$1,0),0),\"\")","v":""},{"$f":"IFERROR(VLOOKUP($A10,data!$A$2:$AF$500,MATCH(X$5,data!$A$1:$AF$1,0),0),\"\")","v":""},{"$f":"IFERROR(VLOOKUP($A10,data!$A$2:$AF$500,MATCH(Y$5,data!$A$1:$AF$1,0),0),\"\")","v":""},{"$f":"IFERROR(VLOOKUP($A10,data!$A$2:$AF$500,MATCH(Z$5,data!$A$1:$AF$1,0),0),\"\")","v":""},{"$f":"IFERROR(VLOOKUP($A10,data!$A$2:$AF$500,MATCH(AA$5,data!$A$1:$AF$1,0),0),\"\")","v":""},{"$f":"IFERROR(VLOOKUP($A10,data!$A$2:$AF$500,MATCH(AB$5,data!$A$1:$AF$1,0),0),\"\")","v":""},{"$f":"IFERROR(VLOOKUP($A10,data!$A$2:$AF$500,MATCH(AC$5,data!$A$1:$AF$1,0),0),\"\")","v":""},{"$f":"IFERROR(VLOOKUP($A10,data!$A$2:$AF$500,MATCH(AD$5,data!$A$1:$AF$1,0),0),\"\")","v":""},{"$f":"IFERROR(VLOOKUP($A10,data!$A$2:$AF$500,MATCH(AE$5,data!$A$1:$AF$1,0),0),\"\")","v":""},{"$f":"IFERROR(VLOOKUP($A10,data!$A$2:$AF$500,MATCH(AF$5,data!$A$1:$AF$1,0),0),\"\")","v":""}]
{"$rows_left_out":13}